lucene-dev mailing list archives

Site index · List index
Message view « Date » · « Thread »
Top « Date » · « Thread »
From Apache Jenkins Server <jenk...@builds.apache.org>
Subject [JENKINS] Lucene-Solr-NightlyTests-5.x - Build # 1076 - Still Failing
Date Sun, 17 Jan 2016 05:35:53 GMT
Build: https://builds.apache.org/job/Lucene-Solr-NightlyTests-5.x/1076/

2 tests failed.
FAILED:  org.apache.solr.cloud.CollectionsAPIDistributedZkTest.test

Error Message:
Captured an uncaught exception in thread: Thread[id=14907, name=collection1, state=RUNNABLE, group=TGRP-CollectionsAPIDistributedZkTest]

Stack Trace:
com.carrotsearch.randomizedtesting.UncaughtExceptionError: Captured an uncaught exception in thread: Thread[id=14907, name=collection1, state=RUNNABLE, group=TGRP-CollectionsAPIDistributedZkTest]
Caused by: org.apache.solr.client.solrj.impl.HttpSolrClient$RemoteSolrException: Error from server at http://127.0.0.1:32961: Could not find collection : awholynewstresscollection_collection1_0
	at __randomizedtesting.SeedInfo.seed([FD3FB35516E95D91]:0)
	at org.apache.solr.client.solrj.impl.HttpSolrClient.executeMethod(HttpSolrClient.java:576)
	at org.apache.solr.client.solrj.impl.HttpSolrClient.request(HttpSolrClient.java:240)
	at org.apache.solr.client.solrj.impl.HttpSolrClient.request(HttpSolrClient.java:229)
	at org.apache.solr.client.solrj.impl.LBHttpSolrClient.doRequest(LBHttpSolrClient.java:372)
	at org.apache.solr.client.solrj.impl.LBHttpSolrClient.request(LBHttpSolrClient.java:325)
	at org.apache.solr.client.solrj.impl.CloudSolrClient.sendRequest(CloudSolrClient.java:1100)
	at org.apache.solr.client.solrj.impl.CloudSolrClient.requestWithRetryOnStaleState(CloudSolrClient.java:871)
	at org.apache.solr.client.solrj.impl.CloudSolrClient.request(CloudSolrClient.java:807)
	at org.apache.solr.client.solrj.SolrClient.request(SolrClient.java:1220)
	at org.apache.solr.cloud.CollectionsAPIDistributedZkTest$1CollectionThread.run(CollectionsAPIDistributedZkTest.java:888)


FAILED:  org.apache.solr.handler.TestReplicationHandler.doTestStressReplication

Error Message:
timed out waiting for collection1 startAt time to exceed: Sun Jan 17 04:15:23 GMT+00:00 2016

Stack Trace:
java.lang.AssertionError: timed out waiting for collection1 startAt time to exceed: Sun Jan 17 04:15:23 GMT+00:00 2016
	at __randomizedtesting.SeedInfo.seed([FD3FB35516E95D91:2694B39313C13422]:0)
	at org.junit.Assert.fail(Assert.java:93)
	at org.apache.solr.handler.TestReplicationHandler.watchCoreStartAt(TestReplicationHandler.java:1419)
	at org.apache.solr.handler.TestReplicationHandler.doTestStressReplication(TestReplicationHandler.java:771)
	at sun.reflect.NativeMethodAccessorImpl.invoke0(Native Method)
	at sun.reflect.NativeMethodAccessorImpl.invoke(NativeMethodAccessorImpl.java:57)
	at sun.reflect.DelegatingMethodAccessorImpl.invoke(DelegatingMethodAccessorImpl.java:43)
	at java.lang.reflect.Method.invoke(Method.java:606)
	at com.carrotsearch.randomizedtesting.RandomizedRunner.invoke(RandomizedRunner.java:1764)
	at com.carrotsearch.randomizedtesting.RandomizedRunner$8.evaluate(RandomizedRunner.java:871)
	at com.carrotsearch.randomizedtesting.RandomizedRunner$9.evaluate(RandomizedRunner.java:907)
	at com.carrotsearch.randomizedtesting.RandomizedRunner$10.evaluate(RandomizedRunner.java:921)
	at com.carrotsearch.randomizedtesting.rules.SystemPropertiesRestoreRule$1.evaluate(SystemPropertiesRestoreRule.java:57)
	at org.apache.lucene.util.TestRuleSetupTeardownChained$1.evaluate(TestRuleSetupTeardownChained.java:50)
	at org.apache.lucene.util.AbstractBeforeAfterRule$1.evaluate(AbstractBeforeAfterRule.java:46)
	at org.apache.lucene.util.TestRuleThreadAndTestName$1.evaluate(TestRuleThreadAndTestName.java:49)
	at org.apache.lucene.util.TestRuleIgnoreAfterMaxFailures$1.evaluate(TestRuleIgnoreAfterMaxFailures.java:65)
	at org.apache.lucene.util.TestRuleMarkFailure$1.evaluate(TestRuleMarkFailure.java:48)
	at com.carrotsearch.randomizedtesting.rules.StatementAdapter.evaluate(StatementAdapter.java:36)
	at com.carrotsearch.randomizedtesting.ThreadLeakControl$StatementRunner.run(ThreadLeakControl.java:367)
	at com.carrotsearch.randomizedtesting.ThreadLeakControl.forkTimeoutingTask(ThreadLeakControl.java:809)
	at com.carrotsearch.randomizedtesting.ThreadLeakControl$3.evaluate(ThreadLeakControl.java:460)
	at com.carrotsearch.randomizedtesting.RandomizedRunner.runSingleTest(RandomizedRunner.java:880)
	at com.carrotsearch.randomizedtesting.RandomizedRunner$5.evaluate(RandomizedRunner.java:781)
	at com.carrotsearch.randomizedtesting.RandomizedRunner$6.evaluate(RandomizedRunner.java:816)
	at com.carrotsearch.randomizedtesting.RandomizedRunner$7.evaluate(RandomizedRunner.java:827)
	at com.carrotsearch.randomizedtesting.rules.StatementAdapter.evaluate(StatementAdapter.java:36)
	at com.carrotsearch.randomizedtesting.rules.SystemPropertiesRestoreRule$1.evaluate(SystemPropertiesRestoreRule.java:57)
	at org.apache.lucene.util.AbstractBeforeAfterRule$1.evaluate(AbstractBeforeAfterRule.java:46)
	at com.carrotsearch.randomizedtesting.rules.StatementAdapter.evaluate(StatementAdapter.java:36)
	at org.apache.lucene.util.TestRuleStoreClassName$1.evaluate(TestRuleStoreClassName.java:42)
	at com.carrotsearch.randomizedtesting.rules.NoShadowingOrOverridesOnMethodsRule$1.evaluate(NoShadowingOrOverridesOnMethodsRule.java:40)
	at com.carrotsearch.randomizedtesting.rules.NoShadowingOrOverridesOnMethodsRule$1.evaluate(NoShadowingOrOverridesOnMethodsRule.java:40)
	at com.carrotsearch.randomizedtesting.rules.StatementAdapter.evaluate(StatementAdapter.java:36)
	at com.carrotsearch.randomizedtesting.rules.StatementAdapter.evaluate(StatementAdapter.java:36)
	at com.carrotsearch.randomizedtesting.rules.StatementAdapter.evaluate(StatementAdapter.java:36)
	at org.apache.lucene.util.TestRuleAssertionsRequired$1.evaluate(TestRuleAssertionsRequired.java:54)
	at org.apache.lucene.util.TestRuleMarkFailure$1.evaluate(TestRuleMarkFailure.java:48)
	at org.apache.lucene.util.TestRuleIgnoreAfterMaxFailures$1.evaluate(TestRuleIgnoreAfterMaxFailures.java:65)
	at org.apache.lucene.util.TestRuleIgnoreTestSuites$1.evaluate(TestRuleIgnoreTestSuites.java:55)
	at com.carrotsearch.randomizedtesting.rules.StatementAdapter.evaluate(StatementAdapter.java:36)
	at com.carrotsearch.randomizedtesting.ThreadLeakControl$StatementRunner.run(ThreadLeakControl.java:367)
	at java.lang.Thread.run(Thread.java:745)




Build Log:
[...truncated 10867 lines...]
   [junit4] Suite: org.apache.solr.cloud.CollectionsAPIDistributedZkTest
   [junit4]   2> Creating dataDir: /x1/jenkins/jenkins-slave/workspace/Lucene-Solr-NightlyTests-5.x/solr/build/solr-core/test/J1/temp/solr.cloud.CollectionsAPIDistributedZkTest_FD3FB35516E95D91-001/init-core-data-001
   [junit4]   2> 1921020 INFO  (SUITE-CollectionsAPIDistributedZkTest-seed#[FD3FB35516E95D91]-worker) [    ] o.a.s.SolrTestCaseJ4 Randomized ssl (false) and clientAuth (false)
   [junit4]   2> 1921020 INFO  (SUITE-CollectionsAPIDistributedZkTest-seed#[FD3FB35516E95D91]-worker) [    ] o.a.s.BaseDistributedSearchTestCase Setting hostContext system property: /
   [junit4]   2> 1921023 INFO  (TEST-CollectionsAPIDistributedZkTest.test-seed#[FD3FB35516E95D91]) [    ] o.a.s.c.ZkTestServer STARTING ZK TEST SERVER
   [junit4]   2> 1921024 INFO  (Thread-9278) [    ] o.a.s.c.ZkTestServer client port:0.0.0.0/0.0.0.0:0
   [junit4]   2> 1921024 INFO  (Thread-9278) [    ] o.a.s.c.ZkTestServer Starting server
   [junit4]   2> 1921124 INFO  (TEST-CollectionsAPIDistributedZkTest.test-seed#[FD3FB35516E95D91]) [    ] o.a.s.c.ZkTestServer start zk server on port:33675
   [junit4]   2> 1921124 INFO  (TEST-CollectionsAPIDistributedZkTest.test-seed#[FD3FB35516E95D91]) [    ] o.a.s.c.c.SolrZkClient Using default ZkCredentialsProvider
   [junit4]   2> 1921125 INFO  (TEST-CollectionsAPIDistributedZkTest.test-seed#[FD3FB35516E95D91]) [    ] o.a.s.c.c.ConnectionManager Waiting for client to connect to ZooKeeper
   [junit4]   2> 1921127 INFO  (zkCallback-972-thread-1) [    ] o.a.s.c.c.ConnectionManager Watcher org.apache.solr.common.cloud.ConnectionManager@4068ba04 name:ZooKeeperConnection Watcher:127.0.0.1:33675 got event WatchedEvent state:SyncConnected type:None path:null path:null type:None
   [junit4]   2> 1921128 INFO  (TEST-CollectionsAPIDistributedZkTest.test-seed#[FD3FB35516E95D91]) [    ] o.a.s.c.c.ConnectionManager Client is connected to ZooKeeper
   [junit4]   2> 1921128 INFO  (TEST-CollectionsAPIDistributedZkTest.test-seed#[FD3FB35516E95D91]) [    ] o.a.s.c.c.SolrZkClient Using default ZkACLProvider
   [junit4]   2> 1921128 INFO  (TEST-CollectionsAPIDistributedZkTest.test-seed#[FD3FB35516E95D91]) [    ] o.a.s.c.c.SolrZkClient makePath: /solr
   [junit4]   2> 1921131 INFO  (TEST-CollectionsAPIDistributedZkTest.test-seed#[FD3FB35516E95D91]) [    ] o.a.s.c.c.SolrZkClient Using default ZkCredentialsProvider
   [junit4]   2> 1921131 INFO  (TEST-CollectionsAPIDistributedZkTest.test-seed#[FD3FB35516E95D91]) [    ] o.a.s.c.c.ConnectionManager Waiting for client to connect to ZooKeeper
   [junit4]   2> 1921133 INFO  (zkCallback-973-thread-1) [    ] o.a.s.c.c.ConnectionManager Watcher org.apache.solr.common.cloud.ConnectionManager@7f7fb059 name:ZooKeeperConnection Watcher:127.0.0.1:33675/solr got event WatchedEvent state:SyncConnected type:None path:null path:null type:None
   [junit4]   2> 1921133 INFO  (TEST-CollectionsAPIDistributedZkTest.test-seed#[FD3FB35516E95D91]) [    ] o.a.s.c.c.ConnectionManager Client is connected to ZooKeeper
   [junit4]   2> 1921133 INFO  (TEST-CollectionsAPIDistributedZkTest.test-seed#[FD3FB35516E95D91]) [    ] o.a.s.c.c.SolrZkClient Using default ZkACLProvider
   [junit4]   2> 1921134 INFO  (TEST-CollectionsAPIDistributedZkTest.test-seed#[FD3FB35516E95D91]) [    ] o.a.s.c.c.SolrZkClient makePath: /collections/collection1
   [junit4]   2> 1921136 INFO  (TEST-CollectionsAPIDistributedZkTest.test-seed#[FD3FB35516E95D91]) [    ] o.a.s.c.c.SolrZkClient makePath: /collections/collection1/shards
   [junit4]   2> 1921137 INFO  (TEST-CollectionsAPIDistributedZkTest.test-seed#[FD3FB35516E95D91]) [    ] o.a.s.c.c.SolrZkClient makePath: /collections/control_collection
   [junit4]   2> 1921139 INFO  (TEST-CollectionsAPIDistributedZkTest.test-seed#[FD3FB35516E95D91]) [    ] o.a.s.c.c.SolrZkClient makePath: /collections/control_collection/shards
   [junit4]   2> 1921141 INFO  (TEST-CollectionsAPIDistributedZkTest.test-seed#[FD3FB35516E95D91]) [    ] o.a.s.c.AbstractZkTestCase put /x1/jenkins/jenkins-slave/workspace/Lucene-Solr-NightlyTests-5.x/solr/core/src/test-files/solr/collection1/conf/solrconfig-tlog.xml to /configs/conf1/solrconfig.xml
   [junit4]   2> 1921141 INFO  (TEST-CollectionsAPIDistributedZkTest.test-seed#[FD3FB35516E95D91]) [    ] o.a.s.c.c.SolrZkClient makePath: /configs/conf1/solrconfig.xml
   [junit4]   2> 1921144 INFO  (TEST-CollectionsAPIDistributedZkTest.test-seed#[FD3FB35516E95D91]) [    ] o.a.s.c.AbstractZkTestCase put /x1/jenkins/jenkins-slave/workspace/Lucene-Solr-NightlyTests-5.x/solr/core/src/test-files/solr/collection1/conf/schema.xml to /configs/conf1/schema.xml
   [junit4]   2> 1921144 INFO  (TEST-CollectionsAPIDistributedZkTest.test-seed#[FD3FB35516E95D91]) [    ] o.a.s.c.c.SolrZkClient makePath: /configs/conf1/schema.xml
   [junit4]   2> 1921147 INFO  (TEST-CollectionsAPIDistributedZkTest.test-seed#[FD3FB35516E95D91]) [    ] o.a.s.c.AbstractZkTestCase put /x1/jenkins/jenkins-slave/workspace/Lucene-Solr-NightlyTests-5.x/solr/core/src/test-files/solr/collection1/conf/solrconfig.snippet.randomindexconfig.xml to /configs/conf1/solrconfig.snippet.randomindexconfig.xml
   [junit4]   2> 1921147 INFO  (TEST-CollectionsAPIDistributedZkTest.test-seed#[FD3FB35516E95D91]) [    ] o.a.s.c.c.SolrZkClient makePath: /configs/conf1/solrconfig.snippet.randomindexconfig.xml
   [junit4]   2> 1921149 INFO  (TEST-CollectionsAPIDistributedZkTest.test-seed#[FD3FB35516E95D91]) [    ] o.a.s.c.AbstractZkTestCase put /x1/jenkins/jenkins-slave/workspace/Lucene-Solr-NightlyTests-5.x/solr/core/src/test-files/solr/collection1/conf/stopwords.txt to /configs/conf1/stopwords.txt
   [junit4]   2> 1921149 INFO  (TEST-CollectionsAPIDistributedZkTest.test-seed#[FD3FB35516E95D91]) [    ] o.a.s.c.c.SolrZkClient makePath: /configs/conf1/stopwords.txt
   [junit4]   2> 1921151 INFO  (TEST-CollectionsAPIDistributedZkTest.test-seed#[FD3FB35516E95D91]) [    ] o.a.s.c.AbstractZkTestCase put /x1/jenkins/jenkins-slave/workspace/Lucene-Solr-NightlyTests-5.x/solr/core/src/test-files/solr/collection1/conf/protwords.txt to /configs/conf1/protwords.txt
   [junit4]   2> 1921152 INFO  (TEST-CollectionsAPIDistributedZkTest.test-seed#[FD3FB35516E95D91]) [    ] o.a.s.c.c.SolrZkClient makePath: /configs/conf1/protwords.txt
   [junit4]   2> 1921154 INFO  (TEST-CollectionsAPIDistributedZkTest.test-seed#[FD3FB35516E95D91]) [    ] o.a.s.c.AbstractZkTestCase put /x1/jenkins/jenkins-slave/workspace/Lucene-Solr-NightlyTests-5.x/solr/core/src/test-files/solr/collection1/conf/currency.xml to /configs/conf1/currency.xml
   [junit4]   2> 1921154 INFO  (TEST-CollectionsAPIDistributedZkTest.test-seed#[FD3FB35516E95D91]) [    ] o.a.s.c.c.SolrZkClient makePath: /configs/conf1/currency.xml
   [junit4]   2> 1921156 INFO  (TEST-CollectionsAPIDistributedZkTest.test-seed#[FD3FB35516E95D91]) [    ] o.a.s.c.AbstractZkTestCase put /x1/jenkins/jenkins-slave/workspace/Lucene-Solr-NightlyTests-5.x/solr/core/src/test-files/solr/collection1/conf/enumsConfig.xml to /configs/conf1/enumsConfig.xml
   [junit4]   2> 1921156 INFO  (TEST-CollectionsAPIDistributedZkTest.test-seed#[FD3FB35516E95D91]) [    ] o.a.s.c.c.SolrZkClient makePath: /configs/conf1/enumsConfig.xml
   [junit4]   2> 1921158 INFO  (TEST-CollectionsAPIDistributedZkTest.test-seed#[FD3FB35516E95D91]) [    ] o.a.s.c.AbstractZkTestCase put /x1/jenkins/jenkins-slave/workspace/Lucene-Solr-NightlyTests-5.x/solr/core/src/test-files/solr/collection1/conf/open-exchange-rates.json to /configs/conf1/open-exchange-rates.json
   [junit4]   2> 1921158 INFO  (TEST-CollectionsAPIDistributedZkTest.test-seed#[FD3FB35516E95D91]) [    ] o.a.s.c.c.SolrZkClient makePath: /configs/conf1/open-exchange-rates.json
   [junit4]   2> 1921160 INFO  (TEST-CollectionsAPIDistributedZkTest.test-seed#[FD3FB35516E95D91]) [    ] o.a.s.c.AbstractZkTestCase put /x1/jenkins/jenkins-slave/workspace/Lucene-Solr-NightlyTests-5.x/solr/core/src/test-files/solr/collection1/conf/mapping-ISOLatin1Accent.txt to /configs/conf1/mapping-ISOLatin1Accent.txt
   [junit4]   2> 1921161 INFO  (TEST-CollectionsAPIDistributedZkTest.test-seed#[FD3FB35516E95D91]) [    ] o.a.s.c.c.SolrZkClient makePath: /configs/conf1/mapping-ISOLatin1Accent.txt
   [junit4]   2> 1921163 INFO  (TEST-CollectionsAPIDistributedZkTest.test-seed#[FD3FB35516E95D91]) [    ] o.a.s.c.AbstractZkTestCase put /x1/jenkins/jenkins-slave/workspace/Lucene-Solr-NightlyTests-5.x/solr/core/src/test-files/solr/collection1/conf/old_synonyms.txt to /configs/conf1/old_synonyms.txt
   [junit4]   2> 1921163 INFO  (TEST-CollectionsAPIDistributedZkTest.test-seed#[FD3FB35516E95D91]) [    ] o.a.s.c.c.SolrZkClient makePath: /configs/conf1/old_synonyms.txt
   [junit4]   2> 1921165 INFO  (TEST-CollectionsAPIDistributedZkTest.test-seed#[FD3FB35516E95D91]) [    ] o.a.s.c.AbstractZkTestCase put /x1/jenkins/jenkins-slave/workspace/Lucene-Solr-NightlyTests-5.x/solr/core/src/test-files/solr/collection1/conf/synonyms.txt to /configs/conf1/synonyms.txt
   [junit4]   2> 1921165 INFO  (TEST-CollectionsAPIDistributedZkTest.test-seed#[FD3FB35516E95D91]) [    ] o.a.s.c.c.SolrZkClient makePath: /configs/conf1/synonyms.txt
   [junit4]   2> 1921492 INFO  (TEST-CollectionsAPIDistributedZkTest.test-seed#[FD3FB35516E95D91]) [    ] o.a.s.SolrTestCaseJ4 Writing core.properties file to /x1/jenkins/jenkins-slave/workspace/Lucene-Solr-NightlyTests-5.x/solr/build/solr-core/test/J1/temp/solr.cloud.CollectionsAPIDistributedZkTest_FD3FB35516E95D91-001/control-001/cores/collection1
   [junit4]   2> 1921493 INFO  (TEST-CollectionsAPIDistributedZkTest.test-seed#[FD3FB35516E95D91]) [    ] o.e.j.s.Server jetty-9.2.13.v20150730
   [junit4]   2> 1921495 INFO  (TEST-CollectionsAPIDistributedZkTest.test-seed#[FD3FB35516E95D91]) [    ] o.e.j.s.h.ContextHandler Started o.e.j.s.ServletContextHandler@7b4805c2{/,null,AVAILABLE}
   [junit4]   2> 1921498 INFO  (TEST-CollectionsAPIDistributedZkTest.test-seed#[FD3FB35516E95D91]) [    ] o.e.j.s.ServerConnector Started ServerConnector@607eb588{HTTP/1.1}{127.0.0.1:32961}
   [junit4]   2> 1921498 INFO  (TEST-CollectionsAPIDistributedZkTest.test-seed#[FD3FB35516E95D91]) [    ] o.e.j.s.Server Started @1924461ms
   [junit4]   2> 1921498 INFO  (TEST-CollectionsAPIDistributedZkTest.test-seed#[FD3FB35516E95D91]) [    ] o.a.s.c.s.e.JettySolrRunner Jetty properties: {hostContext=/, coreRootDirectory=/x1/jenkins/jenkins-slave/workspace/Lucene-Solr-NightlyTests-5.x/solr/build/solr-core/test/J1/../../../../../../../../../../x1/jenkins/jenkins-slave/workspace/Lucene-Solr-NightlyTests-5.x/solr/build/solr-core/test/J1/temp/solr.cloud.CollectionsAPIDistributedZkTest_FD3FB35516E95D91-001/control-001/cores, hostPort=32961, solr.data.dir=/x1/jenkins/jenkins-slave/workspace/Lucene-Solr-NightlyTests-5.x/solr/build/solr-core/test/J1/temp/solr.cloud.CollectionsAPIDistributedZkTest_FD3FB35516E95D91-001/tempDir-001/control/data}
   [junit4]   2> 1921498 INFO  (TEST-CollectionsAPIDistributedZkTest.test-seed#[FD3FB35516E95D91]) [    ] o.a.s.s.SolrDispatchFilter SolrDispatchFilter.init(): sun.misc.Launcher$AppClassLoader@7b3cb2c6
   [junit4]   2> 1921498 INFO  (TEST-CollectionsAPIDistributedZkTest.test-seed#[FD3FB35516E95D91]) [    ] o.a.s.c.SolrResourceLoader new SolrResourceLoader for directory: '/x1/jenkins/jenkins-slave/workspace/Lucene-Solr-NightlyTests-5.x/solr/build/solr-core/test/J1/temp/solr.cloud.CollectionsAPIDistributedZkTest_FD3FB35516E95D91-001/control-001'
   [junit4]   2> 1921498 INFO  (TEST-CollectionsAPIDistributedZkTest.test-seed#[FD3FB35516E95D91]) [    ] o.a.s.c.SolrResourceLoader JNDI not configured for solr (NoInitialContextEx)
   [junit4]   2> 1921499 INFO  (TEST-CollectionsAPIDistributedZkTest.test-seed#[FD3FB35516E95D91]) [    ] o.a.s.c.SolrResourceLoader solr home defaulted to 'solr/' (could not find system property or JNDI)
   [junit4]   2> 1921499 INFO  (TEST-CollectionsAPIDistributedZkTest.test-seed#[FD3FB35516E95D91]) [    ] o.a.s.c.c.SolrZkClient Using default ZkCredentialsProvider
   [junit4]   2> 1921499 INFO  (TEST-CollectionsAPIDistributedZkTest.test-seed#[FD3FB35516E95D91]) [    ] o.a.s.c.c.ConnectionManager Waiting for client to connect to ZooKeeper
   [junit4]   2> 1921504 INFO  (zkCallback-974-thread-1) [    ] o.a.s.c.c.ConnectionManager Watcher org.apache.solr.common.cloud.ConnectionManager@7910ea7c name:ZooKeeperConnection Watcher:127.0.0.1:33675/solr got event WatchedEvent state:SyncConnected type:None path:null path:null type:None
   [junit4]   2> 1921505 INFO  (TEST-CollectionsAPIDistributedZkTest.test-seed#[FD3FB35516E95D91]) [    ] o.a.s.c.c.ConnectionManager Client is connected to ZooKeeper
   [junit4]   2> 1921505 INFO  (TEST-CollectionsAPIDistributedZkTest.test-seed#[FD3FB35516E95D91]) [    ] o.a.s.c.c.SolrZkClient Using default ZkACLProvider
   [junit4]   2> 1921506 INFO  (TEST-CollectionsAPIDistributedZkTest.test-seed#[FD3FB35516E95D91]) [    ] o.a.s.s.SolrDispatchFilter Loading solr.xml from SolrHome (not found in ZooKeeper)
   [junit4]   2> 1921506 INFO  (TEST-CollectionsAPIDistributedZkTest.test-seed#[FD3FB35516E95D91]) [    ] o.a.s.c.SolrXmlConfig Loading container configuration from /x1/jenkins/jenkins-slave/workspace/Lucene-Solr-NightlyTests-5.x/solr/build/solr-core/test/J1/temp/solr.cloud.CollectionsAPIDistributedZkTest_FD3FB35516E95D91-001/control-001/solr.xml
   [junit4]   2> 1921523 INFO  (TEST-CollectionsAPIDistributedZkTest.test-seed#[FD3FB35516E95D91]) [    ] o.a.s.c.CorePropertiesLocator Config-defined core root directory: /x1/jenkins/jenkins-slave/workspace/Lucene-Solr-NightlyTests-5.x/solr/build/solr-core/test/J1/../../../../../../../../../../x1/jenkins/jenkins-slave/workspace/Lucene-Solr-NightlyTests-5.x/solr/build/solr-core/test/J1/temp/solr.cloud.CollectionsAPIDistributedZkTest_FD3FB35516E95D91-001/control-001/cores
   [junit4]   2> 1921523 INFO  (TEST-CollectionsAPIDistributedZkTest.test-seed#[FD3FB35516E95D91]) [    ] o.a.s.c.CoreContainer New CoreContainer 1954882951
   [junit4]   2> 1921523 INFO  (TEST-CollectionsAPIDistributedZkTest.test-seed#[FD3FB35516E95D91]) [    ] o.a.s.c.CoreContainer Loading cores into CoreContainer [instanceDir=/x1/jenkins/jenkins-slave/workspace/Lucene-Solr-NightlyTests-5.x/solr/build/solr-core/test/J1/temp/solr.cloud.CollectionsAPIDistributedZkTest_FD3FB35516E95D91-001/control-001]
   [junit4]   2> 1921523 WARN  (TEST-CollectionsAPIDistributedZkTest.test-seed#[FD3FB35516E95D91]) [    ] o.a.s.c.CoreContainer Couldn't add files from /x1/jenkins/jenkins-slave/workspace/Lucene-Solr-NightlyTests-5.x/solr/build/solr-core/test/J1/temp/solr.cloud.CollectionsAPIDistributedZkTest_FD3FB35516E95D91-001/control-001/lib to classpath: /x1/jenkins/jenkins-slave/workspace/Lucene-Solr-NightlyTests-5.x/solr/build/solr-core/test/J1/temp/solr.cloud.CollectionsAPIDistributedZkTest_FD3FB35516E95D91-001/control-001/lib
   [junit4]   2> 1921524 INFO  (TEST-CollectionsAPIDistributedZkTest.test-seed#[FD3FB35516E95D91]) [    ] o.a.s.h.c.HttpShardHandlerFactory created with socketTimeout : 90000,urlScheme : ,connTimeout : 15000,maxConnectionsPerHost : 20,maxConnections : 10000,corePoolSize : 0,maximumPoolSize : 2147483647,maxThreadIdleTime : 5,sizeOfQueue : -1,fairnessPolicy : false,useRetries : false,
   [junit4]   2> 1921525 INFO  (TEST-CollectionsAPIDistributedZkTest.test-seed#[FD3FB35516E95D91]) [    ] o.a.s.u.UpdateShardHandler Creating UpdateShardHandler HTTP client with params: socketTimeout=340000&connTimeout=45000&retry=true
   [junit4]   2> 1921526 INFO  (TEST-CollectionsAPIDistributedZkTest.test-seed#[FD3FB35516E95D91]) [    ] o.a.s.l.LogWatcher SLF4J impl is org.slf4j.impl.Log4jLoggerFactory
   [junit4]   2> 1921526 INFO  (TEST-CollectionsAPIDistributedZkTest.test-seed#[FD3FB35516E95D91]) [    ] o.a.s.l.LogWatcher Registering Log Listener [Log4j (org.slf4j.impl.Log4jLoggerFactory)]
   [junit4]   2> 1921526 INFO  (TEST-CollectionsAPIDistributedZkTest.test-seed#[FD3FB35516E95D91]) [    ] o.a.s.c.ZkContainer Zookeeper client=127.0.0.1:33675/solr
   [junit4]   2> 1921527 INFO  (TEST-CollectionsAPIDistributedZkTest.test-seed#[FD3FB35516E95D91]) [    ] o.a.s.c.ZkController zkHost includes chroot
   [junit4]   2> 1921527 INFO  (TEST-CollectionsAPIDistributedZkTest.test-seed#[FD3FB35516E95D91]) [    ] o.a.s.c.c.SolrZkClient Using default ZkCredentialsProvider
   [junit4]   2> 1921527 INFO  (TEST-CollectionsAPIDistributedZkTest.test-seed#[FD3FB35516E95D91]) [    ] o.a.s.c.c.ConnectionManager Waiting for client to connect to ZooKeeper
   [junit4]   2> 1921529 INFO  (zkCallback-976-thread-1) [    ] o.a.s.c.c.ConnectionManager Watcher org.apache.solr.common.cloud.ConnectionManager@bd0eaa6 name:ZooKeeperConnection Watcher:127.0.0.1:33675 got event WatchedEvent state:SyncConnected type:None path:null path:null type:None
   [junit4]   2> 1921529 INFO  (TEST-CollectionsAPIDistributedZkTest.test-seed#[FD3FB35516E95D91]) [    ] o.a.s.c.c.ConnectionManager Client is connected to ZooKeeper
   [junit4]   2> 1921529 INFO  (TEST-CollectionsAPIDistributedZkTest.test-seed#[FD3FB35516E95D91]) [    ] o.a.s.c.c.SolrZkClient Using default ZkACLProvider
   [junit4]   2> 1921531 INFO  (TEST-CollectionsAPIDistributedZkTest.test-seed#[FD3FB35516E95D91]) [n:127.0.0.1:32961_    ] o.a.s.c.c.ConnectionManager Waiting for client to connect to ZooKeeper
   [junit4]   2> 1921532 INFO  (zkCallback-977-thread-1-processing-n:127.0.0.1:32961_) [n:127.0.0.1:32961_    ] o.a.s.c.c.ConnectionManager Watcher org.apache.solr.common.cloud.ConnectionManager@2adf989a name:ZooKeeperConnection Watcher:127.0.0.1:33675/solr got event WatchedEvent state:SyncConnected type:None path:null path:null type:None
   [junit4]   2> 1921532 INFO  (TEST-CollectionsAPIDistributedZkTest.test-seed#[FD3FB35516E95D91]) [n:127.0.0.1:32961_    ] o.a.s.c.c.ConnectionManager Client is connected to ZooKeeper
   [junit4]   2> 1921533 INFO  (TEST-CollectionsAPIDistributedZkTest.test-seed#[FD3FB35516E95D91]) [n:127.0.0.1:32961_    ] o.a.s.c.c.SolrZkClient makePath: /overseer/queue
   [junit4]   2> 1921535 INFO  (TEST-CollectionsAPIDistributedZkTest.test-seed#[FD3FB35516E95D91]) [n:127.0.0.1:32961_    ] o.a.s.c.c.SolrZkClient makePath: /overseer/collection-queue-work
   [junit4]   2> 1921540 INFO  (TEST-CollectionsAPIDistributedZkTest.test-seed#[FD3FB35516E95D91]) [n:127.0.0.1:32961_    ] o.a.s.c.c.SolrZkClient makePath: /overseer/collection-map-running
   [junit4]   2> 1921542 INFO  (TEST-CollectionsAPIDistributedZkTest.test-seed#[FD3FB35516E95D91]) [n:127.0.0.1:32961_    ] o.a.s.c.c.SolrZkClient makePath: /overseer/collection-map-completed
   [junit4]   2> 1921544 INFO  (TEST-CollectionsAPIDistributedZkTest.test-seed#[FD3FB35516E95D91]) [n:127.0.0.1:32961_    ] o.a.s.c.c.SolrZkClient makePath: /overseer/collection-map-failure
   [junit4]   2> 1921546 INFO  (TEST-CollectionsAPIDistributedZkTest.test-seed#[FD3FB35516E95D91]) [n:127.0.0.1:32961_    ] o.a.s.c.c.SolrZkClient makePath: /live_nodes
   [junit4]   2> 1921548 INFO  (TEST-CollectionsAPIDistributedZkTest.test-seed#[FD3FB35516E95D91]) [n:127.0.0.1:32961_    ] o.a.s.c.c.SolrZkClient makePath: /aliases.json
   [junit4]   2> 1921550 INFO  (TEST-CollectionsAPIDistributedZkTest.test-seed#[FD3FB35516E95D91]) [n:127.0.0.1:32961_    ] o.a.s.c.c.SolrZkClient makePath: /clusterstate.json
   [junit4]   2> 1921551 INFO  (TEST-CollectionsAPIDistributedZkTest.test-seed#[FD3FB35516E95D91]) [n:127.0.0.1:32961_    ] o.a.s.c.c.SolrZkClient makePath: /security.json
   [junit4]   2> 1921553 INFO  (TEST-CollectionsAPIDistributedZkTest.test-seed#[FD3FB35516E95D91]) [n:127.0.0.1:32961_    ] o.a.s.c.ZkController Register node as live in ZooKeeper:/live_nodes/127.0.0.1:32961_
   [junit4]   2> 1921553 INFO  (TEST-CollectionsAPIDistributedZkTest.test-seed#[FD3FB35516E95D91]) [n:127.0.0.1:32961_    ] o.a.s.c.c.SolrZkClient makePath: /live_nodes/127.0.0.1:32961_
   [junit4]   2> 1921555 INFO  (TEST-CollectionsAPIDistributedZkTest.test-seed#[FD3FB35516E95D91]) [n:127.0.0.1:32961_    ] o.a.s.c.c.SolrZkClient makePath: /overseer_elect
   [junit4]   2> 1921557 INFO  (TEST-CollectionsAPIDistributedZkTest.test-seed#[FD3FB35516E95D91]) [n:127.0.0.1:32961_    ] o.a.s.c.c.SolrZkClient makePath: /overseer_elect/election
   [junit4]   2> 1921558 INFO  (TEST-CollectionsAPIDistributedZkTest.test-seed#[FD3FB35516E95D91]) [n:127.0.0.1:32961_    ] o.a.s.c.Overseer Overseer (id=null) closing
   [junit4]   2> 1921559 INFO  (TEST-CollectionsAPIDistributedZkTest.test-seed#[FD3FB35516E95D91]) [n:127.0.0.1:32961_    ] o.a.s.c.LeaderElector Joined leadership election with path: /overseer_elect/election/95224020988461060-127.0.0.1:32961_-n_0000000000
   [junit4]   2> 1921559 INFO  (TEST-CollectionsAPIDistributedZkTest.test-seed#[FD3FB35516E95D91]) [n:127.0.0.1:32961_    ] o.a.s.c.OverseerElectionContext I am going to be the leader 127.0.0.1:32961_
   [junit4]   2> 1921559 INFO  (TEST-CollectionsAPIDistributedZkTest.test-seed#[FD3FB35516E95D91]) [n:127.0.0.1:32961_    ] o.a.s.c.c.SolrZkClient makePath: /overseer_elect/leader
   [junit4]   2> 1921560 INFO  (TEST-CollectionsAPIDistributedZkTest.test-seed#[FD3FB35516E95D91]) [n:127.0.0.1:32961_    ] o.a.s.c.Overseer Overseer (id=95224020988461060-127.0.0.1:32961_-n_0000000000) starting
   [junit4]   2> 1921562 INFO  (TEST-CollectionsAPIDistributedZkTest.test-seed#[FD3FB35516E95D91]) [n:127.0.0.1:32961_    ] o.a.s.c.c.SolrZkClient makePath: /overseer/queue-work
   [junit4]   2> 1921570 INFO  (TEST-CollectionsAPIDistributedZkTest.test-seed#[FD3FB35516E95D91]) [n:127.0.0.1:32961_    ] o.a.s.c.OverseerAutoReplicaFailoverThread Starting OverseerAutoReplicaFailoverThread autoReplicaFailoverWorkLoopDelay=10000 autoReplicaFailoverWaitAfterExpiration=10000 autoReplicaFailoverBadNodeExpiration=60000
   [junit4]   2> 1921571 INFO  (OverseerCollectionConfigSetProcessor-95224020988461060-127.0.0.1:32961_-n_0000000000) [n:127.0.0.1:32961_    ] o.a.s.c.OverseerTaskProcessor Process current queue of overseer operations
   [junit4]   2> 1921571 INFO  (TEST-CollectionsAPIDistributedZkTest.test-seed#[FD3FB35516E95D91]) [n:127.0.0.1:32961_    ] o.a.s.c.c.ZkStateReader Updating cluster state from ZooKeeper... 
   [junit4]   2> 1921572 INFO  (OverseerStateUpdate-95224020988461060-127.0.0.1:32961_-n_0000000000) [n:127.0.0.1:32961_    ] o.a.s.c.Overseer Starting to work on the main queue
   [junit4]   2> 1921609 INFO  (TEST-CollectionsAPIDistributedZkTest.test-seed#[FD3FB35516E95D91]) [n:127.0.0.1:32961_    ] o.a.s.c.CoreContainer Security conf doesn't exist. Skipping setup for authorization module.
   [junit4]   2> 1921609 INFO  (TEST-CollectionsAPIDistributedZkTest.test-seed#[FD3FB35516E95D91]) [n:127.0.0.1:32961_    ] o.a.s.c.CoreContainer No authentication plugin used.
   [junit4]   2> 1921610 INFO  (TEST-CollectionsAPIDistributedZkTest.test-seed#[FD3FB35516E95D91]) [n:127.0.0.1:32961_    ] o.a.s.c.CorePropertiesLocator Looking for core definitions underneath /x1/jenkins/jenkins-slave/workspace/Lucene-Solr-NightlyTests-5.x/solr/build/solr-core/test/J1/../../../../../../../../../../x1/jenkins/jenkins-slave/workspace/Lucene-Solr-NightlyTests-5.x/solr/build/solr-core/test/J1/temp/solr.cloud.CollectionsAPIDistributedZkTest_FD3FB35516E95D91-001/control-001/cores
   [junit4]   2> 1921612 INFO  (TEST-CollectionsAPIDistributedZkTest.test-seed#[FD3FB35516E95D91]) [n:127.0.0.1:32961_    ] o.a.s.c.CoreDescriptor Created CoreDescriptor: {transient=false, dataDir=data/, configSetProperties=configsetprops.json, shard=, coreNodeName=, schema=schema.xml, loadOnStartup=true, config=solrconfig.xml, name=collection1, collection=control_collection}
   [junit4]   2> 1921612 INFO  (TEST-CollectionsAPIDistributedZkTest.test-seed#[FD3FB35516E95D91]) [n:127.0.0.1:32961_    ] o.a.s.c.CorePropertiesLocator Found core collection1 in /x1/jenkins/jenkins-slave/workspace/Lucene-Solr-NightlyTests-5.x/solr/build/solr-core/test/J1/../../../../../../../../../../x1/jenkins/jenkins-slave/workspace/Lucene-Solr-NightlyTests-5.x/solr/build/solr-core/test/J1/temp/solr.cloud.CollectionsAPIDistributedZkTest_FD3FB35516E95D91-001/control-001/cores/collection1
   [junit4]   2> 1921612 INFO  (TEST-CollectionsAPIDistributedZkTest.test-seed#[FD3FB35516E95D91]) [n:127.0.0.1:32961_    ] o.a.s.c.CorePropertiesLocator Found 1 core definitions
   [junit4]   2> 1921613 INFO  (TEST-CollectionsAPIDistributedZkTest.test-seed#[FD3FB35516E95D91]) [n:127.0.0.1:32961_    ] o.a.s.s.SolrDispatchFilter user.dir=/x1/jenkins/jenkins-slave/workspace/Lucene-Solr-NightlyTests-5.x/solr/build/solr-core/test/J1
   [junit4]   2> 1921613 INFO  (TEST-CollectionsAPIDistributedZkTest.test-seed#[FD3FB35516E95D91]) [n:127.0.0.1:32961_    ] o.a.s.s.SolrDispatchFilter SolrDispatchFilter.init() done
   [junit4]   2> 1921613 INFO  (coreLoadExecutor-3358-thread-1-processing-n:127.0.0.1:32961_) [n:127.0.0.1:32961_ c:control_collection   x:collection1] o.a.s.c.ZkController publishing state=down
   [junit4]   2> 1921613 INFO  (coreLoadExecutor-3358-thread-1-processing-n:127.0.0.1:32961_) [n:127.0.0.1:32961_ c:control_collection   x:collection1] o.a.s.c.ZkController numShards not found on descriptor - reading it from system property
   [junit4]   2> 1921615 INFO  (OverseerStateUpdate-95224020988461060-127.0.0.1:32961_-n_0000000000) [n:127.0.0.1:32961_    ] o.a.s.c.Overseer processMessage: queueSize: 1, message = {
   [junit4]   2>   "collection":"control_collection",
   [junit4]   2>   "shard":null,
   [junit4]   2>   "operation":"state",
   [junit4]   2>   "numShards":"1",
   [junit4]   2>   "state":"down",
   [junit4]   2>   "roles":null,
   [junit4]   2>   "core":"collection1",
   [junit4]   2>   "node_name":"127.0.0.1:32961_",
   [junit4]   2>   "base_url":"http://127.0.0.1:32961"} current state version: 0
   [junit4]   2> 1921616 INFO  (OverseerStateUpdate-95224020988461060-127.0.0.1:32961_-n_0000000000) [n:127.0.0.1:32961_    ] o.a.s.c.o.ReplicaMutator Update state numShards=1 message={
   [junit4]   2>   "collection":"control_collection",
   [junit4]   2>   "shard":null,
   [junit4]   2>   "operation":"state",
   [junit4]   2>   "numShards":"1",
   [junit4]   2>   "state":"down",
   [junit4]   2>   "roles":null,
   [junit4]   2>   "core":"collection1",
   [junit4]   2>   "node_name":"127.0.0.1:32961_",
   [junit4]   2>   "base_url":"http://127.0.0.1:32961"}
   [junit4]   2> 1921616 INFO  (coreLoadExecutor-3358-thread-1-processing-n:127.0.0.1:32961_) [n:127.0.0.1:32961_ c:control_collection   x:collection1] o.a.s.c.ZkController look for our core node name
   [junit4]   2> 1921616 INFO  (OverseerStateUpdate-95224020988461060-127.0.0.1:32961_-n_0000000000) [n:127.0.0.1:32961_    ] o.a.s.c.o.ClusterStateMutator building a new cName: control_collection
   [junit4]   2> 1921617 INFO  (OverseerStateUpdate-95224020988461060-127.0.0.1:32961_-n_0000000000) [n:127.0.0.1:32961_    ] o.a.s.c.o.ReplicaMutator Assigning new node to shard shard=shard1
   [junit4]   2> 1921619 INFO  (zkCallback-977-thread-1-processing-n:127.0.0.1:32961_) [n:127.0.0.1:32961_    ] o.a.s.c.c.ZkStateReader A cluster state change: [WatchedEvent state:SyncConnected type:NodeDataChanged path:/clusterstate.json], has occurred - updating... (live nodes size: [1])
   [junit4]   2> 1922617 INFO  (coreLoadExecutor-3358-thread-1-processing-n:127.0.0.1:32961_) [n:127.0.0.1:32961_ c:control_collection   x:collection1] o.a.s.c.ZkController waiting to find shard id in clusterstate for collection1
   [junit4]   2> 1922617 INFO  (coreLoadExecutor-3358-thread-1-processing-n:127.0.0.1:32961_) [n:127.0.0.1:32961_ c:control_collection   x:collection1] o.a.s.c.ZkController Check for collection zkNode:control_collection
   [junit4]   2> 1922618 INFO  (coreLoadExecutor-3358-thread-1-processing-n:127.0.0.1:32961_) [n:127.0.0.1:32961_ c:control_collection   x:collection1] o.a.s.c.ZkController Collection zkNode exists
   [junit4]   2> 1922618 INFO  (coreLoadExecutor-3358-thread-1-processing-n:127.0.0.1:32961_) [n:127.0.0.1:32961_ c:control_collection   x:collection1] o.a.s.c.c.ZkStateReader Load collection config from: [/collections/control_collection]
   [junit4]   2> 1922619 INFO  (coreLoadExecutor-3358-thread-1-processing-n:127.0.0.1:32961_) [n:127.0.0.1:32961_ c:control_collection   x:collection1] o.a.s.c.c.ZkStateReader path=[/collections/control_collection] [configName]=[conf1] specified config exists in ZooKeeper
   [junit4]   2> 1922619 INFO  (coreLoadExecutor-3358-thread-1-processing-n:127.0.0.1:32961_) [n:127.0.0.1:32961_ c:control_collection   x:collection1] o.a.s.c.SolrResourceLoader new SolrResourceLoader for directory: '/x1/jenkins/jenkins-slave/workspace/Lucene-Solr-NightlyTests-5.x/solr/build/solr-core/test/J1/temp/solr.cloud.CollectionsAPIDistributedZkTest_FD3FB35516E95D91-001/control-001/cores/collection1'
   [junit4]   2> 1922619 INFO  (coreLoadExecutor-3358-thread-1-processing-n:127.0.0.1:32961_) [n:127.0.0.1:32961_ c:control_collection   x:collection1] o.a.s.c.SolrResourceLoader JNDI not configured for solr (NoInitialContextEx)
   [junit4]   2> 1922619 INFO  (coreLoadExecutor-3358-thread-1-processing-n:127.0.0.1:32961_) [n:127.0.0.1:32961_ c:control_collection   x:collection1] o.a.s.c.SolrResourceLoader solr home defaulted to 'solr/' (could not find system property or JNDI)
   [junit4]   2> 1922621 INFO  (coreLoadExecutor-3358-thread-1-processing-n:127.0.0.1:32961_) [n:127.0.0.1:32961_ c:control_collection   x:collection1] o.a.s.c.Config loaded config solrconfig.xml with version 0 
   [junit4]   2> 1922628 INFO  (coreLoadExecutor-3358-thread-1-processing-n:127.0.0.1:32961_) [n:127.0.0.1:32961_ c:control_collection   x:collection1] o.a.s.c.SolrConfig current version of requestparams : -1
   [junit4]   2> 1922642 INFO  (coreLoadExecutor-3358-thread-1-processing-n:127.0.0.1:32961_) [n:127.0.0.1:32961_ c:control_collection   x:collection1] o.a.s.c.SolrConfig Using Lucene MatchVersion: 5.5.0
   [junit4]   2> 1922672 INFO  (coreLoadExecutor-3358-thread-1-processing-n:127.0.0.1:32961_) [n:127.0.0.1:32961_ c:control_collection   x:collection1] o.a.s.c.SolrConfig Loaded SolrConfig: solrconfig.xml
   [junit4]   2> 1922680 INFO  (coreLoadExecutor-3358-thread-1-processing-n:127.0.0.1:32961_) [n:127.0.0.1:32961_ c:control_collection   x:collection1] o.a.s.s.IndexSchema [collection1] Schema name=test
   [junit4]   2> 1922947 INFO  (coreLoadExecutor-3358-thread-1-processing-n:127.0.0.1:32961_) [n:127.0.0.1:32961_ c:control_collection   x:collection1] o.a.s.s.OpenExchangeRatesOrgProvider Initialized with rates=open-exchange-rates.json, refreshInterval=1440.
   [junit4]   2> 1922955 INFO  (coreLoadExecutor-3358-thread-1-processing-n:127.0.0.1:32961_) [n:127.0.0.1:32961_ c:control_collection   x:collection1] o.a.s.s.IndexSchema default search field in schema is text
   [junit4]   2> 1922957 INFO  (coreLoadExecutor-3358-thread-1-processing-n:127.0.0.1:32961_) [n:127.0.0.1:32961_ c:control_collection   x:collection1] o.a.s.s.IndexSchema unique key field: id
   [junit4]   2> 1922966 INFO  (coreLoadExecutor-3358-thread-1-processing-n:127.0.0.1:32961_) [n:127.0.0.1:32961_ c:control_collection   x:collection1] o.a.s.s.FileExchangeRateProvider Reloading exchange rates from file currency.xml
   [junit4]   2> 1922969 INFO  (coreLoadExecutor-3358-thread-1-processing-n:127.0.0.1:32961_) [n:127.0.0.1:32961_ c:control_collection   x:collection1] o.a.s.s.FileExchangeRateProvider Reloading exchange rates from file currency.xml
   [junit4]   2> 1922971 INFO  (coreLoadExecutor-3358-thread-1-processing-n:127.0.0.1:32961_) [n:127.0.0.1:32961_ c:control_collection   x:collection1] o.a.s.s.OpenExchangeRatesOrgProvider Reloading exchange rates from open-exchange-rates.json
   [junit4]   2> 1922972 INFO  (coreLoadExecutor-3358-thread-1-processing-n:127.0.0.1:32961_) [n:127.0.0.1:32961_ c:control_collection   x:collection1] o.a.s.s.OpenExchangeRatesOrgProvider Reloading exchange rates from open-exchange-rates.json
   [junit4]   2> 1922974 INFO  (coreLoadExecutor-3358-thread-1-processing-n:127.0.0.1:32961_) [n:127.0.0.1:32961_ c:control_collection   x:collection1] o.a.s.c.ConfigSetProperties Did not find ConfigSet properties, assuming default properties: Can't find resource 'configsetprops.json' in classpath or '/configs/conf1', cwd=/x1/jenkins/jenkins-slave/workspace/Lucene-Solr-NightlyTests-5.x/solr/build/solr-core/test/J1
   [junit4]   2> 1922974 INFO  (coreLoadExecutor-3358-thread-1-processing-n:127.0.0.1:32961_) [n:127.0.0.1:32961_ c:control_collection   x:collection1] o.a.s.c.CoreContainer Creating SolrCore 'collection1' using configuration from collection control_collection
   [junit4]   2> 1922974 INFO  (coreLoadExecutor-3358-thread-1-processing-n:127.0.0.1:32961_) [n:127.0.0.1:32961_ c:control_collection s:shard1 r:core_node1 x:collection1] o.a.s.c.SolrCore org.apache.solr.core.MockDirectoryFactory
   [junit4]   2> 1922974 INFO  (coreLoadExecutor-3358-thread-1-processing-n:127.0.0.1:32961_) [n:127.0.0.1:32961_ c:control_collection s:shard1 r:core_node1 x:collection1] o.a.s.c.SolrCore [[collection1] ] Opening new SolrCore at [/x1/jenkins/jenkins-slave/workspace/Lucene-Solr-NightlyTests-5.x/solr/build/solr-core/test/J1/temp/solr.cloud.CollectionsAPIDistributedZkTest_FD3FB35516E95D91-001/control-001/cores/collection1], dataDir=[/x1/jenkins/jenkins-slave/workspace/Lucene-Solr-NightlyTests-5.x/solr/build/solr-core/test/J1/../../../../../../../../../../x1/jenkins/jenkins-slave/workspace/Lucene-Solr-NightlyTests-5.x/solr/build/solr-core/test/J1/temp/solr.cloud.CollectionsAPIDistributedZkTest_FD3FB35516E95D91-001/control-001/cores/collection1/data/]
   [junit4]   2> 1922974 INFO  (coreLoadExecutor-3358-thread-1-processing-n:127.0.0.1:32961_) [n:127.0.0.1:32961_ c:control_collection s:shard1 r:core_node1 x:collection1] o.a.s.c.JmxMonitoredMap JMX monitoring is enabled. Adding Solr mbeans to JMX Server: com.sun.jmx.mbeanserver.JmxMBeanServer@166bcf1a
   [junit4]   2> 1922975 INFO  (coreLoadExecutor-3358-thread-1-processing-n:127.0.0.1:32961_) [n:127.0.0.1:32961_ c:control_collection s:shard1 r:core_node1 x:collection1] o.a.s.c.CachingDirectoryFactory return new directory for /x1/jenkins/jenkins-slave/workspace/Lucene-Solr-NightlyTests-5.x/solr/build/solr-core/test/J1/../../../../../../../../../../x1/jenkins/jenkins-slave/workspace/Lucene-Solr-NightlyTests-5.x/solr/build/solr-core/test/J1/temp/solr.cloud.CollectionsAPIDistributedZkTest_FD3FB35516E95D91-001/control-001/cores/collection1/data
   [junit4]   2> 1922975 INFO  (coreLoadExecutor-3358-thread-1-processing-n:127.0.0.1:32961_) [n:127.0.0.1:32961_ c:control_collection s:shard1 r:core_node1 x:collection1] o.a.s.c.SolrCore New index directory detected: old=null new=/x1/jenkins/jenkins-slave/workspace/Lucene-Solr-NightlyTests-5.x/solr/build/solr-core/test/J1/../../../../../../../../../../x1/jenkins/jenkins-slave/workspace/Lucene-Solr-NightlyTests-5.x/solr/build/solr-core/test/J1/temp/solr.cloud.CollectionsAPIDistributedZkTest_FD3FB35516E95D91-001/control-001/cores/collection1/data/index/
   [junit4]   2> 1922975 WARN  (coreLoadExecutor-3358-thread-1-processing-n:127.0.0.1:32961_) [n:127.0.0.1:32961_ c:control_collection s:shard1 r:core_node1 x:collection1] o.a.s.c.SolrCore [collection1] Solr index directory '/x1/jenkins/jenkins-slave/workspace/Lucene-Solr-NightlyTests-5.x/solr/build/solr-core/test/J1/../../../../../../../../../../x1/jenkins/jenkins-slave/workspace/Lucene-Solr-NightlyTests-5.x/solr/build/solr-core/test/J1/temp/solr.cloud.CollectionsAPIDistributedZkTest_FD3FB35516E95D91-001/control-001/cores/collection1/data/index' doesn't exist. Creating new index...
   [junit4]   2> 1922975 INFO  (coreLoadExecutor-3358-thread-1-processing-n:127.0.0.1:32961_) [n:127.0.0.1:32961_ c:control_collection s:shard1 r:core_node1 x:collection1] o.a.s.c.CachingDirectoryFactory return new directory for /x1/jenkins/jenkins-slave/workspace/Lucene-Solr-NightlyTests-5.x/solr/build/solr-core/test/J1/../../../../../../../../../../x1/jenkins/jenkins-slave/workspace/Lucene-Solr-NightlyTests-5.x/solr/build/solr-core/test/J1/temp/solr.cloud.CollectionsAPIDistributedZkTest_FD3FB35516E95D91-001/control-001/cores/collection1/data/index
   [junit4]   2> 1922975 INFO  (coreLoadExecutor-3358-thread-1-processing-n:127.0.0.1:32961_) [n:127.0.0.1:32961_ c:control_collection s:shard1 r:core_node1 x:collection1] o.a.s.u.RandomMergePolicy RandomMergePolicy wrapping class org.apache.lucene.index.TieredMergePolicy: [TieredMergePolicy: maxMergeAtOnce=16, maxMergeAtOnceExplicit=39, maxMergedSegmentMB=52.0048828125, floorSegmentMB=0.50390625, forceMergeDeletesPctAllowed=6.93694183714036, segmentsPerTier=45.0, maxCFSSegmentSizeMB=8.796093022207999E12, noCFSRatio=0.2604247779116181
   [junit4]   2> 1922976 INFO  (coreLoadExecutor-3358-thread-1-processing-n:127.0.0.1:32961_) [n:127.0.0.1:32961_ c:control_collection s:shard1 r:core_node1 x:collection1] o.a.s.c.SolrDeletionPolicy SolrDeletionPolicy.onCommit: commits: num=1
   [junit4]   2> 	commit{dir=MockDirectoryWrapper(RAMDirectory@76cbaaaa lockFactory=org.apache.lucene.store.SingleInstanceLockFactory@3531bbd4),segFN=segments_1,generation=1}
   [junit4]   2> 1922976 INFO  (coreLoadExecutor-3358-thread-1-processing-n:127.0.0.1:32961_) [n:127.0.0.1:32961_ c:control_collection s:shard1 r:core_node1 x:collection1] o.a.s.c.SolrDeletionPolicy newest commit generation = 1
   [junit4]   2> 1922977 INFO  (OldIndexDirectoryCleanupThreadForCore-collection1) [n:127.0.0.1:32961_ c:control_collection s:shard1 r:core_node1 x:collection1] o.a.s.c.SolrCore Looking for old index directories to cleanup for core collection1 in /x1/jenkins/jenkins-slave/workspace/Lucene-Solr-NightlyTests-5.x/solr/build/solr-core/test/J1/../../../../../../../../../../x1/jenkins/jenkins-slave/workspace/Lucene-Solr-NightlyTests-5.x/solr/build/solr-core/test/J1/temp/solr.cloud.CollectionsAPIDistributedZkTest_FD3FB35516E95D91-001/control-001/cores/collection1/data/
   [junit4]   2> 1922977 WARN  (OldIndexDirectoryCleanupThreadForCore-collection1) [n:127.0.0.1:32961_ c:control_collection s:shard1 r:core_node1 x:collection1] o.a.s.c.DirectoryFactory /x1/jenkins/jenkins-slave/workspace/Lucene-Solr-NightlyTests-5.x/solr/build/solr-core/test/J1/../../../../../../../../../../x1/jenkins/jenkins-slave/workspace/Lucene-Solr-NightlyTests-5.x/solr/build/solr-core/test/J1/temp/solr.cloud.CollectionsAPIDistributedZkTest_FD3FB35516E95D91-001/control-001/cores/collection1/data/ does not point to a valid data directory; skipping clean-up of old index directories.
   [junit4]   2> 1922980 INFO  (coreLoadExecutor-3358-thread-1-processing-n:127.0.0.1:32961_) [n:127.0.0.1:32961_ c:control_collection s:shard1 r:core_node1 x:collection1] o.a.s.u.p.UpdateRequestProcessorChain creating updateRequestProcessorChain "nodistrib"
   [junit4]   2> 1922980 INFO  (coreLoadExecutor-3358-thread-1-processing-n:127.0.0.1:32961_) [n:127.0.0.1:32961_ c:control_collection s:shard1 r:core_node1 x:collection1] o.a.s.u.p.UpdateRequestProcessorChain creating updateRequestProcessorChain "dedupe"
   [junit4]   2> 1922980 INFO  (coreLoadExecutor-3358-thread-1-processing-n:127.0.0.1:32961_) [n:127.0.0.1:32961_ c:control_collection s:shard1 r:core_node1 x:collection1] o.a.s.u.p.UpdateRequestProcessorChain inserting DistributedUpdateProcessorFactory into updateRequestProcessorChain "dedupe"
   [junit4]   2> 1922980 INFO  (coreLoadExecutor-3358-thread-1-processing-n:127.0.0.1:32961_) [n:127.0.0.1:32961_ c:control_collection s:shard1 r:core_node1 x:collection1] o.a.s.u.p.UpdateRequestProcessorChain creating updateRequestProcessorChain "stored_sig"
   [junit4]   2> 1922980 INFO  (coreLoadExecutor-3358-thread-1-processing-n:127.0.0.1:32961_) [n:127.0.0.1:32961_ c:control_collection s:shard1 r:core_node1 x:collection1] o.a.s.u.p.UpdateRequestProcessorChain inserting DistributedUpdateProcessorFactory into updateRequestProcessorChain "stored_sig"
   [junit4]   2> 1922980 INFO  (coreLoadExecutor-3358-thread-1-processing-n:127.0.0.1:32961_) [n:127.0.0.1:32961_ c:control_collection s:shard1 r:core_node1 x:collection1] o.a.s.u.p.UpdateRequestProcessorChain creating updateRequestProcessorChain "distrib-dup-test-chain-explicit"
   [junit4]   2> 1922981 INFO  (coreLoadExecutor-3358-thread-1-processing-n:127.0.0.1:32961_) [n:127.0.0.1:32961_ c:control_collection s:shard1 r:core_node1 x:collection1] o.a.s.u.p.UpdateRequestProcessorChain creating updateRequestProcessorChain "distrib-dup-test-chain-implicit"
   [junit4]   2> 1922981 INFO  (coreLoadExecutor-3358-thread-1-processing-n:127.0.0.1:32961_) [n:127.0.0.1:32961_ c:control_collection s:shard1 r:core_node1 x:collection1] o.a.s.u.p.UpdateRequestProcessorChain inserting DistributedUpdateProcessorFactory into updateRequestProcessorChain "distrib-dup-test-chain-implicit"
   [junit4]   2> 1922981 INFO  (coreLoadExecutor-3358-thread-1-processing-n:127.0.0.1:32961_) [n:127.0.0.1:32961_ c:control_collection s:shard1 r:core_node1 x:collection1] o.a.s.c.SolrCore no updateRequestProcessorChain defined as default, creating implicit default
   [junit4]   2> 1922981 WARN  (coreLoadExecutor-3358-thread-1-processing-n:127.0.0.1:32961_) [n:127.0.0.1:32961_ c:control_collection s:shard1 r:core_node1 x:collection1] o.a.s.c.RequestHandlers INVALID paramSet a in requestHandler {type = requestHandler,name = /dump,class = DumpRequestHandler,args = {defaults={a=A,b=B}}}
   [junit4]   2> 1922984 INFO  (coreLoadExecutor-3358-thread-1-processing-n:127.0.0.1:32961_) [n:127.0.0.1:32961_ c:control_collection s:shard1 r:core_node1 x:collection1] o.a.s.h.l.XMLLoader xsltCacheLifetimeSeconds=60
   [junit4]   2> 1922985 INFO  (coreLoadExecutor-3358-thread-1-processing-n:127.0.0.1:32961_) [n:127.0.0.1:32961_ c:control_collection s:shard1 r:core_node1 x:collection1] o.a.s.h.l.XMLLoader xsltCacheLifetimeSeconds=60
   [junit4]   2> 1922986 INFO  (coreLoadExecutor-3358-thread-1-processing-n:127.0.0.1:32961_) [n:127.0.0.1:32961_ c:control_collection s:shard1 r:core_node1 x:collection1] o.a.s.h.l.XMLLoader xsltCacheLifetimeSeconds=60
   [junit4]   2> 1922988 INFO  (coreLoadExecutor-3358-thread-1-processing-n:127.0.0.1:32961_) [n:127.0.0.1:32961_ c:control_collection s:shard1 r:core_node1 x:collection1] o.a.s.h.l.XMLLoader xsltCacheLifetimeSeconds=60
   [junit4]   2> 1922991 INFO  (coreLoadExecutor-3358-thread-1-processing-n:127.0.0.1:32961_) [n:127.0.0.1:32961_ c:control_collection s:shard1 r:core_node1 x:collection1] o.a.s.c.RequestHandlers Registered paths: /admin/properties,/schema,/admin/segments,/update/json,/config,/admin/threads,/update/json/docs,standard,/admin/luke,/admin/plugins,/update/csv,/update,/replication,/admin/logging,/admin/mbeans,/dump,/get,/admin/file,/admin/system,/admin/ping
   [junit4]   2> 1922992 INFO  (coreLoadExecutor-3358-thread-1-processing-n:127.0.0.1:32961_) [n:127.0.0.1:32961_ c:control_collection s:shard1 r:core_node1 x:collection1] o.a.s.c.SolrCore Using default statsCache cache: org.apache.solr.search.stats.LocalStatsCache
   [junit4]   2> 1922993 INFO  (coreLoadExecutor-3358-thread-1-processing-n:127.0.0.1:32961_) [n:127.0.0.1:32961_ c:control_collection s:shard1 r:core_node1 x:collection1] o.a.s.u.UpdateHandler Using UpdateLog implementation: org.apache.solr.update.UpdateLog
   [junit4]   2> 1922993 INFO  (coreLoadExecutor-3358-thread-1-processing-n:127.0.0.1:32961_) [n:127.0.0.1:32961_ c:control_collection s:shard1 r:core_node1 x:collection1] o.a.s.u.UpdateLog Initializing UpdateLog: dataDir= defaultSyncLevel=FLUSH numRecordsToKeep=100 maxNumLogsToKeep=10 numVersionBuckets=65536
   [junit4]   2> 1922994 INFO  (coreLoadExecutor-3358-thread-1-processing-n:127.0.0.1:32961_) [n:127.0.0.1:32961_ c:control_collection s:shard1 r:core_node1 x:collection1] o.a.s.u.CommitTracker Hard AutoCommit: disabled
   [junit4]   2> 1922994 INFO  (coreLoadExecutor-3358-thread-1-processing-n:127.0.0.1:32961_) [n:127.0.0.1:32961_ c:control_collection s:shard1 r:core_node1 x:collection1] o.a.s.u.CommitTracker Soft AutoCommit: disabled
   [junit4]   2> 1922994 INFO  (coreLoadExecutor-3358-thread-1-processing-n:127.0.0.1:32961_) [n:127.0.0.1:32961_ c:control_collection s:shard1 r:core_node1 x:collection1] o.a.s.u.RandomMergePolicy RandomMergePolicy wrapping class org.apache.lucene.index.LogDocMergePolicy: [LogDocMergePolicy: minMergeSize=1000, mergeFactor=18, maxMergeSize=9223372036854775807, maxMergeSizeForForcedMerge=9223372036854775807, calibrateSizeByDeletes=false, maxMergeDocs=2147483647, maxCFSSegmentSizeMB=8.796093022207999E12, noCFSRatio=1.0]
   [junit4]   2> 1922995 INFO  (coreLoadExecutor-3358-thread-1-processing-n:127.0.0.1:32961_) [n:127.0.0.1:32961_ c:control_collection s:shard1 r:core_node1 x:collection1] o.a.s.c.SolrDeletionPolicy SolrDeletionPolicy.onInit: commits: num=1
   [junit4]   2> 	commit{dir=MockDirectoryWrapper(RAMDirectory@76cbaaaa lockFactory=org.apache.lucene.store.SingleInstanceLockFactory@3531bbd4),segFN=segments_1,generation=1}
   [junit4]   2> 1922995 INFO  (coreLoadExecutor-3358-thread-1-processing-n:127.0.0.1:32961_) [n:127.0.0.1:32961_ c:control_collection s:shard1 r:core_node1 x:collection1] o.a.s.c.SolrDeletionPolicy newest commit generation = 1
   [junit4]   2> 1922995 INFO  (coreLoadExecutor-3358-thread-1-processing-n:127.0.0.1:32961_) [n:127.0.0.1:32961_ c:control_collection s:shard1 r:core_node1 x:collection1] o.a.s.s.SolrIndexSearcher Opening Searcher@760752f2[collection1] main
   [junit4]   2> 1922995 INFO  (coreLoadExecutor-3358-thread-1-processing-n:127.0.0.1:32961_) [n:127.0.0.1:32961_ c:control_collection s:shard1 r:core_node1 x:collection1] o.a.s.c.c.ZkStateReader Load collection config from: [/collections/control_collection]
   [junit4]   2> 1922996 INFO  (coreLoadExecutor-3358-thread-1-processing-n:127.0.0.1:32961_) [n:127.0.0.1:32961_ c:control_collection s:shard1 r:core_node1 x:collection1] o.a.s.c.c.ZkStateReader path=[/collections/control_collection] [configName]=[conf1] specified config exists in ZooKeeper
   [junit4]   2> 1922996 INFO  (coreLoadExecutor-3358-thread-1-processing-n:127.0.0.1:32961_) [n:127.0.0.1:32961_ c:control_collection s:shard1 r:core_node1 x:collection1] o.a.s.r.ManagedResourceStorage Setting up ZooKeeper-based storage for the RestManager with znodeBase: /configs/conf1
   [junit4]   2> 1922996 INFO  (coreLoadExecutor-3358-thread-1-processing-n:127.0.0.1:32961_) [n:127.0.0.1:32961_ c:control_collection s:shard1 r:core_node1 x:collection1] o.a.s.r.ManagedResourceStorage Configured ZooKeeperStorageIO with znodeBase: /configs/conf1
   [junit4]   2> 1922996 INFO  (coreLoadExecutor-3358-thread-1-processing-n:127.0.0.1:32961_) [n:127.0.0.1:32961_ c:control_collection s:shard1 r:core_node1 x:collection1] o.a.s.r.RestManager Initializing RestManager with initArgs: {}
   [junit4]   2> 1922996 INFO  (coreLoadExecutor-3358-thread-1-processing-n:127.0.0.1:32961_) [n:127.0.0.1:32961_ c:control_collection s:shard1 r:core_node1 x:collection1] o.a.s.r.ManagedResourceStorage Reading _rest_managed.json using ZooKeeperStorageIO:path=/configs/conf1
   [junit4]   2> 1922997 INFO  (coreLoadExecutor-3358-thread-1-processing-n:127.0.0.1:32961_) [n:127.0.0.1:32961_ c:control_collection s:shard1 r:core_node1 x:collection1] o.a.s.r.ManagedResourceStorage No data found for znode /configs/conf1/_rest_managed.json
   [junit4]   2> 1922997 INFO  (coreLoadExecutor-3358-thread-1-processing-n:127.0.0.1:32961_) [n:127.0.0.1:32961_ c:control_collection s:shard1 r:core_node1 x:collection1] o.a.s.r.ManagedResourceStorage Loaded null at path _rest_managed.json using ZooKeeperStorageIO:path=/configs/conf1
   [junit4]   2> 1922997 INFO  (coreLoadExecutor-3358-thread-1-processing-n:127.0.0.1:32961_) [n:127.0.0.1:32961_ c:control_collection s:shard1 r:core_node1 x:collection1] o.a.s.r.RestManager Initializing 0 registered ManagedResources
   [junit4]   2> 1922997 INFO  (coreLoadExecutor-3358-thread-1-processing-n:127.0.0.1:32961_) [n:127.0.0.1:32961_ c:control_collection s:shard1 r:core_node1 x:collection1] o.a.s.h.ReplicationHandler Commits will be reserved for  10000
   [junit4]   2> 1922998 INFO  (searcherExecutor-3359-thread-1-processing-c:control_collection s:shard1 r:core_node1 x:collection1 n:127.0.0.1:32961_) [n:127.0.0.1:32961_ c:control_collection s:shard1 r:core_node1 x:collection1] o.a.s.c.SolrCore [collection1] Registered new searcher Searcher@760752f2[collection1] main{ExitableDirectoryReader(UninvertingDirectoryReader())}
   [junit4]   2> 1922998 INFO  (coreLoadExecutor-3358-thread-1-processing-n:127.0.0.1:32961_) [n:127.0.0.1:32961_ c:control_collection s:shard1 r:core_node1 x:collection1] o.a.s.u.UpdateLog Looking up max value of version field to seed version buckets
   [junit4]   2> 1922998 INFO  (coreLoadExecutor-3358-thread-1-processing-n:127.0.0.1:32961_) [n:127.0.0.1:32961_ c:control_collection s:shard1 r:core_node1 x:collection1] o.a.s.u.VersionInfo Refreshing highest value of _version_ for 65536 version buckets from index
   [junit4]   2> 1922998 INFO  (coreLoadExecutor-3358-thread-1-processing-n:127.0.0.1:32961_) [n:127.0.0.1:32961_ c:control_collection s:shard1 r:core_node1 x:collection1] o.a.s.u.VersionInfo No terms found for _version_, cannot seed version bucket highest value from index
   [junit4]   2> 1922998 INFO  (coreLoadExecutor-3358-thread-1-processing-n:127.0.0.1:32961_) [n:127.0.0.1:32961_ c:control_collection s:shard1 r:core_node1 x:collection1] o.a.s.u.UpdateLog Could not find max version in index or recent updates, using new clock 1523584337884217344
   [junit4]   2> 1923000 INFO  (coreLoadExecutor-3358-thread-1-processing-n:127.0.0.1:32961_) [n:127.0.0.1:32961_ c:control_collection s:shard1 r:core_node1 x:collection1] o.a.s.u.UpdateLog Took 2.0ms to seed version buckets with highest version 1523584337884217344
   [junit4]   2> 1923000 INFO  (coreLoadExecutor-3358-thread-1-processing-n:127.0.0.1:32961_) [n:127.0.0.1:32961_ c:control_collection s:shard1 r:core_node1 x:collection1] o.a.s.c.ZkController watch zkdir /configs/conf1
   [junit4]   2> 1923001 INFO  (coreLoadExecutor-3358-thread-1-processing-n:127.0.0.1:32961_) [n:127.0.0.1:32961_ c:control_collection s:shard1 r:core_node1 x:collection1] o.a.s.c.CoreContainer registering core: collection1
   [junit4]   2> 1923001 INFO  (coreZkRegister-3352-thread-1-processing-c:control_collection s:shard1 r:core_node1 x:collection1 n:127.0.0.1:32961_) [n:127.0.0.1:32961_ c:control_collection s:shard1 r:core_node1 x:collection1] o.a.s.c.ZkController Register replica - core:collection1 address:http://127.0.0.1:32961 collection:control_collection shard:shard1
   [junit4]   2> 1923002 INFO  (coreZkRegister-3352-thread-1-processing-c:control_collection s:shard1 r:core_node1 x:collection1 n:127.0.0.1:32961_) [n:127.0.0.1:32961_ c:control_collection s:shard1 r:core_node1 x:collection1] o.a.s.c.c.SolrZkClient makePath: /collections/control_collection/leader_elect/shard1/election
   [junit4]   2> 1923006 INFO  (coreZkRegister-3352-thread-1-processing-c:control_collection s:shard1 r:core_node1 x:collection1 n:127.0.0.1:32961_) [n:127.0.0.1:32961_ c:control_collection s:shard1 r:core_node1 x:collection1] o.a.s.c.LeaderElector Joined leadership election with path: /collections/control_collection/leader_elect/shard1/election/95224020988461060-core_node1-n_0000000000
   [junit4]   2> 1923006 INFO  (coreZkRegister-3352-thread-1-processing-c:control_collection s:shard1 r:core_node1 x:collection1 n:127.0.0.1:32961_) [n:127.0.0.1:32961_ c:control_collection s:shard1 r:core_node1 x:collection1] o.a.s.c.ShardLeaderElectionContext Running the leader process for shard=shard1 and weAreReplacement=false and leaderVoteWait=180000
   [junit4]   2> 1923008 INFO  (coreZkRegister-3352-thread-1-processing-c:control_collection s:shard1 r:core_node1 x:collection1 n:127.0.0.1:32961_) [n:127.0.0.1:32961_ c:control_collection s:shard1 r:core_node1 x:collection1] o.a.s.c.ShardLeaderElectionContext Enough replicas found to continue.
   [junit4]   2> 1923008 INFO  (coreZkRegister-3352-thread-1-processing-c:control_collection s:shard1 r:core_node1 x:collection1 n:127.0.0.1:32961_) [n:127.0.0.1:32961_ c:control_collection s:shard1 r:core_node1 x:collection1] o.a.s.c.ShardLeaderElectionContext I may be the new leader - try and sync
   [junit4]   2> 1923008 INFO  (coreZkRegister-3352-thread-1-processing-c:control_collection s:shard1 r:core_node1 x:collection1 n:127.0.0.1:32961_) [n:127.0.0.1:32961_ c:control_collection s:shard1 r:core_node1 x:collection1] o.a.s.c.SyncStrategy Sync replicas to http://127.0.0.1:32961/collection1/
   [junit4]   2> 1923008 INFO  (OverseerStateUpdate-95224020988461060-127.0.0.1:32961_-n_0000000000) [n:127.0.0.1:32961_    ] o.a.s.c.Overseer processMessage: queueSize: 1, message = {
   [junit4]   2>   "operation":"leader",
   [junit4]   2>   "shard":"shard1",
   [junit4]   2>   "collection":"control_collection"} current state version: 1
   [junit4]   2> 1923008 INFO  (coreZkRegister-3352-thread-1-processing-c:control_collection s:shard1 r:core_node1 x:collection1 n:127.0.0.1:32961_) [n:127.0.0.1:32961_ c:control_collection s:shard1 r:core_node1 x:collection1] o.a.s.c.SyncStrategy Sync Success - now sync replicas to me
   [junit4]   2> 1923008 INFO  (coreZkRegister-3352-thread-1-processing-c:control_collection s:shard1 r:core_node1 x:collection1 n:127.0.0.1:32961_) [n:127.0.0.1:32961_ c:control_collection s:shard1 r:core_node1 x:collection1] o.a.s.c.SyncStrategy http://127.0.0.1:32961/collection1/ has no replicas
   [junit4]   2> 1923009 INFO  (coreZkRegister-3352-thread-1-processing-c:control_collection s:shard1 r:core_node1 x:collection1 n:127.0.0.1:32961_) [n:127.0.0.1:32961_ c:control_collection s:shard1 r:core_node1 x:collection1] o.a.s.c.c.SolrZkClient makePath: /collections/control_collection/leaders/shard1
   [junit4]   2> 1923011 INFO  (coreZkRegister-3352-thread-1-processing-c:control_collection s:shard1 r:core_node1 x:collection1 n:127.0.0.1:32961_) [n:127.0.0.1:32961_ c:control_collection s:shard1 r:core_node1 x:collection1] o.a.s.c.ShardLeaderElectionContextBase Creating leader registration node
   [junit4]   2> 1923013 INFO  (coreZkRegister-3352-thread-1-processing-c:control_collection s:shard1 r:core_node1 x:collection1 n:127.0.0.1:32961_) [n:127.0.0.1:32961_ c:control_collection s:shard1 r:core_node1 x:collection1] o.a.s.c.ShardLeaderElectionContext I am the new leader: http://127.0.0.1:32961/collection1/ shard1
   [junit4]   2> 1923014 INFO  (OverseerStateUpdate-95224020988461060-127.0.0.1:32961_-n_0000000000) [n:127.0.0.1:32961_    ] o.a.s.c.Overseer processMessage: queueSize: 1, message = {
   [junit4]   2>   "operation":"leader",
   [junit4]   2>   "shard":"shard1",
   [junit4]   2>   "collection":"control_collection",
   [junit4]   2>   "base_url":"http://127.0.0.1:32961",
   [junit4]   2>   "core":"collection1",
   [junit4]   2>   "state":"active"} current state version: 1
   [junit4]   2> 1923115 INFO  (TEST-CollectionsAPIDistributedZkTest.test-seed#[FD3FB35516E95D91]) [    ] o.a.s.c.c.SolrZkClient Using default ZkCredentialsProvider
   [junit4]   2> 1923116 INFO  (zkCallback-977-thread-1-processing-n:127.0.0.1:32961_) [n:127.0.0.1:32961_    ] o.a.s.c.c.ZkStateReader A cluster state change: [WatchedEvent state:SyncConnected type:NodeDataChanged path:/clusterstate.json], has occurred - updating... (live nodes size: [1])
   [junit4]   2> 1923117 INFO  (TEST-CollectionsAPIDistributedZkTest.test-seed#[FD3FB35516E95D91]) [    ] o.a.s.c.c.ConnectionManager Waiting for client to connect to ZooKeeper
   [junit4]   2> 1923118 INFO  (zkCallback-979-thread-1) [    ] o.a.s.c.c.ConnectionManager Watcher org.apache.solr.common.cloud.ConnectionManager@4af05ce2 name:ZooKeeperConnection Watcher:127.0.0.1:33675/solr got event WatchedEvent state:SyncConnected type:None path:null path:null type:None
   [junit4]   2> 1923118 INFO  (TEST-CollectionsAPIDistributedZkTest.test-seed#[FD3FB35516E95D91]) [    ] o.a.s.c.c.ConnectionManager Client is connected to ZooKeeper
   [junit4]   2> 1923119 INFO  (TEST-CollectionsAPIDistributedZkTest.test-seed#[FD3FB35516E95D91]) [    ] o.a.s.c.c.SolrZkClient Using default ZkACLProvider
   [junit4]   2> 1923119 INFO  (TEST-CollectionsAPIDistributedZkTest.test-seed#[FD3FB35516E95D91]) [    ] o.a.s.c.c.ZkStateReader Updating cluster state from ZooKeeper... 
   [junit4]   2> 1923121 INFO  (TEST-CollectionsAPIDistributedZkTest.test-seed#[FD3FB35516E95D91]) [    ] o.a.s.c.ChaosMonkey monkey: init - expire sessions:false cause connection loss:false
   [junit4]   2> 1923121 INFO  (TEST-CollectionsAPIDistributedZkTest.test-seed#[FD3FB35516E95D91]) [    ] o.a.s.c.AbstractFullDistribZkTestBase Creating collection1 with stateFormat=2
   [junit4]   2> 1923121 INFO  (TEST-CollectionsAPIDistributedZkTest.test-seed#[FD3FB35516E95D91]) [    ] o.a.s.c.c.SolrZkClient Using default ZkCredentialsProvider
   [junit4]   2> 1923121 INFO  (TEST-CollectionsAPIDistributedZkTest.test-seed#[FD3FB35516E95D91]) [    ] o.a.s.c.c.ConnectionManager Waiting for client to connect to ZooKeeper
   [junit4]   2> 1923122 INFO  (zkCallback-980-thread-1) [    ] o.a.s.c.c.ConnectionManager Watcher org.apache.solr.common.cloud.ConnectionManager@70973c50 name:ZooKeeperConnection Watcher:127.0.0.1:33675/solr got event WatchedEvent state:SyncConnected type:None path:null path:null type:None
   [junit4]   2> 1923122 INFO  (TEST-CollectionsAPIDistributedZkTest.test-seed#[FD3FB35516E95D91]) [    ] o.a.s.c.c.ConnectionManager Client is connected to ZooKeeper
   [junit4]   2> 1923122 INFO  (TEST-CollectionsAPIDistributedZkTest.test-seed#[FD3FB35516E95D91]) [    ] o.a.s.c.c.SolrZkClient Using default ZkACLProvider
   [junit4]   2> 1923124 WARN  (NIOServerCxn.Factory:0.0.0.0/0.0.0.0:0) [    ] o.a.z.s.NIOServerCnxn caught end of stream exception
   [junit4]   2> EndOfStreamException: Unable to read additional data from client sessionid 0x1524dbe191a0006, likely client has closed socket
   [junit4]   2> 	at org.apache.zookeeper.server.NIOServerCnxn.doIO(NIOServerCnxn.java:228)
   [junit4]   2> 	at org.apache.zookeeper.server.NIOServerCnxnFactory.run(NIOServerCnxnFactory.java:208)
   [junit4]   2> 	at java.lang.Thread.run(Thread.java:745)
   [junit4]   2> 1923125 INFO  (OverseerStateUpdate-95224020988461060-127.0.0.1:32961_-n_0000000000) [n:127.0.0.1:32961_    ] o.a.s.c.Overseer processMessage: queueSize: 1, message = {
   [junit4]   2>   "operation":"create",
   [junit4]   2>   "name":"collection1",
   [junit4]   2>   "numShards":"2",
   [junit4]   2>   "stateFormat":"2"} current state version: 2
   [junit4]   2> 1923125 INFO  (OverseerStateUpdate-95224020988461060-127.0.0.1:32961_-n_0000000000) [n:127.0.0.1:32961_    ] o.a.s.c.o.ClusterStateMutator building a new cName: collection1
   [junit4]   2> 1923164 INFO  (coreZkRegister-3352-thread-1-processing-c:control_collection s:shard1 r:core_node1 x:collection1 n:127.0.0.1:32961_) [n:127.0.0.1:32961_ c:control_collection s:shard1 r:core_node1 x:collection1] o.a.s.c.ZkController We are http://127.0.0.1:32961/collection1/ and leader is http://127.0.0.1:32961/collection1/
   [junit4]   2> 1923164 INFO  (coreZkRegister-3352-thread-1-processing-c:control_collection s:shard1 r:core_node1 x:collection1 n:127.0.0.1:32961_) [n:127.0.0.1:32961_ c:control_collection s:shard1 r:core_node1 x:collection1] o.a.s.c.ZkController No LogReplay needed for core=collection1 baseURL=http://127.0.0.1:32961
   [junit4]   2> 1923164 INFO  (coreZkRegister-3352-thread-1-processing-c:control_collection s:shard1 r:core_node1 x:collection1 n:127.0.0.1:32961_) [n:127.0.0.1:32961_ c:control_collection s:shard1 r:core_node1 x:collection1] o.a.s.c.ZkController I am the leader, no recovery necessary
   [junit4]   2> 1923164 INFO  (coreZkRegister-3352-thread-1-processing-c:control_collection s:shard1 r:core_node1 x:collection1 n:127.0.0.1:32961_) [n:127.0.0.1:32961_ c:control_collection s:shard1 r:core_node1 x:collection1] o.a.s.c.ZkController publishing state=active
   [junit4]   2> 1923164 INFO  (coreZkRegister-3352-thread-1-processing-c:control_collection s:shard1 r:core_node1 x:collection1 n:127.0.0.1:32961_) [n:127.0.0.1:32961_ c:control_collection s:shard1 r:core_node1 x:collection1] o.a.s.c.ZkController numShards not found on descriptor - reading it from system property
   [junit4]   2> 1923167 INFO  (OverseerStateUpdate-95224020988461060-127.0.0.1:32961_-n_0000000000) [n:127.0.0.1:32961_    ] o.a.s.c.Overseer processMessage: queueSize: 1, message = {
   [junit4]   2>   "collection":"control_collection",
   [junit4]   2>   "shard":"shard1",
   [junit4]   2>   "operation":"state",
   [junit4]   2>   "core_node_name":"core_node1",
   [junit4]   2>   "numShards":"2",
   [junit4]   2>   "state":"active",
   [junit4]   2>   "roles":null,
   [junit4]   2>   "core":"collection1",
   [junit4]   2>   "node_name":"127.0.0.1:32961_",
   [junit4]   2>   "base_url":"http://127.0.0.1:32961"} current state version: 2
   [junit4]   2> 1923167 INFO  (OverseerStateUpdate-95224020988461060-127.0.0.1:32961_-n_0000000000) [n:127.0.0.1:32961_    ] o.a.s.c.o.ReplicaMutator Update state numShards=2 message={
   [junit4]   2>   "collection":"control_collection",
   [junit4]   2>   "shard":"shard1",
   [junit4]   2>   "operation":"state",
   [junit4]   2>   "core_node_name":"core_node1",
   [junit4]   2>   "numShards":"2",
   [junit4]   2>   "state":"active",
   [junit4]   2>   "roles":null,
   [junit4]   2>   "core":"collection1",
   [junit4]   2>   "node_name":"127.0.0.1:32961_",
   [junit4]   2>   "base_url":"http://127.0.0.1:32961"}
   [junit4]   2> 1923168 INFO  (OverseerStateUpdate-95224020988461060-127.0.0.1:32961_-n_0000000000) [n:127.0.0.1:32961_    ] o.a.s.c.o.ZkStateWriter going to create_collection /collections/collection1/state.json
   [junit4]   2> 1923271 INFO  (zkCallback-977-thread-1-processing-n:127.0.0.1:32961_) [n:127.0.0.1:32961_    ] o.a.s.c.c.ZkStateReader A cluster state change: [WatchedEvent state:SyncConnected type:NodeDataChanged path:/clusterstate.json], has occurred - updating... (live nodes size: [1])
   [junit4]   2> 1923272 INFO  (zkCallback-979-thread-1) [    ] o.a.s.c.c.ZkStateReader A cluster state change: [WatchedEvent state:SyncConnected type:NodeDataChanged path:/clusterstate.json], has occurred - updating... (live nodes size: [1])
   [junit4]   2> 1923431 INFO  (TEST-CollectionsAPIDistributedZkTest.test-seed#[FD3FB35516E95D91]) [    ] o.a.s.SolrTestCaseJ4 Writing core.properties file to /x1/jenkins/jenkins-slave/workspace/Lucene-Solr-NightlyTests-5.x/solr/build/solr-core/test/J1/temp/solr.cloud.CollectionsAPIDistributedZkTest_FD3FB35516E95D91-001/shard-1-001/cores/collection1
   [junit4]   2> 1923432 INFO  (TEST-CollectionsAPIDistributedZkTest.test-seed#[FD3FB35516E95D91]) [    ] o.a.s.c.AbstractFullDistribZkTestBase create jetty 1 in directory /x1/jenkins/jenkins-slave/workspace/Lucene-Solr-NightlyTests-5.x/solr/build/solr-core/test/J1/temp/solr.cloud.CollectionsAPIDistributedZkTest_FD3FB35516E95D91-001/shard-1-001
   [junit4]   2> 1923432 INFO  (TEST-CollectionsAPIDistributedZkTest.test-seed#[FD3FB35516E95D91]) [    ] o.e.j.s.Server jetty-9.2.13.v20150730
   [junit4]   2> 1923434 INFO  (TEST-CollectionsAPIDistributedZkTest.test-seed#[FD3FB35516E95D91]) [    ] o.e.j.s.h.ContextHandler Started o.e.j.s.ServletContextHandler@17b82644{/,null,AVAILABLE}
   [junit4]   2> 1923434 INFO  (TEST-CollectionsAPIDistributedZkTest.test-seed#[FD3FB35516E95D91]) [    ] o.e.j.s.ServerConnector Started ServerConnector@4cfe2598{HTTP/1.1}{127.0.0.1:60979}
   [junit4]   2> 1923434 INFO  (TEST-CollectionsAPIDistributedZkTest.test-seed#[FD3FB35516E95D91]) [    ] o.e.j.s.Server Started @1926397ms
   [junit4]   2> 1923435 INFO  (TEST-CollectionsAPIDistributedZkTest.test-seed#[FD3FB35516E95D91]) [    ] o.a.s.c.s.e.JettySolrRunner Jetty properties: {hostContext=/, hostPort=60979, coreRootDirectory=/x1/jenkins/jenkins-slave/workspace/Lucene-Solr-NightlyTests-5.x/solr/build/solr-core/test/J1/temp/solr.cloud.CollectionsAPIDistributedZkTest_FD3FB35516E95D91-001/shard-1-001/cores, solrconfig=solrconfig.xml, solr.data.dir=/x1/jenkins/jenkins-slave/workspace/Lucene-Solr-NightlyTests-5.x/solr/build/solr-core/test/J1/temp/solr.cloud.CollectionsAPIDistributedZkTest_FD3FB35516E95D91-001/tempDir-001/jetty1}
   [junit4]   2> 1923435 INFO  (TEST-CollectionsAPIDistributedZkTest.test-seed#[FD3FB35516E95D91]) [    ] o.a.s.s.SolrDispatchFilter SolrDispatchFilter.init(): sun.misc.Launcher$AppClassLoader@7b3cb2c6
   [junit4]   2> 1923435 INFO  (TEST-CollectionsAPIDistributedZkTest.test-seed#[FD3FB35516E95D91]) [    ] o.a.s.c.SolrResourceLoader new SolrResourceLoader for directory: '/x1/jenkins/jenkins-slave/workspace/Lucene-Solr-NightlyTests-5.x/solr/build/solr-core/test/J1/temp/solr.cloud.CollectionsAPIDistributedZkTest_FD3FB35516E95D91-001/shard-1-001'
   [junit4]   2> 1923435 INFO  (TEST-CollectionsAPIDistributedZkTest.test-seed#[FD3FB35516E95D91]) [    ] o.a.s.c.SolrResourceLoader JNDI not configured for solr (NoInitialContextEx)
   [junit4]   2> 1923435 INFO  (TEST-CollectionsAPIDistributedZkTest.test-seed#[FD3FB35516E95D91]) [    ] o.a.s.c.SolrResourceLoader solr home defaulted to 'solr/' (could not find system property or JNDI)
   [junit4]   2> 1923435 INFO  (TEST-CollectionsAPIDistributedZkTest.test-seed#[FD3FB35516E95D91]) [    ] o.a.s.c.c.SolrZkClient Using default ZkCredentialsProvider
   [junit4]   2> 1923436 INFO  (TEST-CollectionsAPIDistributedZkTest.test-seed#[FD3FB35516E95D91]) [    ] o.a.s.c.c.ConnectionManager Waiting for client to connect to ZooKeeper
   [junit4]   2> 1923437 INFO  (zkCallback-981-thread-1) [    ] o.a.s.c.c.ConnectionManager Watcher org.apache.solr.common.cloud.ConnectionManager@214fa40f name:ZooKeeperConnection Watcher:127.0.0.1:33675/solr got event WatchedEvent state:SyncConnected type:None path:null path:null type:None
   [junit4]   2> 1923438 INFO  (TEST-CollectionsAPIDistributedZkTest.test-seed#[FD3FB35516E95D91]) [    ] o.a.s.c.c.ConnectionManager Client is connected to ZooKeeper
   [junit4]   2> 1923438 INFO  (TEST-CollectionsAPIDistributedZkTest.test-seed#[FD3FB35516E95D91]) [    ] o.a.s.c.c.SolrZkClient Using default ZkACLProvider
   [junit4]   2> 1923439 INFO  (TEST-CollectionsAPIDistributedZkTest.test-seed#[FD3FB35516E95D91]) [    ] o.a.s.s.SolrDispatchFilter Loading solr.xml from SolrHome (not found in ZooKeeper)
   [junit4]   2> 1923439 INFO  (TEST-CollectionsAPIDistributedZkTest.test-seed#[FD3FB35516E95D91]) [    ] o.a.s.c.SolrXmlConfig Loading container configuration from /x1/jenkins/jenkins-slave/workspace/Lucene-Solr-NightlyTests-5.x/solr/build/solr-core/test/J1/temp/solr.cloud.CollectionsAPIDistributedZkTest_FD3FB35516E95D91-001/shard-1-001/solr.xml
   [junit4]   2> 1923453 INFO  (TEST-CollectionsAPIDistributedZkTest.test-seed#[FD3FB35516E95D91]) [    ] o.a.s.c.CorePropertiesLocator Config-defined core root directory: /x1/jenkins/jenkins-slave/workspace/Lucene-Solr-NightlyTests-5.x/solr/build/solr-core/test/J1/temp/solr.cloud.CollectionsAPIDistributedZkTest_FD3FB35516E95D91-001/shard-1-001/cores
   [junit4]   2> 1923454 INFO  (TEST-CollectionsAPIDistributedZkTest.test-seed#[FD3FB35516E95D91]) [    ] o.a.s.c.CoreContainer New CoreContainer 544629357
   [junit4]   2> 1923454 INFO  (TEST-CollectionsAPIDistributedZkTest.test-seed#[FD3FB35516E95D91]) [    ] o.a.s.c.CoreContainer Loading cores into CoreContainer [instanceDir=/x1/jenkins/jenkins-slave/workspace/Lucene-Solr-NightlyTests-5.x/solr/build/solr-core/test/J1/temp/solr.cloud.CollectionsAPIDistributedZkTest_FD3FB35516E95D91-001/shard-1-001]
   [junit4]   2> 1923454 WARN  (TEST-CollectionsAPIDistributedZkTest.test-seed#[FD3FB35516E95D91]) [    ] o.a.s.c.CoreContainer Couldn't add files from /x1/jenkins/jenkins-slave/workspace/Lucene-Solr-NightlyTests-5.x/solr/build/solr-core/test/J1/temp/solr.cloud.CollectionsAPIDistributedZkTest_FD3FB35516E95D91-001/shard-1-001/lib to classpath: /x1/jenkins/jenkins-slave/workspace/Lucene-Solr-NightlyTests-5.x/solr/build/solr-core/test/J1/temp/solr.cloud.CollectionsAPIDistributedZkTest_FD3FB35516E95D91-001/shard-1-001/lib
   [junit4]   2> 1923454 INFO  (TEST-CollectionsAPIDistributedZkTest.test-seed#[FD3FB35516E95D91]) [    ] o.a.s.h.c.HttpShardHandlerFactory created with socketTimeout : 90000,urlScheme : ,connTimeout : 15000,maxConnectionsPerHost : 20,maxConnections : 10000,corePoolSize : 0,maximumPoolSize : 2147483647,maxThreadIdleTime : 5,sizeOfQueue : -1,fairnessPolicy : false,useRetries : false,
   [junit4]   2> 1923455 INFO  (TEST-CollectionsAPIDistributedZkTest.test-seed#[FD3FB35516E95D91]) [    ] o.a.s.u.UpdateShardHandler Creating UpdateShardHandler HTTP client with params: socketTimeout=340000&connTimeout=45000&retry=true
   [junit4]   2> 1923456 INFO  (TEST-CollectionsAPIDistributedZkTest.test-seed#[FD3FB35516E95D91]) [    ] o.a.s.l.LogWatcher SLF4J impl is org.slf4j.impl.Log4jLoggerFactory
   [junit4]   2> 1923456 INFO  (TEST-CollectionsAPIDistributedZkTest.test-seed#[FD3FB35516E95D91]) [    ] o.a.s.l.LogWatcher Registering Log Listener [Log4j (org.slf4j.impl.Log4jLoggerFactory)]
   [junit4]   2> 1923456 INFO  (TEST-CollectionsAPIDistributedZkTest.test-seed#[FD3FB35516E95D91]) [    ] o.a.s.c.ZkContainer Zookeeper client=127.0.0.1:33675/solr
   [junit4]   2> 1923456 INFO  (TEST-CollectionsAPIDistributedZkTest.test-seed#[FD3FB35516E95D91]) [    ] o.a.s.c.ZkController zkHost includes chroot
   [junit4]   2> 1923456 INFO  (TEST-CollectionsAPIDistributedZkTest.test-seed#[FD3FB35516E95D91]) [    ] o.a.s.c.c.SolrZkClient Using default ZkCredentialsProvider
   [junit4]   2> 1923457 INFO  (TEST-CollectionsAPIDistributedZkTest.test-seed#[FD3FB35516E95D91]) [    ] o.a.s.c.c.ConnectionManager Waiting for client to connect to ZooKeeper
   [junit4]   2> 1923458 INFO  (zkCallback-983-thread-1) [    ] o.a.s.c.c.ConnectionManager Watcher org.apache.solr.common.cloud.ConnectionManager@5975ba5e name:ZooKeeperConnection Watcher:127.0.0.1:33675 got event WatchedEvent state:SyncConnected type:None path:null path:null type:None
   [junit4]   2> 1923458 INFO  (TEST-CollectionsAPIDistributedZkTest.test-seed#[FD3FB35516E95D91]) [    ] o.a.s.c.c.ConnectionManager Client is connected to ZooKeeper
   [junit4]   2> 1923458 INFO  (TEST-CollectionsAPIDistributedZkTest.test-seed#[FD3FB35516E95D91]) [    ] o.a.s.c.c.SolrZkClient Using default ZkACLProvider
   [junit4]   2> 1923460 INFO  (TEST-CollectionsAPIDistributedZkTest.test-seed#[FD3FB35516E95D91]) [n:127.0.0.1:60979_    ] o.a.s.c.c.ConnectionManager Waiting for client to connect to ZooKeeper
   [junit4]   2> 1923461 INFO  (zkCallback-984-thread-1-processing-n:127.0.0.1:60979_) [n:127.0.0.1:60979_    ] o.a.s.c.c.ConnectionManager Watcher org.apache.solr.common.cloud.ConnectionManager@1df9123e name:ZooKeeperConnection Watcher:127.0.0.1:33675/solr got event WatchedEvent state:SyncConnected type:None path:null path:null type:None
   [junit4]   2> 1923461 INFO  (TEST-CollectionsAPIDistributedZkTest.test-seed#[FD3FB35516E95D91]) [n:127.0.0.1:60979_    ] o.a.s.c.c.ConnectionManager Client is connected to ZooKeeper
   [junit4]   2> 1923466 INFO  (TEST-CollectionsAPIDistributedZkTest.test-seed#[FD3FB35516E95D91]) [n:127.0.0.1:60979_    ] o.a.s.c.c.ZkStateReader Updating cluster state from ZooKeeper... 
   [junit4]   2> 1924472 INFO  (TEST-CollectionsAPIDistributedZkTest.test-seed#[FD3FB35516E95D91]) [n:127.0.0.1:60979_    ] o.a.s.c.ZkController Register node as live in ZooKeeper:/live_nodes/127.0.0.1:60979_
   [junit4]   2> 1924472 INFO  (TEST-CollectionsAPIDistributedZkTest.test-seed#[FD3FB35516E95D91]) [n:127.0.0.1:60979_    ] o.a.s.c.c.SolrZkClient makePath: /live_nodes/127.0.0.1:60979_
   [junit4]   2> 1924474 INFO  (zkCallback-984-thread-1-processing-n:127.0.0.1:60979_) [n:127.0.0.1:60979_    ] o.a.s.c.c.ZkStateReader A live node change: [WatchedEvent state:SyncConnected type:NodeChildrenChanged path:/live_nodes], has occurred - updating... (live nodes size: [1])
   [junit4]   2> 1924474 INFO  (zkCallback-977-thread-1-processing-n:127.0.0.1:32961_) [n:127.0.0.1:32961_    ] o.a.s.c.c.ZkStateReader A live node change: [WatchedEvent state:SyncConnected type:NodeChildrenChanged path:/live_nodes], has occurred - updating... (live nodes size: [1])
   [junit4]   2> 1924474 INFO  (zkCallback-979-thread-1) [    ] o.a.s.c.c.ZkStateReader A live node change: [WatchedEvent state:SyncConnected type:NodeChildrenChanged path:/live_nodes], has occurred - updating... (live nodes size: [1])
   [junit4]   2> 1924475 INFO  (TEST-CollectionsAPIDistributedZkTest.test-seed#[FD3FB35516E95D91]) [n:127.0.0.1:60979_    ] o.a.s.c.Overseer Overseer (id=null) closing
   [junit4]   2> 1924476 INFO  (TEST-CollectionsAPIDistributedZkTest.test-seed#[FD3FB35516E95D91]) [n:127.0.0.1:60979_    ] o.a.s.c.LeaderElector Joined leadership election with path: /overseer_elect/election/95224020988461065-127.0.0.1:60979_-n_0000000001
   [junit4]   2> 1924477 INFO  (TEST-CollectionsAPIDistributedZkTest.test-seed#[FD3FB35516E95D91]) [n:127.0.0.1:60979_    ] o.a.s.c.LeaderElector Watching path /overseer_elect/election/95224020988461060-127.0.0.1:32961_-n_0000000000 to know if I could be the leader
   [junit4]   2> 1924489 INFO  (TEST-CollectionsAPIDistributedZkTest.test-seed#[FD3FB35516E95D91]) [n:127.0.0.1:60979_    ] o.a.s.c.CoreContainer Security conf doesn't exist. Skipping setup for authorization module.
   [junit4]   2> 1924489 INFO  (TEST-CollectionsAPIDistributedZkTest.test-seed#[FD3FB35516E95D91]) [n:127.0.0.1:60979_    ] o.a.s.c.CoreContainer No authentication plugin used.
   [junit4]   2> 1924490 INFO  (TEST-CollectionsAPIDistributedZkTest.test-seed#[FD3FB35516E95D91]) [n:127.0.0.1:60979_    ] o.a.s.c.CorePropertiesLocator Looking for core definitions underneath /x1/jenkins/jenkins-slave/workspace/Lucene-Solr-NightlyTests-5.x/solr/build/solr-core/test/J1/temp/solr.cloud.CollectionsAPIDistributedZkTest_FD3FB35516E95D91-001/shard-1-001/cores
   [junit4]   2> 1924491 INFO  (TEST-CollectionsAPIDistributedZkTest.test-seed#[FD3FB35516E95D91]) [n:127.0.0.1:60979_    ] o.a.s.c.CoreDescriptor Created CoreDescriptor: {dataDir=data/, configSetProperties=configsetprops.json, config=solrconfig.xml, coreNodeName=, collection=collection1, name=collection1, loadOnStartup=true, schema=schema.xml, transient=false, shard=}
   [junit4]   2> 1924491 INFO  (TEST-CollectionsAPIDistributedZkTest.test-seed#[FD3FB35516E95D91]) [n:127.0.0.1:60979_    ] o.a.s.c.CorePropertiesLocator Found core collection1 in /x1/jenkins/jenkins-slave/workspace/Lucene-Solr-NightlyTests-5.x/solr/build/solr-core/test/J1/temp/solr.cloud.CollectionsAPIDistributedZkTest_FD3FB35516E95D91-001/shard-1-001/cores/collection1
   [junit4]   2> 1924491 INFO  (TEST-CollectionsAPIDistributedZkTest.test-seed#[FD3FB35516E95D91]) [n:127.0.0.1:60979_    ] o.a.s.c.CorePropertiesLocator Found 1 core definitions
   [junit4]   2> 1924493 INFO  (TEST-CollectionsAPIDistributedZkTest.test-seed#[FD3FB35516E95D91]) [n:127.0.0.1:60979_    ] o.a.s.s.SolrDispatchFilter user.dir=/x1/jenkins/jenkins-slave/workspace/Lucene-Solr-NightlyTests-5.x/solr/build/solr-core/test/J1
   [junit4]   2> 1924493 INFO  (coreLoadExecutor-3369-thread-1-processing-n:127.0.0.1:60979_) [n:127.0.0.1:60979_ c:collection1   x:collection1] o.a.s.c.ZkController publishing state=down
   [junit4]   2> 1924493 INFO  (TEST-CollectionsAPIDistributedZkTest.test-seed#[FD3FB35516E95D91]) [n:127.0.0.1:60979_    ] o.a.s.s.SolrDispatchFilter SolrDispatchFilter.init() done
   [junit4]   2> 1924493 INFO  (coreLoadExecutor-3369-thread-1-processing-n:127.0.0.1:60979_) [n:127.0.0.1:60979_ c:collection1   x:collection1] o.a.s.c.ZkController numShards not found on descriptor - reading it from system property
   [junit4]   2> 1924494 INFO  (coreLoadExecutor-3369-thread-1-processing-n:127.0.0.1:60979_) [n:127.0.0.1:60979_ c:collection1   x:collection1] o.a.s.c.ZkController Registering watch for collection collection1
   [junit4]   2> 1924495 INFO  (coreLoadExecutor-3369-thread-1-processing-n:127.0.0.1:60979_) [n:127.0.0.1:60979_ c:collection1   x:collection1] o.a.s.c.c.ZkStateReader addZkWatch [collection1]
   [junit4]   2> 1924495 INFO  (OverseerStateUpdate-95224020988461060-127.0.0.1:32961_-n_0000000000) [n:127.0.0.1:32961_    ] o.a.s.c.Overseer processMessage: queueSize: 1, message = {
   [junit4]   2>   "collection":"collection1",
   [junit4]   2>   "shard":null,
   [junit4]   2>   "operation":"state",
   [junit4]   2>   "numShards":"2",
   [junit4]   2>   "state":"down",
   [junit4]   2>   "roles":null,
   [junit4]   2>   "core":"collection1",
   [junit4]   2>   "node_name":"127.0.0.1:60979_",
   [junit4]   2>   "base_url":"http://127.0.0.1:60979"} current state version: 3
   [junit4]   2> 1924495 INFO  (coreLoadExecutor-3369-thread-1-processing-n:127.0.0.1:60979_) [n:127.0.0.1:60979_ c:collection1   x:collection1] o.a.s.c.c.ZkStateReader Add data for [collection1] ver [0]
   [junit4]   2> 1924495 INFO  (coreLoadExecutor-3369-thread-1-processing-n:127.0.0.1:60979_) [n:127.0.0.1:60979_ c:collection1   x:collection1] o.a.s.c.ZkController look for our core node name
   [junit4]   2> 1924495 INFO  (OverseerStateUpdate-95224020988461060-127.0.0.1:32961_-n_0000000000) [n:127.0.0.1:32961_    ] o.a.s.c.o.ReplicaMutator Update state numShards=2 message={
   [junit4]   2>   "collection":"collection1",
   [junit4]   2>   "shard":null,
   [junit4]   2>   "operation":"state",
   [junit4]   2>   "numShards":"2",
   [junit4]   2>   "state":"down",
   [junit4]   2>   "roles":null,
   [junit4]   2>   "core":"collection1",
   [junit4]   2>   "node_name":"127.0.0.1:60979_",
   [junit4]   2>   "base_url":"http://127.0.0.1:60979"}
   [junit4]   2> 1924495 INFO  (OverseerStateUpdate-95224020988461060-127.0.0.1:32961_-n_0000000000) [n:127.0.0.1:32961_    ] o.a.s.c.o.ReplicaMutator Collection already exists with numShards=2
   [junit4]   2> 1924495 INFO  (OverseerStateUpdate-95224020988461060-127.0.0.1:32961_-n_0000000000) [n:127.0.0.1:32961_    ] o.a.s.c.o.ReplicaMutator Assigning new node to shard shard=shard2
   [junit4]   2> 1924598 INFO  (OverseerStateUpdate-95224020988461060-127.0.0.1:32961_-n_0000000000) [n:127.0.0.1:32961_    ] o.a.s.c.o.ZkStateWriter going to update_collection /collections/collection1/state.json version: 0
   [junit4]   2> 1924599 INFO  (zkCallback-984-thread-1-processing-n:127.0.0.1:60979_) [n:127.0.0.1:60979_    ] o.a.s.c.c.ZkStateReader A cluster state change: [WatchedEvent state:SyncConnected type:NodeDataChanged path:/collections/collection1/state.json] for collection [collection1] has occurred - updating... (live nodes size: [2])
   [junit4]   2> 1924601 INFO  (zkCallback-984-thread-1-processing-n:127.0.0.1:60979_) [n:127.0.0.1:60979_    ] o.a.s.c.c.ZkStateReader Updating data for [collection1] from [0] to [1]
   [junit4]   2> 1925495 INFO  (coreLoadExecutor-3369-thread-1-processing-n:127.0.0.1:60979_) [n:127.0.0.1:60979_ c:collection1   x:collection1] o.a.s.c.ZkController waiting to find shard id in clusterstate for collection1
   [junit4]   2> 1925495 INFO  (coreLoadExecutor-3369-thread-1-processing-n:127.0.0.1:60979_) [n:127.0.0.1:60979_ c:collection1   x:collection1] o.a.s.c.ZkController Check for collection zkNode:collection1
   [junit4]   2> 1925496 INFO  (coreLoadExecutor-3369-thread-1-processing-n:127.0.0.1:60979_) [n:127.0.0.1:60979_ c:collection1   x:collection1] o.a.s.c.ZkController Collection zkNode exists
   [junit4]   2> 1925496 INFO  (coreLoadExecutor-3369-thread-1-processing-n:127.0.0.1:60979_) [n:127.0.0.1:60979_ c:collection1   x:collection1] o.a.s.c.c.ZkStateReader Load collection config from: [/collections/collection1]
   [junit4]   2> 1925497 INFO  (coreLoadExecutor-3369-thread-1-processing-n:127.0.0.1:60979_) [n:127.0.0.1:60979_ c:collection1   x:collection1] o.a.s.c.c.ZkStateReader path=[/collections/collection1] [configName]=[conf1] specified config exists in ZooKeeper
   [junit4]   2> 1925497 INFO  (coreLoadExecutor-3369-thread-1-processing-n:127.0.0.1:60979_) [n:127.0.0.1:60979_ c:collection1   x:collection1] o.a.s.c.SolrResourceLoader new SolrResourceLoader for directory: '/x1/jenkins/jenkins-slave/workspace/Lucene-Solr-NightlyTests-5.x/solr/build/solr-core/test/J1/temp/solr.cloud.CollectionsAPIDistributedZkTest_FD3FB35516E95D91-001/shard-1-001/cores/collection1'
   [junit4]   2> 1925497 INFO  (coreLoadExecutor-3369-thread-1-processing-n:127.0.0.1:60979_) [n:127.0.0.1:60979_ c:collection1   x:collection1] o.a.s.c.SolrResourceLoader JNDI not configured for solr (NoInitialContextEx)
   [junit4]   2> 1925497 INFO  (coreLoadExecutor-3369-thread-1-processing-n:127.0.0.1:60979_) [n:127.0.0.1:60979_ c:collection1   x:collection1] o.a.s.c.SolrResourceLoader solr home defaulted to 'solr/' (could not find system property or JNDI)
   [junit4]   2> 1925499 INFO  (coreLoadExecutor-3369-thread-1-processing-n:127.0.0.1:60979_) [n:127.0.0.1:60979_ c:collection1   x:collection1] o.a.s.c.Config loaded config solrconfig.xml with version 0 
   [junit4]   2> 1925506 INFO  (coreLoadExecutor-3369-thread-1-processing-n:127.0.0.1:60979_) [n:127.0.0.1:60979_ c:collection1   x:collection1] o.a.s.c.SolrConfig current version of requestparams : -1
   [junit4]   2> 1925521 INFO  (coreLoadExecutor-3369-thread-1-processing-n:127.0.0.1:60979_) [n:127.0.0.1:60979_ c:collection1   x:collection1] o.a.s.c.SolrConfig Using Lucene MatchVersion: 5.5.0
   [junit4]   2> 1925550 INFO  (coreLoadExecutor-3369-thread-1-processing-n:127.0.0.1:60979_) [n:127.0.0.1:60979_ c:collection1   x:collection1] o.a.s.c.SolrConfig Loaded SolrConfig: solrconfig.xml
   [junit4]   2> 1925558 INFO  (coreLoadExecutor-3369-thread-1-processing-n:127.0.0.1:60979_) [n:127.0.0.1:60979_ c:collection1   x:collection1] o.a.s.s.IndexSchema [collection1] Schema name=test
   [junit4]   2> 1925809 INFO  (coreLoadExecutor-3369-thread-1-processing-n:127.0.0.1:60979_) [n:127.0.0.1:60979_ c:collection1   x:collection1] o.a.s.s.OpenExchangeRatesOrgProvider Initialized with rates=open-exchange-rates.json, refreshInterval=1440.
   [junit4]   2> 1925817 INFO  (coreLoadExecutor-3369-thread-1-processing-n:127.0.0.1:60979_) [n:127.0.0.1:60979_ c:collection1   x:collection1] o.a.s.s.IndexSchema default search field in schema is text
   [junit4]   2> 1925819 INFO  (coreLoadExecutor-3369-thread-1-processing-n:127.0.0.1:60979_) [n:127.0.0.1:60979_ c:collection1   x:collection1] o.a.s.s.IndexSchema unique key field: id
   [junit4]   2> 1925828 INFO  (coreLoadExecutor-3369-thread-1-processing-n:127.0.0.1:60979_) [n:127.0.0.1:60979_ c:collection1   x:collection1] o.a.s.s.FileExchangeRateProvider Reloading exchange rates from file currency.xml
   [junit4]   2> 1925831 INFO  (coreLoadExecutor-3369-thread-1-processing-n:127.0.0.1:60979_) [n:127.0.0.1:60979_ c:collection1   x:collection1] o.a.s.s.FileExchangeRateProvider Reloading exchange rates from file currency.xml
   [junit4]   2> 1925833 INFO  (coreLoadExecutor-3369-thread-1-processing-n:127.0.0.1:60979_) [n:127.0.0.1:60979_ c:collection1   x:collection1] o.a.s.s.OpenExchangeRatesOrgProvider Reloading exchange rates from open-exchange-rates.json
   [junit4]   2> 1925834 INFO  (coreLoadExecutor-3369-thread-1-processing-n:127.0.0.1:60979_) [n:127.0.0.1:60979_ c:collection1   x:collection1] o.a.s.s.OpenExchangeRatesOrgProvider Reloading exchange rates from open-exchange-rates.json
   [junit4]   2> 1925836 INFO  (coreLoadExecutor-3369-thread-1-processing-n:127.0.0.1:60979_) [n:127.0.0.1:60979_ c:collection1   x:collection1] o.a.s.c.ConfigSetProperties Did not find ConfigSet properties, assuming default properties: Can't find resource 'configsetprops.json' in classpath or '/configs/conf1', cwd=/x1/jenkins/jenkins-slave/workspace/Lucene-Solr-NightlyTests-5.x/solr/build/solr-core/test/J1
   [junit4]   2> 1925836 INFO  (coreLoadExecutor-3369-thread-1-processing-n:127.0.0.1:60979_) [n:127.0.0.1:60979_ c:collection1   x:collection1] o.a.s.c.CoreContainer Creating SolrCore 'collection1' using configuration from collection collection1
   [junit4]  

[...truncated too long message...]

ins-slave/workspace/Lucene-Solr-NightlyTests-5.x/solr/build/solr-core/test/J1/temp/solr.handler.TestReplicationHandler_FD3FB35516E95D91-001/solr-instance-026/./collection1/data
   [junit4]   2> 2840112 INFO  (TEST-TestReplicationHandler.doTestRepeater-seed#[FD3FB35516E95D91]) [    x:collection1] o.a.s.c.CachingDirectoryFactory looking to close /x1/jenkins/jenkins-slave/workspace/Lucene-Solr-NightlyTests-5.x/solr/build/solr-core/test/J1/temp/solr.handler.TestReplicationHandler_FD3FB35516E95D91-001/solr-instance-026/./collection1/data/index [CachedDir<<refCount=0;path=/x1/jenkins/jenkins-slave/workspace/Lucene-Solr-NightlyTests-5.x/solr/build/solr-core/test/J1/temp/solr.handler.TestReplicationHandler_FD3FB35516E95D91-001/solr-instance-026/./collection1/data/index;done=false>>]
   [junit4]   2> 2840112 INFO  (TEST-TestReplicationHandler.doTestRepeater-seed#[FD3FB35516E95D91]) [    x:collection1] o.a.s.c.CachingDirectoryFactory Closing directory: /x1/jenkins/jenkins-slave/workspace/Lucene-Solr-NightlyTests-5.x/solr/build/solr-core/test/J1/temp/solr.handler.TestReplicationHandler_FD3FB35516E95D91-001/solr-instance-026/./collection1/data/index
   [junit4]   2> 2840115 INFO  (TEST-TestReplicationHandler.doTestRepeater-seed#[FD3FB35516E95D91]) [    x:collection1] o.e.j.s.h.ContextHandler Stopped o.e.j.s.ServletContextHandler@712cfc94{/solr,null,UNAVAILABLE}
   [junit4]   2> 2840117 INFO  (TEST-TestReplicationHandler.doTestRepeater-seed#[FD3FB35516E95D91]) [    ] o.e.j.s.ServerConnector Stopped ServerConnector@4193d246{HTTP/1.1}{127.0.0.1:0}
   [junit4]   2> 2840117 INFO  (TEST-TestReplicationHandler.doTestRepeater-seed#[FD3FB35516E95D91]) [    ] o.a.s.c.CoreContainer Shutting down CoreContainer instance=1468793681
   [junit4]   2> 2840117 INFO  (TEST-TestReplicationHandler.doTestRepeater-seed#[FD3FB35516E95D91]) [    x:collection1] o.a.s.c.SolrCore [collection1]  CLOSING SolrCore org.apache.solr.core.SolrCore@7c03a5c9
   [junit4]   2> 2840117 INFO  (TEST-TestReplicationHandler.doTestRepeater-seed#[FD3FB35516E95D91]) [    x:collection1] o.a.s.u.DirectUpdateHandler2 closing DirectUpdateHandler2{commits=0,autocommits=0,soft autocommits=0,optimizes=0,rollbacks=0,expungeDeletes=0,docsPending=0,adds=0,deletesById=0,deletesByQuery=0,errors=0,cumulative_adds=0,cumulative_deletesById=0,cumulative_deletesByQuery=0,cumulative_errors=0}
   [junit4]   2> 2840118 INFO  (TEST-TestReplicationHandler.doTestRepeater-seed#[FD3FB35516E95D91]) [    x:collection1] o.a.s.u.SolrCoreState Closing SolrCoreState
   [junit4]   2> 2840118 INFO  (TEST-TestReplicationHandler.doTestRepeater-seed#[FD3FB35516E95D91]) [    x:collection1] o.a.s.u.DefaultSolrCoreState SolrCoreState ref count has reached 0 - closing IndexWriter
   [junit4]   2> 2840118 INFO  (TEST-TestReplicationHandler.doTestRepeater-seed#[FD3FB35516E95D91]) [    x:collection1] o.a.s.u.DefaultSolrCoreState closing IndexWriter with IndexWriterCloser
   [junit4]   2> 2840118 INFO  (TEST-TestReplicationHandler.doTestRepeater-seed#[FD3FB35516E95D91]) [    x:collection1] o.a.s.c.SolrCore [collection1] Closing main searcher on request.
   [junit4]   2> 2840119 INFO  (TEST-TestReplicationHandler.doTestRepeater-seed#[FD3FB35516E95D91]) [    x:collection1] o.a.s.c.CachingDirectoryFactory Closing MockDirectoryFactory - 2 directories currently being tracked
   [junit4]   2> 2840119 INFO  (TEST-TestReplicationHandler.doTestRepeater-seed#[FD3FB35516E95D91]) [    x:collection1] o.a.s.c.CachingDirectoryFactory looking to close /x1/jenkins/jenkins-slave/workspace/Lucene-Solr-NightlyTests-5.x/solr/build/solr-core/test/J1/temp/solr.handler.TestReplicationHandler_FD3FB35516E95D91-001/solr-instance-027/./collection1/data [CachedDir<<refCount=0;path=/x1/jenkins/jenkins-slave/workspace/Lucene-Solr-NightlyTests-5.x/solr/build/solr-core/test/J1/temp/solr.handler.TestReplicationHandler_FD3FB35516E95D91-001/solr-instance-027/./collection1/data;done=false>>]
   [junit4]   2> 2840119 INFO  (TEST-TestReplicationHandler.doTestRepeater-seed#[FD3FB35516E95D91]) [    x:collection1] o.a.s.c.CachingDirectoryFactory Closing directory: /x1/jenkins/jenkins-slave/workspace/Lucene-Solr-NightlyTests-5.x/solr/build/solr-core/test/J1/temp/solr.handler.TestReplicationHandler_FD3FB35516E95D91-001/solr-instance-027/./collection1/data
   [junit4]   2> 2840119 INFO  (TEST-TestReplicationHandler.doTestRepeater-seed#[FD3FB35516E95D91]) [    x:collection1] o.a.s.c.CachingDirectoryFactory looking to close /x1/jenkins/jenkins-slave/workspace/Lucene-Solr-NightlyTests-5.x/solr/build/solr-core/test/J1/temp/solr.handler.TestReplicationHandler_FD3FB35516E95D91-001/solr-instance-027/./collection1/data/index [CachedDir<<refCount=0;path=/x1/jenkins/jenkins-slave/workspace/Lucene-Solr-NightlyTests-5.x/solr/build/solr-core/test/J1/temp/solr.handler.TestReplicationHandler_FD3FB35516E95D91-001/solr-instance-027/./collection1/data/index;done=false>>]
   [junit4]   2> 2840119 INFO  (TEST-TestReplicationHandler.doTestRepeater-seed#[FD3FB35516E95D91]) [    x:collection1] o.a.s.c.CachingDirectoryFactory Closing directory: /x1/jenkins/jenkins-slave/workspace/Lucene-Solr-NightlyTests-5.x/solr/build/solr-core/test/J1/temp/solr.handler.TestReplicationHandler_FD3FB35516E95D91-001/solr-instance-027/./collection1/data/index
   [junit4]   2> 2840122 INFO  (TEST-TestReplicationHandler.doTestRepeater-seed#[FD3FB35516E95D91]) [    x:collection1] o.e.j.s.h.ContextHandler Stopped o.e.j.s.ServletContextHandler@3b0758e3{/solr,null,UNAVAILABLE}
   [junit4]   2> 2840123 INFO  (SUITE-TestReplicationHandler-seed#[FD3FB35516E95D91]-worker) [    ] o.a.s.SolrTestCaseJ4 ###deleteCore
   [junit4]   2> NOTE: leaving temporary files on disk at: /x1/jenkins/jenkins-slave/workspace/Lucene-Solr-NightlyTests-5.x/solr/build/solr-core/test/J1/temp/solr.handler.TestReplicationHandler_FD3FB35516E95D91-001
   [junit4]   2> NOTE: test params are: codec=CheapBastard, sim=RandomSimilarityProvider(queryNorm=false,coord=crazy): {}, locale=bg, timezone=Etc/GMT0
   [junit4]   2> NOTE: Linux 3.13.0-52-generic amd64/Oracle Corporation 1.7.0_80 (64-bit)/cpus=4,threads=1,free=128172608,total=504889344
   [junit4]   2> NOTE: All tests run in this JVM: [SuggestComponentTest, HighlighterTest, FastVectorHighlighterTest, DistributedFacetPivotSmallAdvancedTest, TestHashPartitioner, TestRuleBasedAuthorizationPlugin, TestBulkSchemaAPI, DistributedIntervalFacetingTest, TestSolrConfigHandler, TestSchemaResource, CollectionTooManyReplicasTest, SecurityConfHandlerTest, SuggesterFSTTest, TestStressVersions, TestQuerySenderListener, TestUniqueKeyFieldResource, CloudExitableDirectoryReaderTest, ChaosMonkeyNothingIsSafeTest, DistributedMLTComponentTest, ShardRoutingCustomTest, DirectoryFactoryTest, DocExpirationUpdateProcessorFactoryTest, TestClusterStateMutator, SolrIndexConfigTest, SolrCloudExampleTest, TestLFUCache, SpellingQueryConverterTest, TestQueryTypes, TestOrdValues, TestPivotHelperCode, OpenCloseCoreStressTest, TestCloudInspectUtil, DistributedQueryComponentCustomSortTest, ZkCLITest, CloudMLTQParserTest, TestDefaultStatsCache, SolrPluginUtilsTest, UniqFieldsUpdateProcessorFactoryTest, VMParamsZkACLAndCredentialsProvidersTest, TestSimpleTrackingShardHandler, SmileWriterTest, TestReplicaProperties, TestMissingGroups, TestChildDocTransformer, DistributedExpandComponentTest, DeleteShardTest, SpellCheckCollatorTest, SortByFunctionTest, ZkControllerTest, TestSimpleQParserPlugin, HighlighterMaxOffsetTest, DocValuesTest, OverseerCollectionConfigSetProcessorTest, TestBM25SimilarityFactory, SpatialFilterTest, TestPartialUpdateDeduplication, ClusterStateUpdateTest, DistanceUnitsTest, TestMiniSolrCloudCluster, TestCoreContainer, TestReplicationHandlerBackup, TestTrie, TestFieldTypeResource, OverseerTaskQueueTest, BlockJoinFacetDistribTest, TestLMJelinekMercerSimilarityFactory, TestCodecSupport, ConvertedLegacyTest, TestExclusionRuleCollectionAccess, TestExceedMaxTermLength, TestConfigSetsAPI, TestAddFieldRealTimeGet, IndexBasedSpellCheckerTest, TestSolrCoreProperties, TestFileDictionaryLookup, WordBreakSolrSpellCheckerTest, TestConfigSetProperties, TestManagedSchemaFieldTypeResource, TestDistributedGrouping, TestShortCircuitedRequests, MinimalSchemaTest, TestXmlQParser, ForceLeaderTest, PreAnalyzedUpdateProcessorTest, NotRequiredUniqueKeyTest, TestHashQParserPlugin, DistanceFunctionTest, TestSchemaManager, TestSerializedLuceneMatchVersion, RequestLoggingTest, BasicDistributedZkTest, ChaosMonkeySafeLeaderTest, CollectionsAPIDistributedZkTest, SyncSliceTest, OverseerTest, ShardRoutingTest, RecoveryZkTest, TestReplicationHandler]
   [junit4] Completed [202/565 (2!)] on J1 in 424.79s, 13 tests, 1 failure <<< FAILURES!

[...truncated 1269 lines...]
BUILD FAILED
/x1/jenkins/jenkins-slave/workspace/Lucene-Solr-NightlyTests-5.x/build.xml:801: The following error occurred while executing this line:
/x1/jenkins/jenkins-slave/workspace/Lucene-Solr-NightlyTests-5.x/build.xml:738: The following error occurred while executing this line:
/x1/jenkins/jenkins-slave/workspace/Lucene-Solr-NightlyTests-5.x/build.xml:59: The following error occurred while executing this line:
/x1/jenkins/jenkins-slave/workspace/Lucene-Solr-NightlyTests-5.x/solr/build.xml:233: The following error occurred while executing this line:
/x1/jenkins/jenkins-slave/workspace/Lucene-Solr-NightlyTests-5.x/solr/common-build.xml:534: The following error occurred while executing this line:
/x1/jenkins/jenkins-slave/workspace/Lucene-Solr-NightlyTests-5.x/lucene/common-build.xml:1444: The following error occurred while executing this line:
/x1/jenkins/jenkins-slave/workspace/Lucene-Solr-NightlyTests-5.x/lucene/common-build.xml:1000: There were test failures: 565 suites (7 ignored), 2259 tests, 1 error, 1 failure, 33 ignored (18 assumptions) [seed: FD3FB35516E95D91]

Total time: 260 minutes 10 seconds
Build step 'Invoke Ant' marked build as failure
Archiving artifacts
Recording test results
Email was triggered for: Failure - Any
Sending email for trigger: Failure - Any



Mime
View raw message