lucene-dev mailing list archives

Site index · List index
Message view « Date » · « Thread »
Top « Date » · « Thread »
From Apache Jenkins Server <jenk...@builds.apache.org>
Subject [JENKINS] Lucene-Solr-Tests-5.x-Java7 - Build # 3932 - Failure
Date Mon, 25 Jan 2016 01:52:52 GMT
Build: https://builds.apache.org/job/Lucene-Solr-Tests-5.x-Java7/3932/

1 tests failed.
FAILED:  org.apache.solr.cloud.OverseerTest.testOverseerFailure

Error Message:
collection1 should be gone after publishing the null state

Stack Trace:
java.lang.AssertionError: collection1 should be gone after publishing the null state
	at __randomizedtesting.SeedInfo.seed([49A2C9DD457A135A:4DAA462E57DFFC7B]:0)
	at org.junit.Assert.fail(Assert.java:93)
	at org.junit.Assert.assertTrue(Assert.java:43)
	at org.junit.Assert.assertFalse(Assert.java:68)
	at org.apache.solr.cloud.OverseerTest.testOverseerFailure(OverseerTest.java:683)
	at sun.reflect.NativeMethodAccessorImpl.invoke0(Native Method)
	at sun.reflect.NativeMethodAccessorImpl.invoke(NativeMethodAccessorImpl.java:57)
	at sun.reflect.DelegatingMethodAccessorImpl.invoke(DelegatingMethodAccessorImpl.java:43)
	at java.lang.reflect.Method.invoke(Method.java:606)
	at com.carrotsearch.randomizedtesting.RandomizedRunner.invoke(RandomizedRunner.java:1764)
	at com.carrotsearch.randomizedtesting.RandomizedRunner$8.evaluate(RandomizedRunner.java:871)
	at com.carrotsearch.randomizedtesting.RandomizedRunner$9.evaluate(RandomizedRunner.java:907)
	at com.carrotsearch.randomizedtesting.RandomizedRunner$10.evaluate(RandomizedRunner.java:921)
	at com.carrotsearch.randomizedtesting.rules.SystemPropertiesRestoreRule$1.evaluate(SystemPropertiesRestoreRule.java:57)
	at org.apache.lucene.util.TestRuleSetupTeardownChained$1.evaluate(TestRuleSetupTeardownChained.java:50)
	at org.apache.lucene.util.AbstractBeforeAfterRule$1.evaluate(AbstractBeforeAfterRule.java:46)
	at org.apache.lucene.util.TestRuleThreadAndTestName$1.evaluate(TestRuleThreadAndTestName.java:49)
	at org.apache.lucene.util.TestRuleIgnoreAfterMaxFailures$1.evaluate(TestRuleIgnoreAfterMaxFailures.java:65)
	at org.apache.lucene.util.TestRuleMarkFailure$1.evaluate(TestRuleMarkFailure.java:48)
	at com.carrotsearch.randomizedtesting.rules.StatementAdapter.evaluate(StatementAdapter.java:36)
	at com.carrotsearch.randomizedtesting.ThreadLeakControl$StatementRunner.run(ThreadLeakControl.java:367)
	at com.carrotsearch.randomizedtesting.ThreadLeakControl.forkTimeoutingTask(ThreadLeakControl.java:809)
	at com.carrotsearch.randomizedtesting.ThreadLeakControl$3.evaluate(ThreadLeakControl.java:460)
	at com.carrotsearch.randomizedtesting.RandomizedRunner.runSingleTest(RandomizedRunner.java:880)
	at com.carrotsearch.randomizedtesting.RandomizedRunner$5.evaluate(RandomizedRunner.java:781)
	at com.carrotsearch.randomizedtesting.RandomizedRunner$6.evaluate(RandomizedRunner.java:816)
	at com.carrotsearch.randomizedtesting.RandomizedRunner$7.evaluate(RandomizedRunner.java:827)
	at com.carrotsearch.randomizedtesting.rules.StatementAdapter.evaluate(StatementAdapter.java:36)
	at com.carrotsearch.randomizedtesting.rules.SystemPropertiesRestoreRule$1.evaluate(SystemPropertiesRestoreRule.java:57)
	at org.apache.lucene.util.AbstractBeforeAfterRule$1.evaluate(AbstractBeforeAfterRule.java:46)
	at com.carrotsearch.randomizedtesting.rules.StatementAdapter.evaluate(StatementAdapter.java:36)
	at org.apache.lucene.util.TestRuleStoreClassName$1.evaluate(TestRuleStoreClassName.java:42)
	at com.carrotsearch.randomizedtesting.rules.NoShadowingOrOverridesOnMethodsRule$1.evaluate(NoShadowingOrOverridesOnMethodsRule.java:40)
	at com.carrotsearch.randomizedtesting.rules.NoShadowingOrOverridesOnMethodsRule$1.evaluate(NoShadowingOrOverridesOnMethodsRule.java:40)
	at com.carrotsearch.randomizedtesting.rules.StatementAdapter.evaluate(StatementAdapter.java:36)
	at com.carrotsearch.randomizedtesting.rules.StatementAdapter.evaluate(StatementAdapter.java:36)
	at com.carrotsearch.randomizedtesting.rules.StatementAdapter.evaluate(StatementAdapter.java:36)
	at org.apache.lucene.util.TestRuleAssertionsRequired$1.evaluate(TestRuleAssertionsRequired.java:54)
	at org.apache.lucene.util.TestRuleMarkFailure$1.evaluate(TestRuleMarkFailure.java:48)
	at org.apache.lucene.util.TestRuleIgnoreAfterMaxFailures$1.evaluate(TestRuleIgnoreAfterMaxFailures.java:65)
	at org.apache.lucene.util.TestRuleIgnoreTestSuites$1.evaluate(TestRuleIgnoreTestSuites.java:55)
	at com.carrotsearch.randomizedtesting.rules.StatementAdapter.evaluate(StatementAdapter.java:36)
	at com.carrotsearch.randomizedtesting.ThreadLeakControl$StatementRunner.run(ThreadLeakControl.java:367)
	at java.lang.Thread.run(Thread.java:745)




Build Log:
[...truncated 10304 lines...]
   [junit4] Suite: org.apache.solr.cloud.OverseerTest
   [junit4]   2> Creating dataDir: /x1/jenkins/jenkins-slave/workspace/Lucene-Solr-Tests-5.x-Java7/solr/build/solr-core/test/J2/temp/solr.cloud.OverseerTest_49A2C9DD457A135A-001/init-core-data-001
   [junit4]   2> 1273377 INFO  (SUITE-OverseerTest-seed#[49A2C9DD457A135A]-worker) [    ] o.a.s.SolrTestCaseJ4 Randomized ssl (true) and clientAuth (false)
   [junit4]   2> 1273377 INFO  (SUITE-OverseerTest-seed#[49A2C9DD457A135A]-worker) [    ] o.a.s.SolrTestCaseJ4 ####initCore
   [junit4]   2> 1273377 INFO  (SUITE-OverseerTest-seed#[49A2C9DD457A135A]-worker) [    ] o.a.s.SolrTestCaseJ4 ####initCore end
   [junit4]   2> 1273380 INFO  (TEST-OverseerTest.testExternalClusterStateChangeBehavior-seed#[49A2C9DD457A135A]) [    ] o.a.s.SolrTestCaseJ4 ###Starting testExternalClusterStateChangeBehavior
   [junit4]   2> 1273381 INFO  (TEST-OverseerTest.testExternalClusterStateChangeBehavior-seed#[49A2C9DD457A135A]) [    ] o.a.s.c.ZkTestServer STARTING ZK TEST SERVER
   [junit4]   2> 1273381 INFO  (Thread-1747) [    ] o.a.s.c.ZkTestServer client port:0.0.0.0/0.0.0.0:0
   [junit4]   2> 1273381 INFO  (Thread-1747) [    ] o.a.s.c.ZkTestServer Starting server
   [junit4]   2> 1273481 INFO  (TEST-OverseerTest.testExternalClusterStateChangeBehavior-seed#[49A2C9DD457A135A]) [    ] o.a.s.c.ZkTestServer start zk server on port:60050
   [junit4]   2> 1273481 INFO  (TEST-OverseerTest.testExternalClusterStateChangeBehavior-seed#[49A2C9DD457A135A]) [    ] o.a.s.c.c.SolrZkClient Using default ZkCredentialsProvider
   [junit4]   2> 1273482 INFO  (TEST-OverseerTest.testExternalClusterStateChangeBehavior-seed#[49A2C9DD457A135A]) [    ] o.a.s.c.c.ConnectionManager Waiting for client to connect to ZooKeeper
   [junit4]   2> 1273484 INFO  (zkCallback-720-thread-1) [    ] o.a.s.c.c.ConnectionManager Watcher org.apache.solr.common.cloud.ConnectionManager@24778738 name:ZooKeeperConnection Watcher:127.0.0.1:60050/solr got event WatchedEvent state:SyncConnected type:None path:null path:null type:None
   [junit4]   2> 1273484 INFO  (TEST-OverseerTest.testExternalClusterStateChangeBehavior-seed#[49A2C9DD457A135A]) [    ] o.a.s.c.c.ConnectionManager Client is connected to ZooKeeper
   [junit4]   2> 1273485 INFO  (TEST-OverseerTest.testExternalClusterStateChangeBehavior-seed#[49A2C9DD457A135A]) [    ] o.a.s.c.c.SolrZkClient Using default ZkACLProvider
   [junit4]   2> 1273485 INFO  (TEST-OverseerTest.testExternalClusterStateChangeBehavior-seed#[49A2C9DD457A135A]) [    ] o.a.s.c.c.SolrZkClient Using default ZkCredentialsProvider
   [junit4]   2> 1273485 INFO  (TEST-OverseerTest.testExternalClusterStateChangeBehavior-seed#[49A2C9DD457A135A]) [    ] o.a.s.c.c.ConnectionManager Waiting for client to connect to ZooKeeper
   [junit4]   2> 1273486 INFO  (zkCallback-721-thread-1) [    ] o.a.s.c.c.ConnectionManager Watcher org.apache.solr.common.cloud.ConnectionManager@468562bb name:ZooKeeperConnection Watcher:127.0.0.1:60050 got event WatchedEvent state:SyncConnected type:None path:null path:null type:None
   [junit4]   2> 1273486 INFO  (TEST-OverseerTest.testExternalClusterStateChangeBehavior-seed#[49A2C9DD457A135A]) [    ] o.a.s.c.c.ConnectionManager Client is connected to ZooKeeper
   [junit4]   2> 1273486 INFO  (TEST-OverseerTest.testExternalClusterStateChangeBehavior-seed#[49A2C9DD457A135A]) [    ] o.a.s.c.c.SolrZkClient Using default ZkACLProvider
   [junit4]   2> 1273487 INFO  (TEST-OverseerTest.testExternalClusterStateChangeBehavior-seed#[49A2C9DD457A135A]) [    ] o.a.s.c.c.SolrZkClient Using default ZkCredentialsProvider
   [junit4]   2> 1273489 INFO  (TEST-OverseerTest.testExternalClusterStateChangeBehavior-seed#[49A2C9DD457A135A]) [    ] o.a.s.c.c.ConnectionManager Waiting for client to connect to ZooKeeper
   [junit4]   2> 1273490 INFO  (zkCallback-722-thread-1) [    ] o.a.s.c.c.ConnectionManager Watcher org.apache.solr.common.cloud.ConnectionManager@15d90e9d name:ZooKeeperConnection Watcher:127.0.0.1:60050 got event WatchedEvent state:SyncConnected type:None path:null path:null type:None
   [junit4]   2> 1273490 INFO  (TEST-OverseerTest.testExternalClusterStateChangeBehavior-seed#[49A2C9DD457A135A]) [    ] o.a.s.c.c.ConnectionManager Client is connected to ZooKeeper
   [junit4]   2> 1273490 INFO  (TEST-OverseerTest.testExternalClusterStateChangeBehavior-seed#[49A2C9DD457A135A]) [    ] o.a.s.c.c.SolrZkClient Using default ZkACLProvider
   [junit4]   2> 1273490 INFO  (TEST-OverseerTest.testExternalClusterStateChangeBehavior-seed#[49A2C9DD457A135A]) [    ] o.a.s.c.c.SolrZkClient makePath: /solr
   [junit4]   2> 1273493 INFO  (TEST-OverseerTest.testExternalClusterStateChangeBehavior-seed#[49A2C9DD457A135A]) [    ] o.a.s.c.c.SolrZkClient makePath: /live_nodes
   [junit4]   2> 1273495 INFO  (TEST-OverseerTest.testExternalClusterStateChangeBehavior-seed#[49A2C9DD457A135A]) [    ] o.a.s.c.c.SolrZkClient makePath: /collections
   [junit4]   2> 1273496 INFO  (TEST-OverseerTest.testExternalClusterStateChangeBehavior-seed#[49A2C9DD457A135A]) [    ] o.a.s.c.c.SolrZkClient makePath: /aliases.json
   [junit4]   2> 1273497 INFO  (TEST-OverseerTest.testExternalClusterStateChangeBehavior-seed#[49A2C9DD457A135A]) [    ] o.a.s.c.c.SolrZkClient makePath: /clusterstate.json
   [junit4]   2> 1273498 INFO  (TEST-OverseerTest.testExternalClusterStateChangeBehavior-seed#[49A2C9DD457A135A]) [    ] o.a.s.c.c.SolrZkClient makePath: /security.json
   [junit4]   2> 1273499 INFO  (TEST-OverseerTest.testExternalClusterStateChangeBehavior-seed#[49A2C9DD457A135A]) [    ] o.a.s.c.c.ZkStateReader Updating cluster state from ZooKeeper... 
   [junit4]   2> 1273502 INFO  (TEST-OverseerTest.testExternalClusterStateChangeBehavior-seed#[49A2C9DD457A135A]) [    ] o.a.s.c.c.SolrZkClient Using default ZkCredentialsProvider
   [junit4]   2> 1273505 INFO  (TEST-OverseerTest.testExternalClusterStateChangeBehavior-seed#[49A2C9DD457A135A]) [    ] o.a.s.c.c.ConnectionManager Waiting for client to connect to ZooKeeper
   [junit4]   2> 1273505 INFO  (zkCallback-723-thread-1) [    ] o.a.s.c.c.ConnectionManager Watcher org.apache.solr.common.cloud.ConnectionManager@384cbdac name:ZooKeeperConnection Watcher:127.0.0.1:60050/solr got event WatchedEvent state:SyncConnected type:None path:null path:null type:None
   [junit4]   2> 1273506 INFO  (TEST-OverseerTest.testExternalClusterStateChangeBehavior-seed#[49A2C9DD457A135A]) [    ] o.a.s.c.c.ConnectionManager Client is connected to ZooKeeper
   [junit4]   2> 1273506 INFO  (TEST-OverseerTest.testExternalClusterStateChangeBehavior-seed#[49A2C9DD457A135A]) [    ] o.a.s.c.c.SolrZkClient Using default ZkACLProvider
   [junit4]   2> 1273506 INFO  (TEST-OverseerTest.testExternalClusterStateChangeBehavior-seed#[49A2C9DD457A135A]) [    ] o.a.s.u.UpdateShardHandler Creating UpdateShardHandler HTTP client with params: socketTimeout=600000&connTimeout=60000&retry=true
   [junit4]   2> 1273510 INFO  (TEST-OverseerTest.testExternalClusterStateChangeBehavior-seed#[49A2C9DD457A135A]) [    ] o.a.s.c.c.SolrZkClient makePath: /overseer_elect
   [junit4]   2> 1273511 INFO  (TEST-OverseerTest.testExternalClusterStateChangeBehavior-seed#[49A2C9DD457A135A]) [    ] o.a.s.c.c.SolrZkClient makePath: /overseer_elect/election
   [junit4]   2> 1273512 INFO  (TEST-OverseerTest.testExternalClusterStateChangeBehavior-seed#[49A2C9DD457A135A]) [    ] o.a.s.c.Overseer Overseer (id=null) closing
   [junit4]   2> 1273513 INFO  (TEST-OverseerTest.testExternalClusterStateChangeBehavior-seed#[49A2C9DD457A135A]) [    ] o.a.s.c.LeaderElector Joined leadership election with path: /overseer_elect/election/95268644328833027-127.0.0.1:60050_solr-n_0000000000
   [junit4]   2> 1273513 INFO  (TEST-OverseerTest.testExternalClusterStateChangeBehavior-seed#[49A2C9DD457A135A]) [    ] o.a.s.c.OverseerElectionContext I am going to be the leader 127.0.0.1:60050_solr
   [junit4]   2> 1273513 INFO  (TEST-OverseerTest.testExternalClusterStateChangeBehavior-seed#[49A2C9DD457A135A]) [    ] o.a.s.c.c.SolrZkClient makePath: /overseer_elect/leader
   [junit4]   2> 1273514 INFO  (TEST-OverseerTest.testExternalClusterStateChangeBehavior-seed#[49A2C9DD457A135A]) [    ] o.a.s.c.Overseer Overseer (id=95268644328833027-127.0.0.1:60050_solr-n_0000000000) starting
   [junit4]   2> 1273516 INFO  (TEST-OverseerTest.testExternalClusterStateChangeBehavior-seed#[49A2C9DD457A135A]) [    ] o.a.s.c.c.SolrZkClient makePath: /overseer/queue
   [junit4]   2> 1273518 INFO  (TEST-OverseerTest.testExternalClusterStateChangeBehavior-seed#[49A2C9DD457A135A]) [    ] o.a.s.c.c.SolrZkClient makePath: /overseer/queue-work
   [junit4]   2> 1273519 INFO  (TEST-OverseerTest.testExternalClusterStateChangeBehavior-seed#[49A2C9DD457A135A]) [    ] o.a.s.c.c.SolrZkClient makePath: /overseer/collection-map-failure
   [junit4]   2> 1273521 INFO  (TEST-OverseerTest.testExternalClusterStateChangeBehavior-seed#[49A2C9DD457A135A]) [    ] o.a.s.c.c.SolrZkClient makePath: /overseer/collection-map-running
   [junit4]   2> 1273523 INFO  (TEST-OverseerTest.testExternalClusterStateChangeBehavior-seed#[49A2C9DD457A135A]) [    ] o.a.s.c.c.SolrZkClient makePath: /overseer/collection-map-completed
   [junit4]   2> 1273525 INFO  (TEST-OverseerTest.testExternalClusterStateChangeBehavior-seed#[49A2C9DD457A135A]) [    ] o.a.s.c.c.SolrZkClient makePath: /overseer/collection-queue-work
   [junit4]   2> 1273528 INFO  (TEST-OverseerTest.testExternalClusterStateChangeBehavior-seed#[49A2C9DD457A135A]) [    ] o.a.s.c.OverseerAutoReplicaFailoverThread Starting OverseerAutoReplicaFailoverThread autoReplicaFailoverWorkLoopDelay=10000 autoReplicaFailoverWaitAfterExpiration=30000 autoReplicaFailoverBadNodeExpiration=60000
   [junit4]   2> 1273529 INFO  (OverseerCollectionConfigSetProcessor-95268644328833027-127.0.0.1:60050_solr-n_0000000000) [    ] o.a.s.c.OverseerTaskProcessor Process current queue of overseer operations
   [junit4]   2> 1273529 INFO  (OverseerStateUpdate-95268644328833027-127.0.0.1:60050_solr-n_0000000000) [    ] o.a.s.c.Overseer Starting to work on the main queue
   [junit4]   2> 1273529 INFO  (OverseerStateUpdate-95268644328833027-127.0.0.1:60050_solr-n_0000000000) [    ] o.a.s.c.c.ZkStateReader Updating cluster state from ZooKeeper... 
   [junit4]   2> 1273533 INFO  (OverseerStateUpdate-95268644328833027-127.0.0.1:60050_solr-n_0000000000) [    ] o.a.s.c.Overseer processMessage: queueSize: 1, message = {
   [junit4]   2>   "operation":"state",
   [junit4]   2>   "base_url":"http://127.0.0.1/solr",
   [junit4]   2>   "node_name":"node1",
   [junit4]   2>   "collection":"c1",
   [junit4]   2>   "core":"core1",
   [junit4]   2>   "roles":"",
   [junit4]   2>   "state":"down"} current state version: 0
   [junit4]   2> 1273534 INFO  (OverseerStateUpdate-95268644328833027-127.0.0.1:60050_solr-n_0000000000) [    ] o.a.s.c.o.ReplicaMutator Update state numShards=null message={
   [junit4]   2>   "operation":"state",
   [junit4]   2>   "base_url":"http://127.0.0.1/solr",
   [junit4]   2>   "node_name":"node1",
   [junit4]   2>   "collection":"c1",
   [junit4]   2>   "core":"core1",
   [junit4]   2>   "roles":"",
   [junit4]   2>   "state":"down"}
   [junit4]   2> 1273534 INFO  (OverseerStateUpdate-95268644328833027-127.0.0.1:60050_solr-n_0000000000) [    ] o.a.s.c.o.ReplicaMutator Assigning new node to shard shard=shard1
   [junit4]   2> 1273535 INFO  (zkCallback-720-thread-1) [    ] o.a.s.c.c.ZkStateReader A cluster state change: [WatchedEvent state:SyncConnected type:NodeDataChanged path:/clusterstate.json], has occurred - updating... (live nodes size: [0])
   [junit4]   2> 1273535 INFO  (zkCallback-723-thread-1) [    ] o.a.s.c.c.ZkStateReader A cluster state change: [WatchedEvent state:SyncConnected type:NodeDataChanged path:/clusterstate.json], has occurred - updating... (live nodes size: [0])
   [junit4]   2> 1273587 INFO  (OverseerStateUpdate-95268644328833027-127.0.0.1:60050_solr-n_0000000000) [    ] o.a.s.c.Overseer processMessage: queueSize: 2, message = {
   [junit4]   2>   "operation":"state",
   [junit4]   2>   "base_url":"http://127.0.0.1/solr",
   [junit4]   2>   "node_name":"node1",
   [junit4]   2>   "collection":"c1",
   [junit4]   2>   "core":"core1",
   [junit4]   2>   "roles":"",
   [junit4]   2>   "state":"recovering"} current state version: 1
   [junit4]   2> 1273587 INFO  (zkCallback-723-thread-1) [    ] o.a.s.c.c.ZkStateReader A cluster state change: [WatchedEvent state:SyncConnected type:NodeDataChanged path:/clusterstate.json], has occurred - updating... (live nodes size: [0])
   [junit4]   2> 1273587 INFO  (zkCallback-720-thread-1) [    ] o.a.s.c.c.ZkStateReader A cluster state change: [WatchedEvent state:SyncConnected type:NodeDataChanged path:/clusterstate.json], has occurred - updating... (live nodes size: [0])
   [junit4]   2> 1273587 INFO  (OverseerStateUpdate-95268644328833027-127.0.0.1:60050_solr-n_0000000000) [    ] o.a.s.c.o.ReplicaMutator Update state numShards=null message={
   [junit4]   2>   "operation":"state",
   [junit4]   2>   "base_url":"http://127.0.0.1/solr",
   [junit4]   2>   "node_name":"node1",
   [junit4]   2>   "collection":"c1",
   [junit4]   2>   "core":"core1",
   [junit4]   2>   "roles":"",
   [junit4]   2>   "state":"recovering"}
   [junit4]   2> 1273587 INFO  (OverseerStateUpdate-95268644328833027-127.0.0.1:60050_solr-n_0000000000) [    ] o.a.s.c.o.ReplicaMutator node=core_node1 is already registered
   [junit4]   2> 1273587 INFO  (OverseerStateUpdate-95268644328833027-127.0.0.1:60050_solr-n_0000000000) [    ] o.a.s.c.o.ReplicaMutator shard=shard1 is already registered
   [junit4]   2> 1273590 INFO  (OverseerStateUpdate-95268644328833027-127.0.0.1:60050_solr-n_0000000000) [    ] o.a.s.c.Overseer processMessage: queueSize: 2, message = {
   [junit4]   2>   "operation":"state",
   [junit4]   2>   "base_url":"http://127.0.0.1/solr",
   [junit4]   2>   "node_name":"node1",
   [junit4]   2>   "collection":"c1",
   [junit4]   2>   "core":"core1",
   [junit4]   2>   "roles":"",
   [junit4]   2>   "state":"active"} current state version: 1
   [junit4]   2> 1273590 INFO  (OverseerStateUpdate-95268644328833027-127.0.0.1:60050_solr-n_0000000000) [    ] o.a.s.c.o.ReplicaMutator Update state numShards=null message={
   [junit4]   2>   "operation":"state",
   [junit4]   2>   "base_url":"http://127.0.0.1/solr",
   [junit4]   2>   "node_name":"node1",
   [junit4]   2>   "collection":"c1",
   [junit4]   2>   "core":"core1",
   [junit4]   2>   "roles":"",
   [junit4]   2>   "state":"active"}
   [junit4]   2> 1273590 INFO  (OverseerStateUpdate-95268644328833027-127.0.0.1:60050_solr-n_0000000000) [    ] o.a.s.c.o.ReplicaMutator node=core_node1 is already registered
   [junit4]   2> 1273590 INFO  (OverseerStateUpdate-95268644328833027-127.0.0.1:60050_solr-n_0000000000) [    ] o.a.s.c.o.ReplicaMutator shard=shard1 is already registered
   [junit4]   2> 1273592 INFO  (OverseerStateUpdate-95268644328833027-127.0.0.1:60050_solr-n_0000000000) [    ] o.a.s.c.Overseer processMessage: queueSize: 3, message = {
   [junit4]   2>   "operation":"create",
   [junit4]   2>   "name":"test",
   [junit4]   2>   "numShards":"1",
   [junit4]   2>   "replicationFactor":"1",
   [junit4]   2>   "stateFormat":"2"} current state version: 1
   [junit4]   2> 1273592 INFO  (OverseerStateUpdate-95268644328833027-127.0.0.1:60050_solr-n_0000000000) [    ] o.a.s.c.o.ClusterStateMutator building a new cName: test
   [junit4]   2> 1273593 WARN  (OverseerStateUpdate-95268644328833027-127.0.0.1:60050_solr-n_0000000000) [    ] o.a.s.c.Overseer Bad version writing to ZK using compare-and-set, will force refresh cluster state
   [junit4]   2> org.apache.zookeeper.KeeperException$BadVersionException: KeeperErrorCode = BadVersion for /clusterstate.json
   [junit4]   2> 	at org.apache.zookeeper.KeeperException.create(KeeperException.java:115)
   [junit4]   2> 	at org.apache.zookeeper.KeeperException.create(KeeperException.java:51)
   [junit4]   2> 	at org.apache.zookeeper.ZooKeeper.setData(ZooKeeper.java:1270)
   [junit4]   2> 	at org.apache.solr.common.cloud.SolrZkClient$8.execute(SolrZkClient.java:362)
   [junit4]   2> 	at org.apache.solr.common.cloud.SolrZkClient$8.execute(SolrZkClient.java:359)
   [junit4]   2> 	at org.apache.solr.common.cloud.ZkCmdExecutor.retryOperation(ZkCmdExecutor.java:61)
   [junit4]   2> 	at org.apache.solr.common.cloud.SolrZkClient.setData(SolrZkClient.java:359)
   [junit4]   2> 	at org.apache.solr.cloud.overseer.ZkStateWriter.writePendingUpdates(ZkStateWriter.java:253)
   [junit4]   2> 	at org.apache.solr.cloud.overseer.ZkStateWriter.enqueueUpdate(ZkStateWriter.java:120)
   [junit4]   2> 	at org.apache.solr.cloud.Overseer$ClusterStateUpdater.processQueueItem(Overseer.java:291)
   [junit4]   2> 	at org.apache.solr.cloud.Overseer$ClusterStateUpdater.run(Overseer.java:215)
   [junit4]   2> 	at java.lang.Thread.run(Thread.java:745)
   [junit4]   2> 1273595 INFO  (OverseerStateUpdate-95268644328833027-127.0.0.1:60050_solr-n_0000000000) [    ] o.a.s.c.Overseer processMessage: workQueueSize: 2, message = {
   [junit4]   2>   "operation":"state",
   [junit4]   2>   "base_url":"http://127.0.0.1/solr",
   [junit4]   2>   "node_name":"node1",
   [junit4]   2>   "collection":"c1",
   [junit4]   2>   "core":"core1",
   [junit4]   2>   "roles":"",
   [junit4]   2>   "state":"recovering"}
   [junit4]   2> 1273596 INFO  (OverseerStateUpdate-95268644328833027-127.0.0.1:60050_solr-n_0000000000) [    ] o.a.s.c.o.ReplicaMutator Update state numShards=null message={
   [junit4]   2>   "operation":"state",
   [junit4]   2>   "base_url":"http://127.0.0.1/solr",
   [junit4]   2>   "node_name":"node1",
   [junit4]   2>   "collection":"c1",
   [junit4]   2>   "core":"core1",
   [junit4]   2>   "roles":"",
   [junit4]   2>   "state":"recovering"}
   [junit4]   2> 1273596 INFO  (OverseerStateUpdate-95268644328833027-127.0.0.1:60050_solr-n_0000000000) [    ] o.a.s.c.o.ReplicaMutator node=core_node1 is already registered
   [junit4]   2> 1273596 INFO  (OverseerStateUpdate-95268644328833027-127.0.0.1:60050_solr-n_0000000000) [    ] o.a.s.c.o.ReplicaMutator shard=shard1 is already registered
   [junit4]   2> 1273597 INFO  (zkCallback-720-thread-1) [    ] o.a.s.c.c.ZkStateReader A cluster state change: [WatchedEvent state:SyncConnected type:NodeDataChanged path:/clusterstate.json], has occurred - updating... (live nodes size: [0])
   [junit4]   2> 1273597 INFO  (zkCallback-723-thread-1) [    ] o.a.s.c.c.ZkStateReader A cluster state change: [WatchedEvent state:SyncConnected type:NodeDataChanged path:/clusterstate.json], has occurred - updating... (live nodes size: [0])
   [junit4]   2> 1273598 INFO  (OverseerStateUpdate-95268644328833027-127.0.0.1:60050_solr-n_0000000000) [    ] o.a.s.c.Overseer processMessage: workQueueSize: 2, message = {
   [junit4]   2>   "operation":"state",
   [junit4]   2>   "base_url":"http://127.0.0.1/solr",
   [junit4]   2>   "node_name":"node1",
   [junit4]   2>   "collection":"c1",
   [junit4]   2>   "core":"core1",
   [junit4]   2>   "roles":"",
   [junit4]   2>   "state":"active"}
   [junit4]   2> 1273599 INFO  (OverseerStateUpdate-95268644328833027-127.0.0.1:60050_solr-n_0000000000) [    ] o.a.s.c.o.ReplicaMutator Update state numShards=null message={
   [junit4]   2>   "operation":"state",
   [junit4]   2>   "base_url":"http://127.0.0.1/solr",
   [junit4]   2>   "node_name":"node1",
   [junit4]   2>   "collection":"c1",
   [junit4]   2>   "core":"core1",
   [junit4]   2>   "roles":"",
   [junit4]   2>   "state":"active"}
   [junit4]   2> 1273599 INFO  (OverseerStateUpdate-95268644328833027-127.0.0.1:60050_solr-n_0000000000) [    ] o.a.s.c.o.ReplicaMutator node=core_node1 is already registered
   [junit4]   2> 1273599 INFO  (OverseerStateUpdate-95268644328833027-127.0.0.1:60050_solr-n_0000000000) [    ] o.a.s.c.o.ReplicaMutator shard=shard1 is already registered
   [junit4]   2> 1273599 INFO  (zkCallback-720-thread-1) [    ] o.a.s.c.c.ZkStateReader A cluster state change: [WatchedEvent state:SyncConnected type:NodeDataChanged path:/clusterstate.json], has occurred - updating... (live nodes size: [0])
   [junit4]   2> 1273600 INFO  (zkCallback-723-thread-1) [    ] o.a.s.c.c.ZkStateReader A cluster state change: [WatchedEvent state:SyncConnected type:NodeDataChanged path:/clusterstate.json], has occurred - updating... (live nodes size: [0])
   [junit4]   2> 1273601 INFO  (OverseerStateUpdate-95268644328833027-127.0.0.1:60050_solr-n_0000000000) [    ] o.a.s.c.Overseer processMessage: queueSize: 0, message = {
   [junit4]   2>   "operation":"create",
   [junit4]   2>   "name":"test",
   [junit4]   2>   "numShards":"1",
   [junit4]   2>   "replicationFactor":"1",
   [junit4]   2>   "stateFormat":"2"} current state version: 4
   [junit4]   2> 1273601 INFO  (OverseerStateUpdate-95268644328833027-127.0.0.1:60050_solr-n_0000000000) [    ] o.a.s.c.o.ClusterStateMutator building a new cName: test
   [junit4]   2> 1273603 INFO  (OverseerStateUpdate-95268644328833027-127.0.0.1:60050_solr-n_0000000000) [    ] o.a.s.c.Overseer processMessage: queueSize: 0, message = {
   [junit4]   2>   "operation":"createshard",
   [junit4]   2>   "collection":"test",
   [junit4]   2>   "shard":"x",
   [junit4]   2>   "replicationFactor":"1"} current state version: 4
   [junit4]   2> 1273604 INFO  (OverseerStateUpdate-95268644328833027-127.0.0.1:60050_solr-n_0000000000) [    ] o.a.s.c.Overseer processMessage: queueSize: 0, message = {
   [junit4]   2>   "operation":"addreplica",
   [junit4]   2>   "collection":"test",
   [junit4]   2>   "shard":"x",
   [junit4]   2>   "base_url":"http://127.0.0.1/solr",
   [junit4]   2>   "node_name":"node1",
   [junit4]   2>   "core":"core1",
   [junit4]   2>   "state":"down"} current state version: 4
   [junit4]   2> 1273604 INFO  (OverseerStateUpdate-95268644328833027-127.0.0.1:60050_solr-n_0000000000) [    ] o.a.s.c.o.SliceMutator createReplica() {
   [junit4]   2>   "operation":"addreplica",
   [junit4]   2>   "collection":"test",
   [junit4]   2>   "shard":"x",
   [junit4]   2>   "base_url":"http://127.0.0.1/solr",
   [junit4]   2>   "node_name":"node1",
   [junit4]   2>   "core":"core1",
   [junit4]   2>   "state":"down"} 
   [junit4]   2> 1273706 INFO  (OverseerStateUpdate-95268644328833027-127.0.0.1:60050_solr-n_0000000000) [    ] o.a.s.c.o.ZkStateWriter going to create_collection /collections/test/state.json
   [junit4]   2> 1273753 INFO  (TEST-OverseerTest.testExternalClusterStateChangeBehavior-seed#[49A2C9DD457A135A]) [    ] o.a.s.c.ZkTestServer connecting to 127.0.0.1:60050 60050
   [junit4]   2> 1273904 INFO  (Thread-1747) [    ] o.a.s.c.ZkTestServer connecting to 127.0.0.1:60050 60050
   [junit4]   2> 1273905 WARN  (Thread-1747) [    ] o.a.s.c.ZkTestServer Watch limit violations: 
   [junit4]   2> Maximum concurrent create/delete watches above limit:
   [junit4]   2> 
   [junit4]   2> 	2	/solr/aliases.json
   [junit4]   2> 
   [junit4]   2> Maximum concurrent data watches above limit:
   [junit4]   2> 
   [junit4]   2> 	2	/solr/clusterstate.json
   [junit4]   2> 
   [junit4]   2> Maximum concurrent children watches above limit:
   [junit4]   2> 
   [junit4]   2> 	2	/solr/collections
   [junit4]   2> 	2	/solr/live_nodes
   [junit4]   2> 
   [junit4]   2> 1273905 INFO  (TEST-OverseerTest.testExternalClusterStateChangeBehavior-seed#[49A2C9DD457A135A]) [    ] o.a.s.SolrTestCaseJ4 ###Ending testExternalClusterStateChangeBehavior
   [junit4]   2> 1273905 INFO  (TEST-OverseerTest.testExternalClusterStateChangeBehavior-seed#[49A2C9DD457A135A]) [    ] o.a.s.c.Overseer Overseer (id=95268644328833027-127.0.0.1:60050_solr-n_0000000000) closing
   [junit4]   2> 1273906 INFO  (OverseerStateUpdate-95268644328833027-127.0.0.1:60050_solr-n_0000000000) [    ] o.a.s.c.Overseer Overseer Loop exiting : 127.0.0.1:60050_solr
   [junit4]   2> 1273907 ERROR (OverseerExitThread) [    ] o.a.s.c.Overseer could not read the data
   [junit4]   2> org.apache.zookeeper.KeeperException$SessionExpiredException: KeeperErrorCode = Session expired for /overseer_elect/leader
   [junit4]   2> 	at org.apache.zookeeper.KeeperException.create(KeeperException.java:127)
   [junit4]   2> 	at org.apache.zookeeper.KeeperException.create(KeeperException.java:51)
   [junit4]   2> 	at org.apache.zookeeper.ZooKeeper.getData(ZooKeeper.java:1155)
   [junit4]   2> 	at org.apache.solr.common.cloud.SolrZkClient$7.execute(SolrZkClient.java:345)
   [junit4]   2> 	at org.apache.solr.common.cloud.SolrZkClient$7.execute(SolrZkClient.java:342)
   [junit4]   2> 	at org.apache.solr.common.cloud.ZkCmdExecutor.retryOperation(ZkCmdExecutor.java:61)
   [junit4]   2> 	at org.apache.solr.common.cloud.SolrZkClient.getData(SolrZkClient.java:342)
   [junit4]   2> 	at org.apache.solr.cloud.Overseer$ClusterStateUpdater.checkIfIamStillLeader(Overseer.java:305)
   [junit4]   2> 	at org.apache.solr.cloud.Overseer$ClusterStateUpdater.access$300(Overseer.java:88)
   [junit4]   2> 	at org.apache.solr.cloud.Overseer$ClusterStateUpdater$2.run(Overseer.java:266)
   [junit4]   2> 1273915 INFO  (TEST-OverseerTest.testShardAssignment-seed#[49A2C9DD457A135A]) [    ] o.a.s.SolrTestCaseJ4 ###Starting testShardAssignment
   [junit4]   2> 1273915 INFO  (TEST-OverseerTest.testShardAssignment-seed#[49A2C9DD457A135A]) [    ] o.a.s.c.ZkTestServer STARTING ZK TEST SERVER
   [junit4]   2> 1273915 INFO  (Thread-1748) [    ] o.a.s.c.ZkTestServer client port:0.0.0.0/0.0.0.0:0
   [junit4]   2> 1273915 INFO  (Thread-1748) [    ] o.a.s.c.ZkTestServer Starting server
   [junit4]   2> 1274015 INFO  (TEST-OverseerTest.testShardAssignment-seed#[49A2C9DD457A135A]) [    ] o.a.s.c.ZkTestServer start zk server on port:55984
   [junit4]   2> 1274015 INFO  (TEST-OverseerTest.testShardAssignment-seed#[49A2C9DD457A135A]) [    ] o.a.s.c.c.SolrZkClient Using default ZkCredentialsProvider
   [junit4]   2> 1274016 INFO  (TEST-OverseerTest.testShardAssignment-seed#[49A2C9DD457A135A]) [    ] o.a.s.c.c.ConnectionManager Waiting for client to connect to ZooKeeper
   [junit4]   2> 1274019 INFO  (zkCallback-726-thread-1) [    ] o.a.s.c.c.ConnectionManager Watcher org.apache.solr.common.cloud.ConnectionManager@90016a1 name:ZooKeeperConnection Watcher:127.0.0.1:55984 got event WatchedEvent state:SyncConnected type:None path:null path:null type:None
   [junit4]   2> 1274019 INFO  (TEST-OverseerTest.testShardAssignment-seed#[49A2C9DD457A135A]) [    ] o.a.s.c.c.ConnectionManager Client is connected to ZooKeeper
   [junit4]   2> 1274020 INFO  (TEST-OverseerTest.testShardAssignment-seed#[49A2C9DD457A135A]) [    ] o.a.s.c.c.SolrZkClient Using default ZkACLProvider
   [junit4]   2> 1274021 INFO  (TEST-OverseerTest.testShardAssignment-seed#[49A2C9DD457A135A]) [    ] o.a.s.c.c.SolrZkClient Using default ZkCredentialsProvider
   [junit4]   2> 1274022 INFO  (TEST-OverseerTest.testShardAssignment-seed#[49A2C9DD457A135A]) [    ] o.a.s.c.c.ConnectionManager Waiting for client to connect to ZooKeeper
   [junit4]   2> 1274023 INFO  (zkCallback-727-thread-1) [    ] o.a.s.c.c.ConnectionManager Watcher org.apache.solr.common.cloud.ConnectionManager@15ab5d60 name:ZooKeeperConnection Watcher:127.0.0.1:55984 got event WatchedEvent state:SyncConnected type:None path:null path:null type:None
   [junit4]   2> 1274023 INFO  (TEST-OverseerTest.testShardAssignment-seed#[49A2C9DD457A135A]) [    ] o.a.s.c.c.ConnectionManager Client is connected to ZooKeeper
   [junit4]   2> 1274024 INFO  (TEST-OverseerTest.testShardAssignment-seed#[49A2C9DD457A135A]) [    ] o.a.s.c.c.SolrZkClient Using default ZkACLProvider
   [junit4]   2> 1274024 INFO  (TEST-OverseerTest.testShardAssignment-seed#[49A2C9DD457A135A]) [    ] o.a.s.c.c.SolrZkClient makePath: /solr
   [junit4]   2> 1274026 INFO  (TEST-OverseerTest.testShardAssignment-seed#[49A2C9DD457A135A]) [    ] o.a.s.c.c.SolrZkClient Using default ZkCredentialsProvider
   [junit4]   2> 1274027 INFO  (TEST-OverseerTest.testShardAssignment-seed#[49A2C9DD457A135A]) [    ] o.a.s.c.c.ConnectionManager Waiting for client to connect to ZooKeeper
   [junit4]   2> 1274028 INFO  (zkCallback-728-thread-1) [    ] o.a.s.c.c.ConnectionManager Watcher org.apache.solr.common.cloud.ConnectionManager@27badfe5 name:ZooKeeperConnection Watcher:127.0.0.1:55984/solr got event WatchedEvent state:SyncConnected type:None path:null path:null type:None
   [junit4]   2> 1274028 INFO  (TEST-OverseerTest.testShardAssignment-seed#[49A2C9DD457A135A]) [    ] o.a.s.c.c.ConnectionManager Client is connected to ZooKeeper
   [junit4]   2> 1274028 INFO  (TEST-OverseerTest.testShardAssignment-seed#[49A2C9DD457A135A]) [    ] o.a.s.c.c.SolrZkClient Using default ZkACLProvider
   [junit4]   2> 1274029 INFO  (TEST-OverseerTest.testShardAssignment-seed#[49A2C9DD457A135A]) [    ] o.a.s.c.c.SolrZkClient makePath: /live_nodes
   [junit4]   2> 1274030 INFO  (TEST-OverseerTest.testShardAssignment-seed#[49A2C9DD457A135A]) [    ] o.a.s.c.c.SolrZkClient makePath: /collections
   [junit4]   2> 1274032 INFO  (TEST-OverseerTest.testShardAssignment-seed#[49A2C9DD457A135A]) [    ] o.a.s.c.c.SolrZkClient makePath: /aliases.json
   [junit4]   2> 1274033 INFO  (TEST-OverseerTest.testShardAssignment-seed#[49A2C9DD457A135A]) [    ] o.a.s.c.c.SolrZkClient makePath: /clusterstate.json
   [junit4]   2> 1274035 INFO  (TEST-OverseerTest.testShardAssignment-seed#[49A2C9DD457A135A]) [    ] o.a.s.c.c.SolrZkClient makePath: /security.json
   [junit4]   2> 1274036 INFO  (TEST-OverseerTest.testShardAssignment-seed#[49A2C9DD457A135A]) [    ] o.a.s.c.c.SolrZkClient Using default ZkCredentialsProvider
   [junit4]   2> 1274036 INFO  (TEST-OverseerTest.testShardAssignment-seed#[49A2C9DD457A135A]) [    ] o.a.s.c.c.ConnectionManager Waiting for client to connect to ZooKeeper
   [junit4]   2> 1274038 INFO  (zkCallback-729-thread-1) [    ] o.a.s.c.c.ConnectionManager Watcher org.apache.solr.common.cloud.ConnectionManager@2725302e name:ZooKeeperConnection Watcher:127.0.0.1:55984/solr got event WatchedEvent state:SyncConnected type:None path:null path:null type:None
   [junit4]   2> 1274038 INFO  (TEST-OverseerTest.testShardAssignment-seed#[49A2C9DD457A135A]) [    ] o.a.s.c.c.ConnectionManager Client is connected to ZooKeeper
   [junit4]   2> 1274038 INFO  (TEST-OverseerTest.testShardAssignment-seed#[49A2C9DD457A135A]) [    ] o.a.s.c.c.SolrZkClient Using default ZkACLProvider
   [junit4]   2> 1274038 INFO  (TEST-OverseerTest.testShardAssignment-seed#[49A2C9DD457A135A]) [    ] o.a.s.u.UpdateShardHandler Creating UpdateShardHandler HTTP client with params: socketTimeout=600000&connTimeout=60000&retry=true
   [junit4]   2> 1274041 INFO  (TEST-OverseerTest.testShardAssignment-seed#[49A2C9DD457A135A]) [    ] o.a.s.c.c.SolrZkClient makePath: /overseer_elect
   [junit4]   2> 1274042 INFO  (TEST-OverseerTest.testShardAssignment-seed#[49A2C9DD457A135A]) [    ] o.a.s.c.c.SolrZkClient makePath: /overseer_elect/election
   [junit4]   2> 1274043 INFO  (TEST-OverseerTest.testShardAssignment-seed#[49A2C9DD457A135A]) [    ] o.a.s.c.Overseer Overseer (id=null) closing
   [junit4]   2> 1274044 INFO  (TEST-OverseerTest.testShardAssignment-seed#[49A2C9DD457A135A]) [    ] o.a.s.c.LeaderElector Joined leadership election with path: /overseer_elect/election/95268644363829251-127.0.0.1:55984_solr-n_0000000000
   [junit4]   2> 1274045 INFO  (TEST-OverseerTest.testShardAssignment-seed#[49A2C9DD457A135A]) [    ] o.a.s.c.OverseerElectionContext I am going to be the leader 127.0.0.1:55984_solr
   [junit4]   2> 1274045 INFO  (TEST-OverseerTest.testShardAssignment-seed#[49A2C9DD457A135A]) [    ] o.a.s.c.c.SolrZkClient makePath: /overseer_elect/leader
   [junit4]   2> 1274046 INFO  (TEST-OverseerTest.testShardAssignment-seed#[49A2C9DD457A135A]) [    ] o.a.s.c.Overseer Overseer (id=95268644363829251-127.0.0.1:55984_solr-n_0000000000) starting
   [junit4]   2> 1274048 INFO  (TEST-OverseerTest.testShardAssignment-seed#[49A2C9DD457A135A]) [    ] o.a.s.c.c.SolrZkClient makePath: /overseer/queue
   [junit4]   2> 1274051 INFO  (TEST-OverseerTest.testShardAssignment-seed#[49A2C9DD457A135A]) [    ] o.a.s.c.c.SolrZkClient makePath: /overseer/queue-work
   [junit4]   2> 1274053 INFO  (TEST-OverseerTest.testShardAssignment-seed#[49A2C9DD457A135A]) [    ] o.a.s.c.c.SolrZkClient makePath: /overseer/collection-map-failure
   [junit4]   2> 1274055 INFO  (TEST-OverseerTest.testShardAssignment-seed#[49A2C9DD457A135A]) [    ] o.a.s.c.c.SolrZkClient makePath: /overseer/collection-map-running
   [junit4]   2> 1274057 INFO  (TEST-OverseerTest.testShardAssignment-seed#[49A2C9DD457A135A]) [    ] o.a.s.c.c.SolrZkClient makePath: /overseer/collection-map-completed
   [junit4]   2> 1274059 INFO  (TEST-OverseerTest.testShardAssignment-seed#[49A2C9DD457A135A]) [    ] o.a.s.c.c.SolrZkClient makePath: /overseer/collection-queue-work
   [junit4]   2> 1274063 INFO  (TEST-OverseerTest.testShardAssignment-seed#[49A2C9DD457A135A]) [    ] o.a.s.c.OverseerAutoReplicaFailoverThread Starting OverseerAutoReplicaFailoverThread autoReplicaFailoverWorkLoopDelay=10000 autoReplicaFailoverWaitAfterExpiration=30000 autoReplicaFailoverBadNodeExpiration=60000
   [junit4]   2> 1274064 INFO  (OverseerCollectionConfigSetProcessor-95268644363829251-127.0.0.1:55984_solr-n_0000000000) [    ] o.a.s.c.OverseerTaskProcessor Process current queue of overseer operations
   [junit4]   2> 1274064 INFO  (OverseerStateUpdate-95268644363829251-127.0.0.1:55984_solr-n_0000000000) [    ] o.a.s.c.Overseer Starting to work on the main queue
   [junit4]   2> 1274064 INFO  (TEST-OverseerTest.testShardAssignment-seed#[49A2C9DD457A135A]) [    ] o.a.s.c.c.ZkStateReader Updating cluster state from ZooKeeper... 
   [junit4]   2> 1274064 INFO  (OverseerStateUpdate-95268644363829251-127.0.0.1:55984_solr-n_0000000000) [    ] o.a.s.c.c.ZkStateReader Updating cluster state from ZooKeeper... 
   [junit4]   2> 1274067 INFO  (TEST-OverseerTest.testShardAssignment-seed#[49A2C9DD457A135A]) [    ] o.a.s.c.c.SolrZkClient Using default ZkCredentialsProvider
   [junit4]   2> 1274067 INFO  (TEST-OverseerTest.testShardAssignment-seed#[49A2C9DD457A135A]) [    ] o.a.s.c.c.ConnectionManager Waiting for client to connect to ZooKeeper
   [junit4]   2> 1274068 INFO  (zkCallback-732-thread-1) [    ] o.a.s.c.c.ConnectionManager Watcher org.apache.solr.common.cloud.ConnectionManager@6f94428f name:ZooKeeperConnection Watcher:127.0.0.1:55984/solr got event WatchedEvent state:SyncConnected type:None path:null path:null type:None
   [junit4]   2> 1274069 INFO  (TEST-OverseerTest.testShardAssignment-seed#[49A2C9DD457A135A]) [    ] o.a.s.c.c.ConnectionManager Client is connected to ZooKeeper
   [junit4]   2> 1274069 INFO  (TEST-OverseerTest.testShardAssignment-seed#[49A2C9DD457A135A]) [    ] o.a.s.c.c.SolrZkClient Using default ZkACLProvider
   [junit4]   2> 1274070 INFO  (TEST-OverseerTest.testShardAssignment-seed#[49A2C9DD457A135A]) [    ] o.a.s.c.c.ZkStateReader Updating cluster state from ZooKeeper... 
   [junit4]   2> 1274072 INFO  (TEST-OverseerTest.testShardAssignment-seed#[49A2C9DD457A135A]) [    ] o.a.s.c.c.SolrZkClient makePath: /live_nodes/127.0.0.1
   [junit4]   2> 1274073 INFO  (zkCallback-732-thread-1) [    ] o.a.s.c.c.ZkStateReader A live node change: [WatchedEvent state:SyncConnected type:NodeChildrenChanged path:/live_nodes], has occurred - updating... (live nodes size: [0])
   [junit4]   2> 1274073 INFO  (zkCallback-729-thread-1) [    ] o.a.s.c.c.ZkStateReader A live node change: [WatchedEvent state:SyncConnected type:NodeChildrenChanged path:/live_nodes], has occurred - updating... (live nodes size: [0])
   [junit4]   2> 1274073 INFO  (zkCallback-728-thread-1) [    ] o.a.s.c.c.ZkStateReader A live node change: [WatchedEvent state:SyncConnected type:NodeChildrenChanged path:/live_nodes], has occurred - updating... (live nodes size: [0])
   [junit4]   2> 1274080 INFO  (OverseerStateUpdate-95268644363829251-127.0.0.1:55984_solr-n_0000000000) [    ] o.a.s.c.Overseer processMessage: queueSize: 1, message = {
   [junit4]   2>   "operation":"state",
   [junit4]   2>   "state":"active",
   [junit4]   2>   "node_name":"127.0.0.1",
   [junit4]   2>   "core":"core1",
   [junit4]   2>   "core_node_name":"node1",
   [junit4]   2>   "collection":"collection1",
   [junit4]   2>   "numShards":"3",
   [junit4]   2>   "base_url":"http://127.0.0.1/solr/"} current state version: 0
   [junit4]   2> 1274081 INFO  (OverseerStateUpdate-95268644363829251-127.0.0.1:55984_solr-n_0000000000) [    ] o.a.s.c.o.ReplicaMutator Update state numShards=3 message={
   [junit4]   2>   "operation":"state",
   [junit4]   2>   "state":"active",
   [junit4]   2>   "node_name":"127.0.0.1",
   [junit4]   2>   "core":"core1",
   [junit4]   2>   "core_node_name":"node1",
   [junit4]   2>   "collection":"collection1",
   [junit4]   2>   "numShards":"3",
   [junit4]   2>   "base_url":"http://127.0.0.1/solr/"}
   [junit4]   2> 1274081 INFO  (OverseerStateUpdate-95268644363829251-127.0.0.1:55984_solr-n_0000000000) [    ] o.a.s.c.o.ClusterStateMutator building a new cName: collection1
   [junit4]   2> 1274081 INFO  (OverseerStateUpdate-95268644363829251-127.0.0.1:55984_solr-n_0000000000) [    ] o.a.s.c.o.ReplicaMutator Assigning new node to shard shard=shard3
   [junit4]   2> 1274083 INFO  (zkCallback-729-thread-1) [    ] o.a.s.c.c.ZkStateReader A cluster state change: [WatchedEvent state:SyncConnected type:NodeDataChanged path:/clusterstate.json], has occurred - updating... (live nodes size: [1])
   [junit4]   2> 1274083 INFO  (zkCallback-732-thread-1) [    ] o.a.s.c.c.ZkStateReader A cluster state change: [WatchedEvent state:SyncConnected type:NodeDataChanged path:/clusterstate.json], has occurred - updating... (live nodes size: [1])
   [junit4]   2> 1274083 INFO  (zkCallback-728-thread-1) [    ] o.a.s.c.c.ZkStateReader A cluster state change: [WatchedEvent state:SyncConnected type:NodeDataChanged path:/clusterstate.json], has occurred - updating... (live nodes size: [1])
   [junit4]   2> 1274580 INFO  (TEST-OverseerTest.testShardAssignment-seed#[49A2C9DD457A135A]) [    ] o.a.s.c.c.SolrZkClient makePath: /collections/collection1/leader_elect/shard3/election
   [junit4]   2> 1274582 INFO  (zkCallback-728-thread-1) [    ] o.a.s.c.c.ZkStateReader A collections change: [WatchedEvent state:SyncConnected type:NodeChildrenChanged path:/collections], has occurred - updating...
   [junit4]   2> 1274582 INFO  (zkCallback-729-thread-1) [    ] o.a.s.c.c.ZkStateReader A collections change: [WatchedEvent state:SyncConnected type:NodeChildrenChanged path:/collections], has occurred - updating...
   [junit4]   2> 1274583 INFO  (zkCallback-732-thread-1) [    ] o.a.s.c.c.ZkStateReader A collections change: [WatchedEvent state:SyncConnected type:NodeChildrenChanged path:/collections], has occurred - updating...
   [junit4]   2> 1274587 INFO  (TEST-OverseerTest.testShardAssignment-seed#[49A2C9DD457A135A]) [    ] o.a.s.c.LeaderElector Joined leadership election with path: /collections/collection1/leader_elect/shard3/election/95268644363829252-127.0.0.1_core1-n_0000000000
   [junit4]   2> 1274587 INFO  (TEST-OverseerTest.testShardAssignment-seed#[49A2C9DD457A135A]) [    ] o.a.s.c.c.SolrZkClient makePath: /collections/collection1/leaders/shard3
   [junit4]   2> 1274590 INFO  (TEST-OverseerTest.testShardAssignment-seed#[49A2C9DD457A135A]) [    ] o.a.s.c.ShardLeaderElectionContextBase Creating leader registration node
   [junit4]   2> 1274592 INFO  (OverseerStateUpdate-95268644363829251-127.0.0.1:55984_solr-n_0000000000) [    ] o.a.s.c.Overseer processMessage: queueSize: 1, message = {
   [junit4]   2>   "operation":"leader",
   [junit4]   2>   "shard":"shard3",
   [junit4]   2>   "collection":"collection1",
   [junit4]   2>   "base_url":"http://127.0.0.1/solr/",
   [junit4]   2>   "core":"core1",
   [junit4]   2>   "state":"active"} current state version: 1
   [junit4]   2> 1274594 INFO  (OverseerStateUpdate-95268644363829251-127.0.0.1:55984_solr-n_0000000000) [    ] o.a.s.c.Overseer processMessage: queueSize: 1, message = {
   [junit4]   2>   "operation":"state",
   [junit4]   2>   "state":"active",
   [junit4]   2>   "node_name":"127.0.0.1",
   [junit4]   2>   "core":"core2",
   [junit4]   2>   "core_node_name":"node2",
   [junit4]   2>   "collection":"collection1",
   [junit4]   2>   "numShards":"3",
   [junit4]   2>   "base_url":"http://127.0.0.1/solr/"} current state version: 1
   [junit4]   2> 1274595 INFO  (OverseerStateUpdate-95268644363829251-127.0.0.1:55984_solr-n_0000000000) [    ] o.a.s.c.o.ReplicaMutator Update state numShards=3 message={
   [junit4]   2>   "operation":"state",
   [junit4]   2>   "state":"active",
   [junit4]   2>   "node_name":"127.0.0.1",
   [junit4]   2>   "core":"core2",
   [junit4]   2>   "core_node_name":"node2",
   [junit4]   2>   "collection":"collection1",
   [junit4]   2>   "numShards":"3",
   [junit4]   2>   "base_url":"http://127.0.0.1/solr/"}
   [junit4]   2> 1274595 INFO  (OverseerStateUpdate-95268644363829251-127.0.0.1:55984_solr-n_0000000000) [    ] o.a.s.c.o.ReplicaMutator Collection already exists with numShards=3
   [junit4]   2> 1274595 INFO  (OverseerStateUpdate-95268644363829251-127.0.0.1:55984_solr-n_0000000000) [    ] o.a.s.c.o.ReplicaMutator Assigning new node to shard shard=shard2
   [junit4]   2> 1274697 INFO  (zkCallback-729-thread-1) [    ] o.a.s.c.c.ZkStateReader A cluster state change: [WatchedEvent state:SyncConnected type:NodeDataChanged path:/clusterstate.json], has occurred - updating... (live nodes size: [1])
   [junit4]   2> 1274697 INFO  (zkCallback-732-thread-1) [    ] o.a.s.c.c.ZkStateReader A cluster state change: [WatchedEvent state:SyncConnected type:NodeDataChanged path:/clusterstate.json], has occurred - updating... (live nodes size: [1])
   [junit4]   2> 1274697 INFO  (zkCallback-728-thread-1) [    ] o.a.s.c.c.ZkStateReader A cluster state change: [WatchedEvent state:SyncConnected type:NodeDataChanged path:/clusterstate.json], has occurred - updating... (live nodes size: [1])
   [junit4]   2> 1275093 INFO  (TEST-OverseerTest.testShardAssignment-seed#[49A2C9DD457A135A]) [    ] o.a.s.c.c.SolrZkClient makePath: /collections/collection1/leader_elect/shard2/election
   [junit4]   2> 1275097 INFO  (TEST-OverseerTest.testShardAssignment-seed#[49A2C9DD457A135A]) [    ] o.a.s.c.LeaderElector Joined leadership election with path: /collections/collection1/leader_elect/shard2/election/95268644363829252-127.0.0.1_core2-n_0000000000
   [junit4]   2> 1275098 INFO  (TEST-OverseerTest.testShardAssignment-seed#[49A2C9DD457A135A]) [    ] o.a.s.c.c.SolrZkClient makePath: /collections/collection1/leaders/shard2
   [junit4]   2> 1275099 INFO  (TEST-OverseerTest.testShardAssignment-seed#[49A2C9DD457A135A]) [    ] o.a.s.c.ShardLeaderElectionContextBase Creating leader registration node
   [junit4]   2> 1275102 INFO  (OverseerStateUpdate-95268644363829251-127.0.0.1:55984_solr-n_0000000000) [    ] o.a.s.c.Overseer processMessage: queueSize: 1, message = {
   [junit4]   2>   "operation":"leader",
   [junit4]   2>   "shard":"shard2",
   [junit4]   2>   "collection":"collection1",
   [junit4]   2>   "base_url":"http://127.0.0.1/solr/",
   [junit4]   2>   "core":"core2",
   [junit4]   2>   "state":"active"} current state version: 2
   [junit4]   2> 1275104 INFO  (OverseerStateUpdate-95268644363829251-127.0.0.1:55984_solr-n_0000000000) [    ] o.a.s.c.Overseer processMessage: queueSize: 1, message = {
   [junit4]   2>   "operation":"state",
   [junit4]   2>   "state":"active",
   [junit4]   2>   "node_name":"127.0.0.1",
   [junit4]   2>   "core":"core3",
   [junit4]   2>   "core_node_name":"node3",
   [junit4]   2>   "collection":"collection1",
   [junit4]   2>   "numShards":"3",
   [junit4]   2>   "base_url":"http://127.0.0.1/solr/"} current state version: 2
   [junit4]   2> 1275104 INFO  (OverseerStateUpdate-95268644363829251-127.0.0.1:55984_solr-n_0000000000) [    ] o.a.s.c.o.ReplicaMutator Update state numShards=3 message={
   [junit4]   2>   "operation":"state",
   [junit4]   2>   "state":"active",
   [junit4]   2>   "node_name":"127.0.0.1",
   [junit4]   2>   "core":"core3",
   [junit4]   2>   "core_node_name":"node3",
   [junit4]   2>   "collection":"collection1",
   [junit4]   2>   "numShards":"3",
   [junit4]   2>   "base_url":"http://127.0.0.1/solr/"}
   [junit4]   2> 1275104 INFO  (OverseerStateUpdate-95268644363829251-127.0.0.1:55984_solr-n_0000000000) [    ] o.a.s.c.o.ReplicaMutator Collection already exists with numShards=3
   [junit4]   2> 1275104 INFO  (OverseerStateUpdate-95268644363829251-127.0.0.1:55984_solr-n_0000000000) [    ] o.a.s.c.o.ReplicaMutator Assigning new node to shard shard=shard1
   [junit4]   2> 1275206 INFO  (zkCallback-732-thread-1) [    ] o.a.s.c.c.ZkStateReader A cluster state change: [WatchedEvent state:SyncConnected type:NodeDataChanged path:/clusterstate.json], has occurred - updating... (live nodes size: [1])
   [junit4]   2> 1275207 INFO  (zkCallback-728-thread-1) [    ] o.a.s.c.c.ZkStateReader A cluster state change: [WatchedEvent state:SyncConnected type:NodeDataChanged path:/clusterstate.json], has occurred - updating... (live nodes size: [1])
   [junit4]   2> 1275206 INFO  (zkCallback-729-thread-1) [    ] o.a.s.c.c.ZkStateReader A cluster state change: [WatchedEvent state:SyncConnected type:NodeDataChanged path:/clusterstate.json], has occurred - updating... (live nodes size: [1])
   [junit4]   2> 1275603 INFO  (TEST-OverseerTest.testShardAssignment-seed#[49A2C9DD457A135A]) [    ] o.a.s.c.c.SolrZkClient makePath: /collections/collection1/leader_elect/shard1/election
   [junit4]   2> 1275606 INFO  (TEST-OverseerTest.testShardAssignment-seed#[49A2C9DD457A135A]) [    ] o.a.s.c.LeaderElector Joined leadership election with path: /collections/collection1/leader_elect/shard1/election/95268644363829252-127.0.0.1_core3-n_0000000000
   [junit4]   2> 1275607 INFO  (TEST-OverseerTest.testShardAssignment-seed#[49A2C9DD457A135A]) [    ] o.a.s.c.c.SolrZkClient makePath: /collections/collection1/leaders/shard1
   [junit4]   2> 1275608 INFO  (TEST-OverseerTest.testShardAssignment-seed#[49A2C9DD457A135A]) [    ] o.a.s.c.ShardLeaderElectionContextBase Creating leader registration node
   [junit4]   2> 1275611 INFO  (OverseerStateUpdate-95268644363829251-127.0.0.1:55984_solr-n_0000000000) [    ] o.a.s.c.Overseer processMessage: queueSize: 1, message = {
   [junit4]   2>   "operation":"leader",
   [junit4]   2>   "shard":"shard1",
   [junit4]   2>   "collection":"collection1",
   [junit4]   2>   "base_url":"http://127.0.0.1/solr/",
   [junit4]   2>   "core":"core3",
   [junit4]   2>   "state":"active"} current state version: 3
   [junit4]   2> 1275613 INFO  (OverseerStateUpdate-95268644363829251-127.0.0.1:55984_solr-n_0000000000) [    ] o.a.s.c.Overseer processMessage: queueSize: 1, message = {
   [junit4]   2>   "operation":"state",
   [junit4]   2>   "state":"active",
   [junit4]   2>   "node_name":"127.0.0.1",
   [junit4]   2>   "core":"core4",
   [junit4]   2>   "core_node_name":"node4",
   [junit4]   2>   "collection":"collection1",
   [junit4]   2>   "numShards":"3",
   [junit4]   2>   "base_url":"http://127.0.0.1/solr/"} current state version: 3
   [junit4]   2> 1275613 INFO  (OverseerStateUpdate-95268644363829251-127.0.0.1:55984_solr-n_0000000000) [    ] o.a.s.c.o.ReplicaMutator Update state numShards=3 message={
   [junit4]   2>   "operation":"state",
   [junit4]   2>   "state":"active",
   [junit4]   2>   "node_name":"127.0.0.1",
   [junit4]   2>   "core":"core4",
   [junit4]   2>   "core_node_name":"node4",
   [junit4]   2>   "collection":"collection1",
   [junit4]   2>   "numShards":"3",
   [junit4]   2>   "base_url":"http://127.0.0.1/solr/"}
   [junit4]   2> 1275613 INFO  (OverseerStateUpdate-95268644363829251-127.0.0.1:55984_solr-n_0000000000) [    ] o.a.s.c.o.ReplicaMutator Collection already exists with numShards=3
   [junit4]   2> 1275614 INFO  (OverseerStateUpdate-95268644363829251-127.0.0.1:55984_solr-n_0000000000) [    ] o.a.s.c.o.ReplicaMutator Assigning new node to shard shard=shard3
   [junit4]   2> 1275716 INFO  (zkCallback-729-thread-1) [    ] o.a.s.c.c.ZkStateReader A cluster state change: [WatchedEvent state:SyncConnected type:NodeDataChanged path:/clusterstate.json], has occurred - updating... (live nodes size: [1])
   [junit4]   2> 1275716 INFO  (zkCallback-732-thread-1) [    ] o.a.s.c.c.ZkStateReader A cluster state change: [WatchedEvent state:SyncConnected type:NodeDataChanged path:/clusterstate.json], has occurred - updating... (live nodes size: [1])
   [junit4]   2> 1275716 INFO  (zkCallback-728-thread-1) [    ] o.a.s.c.c.ZkStateReader A cluster state change: [WatchedEvent state:SyncConnected type:NodeDataChanged path:/clusterstate.json], has occurred - updating... (live nodes size: [1])
   [junit4]   2> 1276113 INFO  (TEST-OverseerTest.testShardAssignment-seed#[49A2C9DD457A135A]) [    ] o.a.s.c.c.SolrZkClient makePath: /collections/collection1/leader_elect/shard3/election
   [junit4]   2> 1276116 INFO  (TEST-OverseerTest.testShardAssignment-seed#[49A2C9DD457A135A]) [    ] o.a.s.c.LeaderElector Joined leadership election with path: /collections/collection1/leader_elect/shard3/election/95268644363829252-127.0.0.1_core4-n_0000000001
   [junit4]   2> 1276116 INFO  (TEST-OverseerTest.testShardAssignment-seed#[49A2C9DD457A135A]) [    ] o.a.s.c.LeaderElector Watching path /collections/collection1/leader_elect/shard3/election/95268644363829252-127.0.0.1_core1-n_0000000000 to know if I could be the leader
   [junit4]   2> 1276118 INFO  (OverseerStateUpdate-95268644363829251-127.0.0.1:55984_solr-n_0000000000) [    ] o.a.s.c.Overseer processMessage: queueSize: 1, message = {
   [junit4]   2>   "operation":"state",
   [junit4]   2>   "state":"active",
   [junit4]   2>   "node_name":"127.0.0.1",
   [junit4]   2>   "core":"core5",
   [junit4]   2>   "core_node_name":"node5",
   [junit4]   2>   "collection":"collection1",
   [junit4]   2>   "numShards":"3",
   [junit4]   2>   "base_url":"http://127.0.0.1/solr/"} current state version: 4
   [junit4]   2> 1276118 INFO  (OverseerStateUpdate-95268644363829251-127.0.0.1:55984_solr-n_0000000000) [    ] o.a.s.c.o.ReplicaMutator Update state numShards=3 message={
   [junit4]   2>   "operation":"state",
   [junit4]   2>   "state":"active",
   [junit4]   2>   "node_name":"127.0.0.1",
   [junit4]   2>   "core":"core5",
   [junit4]   2>   "core_node_name":"node5",
   [junit4]   2>   "collection":"collection1",
   [junit4]   2>   "numShards":"3",
   [junit4]   2>   "base_url":"http://127.0.0.1/solr/"}
   [junit4]   2> 1276119 INFO  (OverseerStateUpdate-95268644363829251-127.0.0.1:55984_solr-n_0000000000) [    ] o.a.s.c.o.ReplicaMutator Collection already exists with numShards=3
   [junit4]   2> 1276119 INFO  (OverseerStateUpdate-95268644363829251-127.0.0.1:55984_solr-n_0000000000) [    ] o.a.s.c.o.ReplicaMutator Assigning new node to shard shard=shard2
   [junit4]   2> 1276221 INFO  (zkCallback-729-thread-1) [    ] o.a.s.c.c.ZkStateReader A cluster state change: [WatchedEvent state:SyncConnected type:NodeDataChanged path:/clusterstate.json], has occurred - updating... (live nodes size: [1])
   [junit4]   2> 1276221 INFO  (zkCallback-728-thread-1) [    ] o.a.s.c.c.ZkStateReader A cluster state change: [WatchedEvent state:SyncConnected type:NodeDataChanged path:/clusterstate.json], has occurred - updating... (live nodes size: [1])
   [junit4]   2> 1276221 INFO  (zkCallback-732-thread-1) [    ] o.a.s.c.c.ZkStateReader A cluster state change: [WatchedEvent state:SyncConnected type:NodeDataChanged path:/clusterstate.json], has occurred - updating... (live nodes size: [1])
   [junit4]   2> 1276618 INFO  (TEST-OverseerTest.testShardAssignment-seed#[49A2C9DD457A135A]) [    ] o.a.s.c.c.SolrZkClient makePath: /collections/collection1/leader_elect/shard2/election
   [junit4]   2> 1276621 INFO  (TEST-OverseerTest.testShardAssignment-seed#[49A2C9DD457A135A]) [    ] o.a.s.c.LeaderElector Joined leadership election with path: /collections/collection1/leader_elect/shard2/election/95268644363829252-127.0.0.1_core5-n_0000000001
   [junit4]   2> 1276622 INFO  (TEST-OverseerTest.testShardAssignment-seed#[49A2C9DD457A135A]) [    ] o.a.s.c.LeaderElector Watching path /collections/collection1/leader_elect/shard2/election/95268644363829252-127.0.0.1_core2-n_0000000000 to know if I could be the leader
   [junit4]   2> 1276625 INFO  (OverseerStateUpdate-95268644363829251-127.0.0.1:55984_solr-n_0000000000) [    ] o.a.s.c.Overseer processMessage: queueSize: 1, message = {
   [junit4]   2>   "operation":"state",
   [junit4]   2>   "state":"active",
   [junit4]   2>   "node_name":"127.0.0.1",
   [junit4]   2>   "core":"core6",
   [junit4]   2>   "core_node_name":"node6",
   [junit4]   2>   "collection":"collection1",
   [junit4]   2>   "numShards":"3",
   [junit4]   2>   "base_url":"http://127.0.0.1/solr/"} current state version: 5
   [junit4]   2> 1276626 INFO  (OverseerStateUpdate-95268644363829251-127.0.0.1:55984_solr-n_0000000000) [    ] o.a.s.c.o.ReplicaMutator Update state numShards=3 message={
   [junit4]   2>   "operation":"state",
   [junit4]   2>   "state":"active",
   [junit4]   2>   "node_name":"127.0.0.1",
   [junit4]   2>   "core":"core6",
   [junit4]   2>   "core_node_name":"node6",
   [junit4]   2>   "collection":"collection1",
   [junit4]   2>   "numShards":"3",
   [junit4]   2>   "base_url":"http://127.0.0.1/solr/"}
   [junit4]   2> 1276626 INFO  (OverseerStateUpdate-95268644363829251-127.0.0.1:55984_solr-n_0000000000) [    ] o.a.s.c.o.ReplicaMutator Collection already exists with numShards=3
   [junit4]   2> 1276626 INFO  (OverseerStateUpdate-95268644363829251-127.0.0.1:55984_solr-n_0000000000) [    ] o.a.s.c.o.ReplicaMutator Assigning new node to shard shard=shard1
   [junit4]   2> 1276729 INFO  (zkCallback-732-thread-1) [    ] o.a.s.c.c.ZkStateReader A cluster state change: [WatchedEvent state:SyncConnected type:NodeDataChanged path:/clusterstate.json], has occurred - updating... (live nodes size: [1])
   [junit4]   2> 1276729 INFO  (zkCallback-728-thread-1) [    ] o.a.s.c.c.ZkStateReader A cluster state change: [WatchedEvent state:SyncConnected type:NodeDataChanged path:/clusterstate.json], has occurred - updating... (live nodes size: [1])
   [junit4]   2> 1276729 INFO  (zkCallback-729-thread-1) [    ] o.a.s.c.c.ZkStateReader A cluster state change: [WatchedEvent state:SyncConnected type:NodeDataChanged path:/clusterstate.json], has occurred - updating... (live nodes size: [1])
   [junit4]   2> 1277124 INFO  (TEST-OverseerTest.testShardAssignment-seed#[49A2C9DD457A135A]) [    ] o.a.s.c.c.SolrZkClient makePath: /collections/collection1/leader_elect/shard1/election
   [junit4]   2> 1277128 INFO  (TEST-OverseerTest.testShardAssignment-seed#[49A2C9DD457A135A]) [    ] o.a.s.c.LeaderElector Joined leadership election with path: /collections/collection1/leader_elect/shard1/election/95268644363829252-127.0.0.1_core6-n_0000000001
   [junit4]   2> 1277129 INFO  (TEST-OverseerTest.testShardAssignment-seed#[49A2C9DD457A135A]) [    ] o.a.s.c.LeaderElector Watching path /collections/collection1/leader_elect/shard1/election/95268644363829252-127.0.0.1_core3-n_0000000000 to know if I could be the leader
   [junit4]   2> 1277131 WARN  (NIOServerCxn.Factory:0.0.0.0/0.0.0.0:0) [    ] o.a.z.s.NIOServerCnxn caught end of stream exception
   [junit4]   2> EndOfStreamException: Unable to read additional data from client sessionid 0x1527653c98a0002, likely client has closed socket
   [junit4]   2> 	at org.apache.zookeeper.server.NIOServerCnxn.doIO(NIOServerCnxn.java:228)
   [junit4]   2> 	at org.apache.zookeeper.server.NIOServerCnxnFactory.run(NIOServerCnxnFactory.java:208)
   [junit4]   2> 	at java.lang.Thread.run(Thread.java:745)
   [junit4]   2> 1277132 INFO  (zkCallback-732-thread-1) [    ] o.a.s.c.c.ZkStateReader A live node change: [WatchedEvent state:SyncConnected type:NodeChildrenChanged path:/live_nodes], has occurred - updating... (live nodes size: [1])
   [junit4]   2> 1277132 INFO  (zkCallback-729-thread-1) [    ] o.a.s.c.c.ZkStateReader A live node change: [WatchedEvent state:SyncConnected type:NodeChildrenChanged path:/live_nodes], has occurred - updating... (live nodes size: [1])
   [junit4]   2> 1277133 WARN  (zkCallback-732-thread-2) [    ] o.a.s.c.LeaderElector 
   [junit4]   2> org.apache.zookeeper.KeeperException$SessionExpiredException: KeeperErrorCode = Session expired for /collections/collection1/leader_elect/shard3/election
   [junit4]   2> 	at org.apache.zookeeper.KeeperException.create(KeeperException.java:127)
   [junit4]   2> 	at org.apache.zookeeper.KeeperException.create(KeeperException.java:51)
   [junit4]   2> 	at org.apache.zookeeper.ZooKeeper.getChildren(ZooKeeper.java:1472)
   [junit4]   2> 	at org.apache.solr.common.cloud.SolrZkClient$6.execute(SolrZkClient.java:328)
   [junit4]   2> 	at org.apache.solr.common.cloud.SolrZkClient$6.execute(SolrZkClient.java:325)
   [junit4]   2> 	at org.apache.solr.common.cloud.ZkCmdExecutor.retryOperation(ZkCmdExecutor.java:61)
   [junit4]   2> 	at org.apache.solr.common.cloud.SolrZkClient.getChildren(SolrZkClient.java:325)
   [junit4]   2> 	at org.apache.solr.cloud.LeaderElector.checkIfIamLeader(LeaderElector.java:108)
   [junit4]   2> 	at org.apache.solr.cloud.LeaderElector.access$200(LeaderElector.java:59)
   [junit4]   2> 	at org.apache.solr.cloud.LeaderElector$ElectionWatcher.process(LeaderElector.java:389)
   [junit4]   2> 	at org.apache.solr.common.cloud.SolrZkClient$3$1.run(SolrZkClient.java:264)
   [junit4]   2> 	at java.util.concurrent.Executors$RunnableAdapter.call(Executors.java:471)
   [junit4]   2> 	at java.util.concurrent.FutureTask.run(FutureTask.java:262)
   [junit4]   2> 	at org.apache.solr.common.util.ExecutorUtil$MDCAwareThreadPoolExecutor$1.run(ExecutorUtil.java:232)
   [junit4]   2> 	at java.util.concurrent.ThreadPoolExecutor.runWorker(ThreadPoolExecutor.java:1145)
   [junit4]   2> 	at java.util.concurrent.ThreadPoolExecutor$Worker.run(ThreadPoolExecutor.java:615)
   [junit4]   2> 	at java.lang.Thread.run(Thread.java:745)
   [junit4]   2> 1277133 ERROR (TEST-OverseerTest.testShardAssignment-seed#[49A2C9DD457A135A]-EventThread) [    ] o.a.z.ClientCnxn Error while calling watcher 
   [junit4]   2> java.util.concurrent.RejectedExecutionException: Task org.apache.solr.common.util.ExecutorUtil$MDCAwareThreadPoolExecutor$1@7de39676 rejected from org.apache.solr.common.util.ExecutorUtil$MDCAwareThreadPoolExecutor@68ab5d8b[Shutting down, pool size = 3, active threads = 3, queued tasks = 0, completed tasks = 9]
   [junit4]   2> 	at java.util.concurrent.ThreadPoolExecutor$AbortPolicy.rejectedExecution(ThreadPoolExecutor.java:2048)
   [junit4]   2> 	at java.util.concurrent.ThreadPoolExecutor.reject(ThreadPoolExecutor.java:821)
   [junit4]   2> 	at java.util.concurrent.ThreadPoolExecutor.execute(ThreadPoolExecutor.java:1372)
   [junit4]   2> 	at org.apache.solr.common.util.ExecutorUtil$MDCAwareThreadPoolExecutor.execute(ExecutorUtil.java:215)
   [junit4]   2> 	at java.util.concurrent.AbstractExecutorService.submit(AbstractExecutorService.java:110)
   [junit4]   2> 	at org.apache.solr.common.cloud.SolrZkClient$3.process(SolrZkClient.java:261)
   [junit4]   2> 	at org.apache.zookeeper.ClientCnxn$EventThread.processEvent(ClientCnxn.java:522)
   [junit4]   2> 	at org.apache.zookeeper.ClientCnxn$EventThread.run(ClientCnxn.java:498)
   [junit4]   2> 1277133 WARN  (zkCallback-732-thread-3) [    ] o.a.s.c.LeaderElector 
   [junit4]   2> org.apache.zookeeper.KeeperException$SessionExpiredException: KeeperErrorCode = Session expired for /collections/collection1/leader_elect/shard2/election
   [junit4]   2> 	at org.apache.zookeeper.KeeperException.create(KeeperException.java:127)
   [junit4]   2> 	at org.apache.zookeeper.KeeperException.create(KeeperException.java:51)
   [junit4]   2> 	at org.apache.zookeeper.ZooKeeper.getChildren(ZooKeeper.java:1472)
   [junit4]   2> 	at org.apache.solr.common.cloud.SolrZkClient$6.execute(SolrZkClient.java:328)
   [junit4]   2> 	at org.apache.solr.common.cloud.SolrZkClient$6.execute(SolrZkClient.java:325)
   [junit4]   2> 	at org.apache.solr.common.cloud.ZkCmdExecutor.retryOperation(ZkCmdExecutor.java:61)
   [junit4]   2> 	at org.apache.solr.common.cloud.SolrZkClient.getChildren(SolrZkClient.java:325)
   [junit4]   2> 	at org.apache.solr.cloud.LeaderElector.checkIfIamLeader(LeaderElector.java:108)
   [junit4]   2> 	at org.apache.solr.cloud.LeaderElector.access$200(LeaderElector.java:59)
   [junit4]   2> 	at org.apache.solr.cloud.LeaderElector$ElectionWatcher.process(LeaderElector.java:389)
   [junit4]   2> 	at org.apache.solr.common.cloud.SolrZkClient$3$1.run(SolrZkClient.java:264)
   [junit4]   2> 	at java.util.concurrent.Executors$RunnableAdapter.call(Executors.java:471)
   [junit4]   2> 	at java.util.concurrent.FutureTask.run(FutureTask.java:262)
   [junit4]   2> 	at org.apache.solr.common.util.ExecutorUtil$MDCAwareThreadPoolExecutor$1.run(ExecutorUtil.java:232)
   [junit4]   2> 	at java.util.concurrent.ThreadPoolExecutor.runWorker(ThreadPoolExecutor.java:1145)
   [junit4]   2> 	at java.util.concurrent.ThreadPoolExecutor$Worker.run(ThreadPoolExecutor.java:615)
   [junit4]   2> 	at java.lang.Thread.run(Thread.java:745)
   [junit4]   2> 1278632 WARN  (zkCallback-732-thread-1) [    ] o.a.s.c.c.ZkStateReader ZooKeeper watch triggered, but Solr cannot talk to ZK: [KeeperErrorCode = Session expired for /live_nodes]
   [junit4]   2> 1278636 INFO  (TEST-OverseerTest.testShardAssignment-seed#[49A2C9DD457A135A]) [    ] o.a.s.c.ZkTestServer connecting to 127.0.0.1:55984 55984
   [junit4]   2> 1278848 INFO  (Thread-1748) [    ] o.a.s.c.ZkTestServer connecting to 127.0.0.1:55984 55984
   [junit4]   2> 1278849 WARN  (Thread-1748) [    ] o.a.s.c.ZkTestServer Watch limit violations: 
   [junit4]   2> Maximum concurrent create/delete watches above limit:
   [junit4]   2> 
   [junit4]   2> 	3	/solr/aliases.json
   [junit4]   2> 
   [junit4]   2> Maximum concurrent data watches above limit:
   [junit4]   2> 
   [junit4]   2> 	3	/solr/clusterstate.json
   [junit4]   2> 
   [junit4]   2> Maximum concurrent children watches above limit:
   [junit4]   2> 
   [junit4]   2> 	3	/solr/collections
   [junit4]   2> 	3	/solr/live_nodes
   [junit4]   2> 
   [junit4]   2> 1278850 INFO  (TEST-OverseerTest.testShardAssignment-seed#[49A2C9DD457A135A]) [    ] o.a.s.SolrTestCaseJ4 ###Ending testShardAssignment
   [junit4]   2> 1278850 INFO  (TEST-OverseerTest.testShardAssignment-seed#[49A2C9DD457A135A]) [    ] o.a.s.c.Overseer Overseer (id=95268644363829251-127.0.0.1:55984_solr-n_0000000000) closing
   [junit4]   2> 1278850 INFO  (OverseerStateUpdate-95268644363829251-127.0.0.1:55984_solr-n_0000000000) [    ] o.a.s.c.Overseer Overseer Loop exiting : 127.0.0.1:55984_solr
   [junit4]   2> 1278854 ERROR (OverseerExitThread) [    ] o.a.s.c.Overseer could not read the data
   [junit4]   2> org.apache.zookeeper.KeeperException$SessionExpiredException: KeeperErrorCode = Session expired for /overseer_elect/leader
   [junit4]   2> 	at org.apache.zookeeper.KeeperException.create(KeeperException.java:127)
   [junit4]   2> 	at org.apache.zookeeper.KeeperException.create(KeeperException.java:51)
   [junit4]   2> 	at org.apache.zookeeper.ZooKeeper.getData(ZooKeeper.java:1155)
   [junit4]   2> 	at org.apache.solr.common.cloud.SolrZkClient$7.execute(SolrZkClient.java:345)
   [junit4]   2> 	at org.apache.solr.common.cloud.SolrZkClient$7.execute(SolrZkClient.java:342)
   [junit4]   2> 	at org.apache.solr.common.cloud.ZkCmdExecutor.retryOperation(ZkCmdExecutor.java:61)
   [junit4]   2> 	at org.apache.solr.common.cloud.SolrZkClient.getData(SolrZkClient.java:342)
   [junit4]   2> 	at org.apache.solr.cloud.Overseer$ClusterStateUpdater.checkIfIamStillLeader(Overseer.java:305)
   [junit4]   2> 	at org.apache.solr.cloud.Overseer$ClusterStateUpdater.access$300(Overseer.java:88)
   [junit4]   2> 	at org.apache.solr.cloud.Overseer$ClusterStateUpdater$2.run(Overseer.java:266)
   [junit4]   2> 1278857 INFO  (TEST-OverseerTest.testPlaceholders-seed#[49A2C9DD457A135A]) [    ] o.a.s.SolrTestCaseJ4 ###Starting testPlaceholders
   [junit4]   2> 1278857 INFO  (TEST-OverseerTest.testPlaceholders-seed#[49A2C9DD457A135A]) [    ] o.a.s.c.ZkTestServer STARTING ZK TEST SERVER
   [junit4]   2> 1278857 INFO  (Thread-1749) [    ] o.a.s.c.ZkTestServer client port:0.0.0.0/0.0.0.0:0
   [junit4]   2> 1278858 INFO  (Thread-1749) [    ] o.a.s.c.ZkTestServer Starting server
   [junit4]   2> 1278957 INFO  (TEST-OverseerTest.testPlaceholders-seed#[49A2C9DD457A135A]) [    ] o.a.s.c.ZkTestServer start zk server on port:58613
   [junit4]   2> 1278958 INFO  (TEST-OverseerTest.testPlaceholders-seed#[49A2C9DD457A135A]) [    ] o.a.s.c.c.SolrZkClient Using default ZkCredentialsProvider
   [junit4]   2> 1278958 INFO  (TEST-OverseerTest.testPlaceholders-seed#[49A2C9DD457A135A]) [    ] o.a.s.c.c.ConnectionManager Waiting for client to connect to ZooKeeper
   [junit4]   2> 1278962 INFO  (zkCallback-733-thread-1) [    ] o.a.s.c.c.ConnectionManager Watcher org.apache.solr.common.cloud.ConnectionManager@34ce187b name:ZooKeeperConnection Watcher:127.0.0.1:58613/solr got event WatchedEvent state:SyncConnected type:None path:null path:null type:None
   [junit4]   2> 1278963 INFO  (TEST-OverseerTest.testPlaceholders-seed#[49A2C9DD457A135A]) [    ] o.a.s.c.c.ConnectionManager Client is connected to ZooKeeper
   [junit4]   2> 1278963 INFO  (TEST-OverseerTest.testPlaceholders-seed#[49A2C9DD457A135A]) [    ] o.a.s.c.c.SolrZkClient Using default ZkACLProvider
   [junit4]   2> 1278963 INFO  (TEST-OverseerTest.testPlaceholders-seed#[49A2C9DD457A135A]) [    ] o.a.s.c.c.SolrZkClient Using default ZkCredentialsProvider
   [junit4]   2> 1278964 INFO  (TEST-OverseerTest.testPlaceholders-seed#[49A2C9DD457A135A]) [    ] o.a.s.c.c.ConnectionManager Waiting for client to connect to ZooKeeper
   [junit4]   2> 1278965 INFO  (zkCallback-734-thread-1) [    ] o.a.s.c.c.ConnectionManager Watcher org.apache.solr.common.cloud.ConnectionManager@5cfe1aee name:ZooKeeperConnection Watcher:127.0.0.1:58613 got event WatchedEvent state:SyncConnected type:None path:null path:null type:None
   [junit4]   2> 1278966 INFO  (TEST-OverseerTest.testPlaceholders-seed#[49A2C9DD457A135A]) [    ] o.a.s.c.c.ConnectionManager Client is connected to ZooKeeper
   [junit4]   2> 1278966 INFO  (TEST-OverseerTest.testPlaceholders-seed#[49A2C9DD457A135A]) [    ] o.a.s.c.c.SolrZkClient Using default ZkACLProvider
   [junit4]   2> 1278967 INFO  (TEST-OverseerTest.testPlaceholders-seed#[49A2C9DD457A135A]) [    ] o.a.s.c.c.SolrZkClient Using default ZkCredentialsProvider
   [junit4]   2> 1278968 INFO  (TEST-OverseerTest.testPlaceholders-seed#[49A2C9DD457A135A]) [    ] o.a.s.c.c.ConnectionManager Waiting for client to connect to ZooKeeper
   [junit4]   2> 1278970 INFO  (zkCallback-735-thread-1) [    ] o.a.s.c.c.ConnectionManager Watcher org.apache.solr.common.cloud.ConnectionManager@10fc6719 name:ZooKeeperConnection Watcher:127.0.0.1:58613 got event WatchedEvent state:SyncConnected type:None path:null path:null type:None
   [junit4]   2> 1278970 INFO  (TEST-OverseerTest.testPlaceholders-seed#[49A2C9DD457A135A]) [    ] o.a.s.c.c.ConnectionManager Client is connected to ZooKeeper
   [junit4]   2> 1278970 INFO  (TEST-OverseerTest.testPlaceholders-seed#[49A2C9DD457A135A]) [    ] o.a.s.c.c.SolrZkClient Using default ZkACLProvider
   [junit4]   2> 1278971 INFO  (TEST-OverseerTest.testPlaceholders-seed#[49A2C9DD457A135A]) [    ] o.a.s.c.c.SolrZkClient makePath: /solr
   [junit4]   2> 1278975 INFO  (TEST-OverseerTest.testPlaceholders-seed#[49A2C9DD457A135A]) [    ] o.a.s.c.c.SolrZkClient makePath: /live_nodes
   [junit4]   2> 1278977 INFO  (TEST-OverseerTest.testPlaceholders-seed#[49A2C9DD457A135A]) [    ] o.a.s.c.c.SolrZkClient makePath: /collections
   [junit4]   2> 1278979 INFO  (TEST-OverseerTest.testPlaceholders-seed#[49A2C9DD457A135A]) [    ] o.a.s.c.c.SolrZkClient makePath: /aliases.json
   [junit4]   2> 1278980 INFO  (TEST-OverseerTest.testPlaceholders-seed#[49A2C9DD457A135A]) [    ] o.a.s.c.c.SolrZkClient makePath: /clusterstate.json
   [junit4]   2> 1278982 INFO  (TEST-OverseerTest.testPlaceholders-seed#[49A2C9DD457A135A]) [    ] o.a.s.c.c.SolrZkClient makePath: /security.json
   [junit4]   2> 1278984 INFO  (TEST-OverseerTest.testPlaceholders-seed#[49A2C9DD457A135A]) [    ] o.a.s.c.c.ZkStateReader Updating cluster state from ZooKeeper... 
   [junit4]   2> 1278986 INFO  (TEST-OverseerTest.testPlaceholders-seed#[49A2C9DD457A135A]) [    ] o.a.s.c.c.SolrZkClient Using default ZkCredentialsProvider
   [junit4]   2> 1278987 INFO  (TEST-OverseerTest.testPlaceholders-seed#[49A2C9DD457A135A]) [    ] o.a.s.c.c.ConnectionManager Waiting for client to connect to ZooKeeper
   [junit4]   2> 1278988 INFO  (zkCallback-736-thread-1) [    ] o.a.s.c.c.ConnectionManager Watcher org.apache.solr.common.cloud.ConnectionManager@47e4d142 name:ZooKeeperConnection Watcher:127.0.0.1:58613/solr got event WatchedEvent state:SyncConnected type:None path:null path:null type:None
   [junit4]   2> 1278988 INFO  (TEST-OverseerTest.testPlaceholders-seed#[49A2C9DD457A135A]) [    ] o.a.s.c.c.ConnectionManager Client is connected to ZooKeeper
   [junit4]   2> 1278988 INFO  (TEST-OverseerTest.testPlaceholders-seed#[49A2C9DD457A135A]) [    ] o.a.s.c.c.SolrZkClient Using default ZkACLProvider
   [junit4]   2> 1278990 INFO  (TEST-OverseerTest.testPlaceholders-seed#[49A2C9DD457A135A]) [    ] o.a.s.c.c.ZkStateReader Updating cluster state from ZooKeeper... 
   [junit4]   2> 1278992 INFO  (TEST-OverseerTest.testPlaceholders-seed#[49A2C9DD457A135A]) [    ] o.a.s.c.c.SolrZkClient makePath: /live_nodes/node1
   [junit4]   2> 1278993 INFO  (zkCallback-733-thread-1) [    ] o.a.s.c.c.ZkStateReader A live node change: [WatchedEvent state:SyncConnected type:NodeChildrenChanged path:/live_nodes], has occurred - updating... (live nodes size: [0])
   [junit4]   2> 1278993 INFO  (zkCallback-736-thread-1) [    ] o.a.s.c.c.ZkStateReader A live node change: [WatchedEvent state:SyncConnected type:NodeChildrenChanged path:/live_nodes], has occurred - updating... (live nodes size: [0])
   [junit4]   2> 1278993 INFO  (TEST-OverseerTest.testPlaceholders-seed#[49A2C9DD457A135A]) [    ] o.a.s.c.c.SolrZkClient Using default ZkCredentialsProvider
   [junit4]   2> 1278999 INFO  (TEST-OverseerTest.testPlaceholders-seed#[49A2C9DD457A135A]) [    ] o.a.s.c.c.ConnectionManager Waiting for client to connect to ZooKeeper
   [junit4]   2> 1279000 INFO  (zkCallback-737-thread-1) [    ] o.a.s.c.c.ConnectionManager Watcher org.apache.solr.common.cloud.ConnectionManager@258007eb name:ZooKeeperConnection Watcher:127.0.0.1:58613/solr got event WatchedEvent state:SyncConnected type:None path:null path:null type:None
   [junit4]   2> 1279000 INFO  (TEST-OverseerTest.testPlaceholders-seed#[49A2C9DD457A135A]) [    ] o.a.s.c.c.ConnectionManager Client is connected to ZooKeeper
   [junit4]   2> 1279000 INFO  (TEST-OverseerTest.testPlaceholders-seed#[49A2C9DD457A135A]) [    ] o.a.s.c.c.SolrZkClient Using default ZkACLProvider
   [junit4]   2> 1279000 INFO  (TEST-OverseerTest.testPlaceholders-seed#[49A2C9DD457A135A]) [    ] o.a.s.u.UpdateShardHandler Creating UpdateShardHandler HTTP client with params: socketTimeout=600000&connTimeout=60000&retry=true
   [junit4]   2> 1279003 INFO  (TEST-OverseerTest.testPlaceholders-seed#[49A2C9DD457A135A]) [    ] o.a.s.c.c.SolrZkClient makePath: /overseer_elect
   [junit4]   2> 1279005 INFO  (TEST-OverseerTest.testPlaceholders-seed#[49A2C9DD457A135A]) [    ] o.a.s.c.c.SolrZkClient makePath: /overseer_elect/election
   [junit4]   2> 1279006 INFO  (TEST-OverseerTest.testPlaceholders-seed#[49A2C9DD457A135A]) [    ] o.a.s.c.Overseer Overseer (id=null) closing
   [junit4]   2> 1279007 INFO  (TEST-OverseerTest.testPlaceholders-seed#[49A2C9DD457A135A]) [    ] o.a.s.c.LeaderElector Joined leadership election with path: /overseer_elect/election/95268644687708164-127.0.0.1:58613_solr-n_0000000000
   [junit4]   2> 1279007 INFO  (TEST-OverseerTest.testPlaceholders-seed#[49A2C9DD457A135A]) [    ] o.a.s.c.OverseerElectionContext I am going to be the leader 127.0.0.1:58613_solr
   [junit4]   2> 1279007 INFO  (TEST-OverseerTest.testPlaceholders-seed#[49A2C9DD457A135A]) [    ] o.a.s.c.c.SolrZkClient makePath: /overseer_elect/leader
   [junit4]   2> 1279010 INFO  (TEST-OverseerTest.testPlaceholders-seed#[49A2C9DD457A135A]) [    ] o.a.s.c.Overseer Overseer (id=95268644687708164-127.0.0.1:58613_solr-n_0000000000) starting
   [junit4]   2> 1279012 INFO  (TEST-OverseerTest.testPlaceholders-seed#[49A2C9DD457A135A]) [    ] o.a.s.c.c.SolrZkClient makePath: /overseer/queue
   [junit4]   2> 1279015 INFO  (TEST-OverseerTest.testPlaceholders-seed#[49A2C9DD457A135A]) [    ] o.a.s.c.c.SolrZkClient makePath: /overseer/queue-work
   [junit4]   2> 1279017 INFO  (TEST-OverseerTest.testPlaceholders-seed#[49A2C9DD457A135A]) [    ] o.a.s.c.c.SolrZkClient makePath: /overseer/collection-map-failure
   [junit4]   2> 1279020 INFO  (TEST-OverseerTest.testPlaceholders-seed#[49A2C9DD457A135A]) [    ] o.a.s.c.c.SolrZkClient makePath: /overseer/collection-map-running
   [junit4]   2> 1279022 INFO  (TEST-OverseerTest.testPlaceholders-seed#[49A2C9DD457A135A]) [    ] o.a.s.c.c.SolrZkClient makePath: /overseer/collection-map-completed
   [junit4]   2> 1279024 INFO  (TEST-OverseerTest.testPlaceholders-seed#[49A2C9DD457A135A]) [    ] o.a.s.c.c.SolrZkClient makePath: /overseer/collection-queue-work
   [junit4]   2> 1279028 INFO  (TEST-OverseerTest.testPlaceholders-seed#[49A2C9DD457A135A]) [    ] o.a.s.c.OverseerAutoReplicaFailoverThread Starting OverseerAutoReplicaFailoverThread autoReplicaFailoverWorkLoopDelay=10000 autoReplicaFailoverWaitAfterExpiration=30000 autoReplicaFailoverBadNodeExpiration=60000
   [junit4]   2> 1279028 INFO  (OverseerCollectionConfigSetProcessor-95268644687708164-127.0.0.1:58613_solr-n_0000000000) [    ] o.a.s.c.OverseerTaskProcessor Process current queue of overseer operations
   [junit4]   2> 1279028 INFO  (OverseerStateUpdate-95268644687708164-127.0.0.1:58613_solr-n_0000000000) [    ] o.a.s.c.Overseer Starting to work on the main queue
   [junit4]   2> 1279029 INFO  (OverseerStateUpdate-95268644687708164-127.0.0.1:58613_solr-n_0000000000) [    ] o.a.s.c.c.ZkStateReader Updating cluster state from ZooKeeper... 
   [junit4]   2> 1279032 INFO  (OverseerStateUpdate-95268644687708164-127.0.0.1:58613_solr-n_0000000000) [    ] o.a.s.c.Overseer processMessage: queueSize: 1, message = {
   [junit4]   2>   "operation":"state",
   [junit4]   2>   "state":"recovering",
   [junit4]   2>   "node_name":"node1",
   [junit4]   2>   "core":"core1",
   [junit4]   2>   "core_node_name":"node1",
   [junit4]   2>   "collection":"collection1",
   [junit4]   2>   "numShards":"12",
   [junit4]   2>   "base_url":"http://node1/solr/"} current state version: 0
   [junit4]   2> 1279033 INFO  (OverseerStateUpdate-95268644687708164-127.0.0.1:58613_solr-n_0000000000) [    ] o.a.s.c.o.ReplicaMutator Update state numShards=12 message={
   [junit4]   2>   "operation":"state",
   [junit4]   2>   "state":"recovering",
   [junit4]   2>   "node_name":"node1",
   [junit4]   2>   "core":"core1",
   [junit4]   2>   "core_node_name":"node1",
   [junit4]   2>   "collection":"collection1",
   [junit4]   2>   "numShards":"12",
   [junit4]   2>   "base_url":"http://node1/solr/"}
   [junit4]   2> 1279033 INFO  (OverseerStateUpdate-95268644687708164-127.0.0.1:58613_solr-n_0000000000) [    ] o.a.s.c.o.ClusterStateMutator building a new cName: collection1
   [junit4]   2> 1279033 INFO  (OverseerStateUpdate-95268644687708164-127.0.0.1:58613_solr-n_0000000000) [    ] o.a.s.c.o.ReplicaMutator Assigning new node to shard shard=shard5
   [junit4]   2> 1279035 INFO  (zkCallback-733-thread-1) [    ] o.a.s.c.c.ZkStateReader A cluster state change: [WatchedEvent state:SyncConnected type:NodeDataChanged path:/clusterstate.json], has occurred - updating... (live nodes size: [1])
   [junit4]   2> 1279035 INFO  (zkCallback-736-thread-1) [    ] o.a.s.c.c.ZkStateReader A cluster state change: [WatchedEvent state:SyncConnected type:NodeDataChanged path:/clusterstate.json], has occurred - updating... (live nodes size: [1])
   [junit4]   2> 1279035 INFO  (zkCallback-737-thread-1) [    ] o.a.s.c.c.ZkStateReader A cluster state change: [WatchedEvent state:SyncConnected type:NodeDataChanged path:/clusterstate.json], has occurred - updating... (live nodes size: [1])
   [junit4]   2> 1279530 INFO  (TEST-OverseerTest.testPlaceholders-seed#[49A2C9DD457A135A]) [    ] o.a.s.c.c.SolrZkClient makePath: /collections/collection1/leader_elect/shard5/election
   [junit4]   2> 1279532 INFO  (zkCallback-737-thread-1) [    ] o.a.s.c.c.ZkStateReader A collections change: [WatchedEvent state:SyncConnected type:NodeChildrenChanged path:/collections], has occurred - updating...
   [junit4]   2> 1279532 INFO  (zkCallback-736-thread-1) [    ] o.a.s.c.c.ZkStateReader A collections change: [WatchedEvent state:SyncConnected type:NodeChildrenChanged path:/collections], has occurred - updating...
   [junit4]   2> 1279532 INFO  (zkCallback-733-thread-1) [    ] o.a.s.c.c.ZkStateReader A collections change: [WatchedEvent state:SyncConnected type:NodeChildrenChanged path:/collections], has occurred - updating...
   [junit4]   2> 1279536 INFO  (TEST-OverseerTest.testPlaceholders-seed#[49A2C9DD457A135A]) [    ] o.a.s.c.LeaderElector Joined leadership election with path: /collections/collection1/leader_elect/shard5/election/95268644687708163-node1_core1-n_0000000000
   [junit4]   2> 1279537 INFO  (TEST-OverseerTest.testPlaceholders-seed#[49A2C9DD457A135A]) [    ] o.a.s.c.c.SolrZkClient makePath: /collections/collection1/leaders/shard5
   [junit4]   2> 1279540 INFO  (TEST-OverseerTest.testPlaceholders-seed#[49A2C9DD457A135A]) [    ] o.a.s.c.ShardLeaderElectionContextBase Creating leader registration node
   [junit4]   2> 1279542 INFO  (OverseerStateUpdate-95268644687708164-127.0.0.1:58613_solr-n_0000000000) [    ] o.a.s.c.Overseer processMessage: queueSize: 1, message = {
   [junit4]   2>   "operation":"leader",
   [junit4]   2>   "shard":"shard5",
   [junit4]   2>   "collection":"collection1",
   [junit4]   2>   "base_url":"http://node1/solr/",
   [junit4]   2>   "core":"core1",
   [junit4]   2>   "state":"active"} current state version: 1
   [junit4]   2> 1279546 INFO  (zkCallback-733-thread-1) [    ] o.a.s.c.c.ZkStateReader A live node change: [WatchedEvent state:SyncConnected type:NodeChildrenChanged path:/live_nodes], has occurred - updating... (live nodes size: [1])
   [junit4]   2> 1279546 INFO  (zkCallback-736-thread-1) [    ] o.a.s.c.c.ZkStateReader A live node change: [WatchedEvent state:SyncConnected type:NodeChildrenChanged path:/live_nodes], has occurred - updating... (live nodes size: [1])
   [junit4]   2> 1279549 INFO  (TEST-OverseerTest.testPlaceholders-seed#[49A2C9DD457A135A]) [    ] o.a.s.c.ZkTestServer connecting to 127.0.0.1:58613 58613
   [junit4]   2> 1279721 INFO  (Thread-1749) [    ] o.a.s.c.ZkTestServer connecting to 127.0.0.1:58613 58613
   [junit4]   2> 1279722 WARN  (Thread-1749) [    ] o.a.s.c.ZkTestServer Watch limit violations: 
   [junit4]   2> Maximum concurrent create/delete watches above limit:
   [junit4]   2> 
   [junit4]   2> 	3	/solr/aliases.json
   [junit4]   2> 
   [junit4]   2> Maximum concurrent data watches above limit:
   [junit4]   2> 
   [junit4]   2> 	3	/solr/clusterstate.json
   [junit4]   2> 
   [junit4]   2> Maximum concurrent children watches above limit:
   [junit4]   2> 
   [junit4]   2> 	3	/solr/collections
   [junit4]   2> 	3	/solr/live_nodes
   [junit4]   2> 
   [junit4]   2> 1279723 INFO  (TEST-OverseerTest.testPlaceholders-seed#[49A2C9DD457A135A]) [    ] o.a.s.SolrTestCaseJ4 ###Ending testPlaceholders
   [junit4]   2> 1279723 INFO  (TEST-OverseerTest.testPlaceholders-seed#[49A2C9DD457A135A]) [    ] o.a.s.c.Overseer Overseer (id=95268644687708164-127.0.0.1:58613_solr-n_0000000000) closing
   [junit4]   2> 1279723 INFO  (OverseerStateUpdate-95268644687708164-127.0.0.1:58613_solr-n_0000000000) [    ] o.a.s.c.Overseer Overseer Loop exiting : 127.0.0.1:58613_solr
   [junit4]   2> 1279725 ERROR (OverseerExitThread) [    ] o.a.s.c.Overseer could not read the data
   [junit4]   2> org.apache.zookeeper.KeeperException$SessionExpiredException: KeeperErrorCode = Session expired for /overseer_elect/leader
   [junit4]   2> 	at org.apache.zookeeper.KeeperException.create(KeeperException.java:127)
   [junit4]   2> 	at org.apache.zookeeper.KeeperException.create(KeeperException.java:51)
   [junit4]   2> 	at org.apache.zookeeper.ZooKeeper.getData(ZooKeeper.java:1155)
   [junit4]   2> 	at org.apache.solr.common.cloud.SolrZkClient$7.execute(SolrZkClient.java:345)
   [junit4]   2> 	at org.apache.solr.common.cloud.SolrZkClient$7.execute(SolrZkClient.java:342)
   [junit4]   2> 	at org.apache.solr.common.cloud.ZkCmdExecutor.retryOperation(ZkCmdExecutor.java:61)
   [junit4]   2> 	at org.apache.solr.common.cloud.SolrZkClient.getData(SolrZkClient.java:342)
   [junit4]   2> 	at org.apache.solr.cloud.Overseer$ClusterStateUpdater.checkIfIamStillLeader(Overseer.java:305)
   [junit4]   2> 	at org.apache.solr.cloud.Overseer$ClusterStateUpdater.access$300(Overseer.java:88)
   [junit4]   2> 	at org.apache.solr.cloud.Overseer$ClusterStateUpdater$2.run(Overseer.java:266)
   [junit4]   2> 1279730 INFO  (TEST-OverseerTest.testOverseerStatsReset-seed#[49A2C9DD457A135A]) [    ] o.a.s.SolrTestCaseJ4 ###Starting testOverseerStatsReset
   [junit4]   2> 1279731 INFO  (TEST-OverseerTest.testOverseerStatsReset-seed#[49A2C9DD457A135A]) [    ] o.a.s.c.ZkTestServer STARTING ZK TEST SERVER
   [junit4]   2> 1279731 INFO  (Thread-1750) [    ] o.a.s.c.ZkTestServer client port:0.0.0.0/0.0.0.0:0
   [junit4]   2> 1279731 INFO  (Thread-1750) [    ] o.a.s.c.ZkTestServer Starting server
   [junit4]   2> 1279831 INFO  (TEST-OverseerTest.testOverseerStatsReset-seed#[49A2C9DD457A135A]) [    ] o.a.s.c.ZkTestServer start zk server on port:36980
   [junit4]   2> 1279831 INFO  (TEST-OverseerTest.testOverseerStatsReset-seed#[49A2C9DD457A135A]) [    ] o.a.s.c.c.SolrZkClient Using default ZkCredentialsProvider
   [junit4]   2> 1279832 INFO  (TEST-OverseerTest.testOverseerStatsReset-seed#[49A2C9DD457A135A]) [    ] o.a.s.c.c.ConnectionManager Waiting for client to connect to ZooKeeper
   [junit4]   2> 1279838 INFO  (zkCallback-740-thread-1) [    ] o.a.s.c.c.ConnectionManager Watcher org.apache.solr.common.cloud.ConnectionManager@ae8086 name:ZooKeeperConnection Watcher:127.0.0.1:36980 got event WatchedEvent state:SyncConnected type:None path:null path:null type:None
   [junit4]   2> 1279838 INFO  (TEST-OverseerTest.testOverseerStatsReset-seed#[49A2C9DD457A135A]) [    ] o.a.s.c.c.ConnectionManager Client is connected to ZooKeeper
   [junit4]   2> 1279839 INFO  (TEST-OverseerTest.testOverseerStatsReset-seed#[49A2C9DD457A135A]) [    ] o.a.s.c.c.SolrZkClient Using default ZkACLProvider
   [junit4]   2> 1279841 INFO  (TEST-OverseerTest.testOverseerStatsReset-seed#[49A2C9DD457A135A]) [    ] o.a.s.c.c.SolrZkClient Using default ZkCredentialsProvider
   [junit4]   2> 1279841 INFO  (TEST-OverseerTest.testOverseerStatsReset-seed#[49A2C9DD457A135A]) [    ] o.a.s.c.c.ConnectionManager Waiting for client to connect to ZooKeeper
   [junit4]   2> 1279842 INFO  (zkCallback-741-thread-1) [    ] o.a.s.c.c.ConnectionManager Watcher org.apache.solr.common.cloud.ConnectionManager@328e20b8 name:ZooKeeperConnection Watcher:127.0.0.1:36980 got event WatchedEvent state:SyncConnected type:None path:null path:null type:None
   [junit4]   2> 1279843 INFO  (TEST-OverseerTest.testOverseerStatsReset-seed#[49A2C9DD457A135A]) [    ] o.a.s.c.c.ConnectionManager Client is connected to ZooKeeper
   [junit4]   2> 1279843 INFO  (TEST-OverseerTest.testOverseerStatsReset-seed#[49A2C9DD457A135A]) [    ] o.a.s.c.c.SolrZkClient Using default ZkACLProvider
   [junit4]   2> 1279843 INFO  (TEST-OverseerTest.testOverseerStatsReset-seed#[49A2C9DD457A135A]) [    ] o.a.s.c.c.SolrZkClient makePath: /solr
   [junit4]   2> 1279846 INFO  (TEST-OverseerTest.testOverseerStatsReset-seed#[49A2C9DD457A135A]) [    ] o.a.s.c.c.SolrZkClient Using default ZkCredentialsProvider
   [junit4]   2> 1279847 INFO  (TEST-OverseerTest.testOverseerStatsReset-seed#[49A2C9DD457A135A]) [    ] o.a.s.c.c.ConnectionManager Waiting for client to connect to ZooKeeper
   [junit4]   2> 1279848 INFO  (zkCallback-742-thread-1) [    ] o.a.s.c.c.ConnectionManager Watcher org.apache.solr.common.cloud.ConnectionManager@10bc026a name:ZooKeeperConnection Watcher:127.0.0.1:36980/solr got event WatchedEvent state:SyncConnected type:None path:null path:null type:None
   [junit4]   2> 1279848 INFO  (TEST-OverseerTest.testOverseerStatsReset-seed#[49A2C9DD457A135A]) [    ] o.a.s.c.c.ConnectionManager Client is connected to ZooKeeper
   [junit4]   2> 1279848 INFO  (TEST-OverseerTest.testOverseerStatsReset-seed#[49A2C9DD457A135A]) [    ] o.a.s.c.c.SolrZkClient Using default ZkACLProvider
   [junit4]   2> 1279849 INFO  (TEST-OverseerTest.testOverseerStatsReset-seed#[49A2C9DD457A135A]) [    ] o.a.s.c.c.SolrZkClient makePath: /live_nodes
   [junit4]   2> 1279850 INFO  (TEST-OverseerTest.testOverseerStatsReset-seed#[49A2C9DD457A135A]) [    ] o.a.s.c.c.SolrZkClient makePath: /collections
   [junit4]   2> 1279852 INFO  (TEST-OverseerTest.testOverseerStatsReset-seed#[49A2C9DD457A135A]) [    ] o.a.s.c.c.SolrZkClient makePath: /aliases.json
   [junit4]   2> 1279853 INFO  (TEST-OverseerTest.testOverseerStatsReset-seed#[49A2C9DD457A135A]) [    ] o.a.s.c.c.SolrZkClient makePath: /clusterstate.json
   [junit4]   2> 1279855 INF

[...truncated too long message...]

//127.0.0.1/solr/"}
   [junit4]   2> 1318924 INFO  (OverseerStateUpdate-95268647124140035-127.0.0.1:58059_solr-n_0000000000) [    ] o.a.s.c.o.ReplicaMutator Collection already exists with numShards=3
   [junit4]   2> 1318924 INFO  (OverseerStateUpdate-95268647124140035-127.0.0.1:58059_solr-n_0000000000) [    ] o.a.s.c.o.ReplicaMutator Assigning new node to shard shard=shard1
   [junit4]   2> 1319026 INFO  (zkCallback-847-thread-1) [    ] o.a.s.c.c.ZkStateReader A cluster state change: [WatchedEvent state:SyncConnected type:NodeDataChanged path:/clusterstate.json], has occurred - updating... (live nodes size: [1])
   [junit4]   2> 1319026 INFO  (zkCallback-848-thread-2) [    ] o.a.s.c.c.ZkStateReader A cluster state change: [WatchedEvent state:SyncConnected type:NodeDataChanged path:/clusterstate.json], has occurred - updating... (live nodes size: [1])
   [junit4]   2> 1319027 INFO  (zkCallback-851-thread-1) [    ] o.a.s.c.c.ZkStateReader A cluster state change: [WatchedEvent state:SyncConnected type:NodeDataChanged path:/clusterstate.json], has occurred - updating... (live nodes size: [1])
   [junit4]   2> 1319423 INFO  (TEST-OverseerTest.testBadQueueItem-seed#[49A2C9DD457A135A]) [    ] o.a.s.c.c.SolrZkClient makePath: /collections/collection2/leader_elect/shard1/election
   [junit4]   2> 1319426 INFO  (TEST-OverseerTest.testBadQueueItem-seed#[49A2C9DD457A135A]) [    ] o.a.s.c.LeaderElector Joined leadership election with path: /collections/collection2/leader_elect/shard1/election/95268647124140036-127.0.0.1_core3-n_0000000000
   [junit4]   2> 1319426 INFO  (TEST-OverseerTest.testBadQueueItem-seed#[49A2C9DD457A135A]) [    ] o.a.s.c.c.SolrZkClient makePath: /collections/collection2/leaders/shard1
   [junit4]   2> 1319428 INFO  (TEST-OverseerTest.testBadQueueItem-seed#[49A2C9DD457A135A]) [    ] o.a.s.c.ShardLeaderElectionContextBase Creating leader registration node
   [junit4]   2> 1319430 INFO  (OverseerStateUpdate-95268647124140035-127.0.0.1:58059_solr-n_0000000000) [    ] o.a.s.c.Overseer processMessage: queueSize: 1, message = {
   [junit4]   2>   "operation":"leader",
   [junit4]   2>   "shard":"shard1",
   [junit4]   2>   "collection":"collection2",
   [junit4]   2>   "base_url":"http://127.0.0.1/solr/",
   [junit4]   2>   "core":"core3",
   [junit4]   2>   "state":"active"} current state version: 7
   [junit4]   2> 1319532 INFO  (zkCallback-847-thread-1) [    ] o.a.s.c.c.ZkStateReader A cluster state change: [WatchedEvent state:SyncConnected type:NodeDataChanged path:/clusterstate.json], has occurred - updating... (live nodes size: [1])
   [junit4]   2> 1319532 INFO  (zkCallback-848-thread-2) [    ] o.a.s.c.c.ZkStateReader A cluster state change: [WatchedEvent state:SyncConnected type:NodeDataChanged path:/clusterstate.json], has occurred - updating... (live nodes size: [1])
   [junit4]   2> 1319535 INFO  (zkCallback-851-thread-1) [    ] o.a.s.c.c.ZkStateReader A cluster state change: [WatchedEvent state:SyncConnected type:NodeDataChanged path:/clusterstate.json], has occurred - updating... (live nodes size: [1])
   [junit4]   2> 1319584 INFO  (zkCallback-848-thread-2) [    ] o.a.s.c.c.ZkStateReader A live node change: [WatchedEvent state:SyncConnected type:NodeChildrenChanged path:/live_nodes], has occurred - updating... (live nodes size: [1])
   [junit4]   2> 1319584 INFO  (zkCallback-851-thread-1) [    ] o.a.s.c.c.ZkStateReader A live node change: [WatchedEvent state:SyncConnected type:NodeChildrenChanged path:/live_nodes], has occurred - updating... (live nodes size: [1])
   [junit4]   2> 1319587 INFO  (TEST-OverseerTest.testBadQueueItem-seed#[49A2C9DD457A135A]) [    ] o.a.s.c.ZkTestServer connecting to 127.0.0.1:58059 58059
   [junit4]   2> 1319719 INFO  (Thread-1758) [    ] o.a.s.c.ZkTestServer connecting to 127.0.0.1:58059 58059
   [junit4]   2> 1319720 WARN  (Thread-1758) [    ] o.a.s.c.ZkTestServer Watch limit violations: 
   [junit4]   2> Maximum concurrent create/delete watches above limit:
   [junit4]   2> 
   [junit4]   2> 	3	/solr/aliases.json
   [junit4]   2> 
   [junit4]   2> Maximum concurrent data watches above limit:
   [junit4]   2> 
   [junit4]   2> 	3	/solr/clusterstate.json
   [junit4]   2> 
   [junit4]   2> Maximum concurrent children watches above limit:
   [junit4]   2> 
   [junit4]   2> 	3	/solr/collections
   [junit4]   2> 	3	/solr/live_nodes
   [junit4]   2> 
   [junit4]   2> 1319720 INFO  (TEST-OverseerTest.testBadQueueItem-seed#[49A2C9DD457A135A]) [    ] o.a.s.SolrTestCaseJ4 ###Ending testBadQueueItem
   [junit4]   2> 1319720 INFO  (TEST-OverseerTest.testBadQueueItem-seed#[49A2C9DD457A135A]) [    ] o.a.s.c.Overseer Overseer (id=95268647124140035-127.0.0.1:58059_solr-n_0000000000) closing
   [junit4]   2> 1319720 INFO  (OverseerStateUpdate-95268647124140035-127.0.0.1:58059_solr-n_0000000000) [    ] o.a.s.c.Overseer Overseer Loop exiting : 127.0.0.1:58059_solr
   [junit4]   2> 1319721 ERROR (OverseerExitThread) [    ] o.a.s.c.Overseer could not read the data
   [junit4]   2> org.apache.zookeeper.KeeperException$SessionExpiredException: KeeperErrorCode = Session expired for /overseer_elect/leader
   [junit4]   2> 	at org.apache.zookeeper.KeeperException.create(KeeperException.java:127)
   [junit4]   2> 	at org.apache.zookeeper.KeeperException.create(KeeperException.java:51)
   [junit4]   2> 	at org.apache.zookeeper.ZooKeeper.getData(ZooKeeper.java:1155)
   [junit4]   2> 	at org.apache.solr.common.cloud.SolrZkClient$7.execute(SolrZkClient.java:345)
   [junit4]   2> 	at org.apache.solr.common.cloud.SolrZkClient$7.execute(SolrZkClient.java:342)
   [junit4]   2> 	at org.apache.solr.common.cloud.ZkCmdExecutor.retryOperation(ZkCmdExecutor.java:61)
   [junit4]   2> 	at org.apache.solr.common.cloud.SolrZkClient.getData(SolrZkClient.java:342)
   [junit4]   2> 	at org.apache.solr.cloud.Overseer$ClusterStateUpdater.checkIfIamStillLeader(Overseer.java:305)
   [junit4]   2> 	at org.apache.solr.cloud.Overseer$ClusterStateUpdater.access$300(Overseer.java:88)
   [junit4]   2> 	at org.apache.solr.cloud.Overseer$ClusterStateUpdater$2.run(Overseer.java:266)
   [junit4]   2> 1322721 INFO  (SUITE-OverseerTest-seed#[49A2C9DD457A135A]-worker) [    ] o.a.s.SolrTestCaseJ4 ###deleteCore
   [junit4]   2> NOTE: leaving temporary files on disk at: /x1/jenkins/jenkins-slave/workspace/Lucene-Solr-Tests-5.x-Java7/solr/build/solr-core/test/J2/temp/solr.cloud.OverseerTest_49A2C9DD457A135A-001
   [junit4]   2> NOTE: test params are: codec=Asserting(Lucene54): {}, docValues:{}, sim=RandomSimilarity(queryNorm=true,coord=crazy): {}, locale=fi-FI, timezone=America/Cuiaba
   [junit4]   2> NOTE: Linux 3.13.0-52-generic amd64/Oracle Corporation 1.7.0_80 (64-bit)/cpus=4,threads=1,free=255925752,total=430440448
   [junit4]   2> NOTE: All tests run in this JVM: [TestSolrQueryParserDefaultOperatorResource, TestSolrJ, TestReqParamsAPI, CurrencyFieldXmlFileTest, AnalysisErrorHandlingTest, TestLeaderElectionZkExpiry, RankQueryTest, TestConfigSetsAPIExclusivity, HLLSerializationTest, TestJmxMonitoredMap, TestJettySolrRunner, DistanceUnitsTest, DocExpirationUpdateProcessorFactoryTest, BasicDistributedZk2Test, RecoveryAfterSoftCommitTest, CoreMergeIndexesAdminHandlerTest, SaslZkACLProviderTest, EnumFieldTest, ZkStateReaderTest, TestBlobHandler, OutOfBoxZkACLAndCredentialsProvidersTest, TestPostingsSolrHighlighter, TestXIncludeConfig, ShowFileRequestHandlerTest, AssignTest, HdfsRecoverLeaseTest, DeleteLastCustomShardedReplicaTest, TestStressUserVersions, TestIntervalFaceting, TestFileDictionaryLookup, TestWriterPerf, TestSolrQueryParser, DocValuesMultiTest, SharedFSAutoReplicaFailoverUtilsTest, AnalyticsQueryTest, AutoCommitTest, XmlUpdateRequestHandlerTest, BinaryUpdateRequestHandlerTest, PreAnalyzedUpdateProcessorTest, TestCollationFieldDocValues, TestNoOpRegenerator, BadComponentTest, DebugComponentTest, TestReloadDeadlock, TestCollationField, TestSearchPerf, TestElisionMultitermQuery, TestGroupingSearch, NoCacheHeaderTest, TestTrackingShardHandlerFactory, TestUtils, TestDefaultStatsCache, TestFuzzyAnalyzedSuggestions, CoreAdminHandlerTest, ClusterStateTest, CollectionsAPIAsyncDistributedZkTest, HardAutoCommitTest, HttpPartitionTest, DistributedFacetPivotLargeTest, LeaderInitiatedRecoveryOnShardRestartTest, QueryParsingTest, DistributedQueueTest, TestCSVResponseWriter, TestSolrConfigHandlerConcurrent, TermVectorComponentDistributedTest, TestTestInjection, TestSolrQueryResponse, TestSchemaSimilarityResource, TestSolrIndexConfig, SearchHandlerTest, ScriptEngineTest, TestRecovery, LukeRequestHandlerTest, TestCharFilters, RulesTest, OverseerTest]
   [junit4] Completed [227/566 (1!)] on J2 in 49.36s, 12 tests, 1 failure, 1 skipped <<< FAILURES!

[...truncated 1128 lines...]
BUILD FAILED
/x1/jenkins/jenkins-slave/workspace/Lucene-Solr-Tests-5.x-Java7/build.xml:750: The following error occurred while executing this line:
/x1/jenkins/jenkins-slave/workspace/Lucene-Solr-Tests-5.x-Java7/build.xml:694: The following error occurred while executing this line:
/x1/jenkins/jenkins-slave/workspace/Lucene-Solr-Tests-5.x-Java7/build.xml:59: The following error occurred while executing this line:
/x1/jenkins/jenkins-slave/workspace/Lucene-Solr-Tests-5.x-Java7/solr/build.xml:233: The following error occurred while executing this line:
/x1/jenkins/jenkins-slave/workspace/Lucene-Solr-Tests-5.x-Java7/solr/common-build.xml:534: The following error occurred while executing this line:
/x1/jenkins/jenkins-slave/workspace/Lucene-Solr-Tests-5.x-Java7/lucene/common-build.xml:1444: The following error occurred while executing this line:
/x1/jenkins/jenkins-slave/workspace/Lucene-Solr-Tests-5.x-Java7/lucene/common-build.xml:1000: There were test failures: 566 suites (7 ignored), 2265 tests, 1 failure, 54 ignored (39 assumptions) [seed: 49A2C9DD457A135A]

Total time: 89 minutes 0 seconds
Build step 'Invoke Ant' marked build as failure
Archiving artifacts
Recording test results
Email was triggered for: Failure - Any
Sending email for trigger: Failure - Any



Mime
View raw message