lucene-dev mailing list archives

Site index · List index
Message view « Date » · « Thread »
Top « Date » · « Thread »
From Apache Jenkins Server <jenk...@builds.apache.org>
Subject [JENKINS] Lucene-Solr-NightlyTests-5.x - Build # 1074 - Still Failing
Date Wed, 13 Jan 2016 13:53:44 GMT
Build: https://builds.apache.org/job/Lucene-Solr-NightlyTests-5.x/1074/

1 tests failed.
FAILED:  org.apache.solr.cloud.CollectionsAPIDistributedZkTest.test

Error Message:
Captured an uncaught exception in thread: Thread[id=33805, name=collection1, state=RUNNABLE, group=TGRP-CollectionsAPIDistributedZkTest]

Stack Trace:
com.carrotsearch.randomizedtesting.UncaughtExceptionError: Captured an uncaught exception in thread: Thread[id=33805, name=collection1, state=RUNNABLE, group=TGRP-CollectionsAPIDistributedZkTest]
Caused by: org.apache.solr.client.solrj.impl.HttpSolrClient$RemoteSolrException: Error from server at https://127.0.0.1:51792/i_q/p: collection already exists: awholynewstresscollection_collection1_5
	at __randomizedtesting.SeedInfo.seed([95EB1EF282912922]:0)
	at org.apache.solr.client.solrj.impl.HttpSolrClient.executeMethod(HttpSolrClient.java:575)
	at org.apache.solr.client.solrj.impl.HttpSolrClient.request(HttpSolrClient.java:241)
	at org.apache.solr.client.solrj.impl.HttpSolrClient.request(HttpSolrClient.java:230)
	at org.apache.solr.client.solrj.impl.LBHttpSolrClient.doRequest(LBHttpSolrClient.java:372)
	at org.apache.solr.client.solrj.impl.LBHttpSolrClient.request(LBHttpSolrClient.java:325)
	at org.apache.solr.client.solrj.impl.CloudSolrClient.sendRequest(CloudSolrClient.java:1100)
	at org.apache.solr.client.solrj.impl.CloudSolrClient.requestWithRetryOnStaleState(CloudSolrClient.java:871)
	at org.apache.solr.client.solrj.impl.CloudSolrClient.request(CloudSolrClient.java:807)
	at org.apache.solr.client.solrj.SolrClient.request(SolrClient.java:1220)
	at org.apache.solr.cloud.AbstractFullDistribZkTestBase.createCollection(AbstractFullDistribZkTestBase.java:1574)
	at org.apache.solr.cloud.AbstractFullDistribZkTestBase.createCollection(AbstractFullDistribZkTestBase.java:1595)
	at org.apache.solr.cloud.CollectionsAPIDistributedZkTest$1CollectionThread.run(CollectionsAPIDistributedZkTest.java:881)




Build Log:
[...truncated 11194 lines...]
   [junit4] Suite: org.apache.solr.cloud.CollectionsAPIDistributedZkTest
   [junit4]   2> Creating dataDir: /x1/jenkins/jenkins-slave/workspace/Lucene-Solr-NightlyTests-5.x/solr/build/solr-core/test/J1/temp/solr.cloud.CollectionsAPIDistributedZkTest_95EB1EF282912922-001/init-core-data-001
   [junit4]   2> 1963273 INFO  (SUITE-CollectionsAPIDistributedZkTest-seed#[95EB1EF282912922]-worker) [    ] o.a.s.SolrTestCaseJ4 Randomized ssl (true) and clientAuth (false)
   [junit4]   2> 1963273 INFO  (SUITE-CollectionsAPIDistributedZkTest-seed#[95EB1EF282912922]-worker) [    ] o.a.s.BaseDistributedSearchTestCase Setting hostContext system property: /i_q/p
   [junit4]   2> 1963278 INFO  (TEST-CollectionsAPIDistributedZkTest.test-seed#[95EB1EF282912922]) [    ] o.a.s.c.ZkTestServer STARTING ZK TEST SERVER
   [junit4]   2> 1963278 INFO  (Thread-27858) [    ] o.a.s.c.ZkTestServer client port:0.0.0.0/0.0.0.0:0
   [junit4]   2> 1963278 INFO  (Thread-27858) [    ] o.a.s.c.ZkTestServer Starting server
   [junit4]   2> 1963378 INFO  (TEST-CollectionsAPIDistributedZkTest.test-seed#[95EB1EF282912922]) [    ] o.a.s.c.ZkTestServer start zk server on port:56217
   [junit4]   2> 1963378 INFO  (TEST-CollectionsAPIDistributedZkTest.test-seed#[95EB1EF282912922]) [    ] o.a.s.c.c.SolrZkClient Using default ZkCredentialsProvider
   [junit4]   2> 1963379 INFO  (TEST-CollectionsAPIDistributedZkTest.test-seed#[95EB1EF282912922]) [    ] o.a.s.c.c.ConnectionManager Waiting for client to connect to ZooKeeper
   [junit4]   2> 1963390 INFO  (zkCallback-909-thread-1) [    ] o.a.s.c.c.ConnectionManager Watcher org.apache.solr.common.cloud.ConnectionManager@17989f08 name:ZooKeeperConnection Watcher:127.0.0.1:56217 got event WatchedEvent state:SyncConnected type:None path:null path:null type:None
   [junit4]   2> 1963390 INFO  (TEST-CollectionsAPIDistributedZkTest.test-seed#[95EB1EF282912922]) [    ] o.a.s.c.c.ConnectionManager Client is connected to ZooKeeper
   [junit4]   2> 1963390 INFO  (TEST-CollectionsAPIDistributedZkTest.test-seed#[95EB1EF282912922]) [    ] o.a.s.c.c.SolrZkClient Using default ZkACLProvider
   [junit4]   2> 1963390 INFO  (TEST-CollectionsAPIDistributedZkTest.test-seed#[95EB1EF282912922]) [    ] o.a.s.c.c.SolrZkClient makePath: /solr
   [junit4]   2> 1963394 INFO  (TEST-CollectionsAPIDistributedZkTest.test-seed#[95EB1EF282912922]) [    ] o.a.s.c.c.SolrZkClient Using default ZkCredentialsProvider
   [junit4]   2> 1963394 INFO  (TEST-CollectionsAPIDistributedZkTest.test-seed#[95EB1EF282912922]) [    ] o.a.s.c.c.ConnectionManager Waiting for client to connect to ZooKeeper
   [junit4]   2> 1963396 INFO  (zkCallback-910-thread-1) [    ] o.a.s.c.c.ConnectionManager Watcher org.apache.solr.common.cloud.ConnectionManager@53668b15 name:ZooKeeperConnection Watcher:127.0.0.1:56217/solr got event WatchedEvent state:SyncConnected type:None path:null path:null type:None
   [junit4]   2> 1963396 INFO  (TEST-CollectionsAPIDistributedZkTest.test-seed#[95EB1EF282912922]) [    ] o.a.s.c.c.ConnectionManager Client is connected to ZooKeeper
   [junit4]   2> 1963396 INFO  (TEST-CollectionsAPIDistributedZkTest.test-seed#[95EB1EF282912922]) [    ] o.a.s.c.c.SolrZkClient Using default ZkACLProvider
   [junit4]   2> 1963396 INFO  (TEST-CollectionsAPIDistributedZkTest.test-seed#[95EB1EF282912922]) [    ] o.a.s.c.c.SolrZkClient makePath: /collections/collection1
   [junit4]   2> 1963399 INFO  (TEST-CollectionsAPIDistributedZkTest.test-seed#[95EB1EF282912922]) [    ] o.a.s.c.c.SolrZkClient makePath: /collections/collection1/shards
   [junit4]   2> 1963401 INFO  (TEST-CollectionsAPIDistributedZkTest.test-seed#[95EB1EF282912922]) [    ] o.a.s.c.c.SolrZkClient makePath: /collections/control_collection
   [junit4]   2> 1963402 INFO  (TEST-CollectionsAPIDistributedZkTest.test-seed#[95EB1EF282912922]) [    ] o.a.s.c.c.SolrZkClient makePath: /collections/control_collection/shards
   [junit4]   2> 1963405 INFO  (TEST-CollectionsAPIDistributedZkTest.test-seed#[95EB1EF282912922]) [    ] o.a.s.c.AbstractZkTestCase put /x1/jenkins/jenkins-slave/workspace/Lucene-Solr-NightlyTests-5.x/solr/core/src/test-files/solr/collection1/conf/solrconfig-tlog.xml to /configs/conf1/solrconfig.xml
   [junit4]   2> 1963405 INFO  (TEST-CollectionsAPIDistributedZkTest.test-seed#[95EB1EF282912922]) [    ] o.a.s.c.c.SolrZkClient makePath: /configs/conf1/solrconfig.xml
   [junit4]   2> 1963409 INFO  (TEST-CollectionsAPIDistributedZkTest.test-seed#[95EB1EF282912922]) [    ] o.a.s.c.AbstractZkTestCase put /x1/jenkins/jenkins-slave/workspace/Lucene-Solr-NightlyTests-5.x/solr/core/src/test-files/solr/collection1/conf/schema.xml to /configs/conf1/schema.xml
   [junit4]   2> 1963409 INFO  (TEST-CollectionsAPIDistributedZkTest.test-seed#[95EB1EF282912922]) [    ] o.a.s.c.c.SolrZkClient makePath: /configs/conf1/schema.xml
   [junit4]   2> 1963412 INFO  (TEST-CollectionsAPIDistributedZkTest.test-seed#[95EB1EF282912922]) [    ] o.a.s.c.AbstractZkTestCase put /x1/jenkins/jenkins-slave/workspace/Lucene-Solr-NightlyTests-5.x/solr/core/src/test-files/solr/collection1/conf/solrconfig.snippet.randomindexconfig.xml to /configs/conf1/solrconfig.snippet.randomindexconfig.xml
   [junit4]   2> 1963413 INFO  (TEST-CollectionsAPIDistributedZkTest.test-seed#[95EB1EF282912922]) [    ] o.a.s.c.c.SolrZkClient makePath: /configs/conf1/solrconfig.snippet.randomindexconfig.xml
   [junit4]   2> 1963415 INFO  (TEST-CollectionsAPIDistributedZkTest.test-seed#[95EB1EF282912922]) [    ] o.a.s.c.AbstractZkTestCase put /x1/jenkins/jenkins-slave/workspace/Lucene-Solr-NightlyTests-5.x/solr/core/src/test-files/solr/collection1/conf/stopwords.txt to /configs/conf1/stopwords.txt
   [junit4]   2> 1963415 INFO  (TEST-CollectionsAPIDistributedZkTest.test-seed#[95EB1EF282912922]) [    ] o.a.s.c.c.SolrZkClient makePath: /configs/conf1/stopwords.txt
   [junit4]   2> 1963418 INFO  (TEST-CollectionsAPIDistributedZkTest.test-seed#[95EB1EF282912922]) [    ] o.a.s.c.AbstractZkTestCase put /x1/jenkins/jenkins-slave/workspace/Lucene-Solr-NightlyTests-5.x/solr/core/src/test-files/solr/collection1/conf/protwords.txt to /configs/conf1/protwords.txt
   [junit4]   2> 1963418 INFO  (TEST-CollectionsAPIDistributedZkTest.test-seed#[95EB1EF282912922]) [    ] o.a.s.c.c.SolrZkClient makePath: /configs/conf1/protwords.txt
   [junit4]   2> 1963422 INFO  (TEST-CollectionsAPIDistributedZkTest.test-seed#[95EB1EF282912922]) [    ] o.a.s.c.AbstractZkTestCase put /x1/jenkins/jenkins-slave/workspace/Lucene-Solr-NightlyTests-5.x/solr/core/src/test-files/solr/collection1/conf/currency.xml to /configs/conf1/currency.xml
   [junit4]   2> 1963422 INFO  (TEST-CollectionsAPIDistributedZkTest.test-seed#[95EB1EF282912922]) [    ] o.a.s.c.c.SolrZkClient makePath: /configs/conf1/currency.xml
   [junit4]   2> 1963427 INFO  (TEST-CollectionsAPIDistributedZkTest.test-seed#[95EB1EF282912922]) [    ] o.a.s.c.AbstractZkTestCase put /x1/jenkins/jenkins-slave/workspace/Lucene-Solr-NightlyTests-5.x/solr/core/src/test-files/solr/collection1/conf/enumsConfig.xml to /configs/conf1/enumsConfig.xml
   [junit4]   2> 1963427 INFO  (TEST-CollectionsAPIDistributedZkTest.test-seed#[95EB1EF282912922]) [    ] o.a.s.c.c.SolrZkClient makePath: /configs/conf1/enumsConfig.xml
   [junit4]   2> 1963429 INFO  (TEST-CollectionsAPIDistributedZkTest.test-seed#[95EB1EF282912922]) [    ] o.a.s.c.AbstractZkTestCase put /x1/jenkins/jenkins-slave/workspace/Lucene-Solr-NightlyTests-5.x/solr/core/src/test-files/solr/collection1/conf/open-exchange-rates.json to /configs/conf1/open-exchange-rates.json
   [junit4]   2> 1963430 INFO  (TEST-CollectionsAPIDistributedZkTest.test-seed#[95EB1EF282912922]) [    ] o.a.s.c.c.SolrZkClient makePath: /configs/conf1/open-exchange-rates.json
   [junit4]   2> 1963437 INFO  (TEST-CollectionsAPIDistributedZkTest.test-seed#[95EB1EF282912922]) [    ] o.a.s.c.AbstractZkTestCase put /x1/jenkins/jenkins-slave/workspace/Lucene-Solr-NightlyTests-5.x/solr/core/src/test-files/solr/collection1/conf/mapping-ISOLatin1Accent.txt to /configs/conf1/mapping-ISOLatin1Accent.txt
   [junit4]   2> 1963437 INFO  (TEST-CollectionsAPIDistributedZkTest.test-seed#[95EB1EF282912922]) [    ] o.a.s.c.c.SolrZkClient makePath: /configs/conf1/mapping-ISOLatin1Accent.txt
   [junit4]   2> 1963443 INFO  (TEST-CollectionsAPIDistributedZkTest.test-seed#[95EB1EF282912922]) [    ] o.a.s.c.AbstractZkTestCase put /x1/jenkins/jenkins-slave/workspace/Lucene-Solr-NightlyTests-5.x/solr/core/src/test-files/solr/collection1/conf/old_synonyms.txt to /configs/conf1/old_synonyms.txt
   [junit4]   2> 1963443 INFO  (TEST-CollectionsAPIDistributedZkTest.test-seed#[95EB1EF282912922]) [    ] o.a.s.c.c.SolrZkClient makePath: /configs/conf1/old_synonyms.txt
   [junit4]   2> 1963447 INFO  (TEST-CollectionsAPIDistributedZkTest.test-seed#[95EB1EF282912922]) [    ] o.a.s.c.AbstractZkTestCase put /x1/jenkins/jenkins-slave/workspace/Lucene-Solr-NightlyTests-5.x/solr/core/src/test-files/solr/collection1/conf/synonyms.txt to /configs/conf1/synonyms.txt
   [junit4]   2> 1963447 INFO  (TEST-CollectionsAPIDistributedZkTest.test-seed#[95EB1EF282912922]) [    ] o.a.s.c.c.SolrZkClient makePath: /configs/conf1/synonyms.txt
   [junit4]   2> 1963462 INFO  (TEST-CollectionsAPIDistributedZkTest.test-seed#[95EB1EF282912922]) [    ] o.a.s.c.c.SolrZkClient Using default ZkCredentialsProvider
   [junit4]   2> 1963463 INFO  (TEST-CollectionsAPIDistributedZkTest.test-seed#[95EB1EF282912922]) [    ] o.a.s.c.c.ConnectionManager Waiting for client to connect to ZooKeeper
   [junit4]   2> 1963466 INFO  (zkCallback-911-thread-1) [    ] o.a.s.c.c.ConnectionManager Watcher org.apache.solr.common.cloud.ConnectionManager@4fca1940 name:ZooKeeperConnection Watcher:127.0.0.1:56217/solr got event WatchedEvent state:SyncConnected type:None path:null path:null type:None
   [junit4]   2> 1963466 INFO  (TEST-CollectionsAPIDistributedZkTest.test-seed#[95EB1EF282912922]) [    ] o.a.s.c.c.ConnectionManager Client is connected to ZooKeeper
   [junit4]   2> 1963466 INFO  (TEST-CollectionsAPIDistributedZkTest.test-seed#[95EB1EF282912922]) [    ] o.a.s.c.c.SolrZkClient Using default ZkACLProvider
   [junit4]   2> 1963930 INFO  (TEST-CollectionsAPIDistributedZkTest.test-seed#[95EB1EF282912922]) [    ] o.a.s.SolrTestCaseJ4 Writing core.properties file to /x1/jenkins/jenkins-slave/workspace/Lucene-Solr-NightlyTests-5.x/solr/build/solr-core/test/J1/temp/solr.cloud.CollectionsAPIDistributedZkTest_95EB1EF282912922-001/control-001/cores/collection1
   [junit4]   2> 1963931 INFO  (TEST-CollectionsAPIDistributedZkTest.test-seed#[95EB1EF282912922]) [    ] o.e.j.s.Server jetty-9.2.13.v20150730
   [junit4]   2> 1963947 INFO  (TEST-CollectionsAPIDistributedZkTest.test-seed#[95EB1EF282912922]) [    ] o.e.j.s.h.ContextHandler Started o.e.j.s.ServletContextHandler@88864d6{/i_q/p,null,AVAILABLE}
   [junit4]   2> 1963953 INFO  (TEST-CollectionsAPIDistributedZkTest.test-seed#[95EB1EF282912922]) [    ] o.e.j.s.ServerConnector Started ServerConnector@3ac9cb8c{SSL-http/1.1}{127.0.0.1:55461}
   [junit4]   2> 1963953 INFO  (TEST-CollectionsAPIDistributedZkTest.test-seed#[95EB1EF282912922]) [    ] o.e.j.s.Server Started @1966606ms
   [junit4]   2> 1963953 INFO  (TEST-CollectionsAPIDistributedZkTest.test-seed#[95EB1EF282912922]) [    ] o.a.s.c.s.e.JettySolrRunner Jetty properties: {hostContext=/i_q/p, solr.data.dir=/x1/jenkins/jenkins-slave/workspace/Lucene-Solr-NightlyTests-5.x/solr/build/solr-core/test/J1/temp/solr.cloud.CollectionsAPIDistributedZkTest_95EB1EF282912922-001/tempDir-001/control/data, coreRootDirectory=/x1/jenkins/jenkins-slave/workspace/Lucene-Solr-NightlyTests-5.x/solr/build/solr-core/test/J1/temp/solr.cloud.CollectionsAPIDistributedZkTest_95EB1EF282912922-001/control-001/cores, hostPort=55461}
   [junit4]   2> 1963954 INFO  (TEST-CollectionsAPIDistributedZkTest.test-seed#[95EB1EF282912922]) [    ] o.a.s.s.SolrDispatchFilter SolrDispatchFilter.init(): sun.misc.Launcher$AppClassLoader@7b3cb2c6
   [junit4]   2> 1963954 INFO  (TEST-CollectionsAPIDistributedZkTest.test-seed#[95EB1EF282912922]) [    ] o.a.s.c.SolrResourceLoader new SolrResourceLoader for directory: '/x1/jenkins/jenkins-slave/workspace/Lucene-Solr-NightlyTests-5.x/solr/build/solr-core/test/J1/temp/solr.cloud.CollectionsAPIDistributedZkTest_95EB1EF282912922-001/control-001'
   [junit4]   2> 1963954 INFO  (TEST-CollectionsAPIDistributedZkTest.test-seed#[95EB1EF282912922]) [    ] o.a.s.c.SolrResourceLoader JNDI not configured for solr (NoInitialContextEx)
   [junit4]   2> 1963954 INFO  (TEST-CollectionsAPIDistributedZkTest.test-seed#[95EB1EF282912922]) [    ] o.a.s.c.SolrResourceLoader solr home defaulted to 'solr/' (could not find system property or JNDI)
   [junit4]   2> 1963954 INFO  (TEST-CollectionsAPIDistributedZkTest.test-seed#[95EB1EF282912922]) [    ] o.a.s.c.c.SolrZkClient Using default ZkCredentialsProvider
   [junit4]   2> 1963955 INFO  (TEST-CollectionsAPIDistributedZkTest.test-seed#[95EB1EF282912922]) [    ] o.a.s.c.c.ConnectionManager Waiting for client to connect to ZooKeeper
   [junit4]   2> 1963957 INFO  (zkCallback-912-thread-1) [    ] o.a.s.c.c.ConnectionManager Watcher org.apache.solr.common.cloud.ConnectionManager@7561d912 name:ZooKeeperConnection Watcher:127.0.0.1:56217/solr got event WatchedEvent state:SyncConnected type:None path:null path:null type:None
   [junit4]   2> 1963957 INFO  (TEST-CollectionsAPIDistributedZkTest.test-seed#[95EB1EF282912922]) [    ] o.a.s.c.c.ConnectionManager Client is connected to ZooKeeper
   [junit4]   2> 1963958 INFO  (TEST-CollectionsAPIDistributedZkTest.test-seed#[95EB1EF282912922]) [    ] o.a.s.c.c.SolrZkClient Using default ZkACLProvider
   [junit4]   2> 1963964 INFO  (TEST-CollectionsAPIDistributedZkTest.test-seed#[95EB1EF282912922]) [    ] o.a.s.s.SolrDispatchFilter Loading solr.xml from SolrHome (not found in ZooKeeper)
   [junit4]   2> 1963964 INFO  (TEST-CollectionsAPIDistributedZkTest.test-seed#[95EB1EF282912922]) [    ] o.a.s.c.SolrXmlConfig Loading container configuration from /x1/jenkins/jenkins-slave/workspace/Lucene-Solr-NightlyTests-5.x/solr/build/solr-core/test/J1/temp/solr.cloud.CollectionsAPIDistributedZkTest_95EB1EF282912922-001/control-001/solr.xml
   [junit4]   2> 1963981 INFO  (TEST-CollectionsAPIDistributedZkTest.test-seed#[95EB1EF282912922]) [    ] o.a.s.c.CorePropertiesLocator Config-defined core root directory: /x1/jenkins/jenkins-slave/workspace/Lucene-Solr-NightlyTests-5.x/solr/build/solr-core/test/J1/temp/solr.cloud.CollectionsAPIDistributedZkTest_95EB1EF282912922-001/control-001/cores
   [junit4]   2> 1963981 INFO  (TEST-CollectionsAPIDistributedZkTest.test-seed#[95EB1EF282912922]) [    ] o.a.s.c.CoreContainer New CoreContainer 1846390021
   [junit4]   2> 1963981 INFO  (TEST-CollectionsAPIDistributedZkTest.test-seed#[95EB1EF282912922]) [    ] o.a.s.c.CoreContainer Loading cores into CoreContainer [instanceDir=/x1/jenkins/jenkins-slave/workspace/Lucene-Solr-NightlyTests-5.x/solr/build/solr-core/test/J1/temp/solr.cloud.CollectionsAPIDistributedZkTest_95EB1EF282912922-001/control-001]
   [junit4]   2> 1963982 WARN  (TEST-CollectionsAPIDistributedZkTest.test-seed#[95EB1EF282912922]) [    ] o.a.s.c.CoreContainer Couldn't add files from /x1/jenkins/jenkins-slave/workspace/Lucene-Solr-NightlyTests-5.x/solr/build/solr-core/test/J1/temp/solr.cloud.CollectionsAPIDistributedZkTest_95EB1EF282912922-001/control-001/lib to classpath: /x1/jenkins/jenkins-slave/workspace/Lucene-Solr-NightlyTests-5.x/solr/build/solr-core/test/J1/temp/solr.cloud.CollectionsAPIDistributedZkTest_95EB1EF282912922-001/control-001/lib
   [junit4]   2> 1963983 INFO  (TEST-CollectionsAPIDistributedZkTest.test-seed#[95EB1EF282912922]) [    ] o.a.s.h.c.HttpShardHandlerFactory created with socketTimeout : 90000,urlScheme : ,connTimeout : 15000,maxConnectionsPerHost : 20,maxConnections : 10000,corePoolSize : 0,maximumPoolSize : 2147483647,maxThreadIdleTime : 5,sizeOfQueue : -1,fairnessPolicy : false,useRetries : false,
   [junit4]   2> 1963986 INFO  (TEST-CollectionsAPIDistributedZkTest.test-seed#[95EB1EF282912922]) [    ] o.a.s.u.UpdateShardHandler Creating UpdateShardHandler HTTP client with params: socketTimeout=340000&connTimeout=45000&retry=true
   [junit4]   2> 1963987 INFO  (TEST-CollectionsAPIDistributedZkTest.test-seed#[95EB1EF282912922]) [    ] o.a.s.l.LogWatcher SLF4J impl is org.slf4j.impl.Log4jLoggerFactory
   [junit4]   2> 1963987 INFO  (TEST-CollectionsAPIDistributedZkTest.test-seed#[95EB1EF282912922]) [    ] o.a.s.l.LogWatcher Registering Log Listener [Log4j (org.slf4j.impl.Log4jLoggerFactory)]
   [junit4]   2> 1963988 INFO  (TEST-CollectionsAPIDistributedZkTest.test-seed#[95EB1EF282912922]) [    ] o.a.s.c.ZkContainer Zookeeper client=127.0.0.1:56217/solr
   [junit4]   2> 1963988 INFO  (TEST-CollectionsAPIDistributedZkTest.test-seed#[95EB1EF282912922]) [    ] o.a.s.c.ZkController zkHost includes chroot
   [junit4]   2> 1963988 INFO  (TEST-CollectionsAPIDistributedZkTest.test-seed#[95EB1EF282912922]) [    ] o.a.s.c.c.SolrZkClient Using default ZkCredentialsProvider
   [junit4]   2> 1963988 INFO  (TEST-CollectionsAPIDistributedZkTest.test-seed#[95EB1EF282912922]) [    ] o.a.s.c.c.ConnectionManager Waiting for client to connect to ZooKeeper
   [junit4]   2> 1963990 INFO  (zkCallback-914-thread-1) [    ] o.a.s.c.c.ConnectionManager Watcher org.apache.solr.common.cloud.ConnectionManager@12bbc73c name:ZooKeeperConnection Watcher:127.0.0.1:56217 got event WatchedEvent state:SyncConnected type:None path:null path:null type:None
   [junit4]   2> 1963990 INFO  (TEST-CollectionsAPIDistributedZkTest.test-seed#[95EB1EF282912922]) [    ] o.a.s.c.c.ConnectionManager Client is connected to ZooKeeper
   [junit4]   2> 1963991 INFO  (TEST-CollectionsAPIDistributedZkTest.test-seed#[95EB1EF282912922]) [    ] o.a.s.c.c.SolrZkClient Using default ZkACLProvider
   [junit4]   2> 1963995 INFO  (TEST-CollectionsAPIDistributedZkTest.test-seed#[95EB1EF282912922]) [n:127.0.0.1:55461_i_q%2Fp    ] o.a.s.c.c.ConnectionManager Waiting for client to connect to ZooKeeper
   [junit4]   2> 1963998 INFO  (zkCallback-915-thread-1-processing-n:127.0.0.1:55461_i_q%2Fp) [n:127.0.0.1:55461_i_q%2Fp    ] o.a.s.c.c.ConnectionManager Watcher org.apache.solr.common.cloud.ConnectionManager@2b2c03d0 name:ZooKeeperConnection Watcher:127.0.0.1:56217/solr got event WatchedEvent state:SyncConnected type:None path:null path:null type:None
   [junit4]   2> 1963998 INFO  (TEST-CollectionsAPIDistributedZkTest.test-seed#[95EB1EF282912922]) [n:127.0.0.1:55461_i_q%2Fp    ] o.a.s.c.c.ConnectionManager Client is connected to ZooKeeper
   [junit4]   2> 1964000 INFO  (TEST-CollectionsAPIDistributedZkTest.test-seed#[95EB1EF282912922]) [n:127.0.0.1:55461_i_q%2Fp    ] o.a.s.c.c.SolrZkClient makePath: /overseer/queue
   [junit4]   2> 1964007 INFO  (TEST-CollectionsAPIDistributedZkTest.test-seed#[95EB1EF282912922]) [n:127.0.0.1:55461_i_q%2Fp    ] o.a.s.c.c.SolrZkClient makePath: /overseer/collection-queue-work
   [junit4]   2> 1964011 INFO  (TEST-CollectionsAPIDistributedZkTest.test-seed#[95EB1EF282912922]) [n:127.0.0.1:55461_i_q%2Fp    ] o.a.s.c.c.SolrZkClient makePath: /overseer/collection-map-running
   [junit4]   2> 1964014 INFO  (TEST-CollectionsAPIDistributedZkTest.test-seed#[95EB1EF282912922]) [n:127.0.0.1:55461_i_q%2Fp    ] o.a.s.c.c.SolrZkClient makePath: /overseer/collection-map-completed
   [junit4]   2> 1964021 INFO  (TEST-CollectionsAPIDistributedZkTest.test-seed#[95EB1EF282912922]) [n:127.0.0.1:55461_i_q%2Fp    ] o.a.s.c.c.SolrZkClient makePath: /overseer/collection-map-failure
   [junit4]   2> 1964025 INFO  (TEST-CollectionsAPIDistributedZkTest.test-seed#[95EB1EF282912922]) [n:127.0.0.1:55461_i_q%2Fp    ] o.a.s.c.c.SolrZkClient makePath: /live_nodes
   [junit4]   2> 1964029 INFO  (TEST-CollectionsAPIDistributedZkTest.test-seed#[95EB1EF282912922]) [n:127.0.0.1:55461_i_q%2Fp    ] o.a.s.c.c.SolrZkClient makePath: /aliases.json
   [junit4]   2> 1964031 INFO  (TEST-CollectionsAPIDistributedZkTest.test-seed#[95EB1EF282912922]) [n:127.0.0.1:55461_i_q%2Fp    ] o.a.s.c.c.SolrZkClient makePath: /clusterstate.json
   [junit4]   2> 1964032 INFO  (TEST-CollectionsAPIDistributedZkTest.test-seed#[95EB1EF282912922]) [n:127.0.0.1:55461_i_q%2Fp    ] o.a.s.c.c.SolrZkClient makePath: /security.json
   [junit4]   2> 1964033 INFO  (TEST-CollectionsAPIDistributedZkTest.test-seed#[95EB1EF282912922]) [n:127.0.0.1:55461_i_q%2Fp    ] o.a.s.c.ZkController Register node as live in ZooKeeper:/live_nodes/127.0.0.1:55461_i_q%2Fp
   [junit4]   2> 1964034 INFO  (TEST-CollectionsAPIDistributedZkTest.test-seed#[95EB1EF282912922]) [n:127.0.0.1:55461_i_q%2Fp    ] o.a.s.c.c.SolrZkClient makePath: /live_nodes/127.0.0.1:55461_i_q%2Fp
   [junit4]   2> 1964037 INFO  (TEST-CollectionsAPIDistributedZkTest.test-seed#[95EB1EF282912922]) [n:127.0.0.1:55461_i_q%2Fp    ] o.a.s.c.c.SolrZkClient makePath: /overseer_elect
   [junit4]   2> 1964039 INFO  (TEST-CollectionsAPIDistributedZkTest.test-seed#[95EB1EF282912922]) [n:127.0.0.1:55461_i_q%2Fp    ] o.a.s.c.c.SolrZkClient makePath: /overseer_elect/election
   [junit4]   2> 1964042 INFO  (TEST-CollectionsAPIDistributedZkTest.test-seed#[95EB1EF282912922]) [n:127.0.0.1:55461_i_q%2Fp    ] o.a.s.c.Overseer Overseer (id=null) closing
   [junit4]   2> 1964043 INFO  (TEST-CollectionsAPIDistributedZkTest.test-seed#[95EB1EF282912922]) [n:127.0.0.1:55461_i_q%2Fp    ] o.a.s.c.LeaderElector Joined leadership election with path: /overseer_elect/election/95203506598772741-127.0.0.1:55461_i_q%2Fp-n_0000000000
   [junit4]   2> 1964043 INFO  (TEST-CollectionsAPIDistributedZkTest.test-seed#[95EB1EF282912922]) [n:127.0.0.1:55461_i_q%2Fp    ] o.a.s.c.OverseerElectionContext I am going to be the leader 127.0.0.1:55461_i_q%2Fp
   [junit4]   2> 1964043 INFO  (TEST-CollectionsAPIDistributedZkTest.test-seed#[95EB1EF282912922]) [n:127.0.0.1:55461_i_q%2Fp    ] o.a.s.c.c.SolrZkClient makePath: /overseer_elect/leader
   [junit4]   2> 1964047 INFO  (TEST-CollectionsAPIDistributedZkTest.test-seed#[95EB1EF282912922]) [n:127.0.0.1:55461_i_q%2Fp    ] o.a.s.c.Overseer Overseer (id=95203506598772741-127.0.0.1:55461_i_q%2Fp-n_0000000000) starting
   [junit4]   2> 1964050 INFO  (TEST-CollectionsAPIDistributedZkTest.test-seed#[95EB1EF282912922]) [n:127.0.0.1:55461_i_q%2Fp    ] o.a.s.c.c.SolrZkClient makePath: /overseer/queue-work
   [junit4]   2> 1964062 INFO  (TEST-CollectionsAPIDistributedZkTest.test-seed#[95EB1EF282912922]) [n:127.0.0.1:55461_i_q%2Fp    ] o.a.s.c.OverseerAutoReplicaFailoverThread Starting OverseerAutoReplicaFailoverThread autoReplicaFailoverWorkLoopDelay=10000 autoReplicaFailoverWaitAfterExpiration=10000 autoReplicaFailoverBadNodeExpiration=60000
   [junit4]   2> 1964063 INFO  (TEST-CollectionsAPIDistributedZkTest.test-seed#[95EB1EF282912922]) [n:127.0.0.1:55461_i_q%2Fp    ] o.a.s.c.c.ZkStateReader Updating cluster state from ZooKeeper... 
   [junit4]   2> 1964063 INFO  (OverseerCollectionConfigSetProcessor-95203506598772741-127.0.0.1:55461_i_q%2Fp-n_0000000000) [n:127.0.0.1:55461_i_q%2Fp    ] o.a.s.c.OverseerTaskProcessor Process current queue of overseer operations
   [junit4]   2> 1964064 INFO  (OverseerStateUpdate-95203506598772741-127.0.0.1:55461_i_q%2Fp-n_0000000000) [n:127.0.0.1:55461_i_q%2Fp    ] o.a.s.c.Overseer Starting to work on the main queue
   [junit4]   2> 1964087 INFO  (TEST-CollectionsAPIDistributedZkTest.test-seed#[95EB1EF282912922]) [n:127.0.0.1:55461_i_q%2Fp    ] o.a.s.c.CoreContainer Security conf doesn't exist. Skipping setup for authorization module.
   [junit4]   2> 1964087 INFO  (TEST-CollectionsAPIDistributedZkTest.test-seed#[95EB1EF282912922]) [n:127.0.0.1:55461_i_q%2Fp    ] o.a.s.c.CoreContainer No authentication plugin used.
   [junit4]   2> 1964089 INFO  (TEST-CollectionsAPIDistributedZkTest.test-seed#[95EB1EF282912922]) [n:127.0.0.1:55461_i_q%2Fp    ] o.a.s.c.CorePropertiesLocator Looking for core definitions underneath /x1/jenkins/jenkins-slave/workspace/Lucene-Solr-NightlyTests-5.x/solr/build/solr-core/test/J1/temp/solr.cloud.CollectionsAPIDistributedZkTest_95EB1EF282912922-001/control-001/cores
   [junit4]   2> 1964090 INFO  (TEST-CollectionsAPIDistributedZkTest.test-seed#[95EB1EF282912922]) [n:127.0.0.1:55461_i_q%2Fp    ] o.a.s.c.CoreDescriptor Created CoreDescriptor: {coreNodeName=, collection=control_collection, loadOnStartup=true, transient=false, dataDir=data/, schema=schema.xml, configSetProperties=configsetprops.json, config=solrconfig.xml, shard=, name=collection1}
   [junit4]   2> 1964090 INFO  (TEST-CollectionsAPIDistributedZkTest.test-seed#[95EB1EF282912922]) [n:127.0.0.1:55461_i_q%2Fp    ] o.a.s.c.CorePropertiesLocator Found core collection1 in /x1/jenkins/jenkins-slave/workspace/Lucene-Solr-NightlyTests-5.x/solr/build/solr-core/test/J1/temp/solr.cloud.CollectionsAPIDistributedZkTest_95EB1EF282912922-001/control-001/cores/collection1
   [junit4]   2> 1964090 INFO  (TEST-CollectionsAPIDistributedZkTest.test-seed#[95EB1EF282912922]) [n:127.0.0.1:55461_i_q%2Fp    ] o.a.s.c.CorePropertiesLocator Found 1 core definitions
   [junit4]   2> 1964093 INFO  (coreLoadExecutor-2630-thread-1-processing-n:127.0.0.1:55461_i_q%2Fp) [n:127.0.0.1:55461_i_q%2Fp c:control_collection   x:collection1] o.a.s.c.ZkController publishing state=down
   [junit4]   2> 1964093 INFO  (coreLoadExecutor-2630-thread-1-processing-n:127.0.0.1:55461_i_q%2Fp) [n:127.0.0.1:55461_i_q%2Fp c:control_collection   x:collection1] o.a.s.c.ZkController numShards not found on descriptor - reading it from system property
   [junit4]   2> 1964096 INFO  (TEST-CollectionsAPIDistributedZkTest.test-seed#[95EB1EF282912922]) [n:127.0.0.1:55461_i_q%2Fp    ] o.a.s.s.SolrDispatchFilter user.dir=/x1/jenkins/jenkins-slave/workspace/Lucene-Solr-NightlyTests-5.x/solr/build/solr-core/test/J1
   [junit4]   2> 1964096 INFO  (TEST-CollectionsAPIDistributedZkTest.test-seed#[95EB1EF282912922]) [n:127.0.0.1:55461_i_q%2Fp    ] o.a.s.s.SolrDispatchFilter SolrDispatchFilter.init() done
   [junit4]   2> 1964097 INFO  (coreLoadExecutor-2630-thread-1-processing-n:127.0.0.1:55461_i_q%2Fp) [n:127.0.0.1:55461_i_q%2Fp c:control_collection   x:collection1] o.a.s.c.ZkController look for our core node name
   [junit4]   2> 1964098 INFO  (OverseerStateUpdate-95203506598772741-127.0.0.1:55461_i_q%2Fp-n_0000000000) [n:127.0.0.1:55461_i_q%2Fp    ] o.a.s.c.Overseer processMessage: queueSize: 1, message = {
   [junit4]   2>   "collection":"control_collection",
   [junit4]   2>   "state":"down",
   [junit4]   2>   "base_url":"https://127.0.0.1:55461/i_q/p",
   [junit4]   2>   "shard":null,
   [junit4]   2>   "node_name":"127.0.0.1:55461_i_q%2Fp",
   [junit4]   2>   "core":"collection1",
   [junit4]   2>   "operation":"state",
   [junit4]   2>   "roles":null,
   [junit4]   2>   "numShards":"1"} current state version: 0
   [junit4]   2> 1964100 INFO  (OverseerStateUpdate-95203506598772741-127.0.0.1:55461_i_q%2Fp-n_0000000000) [n:127.0.0.1:55461_i_q%2Fp    ] o.a.s.c.o.ReplicaMutator Update state numShards=1 message={
   [junit4]   2>   "collection":"control_collection",
   [junit4]   2>   "state":"down",
   [junit4]   2>   "base_url":"https://127.0.0.1:55461/i_q/p",
   [junit4]   2>   "shard":null,
   [junit4]   2>   "node_name":"127.0.0.1:55461_i_q%2Fp",
   [junit4]   2>   "core":"collection1",
   [junit4]   2>   "operation":"state",
   [junit4]   2>   "roles":null,
   [junit4]   2>   "numShards":"1"}
   [junit4]   2> 1964101 INFO  (OverseerStateUpdate-95203506598772741-127.0.0.1:55461_i_q%2Fp-n_0000000000) [n:127.0.0.1:55461_i_q%2Fp    ] o.a.s.c.o.ClusterStateMutator building a new cName: control_collection
   [junit4]   2> 1964101 INFO  (OverseerStateUpdate-95203506598772741-127.0.0.1:55461_i_q%2Fp-n_0000000000) [n:127.0.0.1:55461_i_q%2Fp    ] o.a.s.c.o.ReplicaMutator Assigning new node to shard shard=shard1
   [junit4]   2> 1964104 INFO  (zkCallback-915-thread-1-processing-n:127.0.0.1:55461_i_q%2Fp) [n:127.0.0.1:55461_i_q%2Fp    ] o.a.s.c.c.ZkStateReader A cluster state change: [WatchedEvent state:SyncConnected type:NodeDataChanged path:/clusterstate.json], has occurred - updating... (live nodes size: [1])
   [junit4]   2> 1965098 INFO  (coreLoadExecutor-2630-thread-1-processing-n:127.0.0.1:55461_i_q%2Fp) [n:127.0.0.1:55461_i_q%2Fp c:control_collection   x:collection1] o.a.s.c.ZkController waiting to find shard id in clusterstate for collection1
   [junit4]   2> 1965098 INFO  (coreLoadExecutor-2630-thread-1-processing-n:127.0.0.1:55461_i_q%2Fp) [n:127.0.0.1:55461_i_q%2Fp c:control_collection   x:collection1] o.a.s.c.ZkController Check for collection zkNode:control_collection
   [junit4]   2> 1965099 INFO  (coreLoadExecutor-2630-thread-1-processing-n:127.0.0.1:55461_i_q%2Fp) [n:127.0.0.1:55461_i_q%2Fp c:control_collection   x:collection1] o.a.s.c.ZkController Collection zkNode exists
   [junit4]   2> 1965099 INFO  (coreLoadExecutor-2630-thread-1-processing-n:127.0.0.1:55461_i_q%2Fp) [n:127.0.0.1:55461_i_q%2Fp c:control_collection   x:collection1] o.a.s.c.c.ZkStateReader Load collection config from: [/collections/control_collection]
   [junit4]   2> 1965100 INFO  (coreLoadExecutor-2630-thread-1-processing-n:127.0.0.1:55461_i_q%2Fp) [n:127.0.0.1:55461_i_q%2Fp c:control_collection   x:collection1] o.a.s.c.c.ZkStateReader path=[/collections/control_collection] [configName]=[conf1] specified config exists in ZooKeeper
   [junit4]   2> 1965100 INFO  (coreLoadExecutor-2630-thread-1-processing-n:127.0.0.1:55461_i_q%2Fp) [n:127.0.0.1:55461_i_q%2Fp c:control_collection   x:collection1] o.a.s.c.SolrResourceLoader new SolrResourceLoader for directory: '/x1/jenkins/jenkins-slave/workspace/Lucene-Solr-NightlyTests-5.x/solr/build/solr-core/test/J1/temp/solr.cloud.CollectionsAPIDistributedZkTest_95EB1EF282912922-001/control-001/cores/collection1'
   [junit4]   2> 1965100 INFO  (coreLoadExecutor-2630-thread-1-processing-n:127.0.0.1:55461_i_q%2Fp) [n:127.0.0.1:55461_i_q%2Fp c:control_collection   x:collection1] o.a.s.c.SolrResourceLoader JNDI not configured for solr (NoInitialContextEx)
   [junit4]   2> 1965100 INFO  (coreLoadExecutor-2630-thread-1-processing-n:127.0.0.1:55461_i_q%2Fp) [n:127.0.0.1:55461_i_q%2Fp c:control_collection   x:collection1] o.a.s.c.SolrResourceLoader solr home defaulted to 'solr/' (could not find system property or JNDI)
   [junit4]   2> 1965103 INFO  (coreLoadExecutor-2630-thread-1-processing-n:127.0.0.1:55461_i_q%2Fp) [n:127.0.0.1:55461_i_q%2Fp c:control_collection   x:collection1] o.a.s.c.Config loaded config solrconfig.xml with version 0 
   [junit4]   2> 1965112 INFO  (coreLoadExecutor-2630-thread-1-processing-n:127.0.0.1:55461_i_q%2Fp) [n:127.0.0.1:55461_i_q%2Fp c:control_collection   x:collection1] o.a.s.c.SolrConfig current version of requestparams : -1
   [junit4]   2> 1965143 INFO  (coreLoadExecutor-2630-thread-1-processing-n:127.0.0.1:55461_i_q%2Fp) [n:127.0.0.1:55461_i_q%2Fp c:control_collection   x:collection1] o.a.s.c.SolrConfig Using Lucene MatchVersion: 5.5.0
   [junit4]   2> 1965173 INFO  (coreLoadExecutor-2630-thread-1-processing-n:127.0.0.1:55461_i_q%2Fp) [n:127.0.0.1:55461_i_q%2Fp c:control_collection   x:collection1] o.a.s.c.SolrConfig Loaded SolrConfig: solrconfig.xml
   [junit4]   2> 1965181 INFO  (coreLoadExecutor-2630-thread-1-processing-n:127.0.0.1:55461_i_q%2Fp) [n:127.0.0.1:55461_i_q%2Fp c:control_collection   x:collection1] o.a.s.s.IndexSchema [collection1] Schema name=test
   [junit4]   2> 1965499 INFO  (coreLoadExecutor-2630-thread-1-processing-n:127.0.0.1:55461_i_q%2Fp) [n:127.0.0.1:55461_i_q%2Fp c:control_collection   x:collection1] o.a.s.s.OpenExchangeRatesOrgProvider Initialized with rates=open-exchange-rates.json, refreshInterval=1440.
   [junit4]   2> 1965519 INFO  (coreLoadExecutor-2630-thread-1-processing-n:127.0.0.1:55461_i_q%2Fp) [n:127.0.0.1:55461_i_q%2Fp c:control_collection   x:collection1] o.a.s.s.IndexSchema default search field in schema is text
   [junit4]   2> 1965521 INFO  (coreLoadExecutor-2630-thread-1-processing-n:127.0.0.1:55461_i_q%2Fp) [n:127.0.0.1:55461_i_q%2Fp c:control_collection   x:collection1] o.a.s.s.IndexSchema unique key field: id
   [junit4]   2> 1965539 INFO  (coreLoadExecutor-2630-thread-1-processing-n:127.0.0.1:55461_i_q%2Fp) [n:127.0.0.1:55461_i_q%2Fp c:control_collection   x:collection1] o.a.s.s.FileExchangeRateProvider Reloading exchange rates from file currency.xml
   [junit4]   2> 1965543 INFO  (coreLoadExecutor-2630-thread-1-processing-n:127.0.0.1:55461_i_q%2Fp) [n:127.0.0.1:55461_i_q%2Fp c:control_collection   x:collection1] o.a.s.s.FileExchangeRateProvider Reloading exchange rates from file currency.xml
   [junit4]   2> 1965546 INFO  (coreLoadExecutor-2630-thread-1-processing-n:127.0.0.1:55461_i_q%2Fp) [n:127.0.0.1:55461_i_q%2Fp c:control_collection   x:collection1] o.a.s.s.OpenExchangeRatesOrgProvider Reloading exchange rates from open-exchange-rates.json
   [junit4]   2> 1965547 INFO  (coreLoadExecutor-2630-thread-1-processing-n:127.0.0.1:55461_i_q%2Fp) [n:127.0.0.1:55461_i_q%2Fp c:control_collection   x:collection1] o.a.s.s.OpenExchangeRatesOrgProvider Reloading exchange rates from open-exchange-rates.json
   [junit4]   2> 1965549 INFO  (coreLoadExecutor-2630-thread-1-processing-n:127.0.0.1:55461_i_q%2Fp) [n:127.0.0.1:55461_i_q%2Fp c:control_collection   x:collection1] o.a.s.c.ConfigSetProperties Did not find ConfigSet properties, assuming default properties: Can't find resource 'configsetprops.json' in classpath or '/configs/conf1', cwd=/x1/jenkins/jenkins-slave/workspace/Lucene-Solr-NightlyTests-5.x/solr/build/solr-core/test/J1
   [junit4]   2> 1965549 INFO  (coreLoadExecutor-2630-thread-1-processing-n:127.0.0.1:55461_i_q%2Fp) [n:127.0.0.1:55461_i_q%2Fp c:control_collection   x:collection1] o.a.s.c.CoreContainer Creating SolrCore 'collection1' using configuration from collection control_collection
   [junit4]   2> 1965549 INFO  (coreLoadExecutor-2630-thread-1-processing-n:127.0.0.1:55461_i_q%2Fp) [n:127.0.0.1:55461_i_q%2Fp c:control_collection s:shard1 r:core_node1 x:collection1] o.a.s.c.SolrCore org.apache.solr.core.MockDirectoryFactory
   [junit4]   2> 1965549 INFO  (coreLoadExecutor-2630-thread-1-processing-n:127.0.0.1:55461_i_q%2Fp) [n:127.0.0.1:55461_i_q%2Fp c:control_collection s:shard1 r:core_node1 x:collection1] o.a.s.c.SolrCore [[collection1] ] Opening new SolrCore at [/x1/jenkins/jenkins-slave/workspace/Lucene-Solr-NightlyTests-5.x/solr/build/solr-core/test/J1/temp/solr.cloud.CollectionsAPIDistributedZkTest_95EB1EF282912922-001/control-001/cores/collection1], dataDir=[/x1/jenkins/jenkins-slave/workspace/Lucene-Solr-NightlyTests-5.x/solr/build/solr-core/test/J1/temp/solr.cloud.CollectionsAPIDistributedZkTest_95EB1EF282912922-001/control-001/cores/collection1/data/]
   [junit4]   2> 1965550 INFO  (coreLoadExecutor-2630-thread-1-processing-n:127.0.0.1:55461_i_q%2Fp) [n:127.0.0.1:55461_i_q%2Fp c:control_collection s:shard1 r:core_node1 x:collection1] o.a.s.c.JmxMonitoredMap JMX monitoring is enabled. Adding Solr mbeans to JMX Server: com.sun.jmx.mbeanserver.JmxMBeanServer@385e0377
   [junit4]   2> 1965550 INFO  (coreLoadExecutor-2630-thread-1-processing-n:127.0.0.1:55461_i_q%2Fp) [n:127.0.0.1:55461_i_q%2Fp c:control_collection s:shard1 r:core_node1 x:collection1] o.a.s.c.CachingDirectoryFactory return new directory for /x1/jenkins/jenkins-slave/workspace/Lucene-Solr-NightlyTests-5.x/solr/build/solr-core/test/J1/temp/solr.cloud.CollectionsAPIDistributedZkTest_95EB1EF282912922-001/control-001/cores/collection1/data
   [junit4]   2> 1965550 INFO  (coreLoadExecutor-2630-thread-1-processing-n:127.0.0.1:55461_i_q%2Fp) [n:127.0.0.1:55461_i_q%2Fp c:control_collection s:shard1 r:core_node1 x:collection1] o.a.s.c.SolrCore New index directory detected: old=null new=/x1/jenkins/jenkins-slave/workspace/Lucene-Solr-NightlyTests-5.x/solr/build/solr-core/test/J1/temp/solr.cloud.CollectionsAPIDistributedZkTest_95EB1EF282912922-001/control-001/cores/collection1/data/index/
   [junit4]   2> 1965551 WARN  (coreLoadExecutor-2630-thread-1-processing-n:127.0.0.1:55461_i_q%2Fp) [n:127.0.0.1:55461_i_q%2Fp c:control_collection s:shard1 r:core_node1 x:collection1] o.a.s.c.SolrCore [collection1] Solr index directory '/x1/jenkins/jenkins-slave/workspace/Lucene-Solr-NightlyTests-5.x/solr/build/solr-core/test/J1/temp/solr.cloud.CollectionsAPIDistributedZkTest_95EB1EF282912922-001/control-001/cores/collection1/data/index' doesn't exist. Creating new index...
   [junit4]   2> 1965551 INFO  (coreLoadExecutor-2630-thread-1-processing-n:127.0.0.1:55461_i_q%2Fp) [n:127.0.0.1:55461_i_q%2Fp c:control_collection s:shard1 r:core_node1 x:collection1] o.a.s.c.CachingDirectoryFactory return new directory for /x1/jenkins/jenkins-slave/workspace/Lucene-Solr-NightlyTests-5.x/solr/build/solr-core/test/J1/temp/solr.cloud.CollectionsAPIDistributedZkTest_95EB1EF282912922-001/control-001/cores/collection1/data/index
   [junit4]   2> 1965551 INFO  (coreLoadExecutor-2630-thread-1-processing-n:127.0.0.1:55461_i_q%2Fp) [n:127.0.0.1:55461_i_q%2Fp c:control_collection s:shard1 r:core_node1 x:collection1] o.a.s.u.RandomMergePolicy RandomMergePolicy wrapping class org.apache.lucene.index.TieredMergePolicy: [TieredMergePolicy: maxMergeAtOnce=49, maxMergeAtOnceExplicit=25, maxMergedSegmentMB=0.9697265625, floorSegmentMB=0.720703125, forceMergeDeletesPctAllowed=20.70119545137434, segmentsPerTier=47.0, maxCFSSegmentSizeMB=8.796093022207999E12, noCFSRatio=0.850076328410624
   [junit4]   2> 1965554 INFO  (coreLoadExecutor-2630-thread-1-processing-n:127.0.0.1:55461_i_q%2Fp) [n:127.0.0.1:55461_i_q%2Fp c:control_collection s:shard1 r:core_node1 x:collection1] o.a.s.c.SolrDeletionPolicy SolrDeletionPolicy.onCommit: commits: num=1
   [junit4]   2> 	commit{dir=MockDirectoryWrapper(SimpleFSDirectory@/x1/jenkins/jenkins-slave/workspace/Lucene-Solr-NightlyTests-5.x/solr/build/solr-core/test/J1/temp/solr.cloud.CollectionsAPIDistributedZkTest_95EB1EF282912922-001/index-SimpleFSDirectory-001 lockFactory=org.apache.lucene.store.NativeFSLockFactory@1ba52c2a),segFN=segments_1,generation=1}
   [junit4]   2> 1965555 INFO  (coreLoadExecutor-2630-thread-1-processing-n:127.0.0.1:55461_i_q%2Fp) [n:127.0.0.1:55461_i_q%2Fp c:control_collection s:shard1 r:core_node1 x:collection1] o.a.s.c.SolrDeletionPolicy newest commit generation = 1
   [junit4]   2> 1965559 INFO  (coreLoadExecutor-2630-thread-1-processing-n:127.0.0.1:55461_i_q%2Fp) [n:127.0.0.1:55461_i_q%2Fp c:control_collection s:shard1 r:core_node1 x:collection1] o.a.s.u.p.UpdateRequestProcessorChain creating updateRequestProcessorChain "nodistrib"
   [junit4]   2> 1965559 INFO  (coreLoadExecutor-2630-thread-1-processing-n:127.0.0.1:55461_i_q%2Fp) [n:127.0.0.1:55461_i_q%2Fp c:control_collection s:shard1 r:core_node1 x:collection1] o.a.s.u.p.UpdateRequestProcessorChain creating updateRequestProcessorChain "dedupe"
   [junit4]   2> 1965560 INFO  (coreLoadExecutor-2630-thread-1-processing-n:127.0.0.1:55461_i_q%2Fp) [n:127.0.0.1:55461_i_q%2Fp c:control_collection s:shard1 r:core_node1 x:collection1] o.a.s.u.p.UpdateRequestProcessorChain inserting DistributedUpdateProcessorFactory into updateRequestProcessorChain "dedupe"
   [junit4]   2> 1965560 INFO  (coreLoadExecutor-2630-thread-1-processing-n:127.0.0.1:55461_i_q%2Fp) [n:127.0.0.1:55461_i_q%2Fp c:control_collection s:shard1 r:core_node1 x:collection1] o.a.s.u.p.UpdateRequestProcessorChain creating updateRequestProcessorChain "stored_sig"
   [junit4]   2> 1965560 INFO  (coreLoadExecutor-2630-thread-1-processing-n:127.0.0.1:55461_i_q%2Fp) [n:127.0.0.1:55461_i_q%2Fp c:control_collection s:shard1 r:core_node1 x:collection1] o.a.s.u.p.UpdateRequestProcessorChain inserting DistributedUpdateProcessorFactory into updateRequestProcessorChain "stored_sig"
   [junit4]   2> 1965560 INFO  (coreLoadExecutor-2630-thread-1-processing-n:127.0.0.1:55461_i_q%2Fp) [n:127.0.0.1:55461_i_q%2Fp c:control_collection s:shard1 r:core_node1 x:collection1] o.a.s.u.p.UpdateRequestProcessorChain creating updateRequestProcessorChain "distrib-dup-test-chain-explicit"
   [junit4]   2> 1965560 INFO  (coreLoadExecutor-2630-thread-1-processing-n:127.0.0.1:55461_i_q%2Fp) [n:127.0.0.1:55461_i_q%2Fp c:control_collection s:shard1 r:core_node1 x:collection1] o.a.s.u.p.UpdateRequestProcessorChain creating updateRequestProcessorChain "distrib-dup-test-chain-implicit"
   [junit4]   2> 1965560 INFO  (coreLoadExecutor-2630-thread-1-processing-n:127.0.0.1:55461_i_q%2Fp) [n:127.0.0.1:55461_i_q%2Fp c:control_collection s:shard1 r:core_node1 x:collection1] o.a.s.u.p.UpdateRequestProcessorChain inserting DistributedUpdateProcessorFactory into updateRequestProcessorChain "distrib-dup-test-chain-implicit"
   [junit4]   2> 1965560 INFO  (coreLoadExecutor-2630-thread-1-processing-n:127.0.0.1:55461_i_q%2Fp) [n:127.0.0.1:55461_i_q%2Fp c:control_collection s:shard1 r:core_node1 x:collection1] o.a.s.c.SolrCore no updateRequestProcessorChain defined as default, creating implicit default
   [junit4]   2> 1965560 WARN  (coreLoadExecutor-2630-thread-1-processing-n:127.0.0.1:55461_i_q%2Fp) [n:127.0.0.1:55461_i_q%2Fp c:control_collection s:shard1 r:core_node1 x:collection1] o.a.s.c.RequestHandlers INVALID paramSet a in requestHandler {type = requestHandler,name = /dump,class = DumpRequestHandler,args = {defaults={a=A,b=B}}}
   [junit4]   2> 1965562 INFO  (OldIndexDirectoryCleanupThreadForCore-collection1) [n:127.0.0.1:55461_i_q%2Fp c:control_collection s:shard1 r:core_node1 x:collection1] o.a.s.c.SolrCore Looking for old index directories to cleanup for core collection1 in /x1/jenkins/jenkins-slave/workspace/Lucene-Solr-NightlyTests-5.x/solr/build/solr-core/test/J1/temp/solr.cloud.CollectionsAPIDistributedZkTest_95EB1EF282912922-001/control-001/cores/collection1/data/
   [junit4]   2> 1965563 WARN  (OldIndexDirectoryCleanupThreadForCore-collection1) [n:127.0.0.1:55461_i_q%2Fp c:control_collection s:shard1 r:core_node1 x:collection1] o.a.s.c.DirectoryFactory /x1/jenkins/jenkins-slave/workspace/Lucene-Solr-NightlyTests-5.x/solr/build/solr-core/test/J1/temp/solr.cloud.CollectionsAPIDistributedZkTest_95EB1EF282912922-001/control-001/cores/collection1/data/ does not point to a valid data directory; skipping clean-up of old index directories.
   [junit4]   2> 1965564 INFO  (coreLoadExecutor-2630-thread-1-processing-n:127.0.0.1:55461_i_q%2Fp) [n:127.0.0.1:55461_i_q%2Fp c:control_collection s:shard1 r:core_node1 x:collection1] o.a.s.h.l.XMLLoader xsltCacheLifetimeSeconds=60
   [junit4]   2> 1965565 INFO  (coreLoadExecutor-2630-thread-1-processing-n:127.0.0.1:55461_i_q%2Fp) [n:127.0.0.1:55461_i_q%2Fp c:control_collection s:shard1 r:core_node1 x:collection1] o.a.s.h.l.XMLLoader xsltCacheLifetimeSeconds=60
   [junit4]   2> 1965567 INFO  (coreLoadExecutor-2630-thread-1-processing-n:127.0.0.1:55461_i_q%2Fp) [n:127.0.0.1:55461_i_q%2Fp c:control_collection s:shard1 r:core_node1 x:collection1] o.a.s.h.l.XMLLoader xsltCacheLifetimeSeconds=60
   [junit4]   2> 1965568 INFO  (coreLoadExecutor-2630-thread-1-processing-n:127.0.0.1:55461_i_q%2Fp) [n:127.0.0.1:55461_i_q%2Fp c:control_collection s:shard1 r:core_node1 x:collection1] o.a.s.h.l.XMLLoader xsltCacheLifetimeSeconds=60
   [junit4]   2> 1965572 INFO  (coreLoadExecutor-2630-thread-1-processing-n:127.0.0.1:55461_i_q%2Fp) [n:127.0.0.1:55461_i_q%2Fp c:control_collection s:shard1 r:core_node1 x:collection1] o.a.s.c.RequestHandlers Registered paths: /admin/threads,/update/json,/admin/luke,/replication,/dump,/get,standard,/admin/mbeans,/update/json/docs,/admin/properties,/admin/logging,/config,/admin/system,/admin/plugins,/update,/admin/file,/update/csv,/admin/segments,/admin/ping,/schema
   [junit4]   2> 1965573 INFO  (coreLoadExecutor-2630-thread-1-processing-n:127.0.0.1:55461_i_q%2Fp) [n:127.0.0.1:55461_i_q%2Fp c:control_collection s:shard1 r:core_node1 x:collection1] o.a.s.c.SolrCore Using default statsCache cache: org.apache.solr.search.stats.LocalStatsCache
   [junit4]   2> 1965574 INFO  (coreLoadExecutor-2630-thread-1-processing-n:127.0.0.1:55461_i_q%2Fp) [n:127.0.0.1:55461_i_q%2Fp c:control_collection s:shard1 r:core_node1 x:collection1] o.a.s.u.UpdateHandler Using UpdateLog implementation: org.apache.solr.update.UpdateLog
   [junit4]   2> 1965574 INFO  (coreLoadExecutor-2630-thread-1-processing-n:127.0.0.1:55461_i_q%2Fp) [n:127.0.0.1:55461_i_q%2Fp c:control_collection s:shard1 r:core_node1 x:collection1] o.a.s.u.UpdateLog Initializing UpdateLog: dataDir= defaultSyncLevel=FLUSH numRecordsToKeep=100 maxNumLogsToKeep=10 numVersionBuckets=65536
   [junit4]   2> 1965574 INFO  (coreLoadExecutor-2630-thread-1-processing-n:127.0.0.1:55461_i_q%2Fp) [n:127.0.0.1:55461_i_q%2Fp c:control_collection s:shard1 r:core_node1 x:collection1] o.a.s.u.CommitTracker Hard AutoCommit: disabled
   [junit4]   2> 1965574 INFO  (coreLoadExecutor-2630-thread-1-processing-n:127.0.0.1:55461_i_q%2Fp) [n:127.0.0.1:55461_i_q%2Fp c:control_collection s:shard1 r:core_node1 x:collection1] o.a.s.u.CommitTracker Soft AutoCommit: disabled
   [junit4]   2> 1965575 INFO  (coreLoadExecutor-2630-thread-1-processing-n:127.0.0.1:55461_i_q%2Fp) [n:127.0.0.1:55461_i_q%2Fp c:control_collection s:shard1 r:core_node1 x:collection1] o.a.s.u.RandomMergePolicy RandomMergePolicy wrapping class org.apache.lucene.index.MockRandomMergePolicy: org.apache.lucene.index.MockRandomMergePolicy@1ee0bedb
   [junit4]   2> 1965576 INFO  (coreLoadExecutor-2630-thread-1-processing-n:127.0.0.1:55461_i_q%2Fp) [n:127.0.0.1:55461_i_q%2Fp c:control_collection s:shard1 r:core_node1 x:collection1] o.a.s.c.SolrDeletionPolicy SolrDeletionPolicy.onInit: commits: num=1
   [junit4]   2> 	commit{dir=MockDirectoryWrapper(SimpleFSDirectory@/x1/jenkins/jenkins-slave/workspace/Lucene-Solr-NightlyTests-5.x/solr/build/solr-core/test/J1/temp/solr.cloud.CollectionsAPIDistributedZkTest_95EB1EF282912922-001/index-SimpleFSDirectory-001 lockFactory=org.apache.lucene.store.NativeFSLockFactory@1ba52c2a),segFN=segments_1,generation=1}
   [junit4]   2> 1965576 INFO  (coreLoadExecutor-2630-thread-1-processing-n:127.0.0.1:55461_i_q%2Fp) [n:127.0.0.1:55461_i_q%2Fp c:control_collection s:shard1 r:core_node1 x:collection1] o.a.s.c.SolrDeletionPolicy newest commit generation = 1
   [junit4]   2> 1965576 INFO  (coreLoadExecutor-2630-thread-1-processing-n:127.0.0.1:55461_i_q%2Fp) [n:127.0.0.1:55461_i_q%2Fp c:control_collection s:shard1 r:core_node1 x:collection1] o.a.s.s.SolrIndexSearcher Opening Searcher@7abd564c[collection1] main
   [junit4]   2> 1965577 INFO  (coreLoadExecutor-2630-thread-1-processing-n:127.0.0.1:55461_i_q%2Fp) [n:127.0.0.1:55461_i_q%2Fp c:control_collection s:shard1 r:core_node1 x:collection1] o.a.s.c.c.ZkStateReader Load collection config from: [/collections/control_collection]
   [junit4]   2> 1965578 INFO  (coreLoadExecutor-2630-thread-1-processing-n:127.0.0.1:55461_i_q%2Fp) [n:127.0.0.1:55461_i_q%2Fp c:control_collection s:shard1 r:core_node1 x:collection1] o.a.s.c.c.ZkStateReader path=[/collections/control_collection] [configName]=[conf1] specified config exists in ZooKeeper
   [junit4]   2> 1965578 INFO  (coreLoadExecutor-2630-thread-1-processing-n:127.0.0.1:55461_i_q%2Fp) [n:127.0.0.1:55461_i_q%2Fp c:control_collection s:shard1 r:core_node1 x:collection1] o.a.s.r.ManagedResourceStorage Setting up ZooKeeper-based storage for the RestManager with znodeBase: /configs/conf1
   [junit4]   2> 1965578 INFO  (coreLoadExecutor-2630-thread-1-processing-n:127.0.0.1:55461_i_q%2Fp) [n:127.0.0.1:55461_i_q%2Fp c:control_collection s:shard1 r:core_node1 x:collection1] o.a.s.r.ManagedResourceStorage Configured ZooKeeperStorageIO with znodeBase: /configs/conf1
   [junit4]   2> 1965578 INFO  (coreLoadExecutor-2630-thread-1-processing-n:127.0.0.1:55461_i_q%2Fp) [n:127.0.0.1:55461_i_q%2Fp c:control_collection s:shard1 r:core_node1 x:collection1] o.a.s.r.RestManager Initializing RestManager with initArgs: {}
   [junit4]   2> 1965578 INFO  (coreLoadExecutor-2630-thread-1-processing-n:127.0.0.1:55461_i_q%2Fp) [n:127.0.0.1:55461_i_q%2Fp c:control_collection s:shard1 r:core_node1 x:collection1] o.a.s.r.ManagedResourceStorage Reading _rest_managed.json using ZooKeeperStorageIO:path=/configs/conf1
   [junit4]   2> 1965579 INFO  (coreLoadExecutor-2630-thread-1-processing-n:127.0.0.1:55461_i_q%2Fp) [n:127.0.0.1:55461_i_q%2Fp c:control_collection s:shard1 r:core_node1 x:collection1] o.a.s.r.ManagedResourceStorage No data found for znode /configs/conf1/_rest_managed.json
   [junit4]   2> 1965579 INFO  (coreLoadExecutor-2630-thread-1-processing-n:127.0.0.1:55461_i_q%2Fp) [n:127.0.0.1:55461_i_q%2Fp c:control_collection s:shard1 r:core_node1 x:collection1] o.a.s.r.ManagedResourceStorage Loaded null at path _rest_managed.json using ZooKeeperStorageIO:path=/configs/conf1
   [junit4]   2> 1965579 INFO  (coreLoadExecutor-2630-thread-1-processing-n:127.0.0.1:55461_i_q%2Fp) [n:127.0.0.1:55461_i_q%2Fp c:control_collection s:shard1 r:core_node1 x:collection1] o.a.s.r.RestManager Initializing 0 registered ManagedResources
   [junit4]   2> 1965579 INFO  (coreLoadExecutor-2630-thread-1-processing-n:127.0.0.1:55461_i_q%2Fp) [n:127.0.0.1:55461_i_q%2Fp c:control_collection s:shard1 r:core_node1 x:collection1] o.a.s.h.ReplicationHandler Commits will be reserved for  10000
   [junit4]   2> 1965579 INFO  (coreLoadExecutor-2630-thread-1-processing-n:127.0.0.1:55461_i_q%2Fp) [n:127.0.0.1:55461_i_q%2Fp c:control_collection s:shard1 r:core_node1 x:collection1] o.a.s.u.UpdateLog Looking up max value of version field to seed version buckets
   [junit4]   2> 1965579 INFO  (coreLoadExecutor-2630-thread-1-processing-n:127.0.0.1:55461_i_q%2Fp) [n:127.0.0.1:55461_i_q%2Fp c:control_collection s:shard1 r:core_node1 x:collection1] o.a.s.u.VersionInfo Refreshing highest value of _version_ for 65536 version buckets from index
   [junit4]   2> 1965579 INFO  (coreLoadExecutor-2630-thread-1-processing-n:127.0.0.1:55461_i_q%2Fp) [n:127.0.0.1:55461_i_q%2Fp c:control_collection s:shard1 r:core_node1 x:collection1] o.a.s.u.VersionInfo No terms found for _version_, cannot seed version bucket highest value from index
   [junit4]   2> 1965579 INFO  (coreLoadExecutor-2630-thread-1-processing-n:127.0.0.1:55461_i_q%2Fp) [n:127.0.0.1:55461_i_q%2Fp c:control_collection s:shard1 r:core_node1 x:collection1] o.a.s.u.UpdateLog Could not find max version in index or recent updates, using new clock 1523256107992088576
   [junit4]   2> 1965580 INFO  (searcherExecutor-2631-thread-1-processing-c:control_collection s:shard1 x:collection1 n:127.0.0.1:55461_i_q%2Fp r:core_node1) [n:127.0.0.1:55461_i_q%2Fp c:control_collection s:shard1 r:core_node1 x:collection1] o.a.s.c.SolrCore [collection1] Registered new searcher Searcher@7abd564c[collection1] main{ExitableDirectoryReader(UninvertingDirectoryReader())}
   [junit4]   2> 1965582 INFO  (coreLoadExecutor-2630-thread-1-processing-n:127.0.0.1:55461_i_q%2Fp) [n:127.0.0.1:55461_i_q%2Fp c:control_collection s:shard1 r:core_node1 x:collection1] o.a.s.u.UpdateLog Took 2.0ms to seed version buckets with highest version 1523256107992088576
   [junit4]   2> 1965582 INFO  (coreLoadExecutor-2630-thread-1-processing-n:127.0.0.1:55461_i_q%2Fp) [n:127.0.0.1:55461_i_q%2Fp c:control_collection s:shard1 r:core_node1 x:collection1] o.a.s.c.ZkController watch zkdir /configs/conf1
   [junit4]   2> 1965583 INFO  (coreLoadExecutor-2630-thread-1-processing-n:127.0.0.1:55461_i_q%2Fp) [n:127.0.0.1:55461_i_q%2Fp c:control_collection s:shard1 r:core_node1 x:collection1] o.a.s.c.CoreContainer registering core: collection1
   [junit4]   2> 1965583 INFO  (coreZkRegister-2624-thread-1-processing-c:control_collection s:shard1 x:collection1 n:127.0.0.1:55461_i_q%2Fp r:core_node1) [n:127.0.0.1:55461_i_q%2Fp c:control_collection s:shard1 r:core_node1 x:collection1] o.a.s.c.ZkController Register replica - core:collection1 address:https://127.0.0.1:55461/i_q/p collection:control_collection shard:shard1
   [junit4]   2> 1965584 INFO  (coreZkRegister-2624-thread-1-processing-c:control_collection s:shard1 x:collection1 n:127.0.0.1:55461_i_q%2Fp r:core_node1) [n:127.0.0.1:55461_i_q%2Fp c:control_collection s:shard1 r:core_node1 x:collection1] o.a.s.c.c.SolrZkClient makePath: /collections/control_collection/leader_elect/shard1/election
   [junit4]   2> 1965588 INFO  (coreZkRegister-2624-thread-1-processing-c:control_collection s:shard1 x:collection1 n:127.0.0.1:55461_i_q%2Fp r:core_node1) [n:127.0.0.1:55461_i_q%2Fp c:control_collection s:shard1 r:core_node1 x:collection1] o.a.s.c.LeaderElector Joined leadership election with path: /collections/control_collection/leader_elect/shard1/election/95203506598772741-core_node1-n_0000000000
   [junit4]   2> 1965588 INFO  (coreZkRegister-2624-thread-1-processing-c:control_collection s:shard1 x:collection1 n:127.0.0.1:55461_i_q%2Fp r:core_node1) [n:127.0.0.1:55461_i_q%2Fp c:control_collection s:shard1 r:core_node1 x:collection1] o.a.s.c.ShardLeaderElectionContext Running the leader process for shard=shard1 and weAreReplacement=false and leaderVoteWait=180000
   [junit4]   2> 1965591 INFO  (OverseerStateUpdate-95203506598772741-127.0.0.1:55461_i_q%2Fp-n_0000000000) [n:127.0.0.1:55461_i_q%2Fp    ] o.a.s.c.Overseer processMessage: queueSize: 1, message = {
   [junit4]   2>   "operation":"leader",
   [junit4]   2>   "shard":"shard1",
   [junit4]   2>   "collection":"control_collection"} current state version: 1
   [junit4]   2> 1965593 INFO  (coreZkRegister-2624-thread-1-processing-c:control_collection s:shard1 x:collection1 n:127.0.0.1:55461_i_q%2Fp r:core_node1) [n:127.0.0.1:55461_i_q%2Fp c:control_collection s:shard1 r:core_node1 x:collection1] o.a.s.c.ShardLeaderElectionContext Enough replicas found to continue.
   [junit4]   2> 1965593 INFO  (coreZkRegister-2624-thread-1-processing-c:control_collection s:shard1 x:collection1 n:127.0.0.1:55461_i_q%2Fp r:core_node1) [n:127.0.0.1:55461_i_q%2Fp c:control_collection s:shard1 r:core_node1 x:collection1] o.a.s.c.ShardLeaderElectionContext I may be the new leader - try and sync
   [junit4]   2> 1965593 INFO  (coreZkRegister-2624-thread-1-processing-c:control_collection s:shard1 x:collection1 n:127.0.0.1:55461_i_q%2Fp r:core_node1) [n:127.0.0.1:55461_i_q%2Fp c:control_collection s:shard1 r:core_node1 x:collection1] o.a.s.c.SyncStrategy Sync replicas to https://127.0.0.1:55461/i_q/p/collection1/
   [junit4]   2> 1965593 INFO  (coreZkRegister-2624-thread-1-processing-c:control_collection s:shard1 x:collection1 n:127.0.0.1:55461_i_q%2Fp r:core_node1) [n:127.0.0.1:55461_i_q%2Fp c:control_collection s:shard1 r:core_node1 x:collection1] o.a.s.c.SyncStrategy Sync Success - now sync replicas to me
   [junit4]   2> 1965593 INFO  (coreZkRegister-2624-thread-1-processing-c:control_collection s:shard1 x:collection1 n:127.0.0.1:55461_i_q%2Fp r:core_node1) [n:127.0.0.1:55461_i_q%2Fp c:control_collection s:shard1 r:core_node1 x:collection1] o.a.s.c.SyncStrategy https://127.0.0.1:55461/i_q/p/collection1/ has no replicas
   [junit4]   2> 1965594 INFO  (coreZkRegister-2624-thread-1-processing-c:control_collection s:shard1 x:collection1 n:127.0.0.1:55461_i_q%2Fp r:core_node1) [n:127.0.0.1:55461_i_q%2Fp c:control_collection s:shard1 r:core_node1 x:collection1] o.a.s.c.c.SolrZkClient makePath: /collections/control_collection/leaders/shard1
   [junit4]   2> 1965597 INFO  (coreZkRegister-2624-thread-1-processing-c:control_collection s:shard1 x:collection1 n:127.0.0.1:55461_i_q%2Fp r:core_node1) [n:127.0.0.1:55461_i_q%2Fp c:control_collection s:shard1 r:core_node1 x:collection1] o.a.s.c.ShardLeaderElectionContextBase Creating leader registration node
   [junit4]   2> 1965599 INFO  (coreZkRegister-2624-thread-1-processing-c:control_collection s:shard1 x:collection1 n:127.0.0.1:55461_i_q%2Fp r:core_node1) [n:127.0.0.1:55461_i_q%2Fp c:control_collection s:shard1 r:core_node1 x:collection1] o.a.s.c.ShardLeaderElectionContext I am the new leader: https://127.0.0.1:55461/i_q/p/collection1/ shard1
   [junit4]   2> 1965600 INFO  (OverseerStateUpdate-95203506598772741-127.0.0.1:55461_i_q%2Fp-n_0000000000) [n:127.0.0.1:55461_i_q%2Fp    ] o.a.s.c.Overseer processMessage: queueSize: 1, message = {
   [junit4]   2>   "operation":"leader",
   [junit4]   2>   "shard":"shard1",
   [junit4]   2>   "collection":"control_collection",
   [junit4]   2>   "base_url":"https://127.0.0.1:55461/i_q/p",
   [junit4]   2>   "core":"collection1",
   [junit4]   2>   "state":"active"} current state version: 1
   [junit4]   2> 1965600 INFO  (TEST-CollectionsAPIDistributedZkTest.test-seed#[95EB1EF282912922]) [    ] o.a.s.c.c.SolrZkClient Using default ZkCredentialsProvider
   [junit4]   2> 1965601 INFO  (TEST-CollectionsAPIDistributedZkTest.test-seed#[95EB1EF282912922]) [    ] o.a.s.c.c.ConnectionManager Waiting for client to connect to ZooKeeper
   [junit4]   2> 1965603 INFO  (zkCallback-917-thread-1) [    ] o.a.s.c.c.ConnectionManager Watcher org.apache.solr.common.cloud.ConnectionManager@399c19e name:ZooKeeperConnection Watcher:127.0.0.1:56217/solr got event WatchedEvent state:SyncConnected type:None path:null path:null type:None
   [junit4]   2> 1965603 INFO  (TEST-CollectionsAPIDistributedZkTest.test-seed#[95EB1EF282912922]) [    ] o.a.s.c.c.ConnectionManager Client is connected to ZooKeeper
   [junit4]   2> 1965603 INFO  (TEST-CollectionsAPIDistributedZkTest.test-seed#[95EB1EF282912922]) [    ] o.a.s.c.c.SolrZkClient Using default ZkACLProvider
   [junit4]   2> 1965603 INFO  (TEST-CollectionsAPIDistributedZkTest.test-seed#[95EB1EF282912922]) [    ] o.a.s.c.c.ZkStateReader Updating cluster state from ZooKeeper... 
   [junit4]   2> 1965607 INFO  (TEST-CollectionsAPIDistributedZkTest.test-seed#[95EB1EF282912922]) [    ] o.a.s.c.ChaosMonkey monkey: init - expire sessions:false cause connection loss:false
   [junit4]   2> 1965607 INFO  (TEST-CollectionsAPIDistributedZkTest.test-seed#[95EB1EF282912922]) [    ] o.a.s.c.AbstractFullDistribZkTestBase Creating collection1 with stateFormat=2
   [junit4]   2> 1965607 INFO  (TEST-CollectionsAPIDistributedZkTest.test-seed#[95EB1EF282912922]) [    ] o.a.s.c.c.SolrZkClient Using default ZkCredentialsProvider
   [junit4]   2> 1965608 INFO  (TEST-CollectionsAPIDistributedZkTest.test-seed#[95EB1EF282912922]) [    ] o.a.s.c.c.ConnectionManager Waiting for client to connect to ZooKeeper
   [junit4]   2> 1965612 INFO  (zkCallback-918-thread-1) [    ] o.a.s.c.c.ConnectionManager Watcher org.apache.solr.common.cloud.ConnectionManager@7e87360e name:ZooKeeperConnection Watcher:127.0.0.1:56217/solr got event WatchedEvent state:SyncConnected type:None path:null path:null type:None
   [junit4]   2> 1965613 INFO  (TEST-CollectionsAPIDistributedZkTest.test-seed#[95EB1EF282912922]) [    ] o.a.s.c.c.ConnectionManager Client is connected to ZooKeeper
   [junit4]   2> 1965613 INFO  (TEST-CollectionsAPIDistributedZkTest.test-seed#[95EB1EF282912922]) [    ] o.a.s.c.c.SolrZkClient Using default ZkACLProvider
   [junit4]   2> 1965616 INFO  (OverseerStateUpdate-95203506598772741-127.0.0.1:55461_i_q%2Fp-n_0000000000) [n:127.0.0.1:55461_i_q%2Fp    ] o.a.s.c.Overseer processMessage: queueSize: 1, message = {
   [junit4]   2>   "operation":"create",
   [junit4]   2>   "name":"collection1",
   [junit4]   2>   "numShards":"2",
   [junit4]   2>   "stateFormat":"2"} current state version: 1
   [junit4]   2> 1965616 INFO  (OverseerStateUpdate-95203506598772741-127.0.0.1:55461_i_q%2Fp-n_0000000000) [n:127.0.0.1:55461_i_q%2Fp    ] o.a.s.c.o.ClusterStateMutator building a new cName: collection1
   [junit4]   2> 1965616 INFO  (zkCallback-915-thread-1-processing-n:127.0.0.1:55461_i_q%2Fp) [n:127.0.0.1:55461_i_q%2Fp    ] o.a.s.c.c.ZkStateReader A cluster state change: [WatchedEvent state:SyncConnected type:NodeDataChanged path:/clusterstate.json], has occurred - updating... (live nodes size: [1])
   [junit4]   2> 1965617 INFO  (zkCallback-917-thread-1) [    ] o.a.s.c.c.ZkStateReader A cluster state change: [WatchedEvent state:SyncConnected type:NodeDataChanged path:/clusterstate.json], has occurred - updating... (live nodes size: [1])
   [junit4]   2> 1965650 INFO  (coreZkRegister-2624-thread-1-processing-c:control_collection s:shard1 x:collection1 n:127.0.0.1:55461_i_q%2Fp r:core_node1) [n:127.0.0.1:55461_i_q%2Fp c:control_collection s:shard1 r:core_node1 x:collection1] o.a.s.c.ZkController We are https://127.0.0.1:55461/i_q/p/collection1/ and leader is https://127.0.0.1:55461/i_q/p/collection1/
   [junit4]   2> 1965650 INFO  (coreZkRegister-2624-thread-1-processing-c:control_collection s:shard1 x:collection1 n:127.0.0.1:55461_i_q%2Fp r:core_node1) [n:127.0.0.1:55461_i_q%2Fp c:control_collection s:shard1 r:core_node1 x:collection1] o.a.s.c.ZkController No LogReplay needed for core=collection1 baseURL=https://127.0.0.1:55461/i_q/p
   [junit4]   2> 1965650 INFO  (coreZkRegister-2624-thread-1-processing-c:control_collection s:shard1 x:collection1 n:127.0.0.1:55461_i_q%2Fp r:core_node1) [n:127.0.0.1:55461_i_q%2Fp c:control_collection s:shard1 r:core_node1 x:collection1] o.a.s.c.ZkController I am the leader, no recovery necessary
   [junit4]   2> 1965651 INFO  (coreZkRegister-2624-thread-1-processing-c:control_collection s:shard1 x:collection1 n:127.0.0.1:55461_i_q%2Fp r:core_node1) [n:127.0.0.1:55461_i_q%2Fp c:control_collection s:shard1 r:core_node1 x:collection1] o.a.s.c.ZkController publishing state=active
   [junit4]   2> 1965651 INFO  (coreZkRegister-2624-thread-1-processing-c:control_collection s:shard1 x:collection1 n:127.0.0.1:55461_i_q%2Fp r:core_node1) [n:127.0.0.1:55461_i_q%2Fp c:control_collection s:shard1 r:core_node1 x:collection1] o.a.s.c.ZkController numShards not found on descriptor - reading it from system property
   [junit4]   2> 1965653 INFO  (OverseerStateUpdate-95203506598772741-127.0.0.1:55461_i_q%2Fp-n_0000000000) [n:127.0.0.1:55461_i_q%2Fp    ] o.a.s.c.Overseer processMessage: queueSize: 1, message = {
   [junit4]   2>   "collection":"control_collection",
   [junit4]   2>   "state":"active",
   [junit4]   2>   "base_url":"https://127.0.0.1:55461/i_q/p",
   [junit4]   2>   "shard":"shard1",
   [junit4]   2>   "node_name":"127.0.0.1:55461_i_q%2Fp",
   [junit4]   2>   "core":"collection1",
   [junit4]   2>   "operation":"state",
   [junit4]   2>   "roles":null,
   [junit4]   2>   "core_node_name":"core_node1",
   [junit4]   2>   "numShards":"2"} current state version: 2
   [junit4]   2> 1965654 INFO  (OverseerStateUpdate-95203506598772741-127.0.0.1:55461_i_q%2Fp-n_0000000000) [n:127.0.0.1:55461_i_q%2Fp    ] o.a.s.c.o.ReplicaMutator Update state numShards=2 message={
   [junit4]   2>   "collection":"control_collection",
   [junit4]   2>   "state":"active",
   [junit4]   2>   "base_url":"https://127.0.0.1:55461/i_q/p",
   [junit4]   2>   "shard":"shard1",
   [junit4]   2>   "node_name":"127.0.0.1:55461_i_q%2Fp",
   [junit4]   2>   "core":"collection1",
   [junit4]   2>   "operation":"state",
   [junit4]   2>   "roles":null,
   [junit4]   2>   "core_node_name":"core_node1",
   [junit4]   2>   "numShards":"2"}
   [junit4]   2> 1965654 INFO  (OverseerStateUpdate-95203506598772741-127.0.0.1:55461_i_q%2Fp-n_0000000000) [n:127.0.0.1:55461_i_q%2Fp    ] o.a.s.c.o.ZkStateWriter going to create_collection /collections/collection1/state.json
   [junit4]   2> 1965760 INFO  (zkCallback-917-thread-1) [    ] o.a.s.c.c.ZkStateReader A cluster state change: [WatchedEvent state:SyncConnected type:NodeDataChanged path:/clusterstate.json], has occurred - updating... (live nodes size: [1])
   [junit4]   2> 1965761 INFO  (zkCallback-915-thread-1-processing-n:127.0.0.1:55461_i_q%2Fp) [n:127.0.0.1:55461_i_q%2Fp    ] o.a.s.c.c.ZkStateReader A cluster state change: [WatchedEvent state:SyncConnected type:NodeDataChanged path:/clusterstate.json], has occurred - updating... (live nodes size: [1])
   [junit4]   2> 1966055 INFO  (TEST-CollectionsAPIDistributedZkTest.test-seed#[95EB1EF282912922]) [    ] o.a.s.SolrTestCaseJ4 Writing core.properties file to /x1/jenkins/jenkins-slave/workspace/Lucene-Solr-NightlyTests-5.x/solr/build/solr-core/test/J1/temp/solr.cloud.CollectionsAPIDistributedZkTest_95EB1EF282912922-001/shard-1-001/cores/collection1
   [junit4]   2> 1966076 INFO  (TEST-CollectionsAPIDistributedZkTest.test-seed#[95EB1EF282912922]) [    ] o.a.s.c.AbstractFullDistribZkTestBase create jetty 1 in directory /x1/jenkins/jenkins-slave/workspace/Lucene-Solr-NightlyTests-5.x/solr/build/solr-core/test/J1/temp/solr.cloud.CollectionsAPIDistributedZkTest_95EB1EF282912922-001/shard-1-001
   [junit4]   2> 1966077 INFO  (TEST-CollectionsAPIDistributedZkTest.test-seed#[95EB1EF282912922]) [    ] o.e.j.s.Server jetty-9.2.13.v20150730
   [junit4]   2> 1966105 INFO  (TEST-CollectionsAPIDistributedZkTest.test-seed#[95EB1EF282912922]) [    ] o.e.j.s.h.ContextHandler Started o.e.j.s.ServletContextHandler@6c950708{/i_q/p,null,AVAILABLE}
   [junit4]   2> 1966111 INFO  (TEST-CollectionsAPIDistributedZkTest.test-seed#[95EB1EF282912922]) [    ] o.e.j.s.ServerConnector Started ServerConnector@2c00d5e9{SSL-http/1.1}{127.0.0.1:51792}
   [junit4]   2> 1966111 INFO  (TEST-CollectionsAPIDistributedZkTest.test-seed#[95EB1EF282912922]) [    ] o.e.j.s.Server Started @1968764ms
   [junit4]   2> 1966111 INFO  (TEST-CollectionsAPIDistributedZkTest.test-seed#[95EB1EF282912922]) [    ] o.a.s.c.s.e.JettySolrRunner Jetty properties: {solrconfig=solrconfig.xml, solr.data.dir=/x1/jenkins/jenkins-slave/workspace/Lucene-Solr-NightlyTests-5.x/solr/build/solr-core/test/J1/temp/solr.cloud.CollectionsAPIDistributedZkTest_95EB1EF282912922-001/tempDir-001/jetty1, hostPort=51792, hostContext=/i_q/p, coreRootDirectory=/x1/jenkins/jenkins-slave/workspace/Lucene-Solr-NightlyTests-5.x/solr/build/solr-core/test/J1/../../../../../../../../../../x1/jenkins/jenkins-slave/workspace/Lucene-Solr-NightlyTests-5.x/solr/build/solr-core/test/J1/temp/solr.cloud.CollectionsAPIDistributedZkTest_95EB1EF282912922-001/shard-1-001/cores}
   [junit4]   2> 1966112 INFO  (TEST-CollectionsAPIDistributedZkTest.test-seed#[95EB1EF282912922]) [    ] o.a.s.s.SolrDispatchFilter SolrDispatchFilter.init(): sun.misc.Launcher$AppClassLoader@7b3cb2c6
   [junit4]   2> 1966112 INFO  (TEST-CollectionsAPIDistributedZkTest.test-seed#[95EB1EF282912922]) [    ] o.a.s.c.SolrResourceLoader new SolrResourceLoader for directory: '/x1/jenkins/jenkins-slave/workspace/Lucene-Solr-NightlyTests-5.x/solr/build/solr-core/test/J1/temp/solr.cloud.CollectionsAPIDistributedZkTest_95EB1EF282912922-001/shard-1-001'
   [junit4]   2> 1966112 INFO  (TEST-CollectionsAPIDistributedZkTest.test-seed#[95EB1EF282912922]) [    ] o.a.s.c.SolrResourceLoader JNDI not configured for solr (NoInitialContextEx)
   [junit4]   2> 1966112 INFO  (TEST-CollectionsAPIDistributedZkTest.test-seed#[95EB1EF282912922]) [    ] o.a.s.c.SolrResourceLoader solr home defaulted to 'solr/' (could not find system property or JNDI)
   [junit4]   2> 1966112 INFO  (TEST-CollectionsAPIDistributedZkTest.test-seed#[95EB1EF282912922]) [    ] o.a.s.c.c.SolrZkClient Using default ZkCredentialsProvider
   [junit4]   2> 1966113 INFO  (TEST-CollectionsAPIDistributedZkTest.test-seed#[95EB1EF282912922]) [    ] o.a.s.c.c.ConnectionManager Waiting for client to connect to ZooKeeper
   [junit4]   2> 1966115 INFO  (zkCallback-919-thread-1) [    ] o.a.s.c.c.ConnectionManager Watcher org.apache.solr.common.cloud.ConnectionManager@14c3c278 name:ZooKeeperConnection Watcher:127.0.0.1:56217/solr got event WatchedEvent state:SyncConnected type:None path:null path:null type:None
   [junit4]   2> 1966115 INFO  (TEST-CollectionsAPIDistributedZkTest.test-seed#[95EB1EF282912922]) [    ] o.a.s.c.c.ConnectionManager Client is connected to ZooKeeper
   [junit4]   2> 1966116 INFO  (TEST-CollectionsAPIDistributedZkTest.test-seed#[95EB1EF282912922]) [    ] o.a.s.c.c.SolrZkClient Using default ZkACLProvider
   [junit4]   2> 1966117 INFO  (TEST-CollectionsAPIDistributedZkTest.test-seed#[95EB1EF282912922]) [    ] o.a.s.s.SolrDispatchFilter Loading solr.xml from SolrHome (not found in ZooKeeper)
   [junit4]   2> 1966117 INFO  (TEST-CollectionsAPIDistributedZkTest.test-seed#[95EB1EF282912922]) [    ] o.a.s.c.SolrXmlConfig Loading container configuration from /x1/jenkins/jenkins-slave/workspace/Lucene-Solr-NightlyTests-5.x/solr/build/solr-core/test/J1/temp/solr.cloud.CollectionsAPIDistributedZkTest_95EB1EF282912922-001/shard-1-001/solr.xml
   [junit4]   2> 1966132 INFO  (TEST-CollectionsAPIDistributedZkTest.test-seed#[95EB1EF282912922]) [    ] o.a.s.c.CorePropertiesLocator Config-defined core root directory: /x1/jenkins/jenkins-slave/workspace/Lucene-Solr-NightlyTests-5.x/solr/build/solr-core/test/J1/../../../../../../../../../../x1/jenkins/jenkins-slave/workspace/Lucene-Solr-NightlyTests-5.x/solr/build/solr-core/test/J1/temp/solr.cloud.CollectionsAPIDistributedZkTest_95EB1EF282912922-001/shard-1-001/cores
   [junit4]   2> 1966132 INFO  (TEST-CollectionsAPIDistributedZkTest.test-seed#[95EB1EF282912922]) [    ] o.a.s.c.CoreContainer New CoreContainer 1937557899
   [junit4]   2> 1966132 INFO  (TEST-CollectionsAPIDistributedZkTest.test-seed#[95EB1EF282912922]) [    ] o.a.s.c.CoreContainer Loading cores into CoreContainer [instanceDir=/x1/jenkins/jenkins-slave/workspace/Lucene-Solr-NightlyTests-5.x/solr/build/solr-core/test/J1/temp/solr.cloud.CollectionsAPIDistributedZkTest_95EB1EF282912922-001/shard-1-001]
   [junit4]   2> 1966132 WARN  (TEST-CollectionsAPIDistributedZkTest.test-seed#[95EB1EF282912922]) [    ] o.a.s.c.CoreContainer Couldn't add files from /x1/jenkins/jenkins-slave/workspace/Lucene-Solr-NightlyTests-5.x/solr/build/solr-core/test/J1/temp/solr.cloud.CollectionsAPIDistributedZkTest_95EB1EF282912922-001/shard-1-001/lib to classpath: /x1/jenkins/jenkins-slave/workspace/Lucene-Solr-NightlyTests-5.x/solr/build/solr-core/test/J1/temp/solr.cloud.CollectionsAPIDistributedZkTest_95EB1EF282912922-001/shard-1-001/lib
   [junit4]   2> 1966133 INFO  (TEST-CollectionsAPIDistributedZkTest.test-seed#[95EB1EF282912922]) [    ] o.a.s.h.c.HttpShardHandlerFactory created with socketTimeout : 90000,urlScheme : ,connTimeout : 15000,maxConnectionsPerHost : 20,maxConnections : 10000,corePoolSize : 0,maximumPoolSize : 2147483647,maxThreadIdleTime : 5,sizeOfQueue : -1,fairnessPolicy : false,useRetries : false,
   [junit4]   2> 1966135 INFO  (TEST-CollectionsAPIDistributedZkTest.test-seed#[95EB1EF282912922]) [    ] o.a.s.u.UpdateShardHandler Creating UpdateShardHandler HTTP client with params: socketTimeout=340000&connTimeout=45000&retry=true
   [junit4]   2> 1966136 INFO  (TEST-CollectionsAPIDistributedZkTest.test-seed#[95EB1EF282912922]) [    ] o.a.s.l.LogWatcher SLF4J impl is org.slf4j.impl.Log4jLoggerFactory
   [junit4]   2> 1966136 INFO  (TEST-CollectionsAPIDistributedZkTest.test-seed#[95EB1EF282912922]) [    ] o.a.s.l.LogWatcher Registering Log Listener [Log4j (org.slf4j.impl.Log4jLoggerFactory)]
   [junit4]   2> 1966136 INFO  (TEST-CollectionsAPIDistributedZkTest.test-seed#[95EB1EF282912922]) [    ] o.a.s.c.ZkContainer Zookeeper client=127.0.0.1:56217/solr
   [junit4]   2> 1966136 INFO  (TEST-CollectionsAPIDistributedZkTest.test-seed#[95EB1EF282912922]) [    ] o.a.s.c.ZkController zkHost includes chroot
   [junit4]   2> 1966136 INFO  (TEST-CollectionsAPIDistributedZkTest.test-seed#[95EB1EF282912922]) [    ] o.a.s.c.c.SolrZkClient Using default ZkCredentialsProvider
   [junit4]   2> 1966137 INFO  (TEST-CollectionsAPIDistributedZkTest.test-seed#[95EB1EF282912922]) [    ] o.a.s.c.c.ConnectionManager Waiting for client to connect to ZooKeeper
   [junit4]   2> 1966138 INFO  (zkCallback-921-thread-1) [    ] o.a.s.c.c.ConnectionManager Watcher org.apache.solr.common.cloud.ConnectionManager@253cf1cd name:ZooKeeperConnection Watcher:127.0.0.1:56217 got event WatchedEvent state:SyncConnected type:None path:null path:null type:None
   [junit4]   2> 1966139 INFO  (TEST-CollectionsAPIDistributedZkTest.test-seed#[95EB1EF282912922]) [    ] o.a.s.c.c.ConnectionManager Client is connected to ZooKeeper
   [junit4]   2> 1966140 INFO  (TEST-CollectionsAPIDistributedZkTest.test-seed#[95EB1EF282912922]) [    ] o.a.s.c.c.SolrZkClient Using default ZkACLProvider
   [junit4]   2> 1966142 INFO  (TEST-CollectionsAPIDistributedZkTest.test-seed#[95EB1EF282912922]) [n:127.0.0.1:51792_i_q%2Fp    ] o.a.s.c.c.ConnectionManager Waiting for client to connect to ZooKeeper
   [junit4]   2> 1966144 INFO  (zkCallback-922-thread-1-processing-n:127.0.0.1:51792_i_q%2Fp) [n:127.0.0.1:51792_i_q%2Fp    ] o.a.s.c.c.ConnectionManager Watcher org.apache.solr.common.cloud.ConnectionManager@3a6d68ec name:ZooKeeperConnection Watcher:127.0.0.1:56217/solr got event WatchedEvent state:SyncConnected type:None path:null path:null type:None
   [junit4]   2> 1966145 INFO  (TEST-CollectionsAPIDistributedZkTest.test-seed#[95EB1EF282912922]) [n:127.0.0.1:51792_i_q%2Fp    ] o.a.s.c.c.ConnectionManager Client is connected to ZooKeeper
   [junit4]   2> 1966155 INFO  (TEST-CollectionsAPIDistributedZkTest.test-seed#[95EB1EF282912922]) [n:127.0.0.1:51792_i_q%2Fp    ] o.a.s.c.c.ZkStateReader Updating cluster state from ZooKeeper... 
   [junit4]   2> 1967175 INFO  (TEST-CollectionsAPIDistributedZkTest.test-seed#[95EB1EF282912922]) [n:127.0.0.1:51792_i_q%2Fp    ] o.a.s.c.ZkController Register node as live in ZooKeeper:/live_nodes/127.0.0.1:51792_i_q%2Fp
   [junit4]   2> 1967175 INFO  (TEST-CollectionsAPIDistributedZkTest.test-seed#[95EB1EF282912922]) [n:127.0.0.1:51792_i_q%2Fp    ] o.a.s.c.c.SolrZkClient makePath: /live_nodes/127.0.0.1:51792_i_q%2Fp
   [junit4]   2> 1967176 INFO  (zkCallback-922-thread-1-processing-n:127.0.0.1:51792_i_q%2Fp) [n:127.0.0.1:51792_i_q%2Fp    ] o.a.s.c.c.ZkStateReader A live node change: [WatchedEvent state:SyncConnected type:NodeChildrenChanged path:/live_nodes], has occurred - updating... (live nodes size: [1])
   [junit4]   2> 1967176 INFO  (zkCallback-917-thread-1) [    ] o.a.s.c.c.ZkStateReader A live node change: [WatchedEvent state:SyncConnected type:NodeChildrenChanged path:/live_nodes], has occurred - updating... (live nodes size: [1])
   [junit4]   2> 1967176 INFO  (zkCallback-915-thread-1-processing-n:127.0.0.1:55461_i_q%2Fp) [n:127.0.0.1:55461_i_q%2Fp    ] o.a.s.c.c.ZkStateReader A live node change: [WatchedEvent state:SyncConnected type:NodeChildrenChanged path:/live_nodes], has occurred - updating... (live nodes size: [1])
   [junit4]   2> 1967178 INFO  (TEST-CollectionsAPIDistributedZkTest.test-seed#[95EB1EF282912922]) [n:127.0.0.1:51792_i_q%2Fp    ] o.a.s.c.Overseer Overseer (id=null) closing
   [junit4]   2> 1967179 INFO  (TEST-CollectionsAPIDistributedZkTest.test-seed#[95EB1EF282912922]) [n:127.0.0.1:51792_i_q%2Fp    ] o.a.s.c.LeaderElector Joined leadership election with path: /overseer_elect/election/95203506598772746-127.0.0.1:51792_i_q%2Fp-n_0000000001
   [junit4]   2> 1967179 INFO  (TEST-CollectionsAPIDistributedZkTest.test-seed#[95EB1EF282912922]) [n:127.0.0.1:51792_i_q%2Fp    ] o.a.s.c.LeaderElector Watching path /overseer_elect/election/95203506598772741-127.0.0.1:55461_i_q%2Fp-n_0000000000 to know if I could be the leader
   [junit4]   2> 1967204 INFO  (TEST-CollectionsAPIDistributedZkTest.test-seed#[95EB1EF282912922]) [n:127.0.0.1:51792_i_q%2Fp    ] o.a.s.c.CoreContainer Security conf doesn't exist. Skipping setup for authorization module.
   [junit4]   2> 1967204 INFO  (TEST-CollectionsAPIDistributedZkTest.test-seed#[95EB1EF282912922]) [n:127.0.0.1:51792_i_q%2Fp    ] o.a.s.c.CoreContainer No authentication plugin used.
   [junit4]   2> 1967205 INFO  (TEST-CollectionsAPIDistributedZkTest.test-seed#[95EB1EF282912922]) [n:127.0.0.1:51792_i_q%2Fp    ] o.a.s.c.CorePropertiesLocator Looking for core definitions underneath /x1/jenkins/jenkins-slave/workspace/Lucene-Solr-NightlyTests-5.x/solr/build/solr-core/test/J1/../../../../../../../../../../x1/jenkins/jenkins-slave/workspace/Lucene-Solr-NightlyTests-5.x/solr/build/solr-core/test/J1/temp/solr.cloud.CollectionsAPIDistributedZkTest_95EB1EF282912922-001/shard-1-001/cores
   [junit4]   2> 1967206 INFO  (TEST-CollectionsAPIDistributedZkTest.test-seed#[95EB1EF282912922]) [n:127.0.0.1:51792_i_q%2Fp    ] o.a.s.c.CoreDescriptor Created CoreDescriptor: {name=collection1, configSetProperties=configsetprops.json, collection=collection1, transient=false, config=solrconfig.xml, dataDir=data/, loadOnStartup=true, schema=schema.xml, coreNodeName=, shard=}
   [junit4]   2> 1967206 INFO  (TEST-CollectionsAPIDistributedZkTest.test-seed#[95EB1EF282912922]) [n:127.0.0.1:51792_i_q%2Fp    ] o.a.s.c.CorePropertiesLocator Found core collection1 in /x1/jenkins/jenkins-slave/workspace/Lucene-Solr-NightlyTests-5.x/solr/build/solr-core/test/J1/../../../../../../../../../../x1/jenkins/jenkins-slave/workspace/Lucene-Solr-NightlyTests-5.x/solr/build/solr-core/test/J1/temp/solr.cloud.CollectionsAPIDistributedZkTest_95EB1EF282912922-001/shard-1-001/cores/collection1
   [junit4]   2> 1967206 INFO  (TEST-CollectionsAPIDistributedZkTest.test-seed#[95EB1EF282912922]) [n:127.0.0.1:51792_i_q%2Fp    ] o.a.s.c.CorePropertiesLocator Found 1 core definitions
   [junit4]   2> 1967207 INFO  (TEST-CollectionsAPIDistributedZkTest.test-seed#[95EB1EF282912922]) [n:127.0.0.1:51792_i_q%2Fp    ] o.a.s.s.SolrDispatchFilter user.dir=/x1/jenkins/jenkins-slave/workspace/Lucene-Solr-NightlyTests-5.x/solr/build/solr-core/test/J1
   [junit4]   2> 1967207 INFO  (TEST-CollectionsAPIDistributedZkTest.test-seed#[95EB1EF282912922]) [n:127.0.0.1:51792_i_q%2Fp    ] o.a.s.s.SolrDispatchFilter SolrDispatchFilter.init() done
   [junit4]   2> 1967208 INFO  (coreLoadExecutor-2641-thread-1-processing-n:127.0.0.1:51792_i_q%2Fp) [n:127.0.0.1:51792_i_q%2Fp c:collection1   x:collection1] o.a.s.c.ZkController publishing state=down
   [junit4]   2> 1967208 INFO  (coreLoadExecutor-2641-thread-1-processing-n:127.0.0.1:51792_i_q%2Fp) [n:127.0.0.1:51792_i_q%2Fp c:collection1   x:collection1] o.a.s.c.ZkController numShards not found on descriptor - reading it from system property
   [junit4]   2> 1967210 INFO  (coreLoadExecutor-2641-thread-1-processing-n:127.0.0.1:51792_i_q%2Fp) [n:127.0.0.1:51792_i_q%2Fp c:collection1   x:collection1] o.a.s.c.ZkController Registering watch for collection collection1
   [junit4]   2> 1967210 INFO  (coreLoadExecutor-2641-thread-1-processing-n:127.0.0.1:51792_i_q%2Fp) [n:127.0.0.1:51792_i_q%2Fp c:collection1   x:collection1] o.a.s.c.c.ZkStateReader addZkWatch [collection1]
   [junit4]   2> 1967211 INFO  (coreLoadExecutor-2641-thread-1-processing-n:127.0.0.1:51792_i_q%2Fp) [n:127.0.0.1:51792_i_q%2Fp c:collection1   x:collection1] o.a.s.c.c.ZkStateReader Add data for [collection1] ver [0]
   [junit4]   2> 1967211 INFO  (OverseerStateUpdate-95203506598772741-127.0.0.1:55461_i_q%2Fp-n_0000000000) [n:127.0.0.1:55461_i_q%2Fp    ] o.a.s.c.Overseer processMessage: queueSize: 1, message = {
   [junit4]   2>   "collection":"collection1",
   [junit4]   2>   "state":"down",
   [junit4]   2>   "base_url":"https://127.0.0.1:51792/i_q/p",
   [junit4]   2>   "shard":null,
   [junit4]   2>   "node_name":"127.0.0.1:51792_i_q%2Fp",
   [junit4]   2>   "core":"collection1",
   [junit4]   2>   "operation":"state",
   [junit4]   2>   "roles":null,
   [junit4]   2>   "numShards":"2"} current state version: 3
   [junit4]   2> 1967211 INFO  (coreLoadExecutor-2641-thread-1-processing-n:127.0.0.1:51792_i_q%2Fp) [n:127.0.0.1:51792_i_q%2Fp c:collection1   x:collection1] o.a.s.c.ZkController look for our core node name
   [junit4]   2> 1967212 INFO  (OverseerStateUpdate-95203506598772741-127.0.0.1:55461_i_q%2Fp-n_0000000000) [n:127.0.0.1:55461_i_q%2Fp    ] o.a.s.c.o.ReplicaMutator Update state numShards=2 message={
   [junit4]   2>   "collection":"collection1",
   [junit4]   2>   "state":"down",
   [junit4]   2>   "base_url":"https://127.0.0.1:51792/i_q/p",
   [junit4]   2>   "shard":null,
   [junit4]   2>   "node_name":"127.0.0.1:51792_i_q%2Fp",
   [junit4]   2>   "core":"collection1",
   [junit4]   2>   "operation":"state",
   [junit4]   2>   "roles":null,
   [junit4]   2>   "numShards":"2"}
   [junit4]   2> 1967212 INFO  (OverseerStateUpdate-95203506598772741-127.0.0.1:55461_i_q%2Fp-n_0000000000) [n:127.0.0.1:55461_i_q%2Fp    ] o.a.s.c.o.ReplicaMutator Collection already exists with numShards=2
   [junit4]   2> 1967212 INFO  (OverseerStateUpdate-95203506598772741-127.0.0.1:55461_i_q%2Fp-n_0000000000) [n:127.0.0.1:55461_i_q%2Fp    ] o.a.s.c.o.ReplicaMutator Assigning new node to shard shard=shard2
   [junit4]   2> 1967315 INFO  (OverseerStateUpdate-95203506598772741-127.0.0.1:55461_i_q%2Fp-n_0000000000) [n:127.0.0.1:55461_i_q%2Fp    ] o.a.s.c.o.ZkStateWriter going to update_collection /collections/collection1/state.json version: 0
   [junit4]   2> 1967318 INFO  (zkCallback-922-thread-1-processing-n:127.0.0.1:51792_i_q%2Fp) [n:127.0.0.1:51792_i_q%2Fp    ] o.a.s.c.c.ZkStateReader A cluster state change: [WatchedEvent state:SyncConnected type:NodeDataChanged path:/collections/collection1/state.json] for collection [collection1] has occurred - updating... (live nodes size: [2])
   [junit4]   2> 1967321 INFO  (zkCallback-922-thread-1-processing-n:127.0.0.1:51792_i_q%2Fp) [n:127.0.0.1:51792_i_q%2Fp    ] o.a.s.c.c.ZkStateReader Updating data for [collection1] from [0] to [1]
   [junit4]   2> 1968211 INFO  (coreLoadExecutor-2641-thread-1-processing-n:127.0.0.1:51792_i_q%2Fp) [n:127.0.0.1:51792_i_q%2Fp c:collection1   x:collection1] o.a.s.c.ZkController waiting to find shard id in clusterstate for collection1
   [junit4]   2> 1968211 INFO  (coreLoadExecutor-2641-thread-1-processing-n:127.0.0.1:51792_i_q%2Fp) [n:127.0.0.1:51792_i_q%2Fp c:collection1   x:collection1] o.a.s.c.ZkController Check for collection zkNode:collection1
   [junit4]   2> 1968212 INFO  (coreLoadExecutor-2641-thread-1-processing-n:127.0.0.1:51792_i_q%2Fp) [n:127.0.0.1:51792_i_q%2Fp c:collection1   x:collection1] o.a.s.c.ZkController Collection zkNode exists
   [junit4]   2> 1968212 INFO  (coreLoadExecutor-2641-thread-1-processing-n:127.0.0.1:51792_i_q%2Fp) [n:127.0.0.1:51792_i_q%2Fp c:collection1   x:collection1] o.a.s.c.c.ZkStateReader Load collection config from: [/collections/collection1]
   [junit4]   2> 1968213 INFO  (coreLoadExecutor-2641-thread-1-processing-n:127.0.0.1:51792_i_q%2Fp) [n:127.0.0.1:51792_i_q%2Fp c:collection1   x:collection1] o.a.s.c.c.ZkStateReader path=[/collections/collection1] [configName]=[conf1] specified config exists in ZooKeeper
   [junit4]   2> 1968213 INFO  (coreLoadExecutor-2641-thread-1-processing-n:127.0.0.1:51792_i_q%2Fp) [n:127.0.0.1:51792_i_q%2Fp c:collection1   x:collection1] o.a.s.c.SolrResourceLoader new SolrResourceLoader for directory: '/x1/jenkins/jenkins-slave/workspace/Lucene-Solr-NightlyTests-5.x/solr/build/solr-core/test/J1/temp/solr.cloud.CollectionsAPIDistributedZkTest_95EB1EF282912922-001/shard-1-001/cores/collection1'
   [junit4]   2> 1968213 INFO  (coreLoadExecutor-2641-thread-1-processing-n:127.0.0.1:51792_i_q%2Fp) [n:127.0.0.1:51792_i_q%2Fp c:collection1   x:collection1] o.a.s.c.SolrResourceLoader JNDI not configured for solr (NoInitialContextEx)
   [junit4]   2> 1968213 INFO  (coreLoadExecutor-2641-thread-1-processing-n:127.0.0.1:51792_i_q%2Fp) [n:127.0.0.1:51792_i_q%2Fp c:collection1   x:collection1] o.a.s.c.SolrResourceLoader solr home defaulted to 'solr/' (could not find system property or JNDI)
   [junit4]   2> 1968215 INFO  (coreLoadExecutor-2641-thread-1-processing-n:127.0.0.1:51792_i_q%2Fp) [n:127.0.0.1:51792_i_q%2Fp c:collection1   x:collection1] o.a.s.c.Config loaded config solrconfig.xml with version 0 
   [junit4]   2> 1968224 INFO  (coreLoadExecutor-2641-thread-1-processing-n:127.0.0.1:51792_i_q%2Fp) [n:127.0.0.1:51792_i_q%2Fp c:collection1   x:collection1] o.a.s.c.SolrConfig current version of requestparams : -1
   [junit4]   2> 1968248 INFO  (coreLoadExecutor-2641-thread-1-processing-n:127.0.0.1:51792_i_q%2Fp) [n:127.0.0.1:51792_i_q%2Fp c:collection1   x:collection1] o.a.s.c.SolrConfig Using Lucene MatchVersion: 5.5.0
   [junit4]   2> 1968295 INFO  (coreLoadExecutor-2641-thread-1-processing-n:127.0.0.1:51792_i_q%2Fp) [n:127.0.0.1:51792_i_q%2Fp c:collection1   x:collection1] o.a.s.c.SolrConfig Loaded SolrConfig: solrconfig.xml
   [junit4]   2> 1968303 INFO  (coreLoadExecutor-2641-thread-1-processing-n:127.0.0.1:51792_i_q%2Fp) [n:127.0.0.1:51792_i_q%2Fp c:collection1   x:collection1] o.a.s.s.IndexSchema [collection1] Schema name=test
   [junit4]   2> 1968649 INFO  (coreLoadExecutor-2641-thread-1-processing-n:127.0.0.1:51792_i_q%2Fp) [n:127.0.0.1:51792_i_q%2Fp c:collection1   x:collection1] o.a.s.s.OpenExchangeRatesOrgProvider Initialized with rates=open-exchange-rates.json, refreshInterval=1440.
   [junit4]   2> 1968659 INFO  (coreLoadExecutor-2641-thread-1-processing-n:127.0.0.1:51792_i_q%2Fp) [n:127.0.0.1:51792_i_q%2Fp c:collection1   x:collection1] o.a.s.s.IndexSchema default search field in schema is text
   [junit4]   2> 1968661 INFO  (coreLoadExecutor-2641-thread-1-processing-n:127.0.0.1:51792_i_q%2Fp) [n:127.0.0.1:51792_i_q%2Fp c:collection1   x:collection1] o.a.s.s.IndexSchema unique key field: id
   [junit4]   2> 1968673 INFO  (coreLoadExecutor-2641-thread-1-processing-n:127.0.0.1:51792_i_q%2Fp) [n:127.0.0.1:51792_i_q%2Fp c:collection1   x:collection1] o.a.s.s.FileExchangeRateProvider Reloading exchange rates from file currency.xml
   [junit4]   2> 1968677 INFO  (coreLoadExecutor-2641-thread-1-processing-n:127.0.0.1:51792_i_q%2Fp) [n:127.0.0.1:51792_i_q%2Fp c:collection1   x:collection1] o.a.s.s.FileExchangeRateProvider Reloading exchange rates from file currency.xml
   [junit4]   2> 1968679 INFO  (coreLoadExecutor-2641-thread-1-processing-n:127.0.0.1:51792_i_q%2Fp) [n:127.0.0.1:51792_i_q%2Fp c:collection1   x:collection1] o.a.s.s.OpenExchangeRatesOrgProvider Reloading exchange rates from open-exchange-rates.json
   [junit4]   2> 1968680 INFO  (coreLoadExecutor-2641-thread-1-processing-n:127.0.0.1:51792_i_q%2Fp) [n:127.0.0.1:51792_i_q%2Fp c:collection1   x:collection1] o.a.s.s.OpenExchangeRatesOrgProvider Reloading exchange rates from open-exchange-rates.json
   [junit4]   2> 1968682 INFO  (coreLoadExecutor-2641-thread-1-processing-n:127.0.0.1:51792_i_q%2Fp) [n:127.0.0.1:51792_i_q%2Fp c:collection1   x:collection1] o.a.s.c.ConfigSetProperties Did not find ConfigSet properties, assuming default properties: Can't find resource 'configsetprops.json' in classpath or '/configs/conf1', cwd=/x1/jenkins/jenkins-slave/workspace/Lucene-Solr-NightlyTests-5.x/solr/build/solr-core/test/J1
   [junit4]   2> 1968682 INFO  (coreLoadExecutor-2641-thread-1-processing-n:127.0.0.1:51792_i_q%2Fp) [n:127.0.0.1:51792_i_q%2Fp c:collection1   x:collection1] o.a.s.c.CoreContainer Creating SolrCore 'collection1' using configuration from collection collection1
   [junit4]   2> 1968682 INFO  (coreLoadExecutor-2641-thread-1-processing-n:127.0.0.1:51792_i_q%2Fp) [n:127.0.0.1:51792_i_q%2Fp c:collection1 s:shard2 r:core_node1 x:collection1] o.a.s.c.SolrCore org.apache.solr.core.MockDirectoryFactory
   [junit4]   2> 1968682 INFO  (coreLoadExecutor-2641-thread-1-processing-n:127.0.0.1:51792_i_q%2Fp) [n:127.0.0.1:51792_i_q%2Fp c:collection1 s:shard2 r:core_node1 x:collection1] o.a.s.c.SolrCore [[collection1] ] Opening new SolrCore at [/x1/jenkins/jenkins-slave/workspace/Lucene-Solr-NightlyTests-5.x/solr/build/solr-core/test/J1/temp/solr.cloud.CollectionsAPIDistributedZkTest_95EB1EF282912922-001/shard-1-001/cores/collection1], dataDir=[/x1/jenkins/jenkins-slave/workspace/Lucene-Solr-NightlyTests-5.x/solr/build/solr-core/test/J1/../../../../../../../../../../x1/jenkins/jenkins-slave/workspace/Lucene-Solr-NightlyTests-5.x/solr/build/solr-core/test/J1/temp/solr.cloud.CollectionsAPIDistributedZkTest_95EB1EF282912922-001/shard-1-001/cores/collection1/data/]
   [junit4]   2> 1968682 INFO  (coreLoadExecutor-2641-thread-1-processing-n:127.0.0.1:51792_i_q%2Fp) [n:127.0.0.1:51792_i_q%2Fp c:collection1 s:shard2 r:core_node1 x:collection1] o.a.s.c.JmxMonitoredMap JMX monitoring is enabled. Adding Solr mbeans to JMX Server: com.sun.jmx.mbeanserver.JmxMBeanServer@385e0377
   [junit4]   2> 1968683 INFO  (coreLoadExecutor-2641-thread-1-processing-n:127.0.0.1:51792_i_q%2Fp) [n:127.0.0.1:51792_i_q%2Fp c:collection1 s:shard2 r:core_node1 x:collection1] o.a.s.c.CachingDirectoryFactory return new directory for 

[...truncated too long message...]

.linedocsfile=/x1/jenkins/lucene-data/enwiki.random.lines.txt -Dtests.locale=it -Dtests.timezone=CST -Dtests.asserts=true -Dtests.file.encoding=UTF-8
   [junit4] ERROR    640s J1 | CollectionsAPIDistributedZkTest.test <<<
   [junit4]    > Throwable #1: com.carrotsearch.randomizedtesting.UncaughtExceptionError: Captured an uncaught exception in thread: Thread[id=33805, name=collection1, state=RUNNABLE, group=TGRP-CollectionsAPIDistributedZkTest]
   [junit4]    > Caused by: org.apache.solr.client.solrj.impl.HttpSolrClient$RemoteSolrException: Error from server at https://127.0.0.1:51792/i_q/p: collection already exists: awholynewstresscollection_collection1_5
   [junit4]    > 	at __randomizedtesting.SeedInfo.seed([95EB1EF282912922]:0)
   [junit4]    > 	at org.apache.solr.client.solrj.impl.HttpSolrClient.executeMethod(HttpSolrClient.java:575)
   [junit4]    > 	at org.apache.solr.client.solrj.impl.HttpSolrClient.request(HttpSolrClient.java:241)
   [junit4]    > 	at org.apache.solr.client.solrj.impl.HttpSolrClient.request(HttpSolrClient.java:230)
   [junit4]    > 	at org.apache.solr.client.solrj.impl.LBHttpSolrClient.doRequest(LBHttpSolrClient.java:372)
   [junit4]    > 	at org.apache.solr.client.solrj.impl.LBHttpSolrClient.request(LBHttpSolrClient.java:325)
   [junit4]    > 	at org.apache.solr.client.solrj.impl.CloudSolrClient.sendRequest(CloudSolrClient.java:1100)
   [junit4]    > 	at org.apache.solr.client.solrj.impl.CloudSolrClient.requestWithRetryOnStaleState(CloudSolrClient.java:871)
   [junit4]    > 	at org.apache.solr.client.solrj.impl.CloudSolrClient.request(CloudSolrClient.java:807)
   [junit4]    > 	at org.apache.solr.client.solrj.SolrClient.request(SolrClient.java:1220)
   [junit4]    > 	at org.apache.solr.cloud.AbstractFullDistribZkTestBase.createCollection(AbstractFullDistribZkTestBase.java:1574)
   [junit4]    > 	at org.apache.solr.cloud.AbstractFullDistribZkTestBase.createCollection(AbstractFullDistribZkTestBase.java:1595)
   [junit4]    > 	at org.apache.solr.cloud.CollectionsAPIDistributedZkTest$1CollectionThread.run(CollectionsAPIDistributedZkTest.java:881)Throwable #2: com.carrotsearch.randomizedtesting.UncaughtExceptionError: Captured an uncaught exception in thread: Thread[id=33808, name=collection4, state=RUNNABLE, group=TGRP-CollectionsAPIDistributedZkTest]
   [junit4]    > Caused by: org.apache.solr.client.solrj.impl.HttpSolrClient$RemoteSolrException: Error from server at https://127.0.0.1:51792/i_q/p: Could not find collection : awholynewstresscollection_collection4_4
   [junit4]    > 	at __randomizedtesting.SeedInfo.seed([95EB1EF282912922]:0)
   [junit4]    > 	at org.apache.solr.client.solrj.impl.HttpSolrClient.executeMethod(HttpSolrClient.java:575)
   [junit4]    > 	at org.apache.solr.client.solrj.impl.HttpSolrClient.request(HttpSolrClient.java:241)
   [junit4]    > 	at org.apache.solr.client.solrj.impl.HttpSolrClient.request(HttpSolrClient.java:230)
   [junit4]    > 	at org.apache.solr.client.solrj.impl.LBHttpSolrClient.doRequest(LBHttpSolrClient.java:372)
   [junit4]    > 	at org.apache.solr.client.solrj.impl.LBHttpSolrClient.request(LBHttpSolrClient.java:325)
   [junit4]    > 	at org.apache.solr.client.solrj.impl.CloudSolrClient.sendRequest(CloudSolrClient.java:1100)
   [junit4]    > 	at org.apache.solr.client.solrj.impl.CloudSolrClient.requestWithRetryOnStaleState(CloudSolrClient.java:871)
   [junit4]    > 	at org.apache.solr.client.solrj.impl.CloudSolrClient.request(CloudSolrClient.java:807)
   [junit4]    > 	at org.apache.solr.client.solrj.SolrClient.request(SolrClient.java:1220)
   [junit4]    > 	at org.apache.solr.cloud.CollectionsAPIDistributedZkTest$1CollectionThread.run(CollectionsAPIDistributedZkTest.java:888)Throwable #3: com.carrotsearch.randomizedtesting.UncaughtExceptionError: Captured an uncaught exception in thread: Thread[id=33809, name=collection5, state=RUNNABLE, group=TGRP-CollectionsAPIDistributedZkTest]
   [junit4]    > Caused by: org.apache.solr.client.solrj.impl.HttpSolrClient$RemoteSolrException: Error from server at https://127.0.0.1:51792/i_q/p: collection already exists: awholynewstresscollection_collection5_8
   [junit4]    > 	at __randomizedtesting.SeedInfo.seed([95EB1EF282912922]:0)
   [junit4]    > 	at org.apache.solr.client.solrj.impl.HttpSolrClient.executeMethod(HttpSolrClient.java:575)
   [junit4]    > 	at org.apache.solr.client.solrj.impl.HttpSolrClient.request(HttpSolrClient.java:241)
   [junit4]    > 	at org.apache.solr.client.solrj.impl.HttpSolrClient.request(HttpSolrClient.java:230)
   [junit4]    > 	at org.apache.solr.client.solrj.impl.LBHttpSolrClient.doRequest(LBHttpSolrClient.java:372)
   [junit4]    > 	at org.apache.solr.client.solrj.impl.LBHttpSolrClient.request(LBHttpSolrClient.java:325)
   [junit4]    > 	at org.apache.solr.client.solrj.impl.CloudSolrClient.sendRequest(CloudSolrClient.java:1100)
   [junit4]    > 	at org.apache.solr.client.solrj.impl.CloudSolrClient.requestWithRetryOnStaleState(CloudSolrClient.java:871)
   [junit4]    > 	at org.apache.solr.client.solrj.impl.CloudSolrClient.request(CloudSolrClient.java:807)
   [junit4]    > 	at org.apache.solr.client.solrj.SolrClient.request(SolrClient.java:1220)
   [junit4]    > 	at org.apache.solr.cloud.AbstractFullDistribZkTestBase.createCollection(AbstractFullDistribZkTestBase.java:1574)
   [junit4]    > 	at org.apache.solr.cloud.AbstractFullDistribZkTestBase.createCollection(AbstractFullDistribZkTestBase.java:1595)
   [junit4]    > 	at org.apache.solr.cloud.CollectionsAPIDistributedZkTest$1CollectionThread.run(CollectionsAPIDistributedZkTest.java:881)
   [junit4]   2> 2603449 INFO  (SUITE-CollectionsAPIDistributedZkTest-seed#[95EB1EF282912922]-worker) [n:127.0.0.1:38304_i_q%2Fp c:addReplicaColl s:shard2 r:core_node6 x:addReplicaColl_shard2_replica3] o.a.s.SolrTestCaseJ4 ###deleteCore
   [junit4]   2> NOTE: test params are: codec=FastCompressingStoredFields(storedFieldsFormat=CompressingStoredFieldsFormat(compressionMode=FAST, chunkSize=5, maxDocsPerChunk=7, blockSize=551), termVectorsFormat=CompressingTermVectorsFormat(compressionMode=FAST, chunkSize=5, blockSize=551)), sim=RandomSimilarityProvider(queryNorm=false,coord=no): {}, locale=it, timezone=CST
   [junit4]   2> NOTE: Linux 3.13.0-52-generic amd64/Oracle Corporation 1.7.0_80 (64-bit)/cpus=4,threads=1,free=67383416,total=468189184
   [junit4]   2> NOTE: All tests run in this JVM: [ConvertedLegacyTest, TestReqParamsAPI, CSVRequestHandlerTest, TestSolrDeletionPolicy2, TestHdfsUpdateLog, TestSurroundQueryParser, ChangedSchemaMergeTest, DistributedMLTComponentTest, HdfsChaosMonkeySafeLeaderTest, HttpPartitionTest, TestDocumentBuilder, TestClassNameShortening, SolrCmdDistributorTest, HdfsSyncSliceTest, DataDrivenBlockJoinTest, TestConfigSets, WordBreakSolrSpellCheckerTest, AnalyticsQueryTest, EnumFieldTest, TestNoOpRegenerator, TestRequestForwarding, AssignTest, TestLeaderElectionZkExpiry, DirectSolrSpellCheckerTest, HLLUtilTest, TestConfigOverlay, ZkSolrClientTest, MBeansHandlerTest, TestObjectReleaseTracker, DistribCursorPagingTest, FastVectorHighlighterTest, TestHashPartitioner, TestLRUStatsCache, TestSha256AuthenticationProvider, NotRequiredUniqueKeyTest, TestDistribDocBasedVersion, TestStressVersions, CheckHdfsIndexTest, BlockDirectoryTest, TestTrie, ShardRoutingTest, TestRandomRequestDistribution, TestBinaryResponseWriter, TimeZoneUtilsTest, ClusterStateUpdateTest, RecoveryAfterSoftCommitTest, DeleteLastCustomShardedReplicaTest, ExitableDirectoryReaderTest, SpellingQueryConverterTest, TestInitQParser, TestBM25SimilarityFactory, TestMiniSolrCloudClusterBase, TestLMJelinekMercerSimilarityFactory, TestQueryUtils, TestSmileRequest, TestDistributedStatsComponentCardinality, TestDistribIDF, TestReloadAndDeleteDocs, TestDFRSimilarityFactory, TestFastLRUCache, SpellCheckCollatorTest, IndexBasedSpellCheckerTest, TestUpdate, TestSolrQueryParserDefaultOperatorResource, TestStressUserVersions, SharedFSAutoReplicaFailoverUtilsTest, TestUseDocValuesAsStored, CollectionsAPIAsyncDistributedZkTest, OpenExchangeRatesOrgProviderTest, UpdateRequestProcessorFactoryTest, OverseerRolesTest, TestDynamicFieldCollectionResource, ShardRoutingCustomTest, NumericFieldsTest, TestPartialUpdateDeduplication, ChaosMonkeyNothingIsSafeTest, DistributedFacetPivotLargeTest, ZkStateReaderTest, TestJettySolrRunner, TestTrackingShardHandlerFactory, TestLFUCache, RestartWhileUpdatingTest, TestSortByMinMaxFunction, TestQueryTypes, TestSchemaSimilarityResource, TermsComponentTest, TestCloudPivotFacet, TestIntervalFaceting, OutOfBoxZkACLAndCredentialsProvidersTest, CollectionsAPIDistributedZkTest]
   [junit4] Completed [283/564 (1!)] on J1 in 641.11s, 1 test, 1 error <<< FAILURES!

[...truncated 916 lines...]
BUILD FAILED
/x1/jenkins/jenkins-slave/workspace/Lucene-Solr-NightlyTests-5.x/build.xml:801: The following error occurred while executing this line:
/x1/jenkins/jenkins-slave/workspace/Lucene-Solr-NightlyTests-5.x/build.xml:738: The following error occurred while executing this line:
/x1/jenkins/jenkins-slave/workspace/Lucene-Solr-NightlyTests-5.x/build.xml:59: The following error occurred while executing this line:
/x1/jenkins/jenkins-slave/workspace/Lucene-Solr-NightlyTests-5.x/solr/build.xml:233: The following error occurred while executing this line:
/x1/jenkins/jenkins-slave/workspace/Lucene-Solr-NightlyTests-5.x/solr/common-build.xml:532: The following error occurred while executing this line:
/x1/jenkins/jenkins-slave/workspace/Lucene-Solr-NightlyTests-5.x/lucene/common-build.xml:1444: The following error occurred while executing this line:
/x1/jenkins/jenkins-slave/workspace/Lucene-Solr-NightlyTests-5.x/lucene/common-build.xml:1000: There were test failures: 564 suites (7 ignored), 2253 tests, 1 error, 33 ignored (18 assumptions) [seed: 95EB1EF282912922]

Total time: 202 minutes 59 seconds
Build step 'Invoke Ant' marked build as failure
Archiving artifacts
Recording test results
Email was triggered for: Failure - Any
Sending email for trigger: Failure - Any



Mime
View raw message