lucene-dev mailing list archives

Site index · List index
Message view « Date » · « Thread »
Top « Date » · « Thread »
From Policeman Jenkins Server <jenk...@thetaphi.de>
Subject [JENKINS] Lucene-Solr-5.x-Windows (32bit/jdk1.7.0_80) - Build # 5411 - Failure!
Date Mon, 11 Jan 2016 21:14:09 GMT
Build: http://jenkins.thetaphi.de/job/Lucene-Solr-5.x-Windows/5411/
Java: 32bit/jdk1.7.0_80 -server -XX:+UseParallelGC

2 tests failed.
FAILED:  junit.framework.TestSuite.org.apache.solr.client.solrj.embedded.LargeVolumeBinaryJettyTest

Error Message:
ObjectTracker found 1 object(s) that were not released!!! [TransactionLog]

Stack Trace:
java.lang.AssertionError: ObjectTracker found 1 object(s) that were not released!!! [TransactionLog]
	at __randomizedtesting.SeedInfo.seed([699413EC8B3D3869]:0)
	at org.junit.Assert.fail(Assert.java:93)
	at org.junit.Assert.assertTrue(Assert.java:43)
	at org.junit.Assert.assertNull(Assert.java:551)
	at org.apache.solr.SolrTestCaseJ4.afterClass(SolrTestCaseJ4.java:228)
	at sun.reflect.NativeMethodAccessorImpl.invoke0(Native Method)
	at sun.reflect.NativeMethodAccessorImpl.invoke(NativeMethodAccessorImpl.java:57)
	at sun.reflect.DelegatingMethodAccessorImpl.invoke(DelegatingMethodAccessorImpl.java:43)
	at java.lang.reflect.Method.invoke(Method.java:606)
	at com.carrotsearch.randomizedtesting.RandomizedRunner.invoke(RandomizedRunner.java:1764)
	at com.carrotsearch.randomizedtesting.RandomizedRunner$7.evaluate(RandomizedRunner.java:834)
	at com.carrotsearch.randomizedtesting.rules.StatementAdapter.evaluate(StatementAdapter.java:36)
	at com.carrotsearch.randomizedtesting.rules.SystemPropertiesRestoreRule$1.evaluate(SystemPropertiesRestoreRule.java:57)
	at org.apache.lucene.util.AbstractBeforeAfterRule$1.evaluate(AbstractBeforeAfterRule.java:46)
	at com.carrotsearch.randomizedtesting.rules.StatementAdapter.evaluate(StatementAdapter.java:36)
	at org.apache.lucene.util.TestRuleStoreClassName$1.evaluate(TestRuleStoreClassName.java:42)
	at com.carrotsearch.randomizedtesting.rules.NoShadowingOrOverridesOnMethodsRule$1.evaluate(NoShadowingOrOverridesOnMethodsRule.java:40)
	at com.carrotsearch.randomizedtesting.rules.NoShadowingOrOverridesOnMethodsRule$1.evaluate(NoShadowingOrOverridesOnMethodsRule.java:40)
	at com.carrotsearch.randomizedtesting.rules.StatementAdapter.evaluate(StatementAdapter.java:36)
	at com.carrotsearch.randomizedtesting.rules.StatementAdapter.evaluate(StatementAdapter.java:36)
	at com.carrotsearch.randomizedtesting.rules.StatementAdapter.evaluate(StatementAdapter.java:36)
	at org.apache.lucene.util.TestRuleAssertionsRequired$1.evaluate(TestRuleAssertionsRequired.java:54)
	at org.apache.lucene.util.TestRuleMarkFailure$1.evaluate(TestRuleMarkFailure.java:48)
	at org.apache.lucene.util.TestRuleIgnoreAfterMaxFailures$1.evaluate(TestRuleIgnoreAfterMaxFailures.java:65)
	at org.apache.lucene.util.TestRuleIgnoreTestSuites$1.evaluate(TestRuleIgnoreTestSuites.java:55)
	at com.carrotsearch.randomizedtesting.rules.StatementAdapter.evaluate(StatementAdapter.java:36)
	at com.carrotsearch.randomizedtesting.ThreadLeakControl$StatementRunner.run(ThreadLeakControl.java:367)
	at java.lang.Thread.run(Thread.java:745)


FAILED:  junit.framework.TestSuite.org.apache.solr.client.solrj.embedded.LargeVolumeBinaryJettyTest

Error Message:
Could not remove the following files (in the order of attempts):    C:\Users\JenkinsSlave\workspace\Lucene-Solr-5.x-Windows\solr\build\solr-solrj\test\J1\temp\solr.client.solrj.embedded.LargeVolumeBinaryJettyTest_699413EC8B3D3869-001\tempDir-001\collection1\data\tlog\tlog.0000000000000000002: java.nio.file.FileSystemException: C:\Users\JenkinsSlave\workspace\Lucene-Solr-5.x-Windows\solr\build\solr-solrj\test\J1\temp\solr.client.solrj.embedded.LargeVolumeBinaryJettyTest_699413EC8B3D3869-001\tempDir-001\collection1\data\tlog\tlog.0000000000000000002: The process cannot access the file because it is being used by another process.     C:\Users\JenkinsSlave\workspace\Lucene-Solr-5.x-Windows\solr\build\solr-solrj\test\J1\temp\solr.client.solrj.embedded.LargeVolumeBinaryJettyTest_699413EC8B3D3869-001\tempDir-001\collection1\data\tlog: java.nio.file.DirectoryNotEmptyException: C:\Users\JenkinsSlave\workspace\Lucene-Solr-5.x-Windows\solr\build\solr-solrj\test\J1\temp\solr.client.solrj.embedded.LargeVolumeBinaryJettyTest_699413EC8B3D3869-001\tempDir-001\collection1\data\tlog    C:\Users\JenkinsSlave\workspace\Lucene-Solr-5.x-Windows\solr\build\solr-solrj\test\J1\temp\solr.client.solrj.embedded.LargeVolumeBinaryJettyTest_699413EC8B3D3869-001\tempDir-001\collection1\data: java.nio.file.DirectoryNotEmptyException: C:\Users\JenkinsSlave\workspace\Lucene-Solr-5.x-Windows\solr\build\solr-solrj\test\J1\temp\solr.client.solrj.embedded.LargeVolumeBinaryJettyTest_699413EC8B3D3869-001\tempDir-001\collection1\data    C:\Users\JenkinsSlave\workspace\Lucene-Solr-5.x-Windows\solr\build\solr-solrj\test\J1\temp\solr.client.solrj.embedded.LargeVolumeBinaryJettyTest_699413EC8B3D3869-001\tempDir-001\collection1: java.nio.file.DirectoryNotEmptyException: C:\Users\JenkinsSlave\workspace\Lucene-Solr-5.x-Windows\solr\build\solr-solrj\test\J1\temp\solr.client.solrj.embedded.LargeVolumeBinaryJettyTest_699413EC8B3D3869-001\tempDir-001\collection1    C:\Users\JenkinsSlave\workspace\Lucene-Solr-5.x-Windows\solr\build\solr-solrj\test\J1\temp\solr.client.solrj.embedded.LargeVolumeBinaryJettyTest_699413EC8B3D3869-001\tempDir-001: java.nio.file.DirectoryNotEmptyException: C:\Users\JenkinsSlave\workspace\Lucene-Solr-5.x-Windows\solr\build\solr-solrj\test\J1\temp\solr.client.solrj.embedded.LargeVolumeBinaryJettyTest_699413EC8B3D3869-001\tempDir-001    C:\Users\JenkinsSlave\workspace\Lucene-Solr-5.x-Windows\solr\build\solr-solrj\test\J1\temp\solr.client.solrj.embedded.LargeVolumeBinaryJettyTest_699413EC8B3D3869-001: java.nio.file.DirectoryNotEmptyException: C:\Users\JenkinsSlave\workspace\Lucene-Solr-5.x-Windows\solr\build\solr-solrj\test\J1\temp\solr.client.solrj.embedded.LargeVolumeBinaryJettyTest_699413EC8B3D3869-001 

Stack Trace:
java.io.IOException: Could not remove the following files (in the order of attempts):
   C:\Users\JenkinsSlave\workspace\Lucene-Solr-5.x-Windows\solr\build\solr-solrj\test\J1\temp\solr.client.solrj.embedded.LargeVolumeBinaryJettyTest_699413EC8B3D3869-001\tempDir-001\collection1\data\tlog\tlog.0000000000000000002: java.nio.file.FileSystemException: C:\Users\JenkinsSlave\workspace\Lucene-Solr-5.x-Windows\solr\build\solr-solrj\test\J1\temp\solr.client.solrj.embedded.LargeVolumeBinaryJettyTest_699413EC8B3D3869-001\tempDir-001\collection1\data\tlog\tlog.0000000000000000002: The process cannot access the file because it is being used by another process.

   C:\Users\JenkinsSlave\workspace\Lucene-Solr-5.x-Windows\solr\build\solr-solrj\test\J1\temp\solr.client.solrj.embedded.LargeVolumeBinaryJettyTest_699413EC8B3D3869-001\tempDir-001\collection1\data\tlog: java.nio.file.DirectoryNotEmptyException: C:\Users\JenkinsSlave\workspace\Lucene-Solr-5.x-Windows\solr\build\solr-solrj\test\J1\temp\solr.client.solrj.embedded.LargeVolumeBinaryJettyTest_699413EC8B3D3869-001\tempDir-001\collection1\data\tlog
   C:\Users\JenkinsSlave\workspace\Lucene-Solr-5.x-Windows\solr\build\solr-solrj\test\J1\temp\solr.client.solrj.embedded.LargeVolumeBinaryJettyTest_699413EC8B3D3869-001\tempDir-001\collection1\data: java.nio.file.DirectoryNotEmptyException: C:\Users\JenkinsSlave\workspace\Lucene-Solr-5.x-Windows\solr\build\solr-solrj\test\J1\temp\solr.client.solrj.embedded.LargeVolumeBinaryJettyTest_699413EC8B3D3869-001\tempDir-001\collection1\data
   C:\Users\JenkinsSlave\workspace\Lucene-Solr-5.x-Windows\solr\build\solr-solrj\test\J1\temp\solr.client.solrj.embedded.LargeVolumeBinaryJettyTest_699413EC8B3D3869-001\tempDir-001\collection1: java.nio.file.DirectoryNotEmptyException: C:\Users\JenkinsSlave\workspace\Lucene-Solr-5.x-Windows\solr\build\solr-solrj\test\J1\temp\solr.client.solrj.embedded.LargeVolumeBinaryJettyTest_699413EC8B3D3869-001\tempDir-001\collection1
   C:\Users\JenkinsSlave\workspace\Lucene-Solr-5.x-Windows\solr\build\solr-solrj\test\J1\temp\solr.client.solrj.embedded.LargeVolumeBinaryJettyTest_699413EC8B3D3869-001\tempDir-001: java.nio.file.DirectoryNotEmptyException: C:\Users\JenkinsSlave\workspace\Lucene-Solr-5.x-Windows\solr\build\solr-solrj\test\J1\temp\solr.client.solrj.embedded.LargeVolumeBinaryJettyTest_699413EC8B3D3869-001\tempDir-001
   C:\Users\JenkinsSlave\workspace\Lucene-Solr-5.x-Windows\solr\build\solr-solrj\test\J1\temp\solr.client.solrj.embedded.LargeVolumeBinaryJettyTest_699413EC8B3D3869-001: java.nio.file.DirectoryNotEmptyException: C:\Users\JenkinsSlave\workspace\Lucene-Solr-5.x-Windows\solr\build\solr-solrj\test\J1\temp\solr.client.solrj.embedded.LargeVolumeBinaryJettyTest_699413EC8B3D3869-001

	at org.apache.lucene.util.IOUtils.rm(IOUtils.java:295)
	at org.apache.lucene.util.TestRuleTemporaryFilesCleanup.afterAlways(TestRuleTemporaryFilesCleanup.java:218)
	at com.carrotsearch.randomizedtesting.rules.TestRuleAdapter$1.afterAlways(TestRuleAdapter.java:31)
	at com.carrotsearch.randomizedtesting.rules.StatementAdapter.evaluate(StatementAdapter.java:43)
	at com.carrotsearch.randomizedtesting.rules.StatementAdapter.evaluate(StatementAdapter.java:36)
	at org.apache.lucene.util.TestRuleAssertionsRequired$1.evaluate(TestRuleAssertionsRequired.java:54)
	at org.apache.lucene.util.TestRuleMarkFailure$1.evaluate(TestRuleMarkFailure.java:48)
	at org.apache.lucene.util.TestRuleIgnoreAfterMaxFailures$1.evaluate(TestRuleIgnoreAfterMaxFailures.java:65)
	at org.apache.lucene.util.TestRuleIgnoreTestSuites$1.evaluate(TestRuleIgnoreTestSuites.java:55)
	at com.carrotsearch.randomizedtesting.rules.StatementAdapter.evaluate(StatementAdapter.java:36)
	at com.carrotsearch.randomizedtesting.ThreadLeakControl$StatementRunner.run(ThreadLeakControl.java:367)
	at java.lang.Thread.run(Thread.java:745)




Build Log:
[...truncated 11964 lines...]
   [junit4] Suite: org.apache.solr.client.solrj.embedded.LargeVolumeBinaryJettyTest
   [junit4]   2> Creating dataDir: C:\Users\JenkinsSlave\workspace\Lucene-Solr-5.x-Windows\solr\build\solr-solrj\test\J1\temp\solr.client.solrj.embedded.LargeVolumeBinaryJettyTest_699413EC8B3D3869-001\init-core-data-001
   [junit4]   2> 37104 INFO  (SUITE-LargeVolumeBinaryJettyTest-seed#[699413EC8B3D3869]-worker) [    ] o.a.s.SolrTestCaseJ4 Randomized ssl (false) and clientAuth (false)
   [junit4]   2> 37301 INFO  (SUITE-LargeVolumeBinaryJettyTest-seed#[699413EC8B3D3869]-worker) [    ] o.a.s.SolrTestCaseJ4 ####initCore
   [junit4]   2> 37301 INFO  (SUITE-LargeVolumeBinaryJettyTest-seed#[699413EC8B3D3869]-worker) [    ] o.a.s.SolrTestCaseJ4 ####initCore end
   [junit4]   2> 37303 INFO  (SUITE-LargeVolumeBinaryJettyTest-seed#[699413EC8B3D3869]-worker) [    ] o.a.s.SolrTestCaseJ4 Writing core.properties file to C:\Users\JenkinsSlave\workspace\Lucene-Solr-5.x-Windows\solr\build\solr-solrj\test\J1\temp\solr.client.solrj.embedded.LargeVolumeBinaryJettyTest_699413EC8B3D3869-001\tempDir-002\cores\core
   [junit4]   2> 37306 INFO  (SUITE-LargeVolumeBinaryJettyTest-seed#[699413EC8B3D3869]-worker) [    ] o.e.j.s.Server jetty-9.2.13.v20150730
   [junit4]   2> 37309 INFO  (SUITE-LargeVolumeBinaryJettyTest-seed#[699413EC8B3D3869]-worker) [    ] o.e.j.s.h.ContextHandler Started o.e.j.s.ServletContextHandler@1e7782e{/solr,null,AVAILABLE}
   [junit4]   2> 37311 INFO  (SUITE-LargeVolumeBinaryJettyTest-seed#[699413EC8B3D3869]-worker) [    ] o.e.j.s.ServerConnector Started ServerConnector@179c53d{HTTP/1.1}{127.0.0.1:55041}
   [junit4]   2> 37312 INFO  (SUITE-LargeVolumeBinaryJettyTest-seed#[699413EC8B3D3869]-worker) [    ] o.e.j.s.Server Started @40956ms
   [junit4]   2> 37312 INFO  (SUITE-LargeVolumeBinaryJettyTest-seed#[699413EC8B3D3869]-worker) [    ] o.a.s.c.s.e.JettySolrRunner Jetty properties: {configSetBaseDir=C:\Users\JenkinsSlave\workspace\Lucene-Solr-5.x-Windows\solr\build\solr-solrj\test\J1\temp\solr.client.solrj.embedded.LargeVolumeBinaryJettyTest_699413EC8B3D3869-001\tempDir-001, hostContext=/solr, hostPort=55041, coreRootDirectory=C:\Users\JenkinsSlave\workspace\Lucene-Solr-5.x-Windows\solr\build\solr-solrj\test\J1\temp\solr.client.solrj.embedded.LargeVolumeBinaryJettyTest_699413EC8B3D3869-001\tempDir-002\cores}
   [junit4]   2> 37312 INFO  (SUITE-LargeVolumeBinaryJettyTest-seed#[699413EC8B3D3869]-worker) [    ] o.a.s.s.SolrDispatchFilter SolrDispatchFilter.init(): sun.misc.Launcher$AppClassLoader@a65760
   [junit4]   2> 37312 INFO  (SUITE-LargeVolumeBinaryJettyTest-seed#[699413EC8B3D3869]-worker) [    ] o.a.s.c.SolrResourceLoader new SolrResourceLoader for directory: 'C:\Users\JenkinsSlave\workspace\Lucene-Solr-5.x-Windows\solr\build\solr-solrj\test\J1\temp\solr.client.solrj.embedded.LargeVolumeBinaryJettyTest_699413EC8B3D3869-001\tempDir-001'
   [junit4]   2> 37312 INFO  (SUITE-LargeVolumeBinaryJettyTest-seed#[699413EC8B3D3869]-worker) [    ] o.a.s.c.SolrResourceLoader JNDI not configured for solr (NoInitialContextEx)
   [junit4]   2> 37313 INFO  (SUITE-LargeVolumeBinaryJettyTest-seed#[699413EC8B3D3869]-worker) [    ] o.a.s.c.SolrResourceLoader using system property solr.solr.home: C:\Users\JenkinsSlave\workspace\Lucene-Solr-5.x-Windows\solr\build\solr-solrj\test\J1\temp\solr.client.solrj.embedded.LargeVolumeBinaryJettyTest_699413EC8B3D3869-001\tempDir-001
   [junit4]   2> 37313 INFO  (SUITE-LargeVolumeBinaryJettyTest-seed#[699413EC8B3D3869]-worker) [    ] o.a.s.c.SolrXmlConfig Loading container configuration from C:\Users\JenkinsSlave\workspace\Lucene-Solr-5.x-Windows\solr\build\solr-solrj\test\J1\temp\solr.client.solrj.embedded.LargeVolumeBinaryJettyTest_699413EC8B3D3869-001\tempDir-001\solr.xml
   [junit4]   2> 37344 INFO  (SUITE-LargeVolumeBinaryJettyTest-seed#[699413EC8B3D3869]-worker) [    ] o.a.s.c.CorePropertiesLocator Config-defined core root directory: C:\Users\JenkinsSlave\workspace\Lucene-Solr-5.x-Windows\solr\build\solr-solrj\test\J1\temp\solr.client.solrj.embedded.LargeVolumeBinaryJettyTest_699413EC8B3D3869-001\tempDir-001
   [junit4]   2> 37344 INFO  (SUITE-LargeVolumeBinaryJettyTest-seed#[699413EC8B3D3869]-worker) [    ] o.a.s.c.CoreContainer New CoreContainer 14508434
   [junit4]   2> 37344 INFO  (SUITE-LargeVolumeBinaryJettyTest-seed#[699413EC8B3D3869]-worker) [    ] o.a.s.c.CoreContainer Loading cores into CoreContainer [instanceDir=C:\Users\JenkinsSlave\workspace\Lucene-Solr-5.x-Windows\solr\build\solr-solrj\test\J1\temp\solr.client.solrj.embedded.LargeVolumeBinaryJettyTest_699413EC8B3D3869-001\tempDir-001]
   [junit4]   2> 37345 WARN  (SUITE-LargeVolumeBinaryJettyTest-seed#[699413EC8B3D3869]-worker) [    ] o.a.s.c.CoreContainer Couldn't add files from C:\Users\JenkinsSlave\workspace\Lucene-Solr-5.x-Windows\solr\build\solr-solrj\test\J1\temp\solr.client.solrj.embedded.LargeVolumeBinaryJettyTest_699413EC8B3D3869-001\tempDir-001\lib to classpath: C:\Users\JenkinsSlave\workspace\Lucene-Solr-5.x-Windows\solr\build\solr-solrj\test\J1\temp\solr.client.solrj.embedded.LargeVolumeBinaryJettyTest_699413EC8B3D3869-001\tempDir-001\lib
   [junit4]   2> 37345 INFO  (SUITE-LargeVolumeBinaryJettyTest-seed#[699413EC8B3D3869]-worker) [    ] o.a.s.h.c.HttpShardHandlerFactory created with socketTimeout : 600000,connTimeout : 60000,maxConnectionsPerHost : 20,maxConnections : 10000,corePoolSize : 0,maximumPoolSize : 2147483647,maxThreadIdleTime : 5,sizeOfQueue : -1,fairnessPolicy : false,useRetries : false,
   [junit4]   2> 37348 INFO  (SUITE-LargeVolumeBinaryJettyTest-seed#[699413EC8B3D3869]-worker) [    ] o.a.s.u.UpdateShardHandler Creating UpdateShardHandler HTTP client with params: socketTimeout=600000&connTimeout=60000&retry=true
   [junit4]   2> 37348 INFO  (SUITE-LargeVolumeBinaryJettyTest-seed#[699413EC8B3D3869]-worker) [    ] o.a.s.l.LogWatcher SLF4J impl is org.slf4j.impl.Log4jLoggerFactory
   [junit4]   2> 37348 INFO  (SUITE-LargeVolumeBinaryJettyTest-seed#[699413EC8B3D3869]-worker) [    ] o.a.s.l.LogWatcher Registering Log Listener [Log4j (org.slf4j.impl.Log4jLoggerFactory)]
   [junit4]   2> 37348 INFO  (SUITE-LargeVolumeBinaryJettyTest-seed#[699413EC8B3D3869]-worker) [    ] o.a.s.c.CoreContainer Security conf doesn't exist. Skipping setup for authorization module.
   [junit4]   2> 37348 INFO  (SUITE-LargeVolumeBinaryJettyTest-seed#[699413EC8B3D3869]-worker) [    ] o.a.s.c.CoreContainer No authentication plugin used.
   [junit4]   2> 37349 INFO  (SUITE-LargeVolumeBinaryJettyTest-seed#[699413EC8B3D3869]-worker) [    ] o.a.s.c.CorePropertiesLocator Looking for core definitions underneath C:\Users\JenkinsSlave\workspace\Lucene-Solr-5.x-Windows\solr\build\solr-solrj\test\J1\temp\solr.client.solrj.embedded.LargeVolumeBinaryJettyTest_699413EC8B3D3869-001\tempDir-001
   [junit4]   2> 37363 INFO  (SUITE-LargeVolumeBinaryJettyTest-seed#[699413EC8B3D3869]-worker) [    ] o.a.s.c.CoreDescriptor Created CoreDescriptor: {transient=false, dataDir=data\, schema=schema.xml, name=collection1, loadOnStartup=true, configSetProperties=configsetprops.json, config=solrconfig.xml}
   [junit4]   2> 37363 INFO  (SUITE-LargeVolumeBinaryJettyTest-seed#[699413EC8B3D3869]-worker) [    ] o.a.s.c.CorePropertiesLocator Found core collection1 in C:\Users\JenkinsSlave\workspace\Lucene-Solr-5.x-Windows\solr\build\solr-solrj\test\J1\temp\solr.client.solrj.embedded.LargeVolumeBinaryJettyTest_699413EC8B3D3869-001\tempDir-001\collection1
   [junit4]   2> 37363 INFO  (SUITE-LargeVolumeBinaryJettyTest-seed#[699413EC8B3D3869]-worker) [    ] o.a.s.c.CorePropertiesLocator Found 1 core definitions
   [junit4]   2> 37364 INFO  (SUITE-LargeVolumeBinaryJettyTest-seed#[699413EC8B3D3869]-worker) [    ] o.a.s.s.SolrDispatchFilter user.dir=C:\Users\JenkinsSlave\workspace\Lucene-Solr-5.x-Windows\solr\build\solr-solrj\test\J1
   [junit4]   2> 37364 INFO  (SUITE-LargeVolumeBinaryJettyTest-seed#[699413EC8B3D3869]-worker) [    ] o.a.s.s.SolrDispatchFilter SolrDispatchFilter.init() done
   [junit4]   2> 37367 INFO  (coreLoadExecutor-29-thread-1) [    ] o.a.s.c.SolrResourceLoader new SolrResourceLoader for directory: 'C:\Users\JenkinsSlave\workspace\Lucene-Solr-5.x-Windows\solr\build\solr-solrj\test\J1\temp\solr.client.solrj.embedded.LargeVolumeBinaryJettyTest_699413EC8B3D3869-001\tempDir-001\collection1'
   [junit4]   2> 37367 INFO  (coreLoadExecutor-29-thread-1) [    ] o.a.s.c.SolrResourceLoader JNDI not configured for solr (NoInitialContextEx)
   [junit4]   2> 37367 INFO  (coreLoadExecutor-29-thread-1) [    ] o.a.s.c.SolrResourceLoader using system property solr.solr.home: C:\Users\JenkinsSlave\workspace\Lucene-Solr-5.x-Windows\solr\build\solr-solrj\test\J1\temp\solr.client.solrj.embedded.LargeVolumeBinaryJettyTest_699413EC8B3D3869-001\tempDir-001
   [junit4]   2> 37433 INFO  (coreLoadExecutor-29-thread-1) [    ] o.a.s.c.SolrConfig current version of requestparams : -1
   [junit4]   2> 37434 INFO  (coreLoadExecutor-29-thread-1) [    ] o.a.s.c.SolrConfig Adding specified lib dirs to ClassLoader
   [junit4]   2> 37435 WARN  (coreLoadExecutor-29-thread-1) [    ] o.a.s.c.SolrConfig Couldn't add files from C:\Users\JenkinsSlave\workspace\Lucene-Solr-5.x-Windows\solr\build\solr-solrj\test\J1\temp\solr.client.solrj.embedded.LargeVolumeBinaryJettyTest_699413EC8B3D3869-001\tempDir-001\collection1\..\..\..\..\contrib\extraction\lib filtered by .*\.jar to classpath: C:\Users\JenkinsSlave\workspace\Lucene-Solr-5.x-Windows\solr\build\solr-solrj\test\J1\temp\solr.client.solrj.embedded.LargeVolumeBinaryJettyTest_699413EC8B3D3869-001\tempDir-001\collection1\..\..\..\..\contrib\extraction\lib
   [junit4]   2> 37436 WARN  (coreLoadExecutor-29-thread-1) [    ] o.a.s.c.SolrConfig Couldn't add files from C:\Users\JenkinsSlave\workspace\Lucene-Solr-5.x-Windows\solr\build\solr-solrj\test\J1\temp\solr.client.solrj.embedded.LargeVolumeBinaryJettyTest_699413EC8B3D3869-001\tempDir-001\collection1\..\..\..\..\dist filtered by solr-cell-\d.*\.jar to classpath: C:\Users\JenkinsSlave\workspace\Lucene-Solr-5.x-Windows\solr\build\solr-solrj\test\J1\temp\solr.client.solrj.embedded.LargeVolumeBinaryJettyTest_699413EC8B3D3869-001\tempDir-001\collection1\..\..\..\..\dist
   [junit4]   2> 37436 WARN  (coreLoadExecutor-29-thread-1) [    ] o.a.s.c.SolrConfig Couldn't add files from C:\Users\JenkinsSlave\workspace\Lucene-Solr-5.x-Windows\solr\build\solr-solrj\test\J1\temp\solr.client.solrj.embedded.LargeVolumeBinaryJettyTest_699413EC8B3D3869-001\tempDir-001\collection1\..\..\..\..\contrib\clustering\lib filtered by .*\.jar to classpath: C:\Users\JenkinsSlave\workspace\Lucene-Solr-5.x-Windows\solr\build\solr-solrj\test\J1\temp\solr.client.solrj.embedded.LargeVolumeBinaryJettyTest_699413EC8B3D3869-001\tempDir-001\collection1\..\..\..\..\contrib\clustering\lib
   [junit4]   2> 37436 WARN  (coreLoadExecutor-29-thread-1) [    ] o.a.s.c.SolrConfig Couldn't add files from C:\Users\JenkinsSlave\workspace\Lucene-Solr-5.x-Windows\solr\build\solr-solrj\test\J1\temp\solr.client.solrj.embedded.LargeVolumeBinaryJettyTest_699413EC8B3D3869-001\tempDir-001\collection1\..\..\..\..\dist filtered by solr-clustering-\d.*\.jar to classpath: C:\Users\JenkinsSlave\workspace\Lucene-Solr-5.x-Windows\solr\build\solr-solrj\test\J1\temp\solr.client.solrj.embedded.LargeVolumeBinaryJettyTest_699413EC8B3D3869-001\tempDir-001\collection1\..\..\..\..\dist
   [junit4]   2> 37437 WARN  (coreLoadExecutor-29-thread-1) [    ] o.a.s.c.SolrConfig Couldn't add files from C:\Users\JenkinsSlave\workspace\Lucene-Solr-5.x-Windows\solr\build\solr-solrj\test\J1\temp\solr.client.solrj.embedded.LargeVolumeBinaryJettyTest_699413EC8B3D3869-001\tempDir-001\collection1\..\..\..\..\contrib\langid\lib filtered by .*\.jar to classpath: C:\Users\JenkinsSlave\workspace\Lucene-Solr-5.x-Windows\solr\build\solr-solrj\test\J1\temp\solr.client.solrj.embedded.LargeVolumeBinaryJettyTest_699413EC8B3D3869-001\tempDir-001\collection1\..\..\..\..\contrib\langid\lib
   [junit4]   2> 37437 WARN  (coreLoadExecutor-29-thread-1) [    ] o.a.s.c.SolrConfig Couldn't add files from C:\Users\JenkinsSlave\workspace\Lucene-Solr-5.x-Windows\solr\build\solr-solrj\test\J1\temp\solr.client.solrj.embedded.LargeVolumeBinaryJettyTest_699413EC8B3D3869-001\tempDir-001\collection1\..\..\..\..\dist filtered by solr-langid-\d.*\.jar to classpath: C:\Users\JenkinsSlave\workspace\Lucene-Solr-5.x-Windows\solr\build\solr-solrj\test\J1\temp\solr.client.solrj.embedded.LargeVolumeBinaryJettyTest_699413EC8B3D3869-001\tempDir-001\collection1\..\..\..\..\dist
   [junit4]   2> 37438 WARN  (coreLoadExecutor-29-thread-1) [    ] o.a.s.c.SolrConfig Couldn't add files from C:\Users\JenkinsSlave\workspace\Lucene-Solr-5.x-Windows\solr\build\solr-solrj\test\J1\temp\solr.client.solrj.embedded.LargeVolumeBinaryJettyTest_699413EC8B3D3869-001\tempDir-001\collection1\..\..\..\..\contrib\velocity\lib filtered by .*\.jar to classpath: C:\Users\JenkinsSlave\workspace\Lucene-Solr-5.x-Windows\solr\build\solr-solrj\test\J1\temp\solr.client.solrj.embedded.LargeVolumeBinaryJettyTest_699413EC8B3D3869-001\tempDir-001\collection1\..\..\..\..\contrib\velocity\lib
   [junit4]   2> 37438 WARN  (coreLoadExecutor-29-thread-1) [    ] o.a.s.c.SolrConfig Couldn't add files from C:\Users\JenkinsSlave\workspace\Lucene-Solr-5.x-Windows\solr\build\solr-solrj\test\J1\temp\solr.client.solrj.embedded.LargeVolumeBinaryJettyTest_699413EC8B3D3869-001\tempDir-001\collection1\..\..\..\..\dist filtered by solr-velocity-\d.*\.jar to classpath: C:\Users\JenkinsSlave\workspace\Lucene-Solr-5.x-Windows\solr\build\solr-solrj\test\J1\temp\solr.client.solrj.embedded.LargeVolumeBinaryJettyTest_699413EC8B3D3869-001\tempDir-001\collection1\..\..\..\..\dist
   [junit4]   2> 37467 INFO  (coreLoadExecutor-29-thread-1) [    ] o.a.s.u.SolrIndexConfig IndexWriter infoStream solr logging is enabled
   [junit4]   2> 37470 INFO  (coreLoadExecutor-29-thread-1) [    ] o.a.s.c.SolrConfig Using Lucene MatchVersion: 5.5.0
   [junit4]   2> 37531 INFO  (coreLoadExecutor-29-thread-1) [    ] o.a.s.c.SolrConfig Loaded SolrConfig: solrconfig.xml
   [junit4]   2> 37591 INFO  (coreLoadExecutor-29-thread-1) [    ] o.a.s.s.IndexSchema [collection1] Schema name=example
   [junit4]   2> 38070 INFO  (coreLoadExecutor-29-thread-1) [    ] o.a.s.s.IndexSchema unique key field: id
   [junit4]   2> 38099 INFO  (coreLoadExecutor-29-thread-1) [    ] o.a.s.r.RestManager Registered ManagedResource impl org.apache.solr.rest.schema.analysis.ManagedWordSetResource for path /schema/analysis/stopwords/english
   [junit4]   2> 38100 INFO  (coreLoadExecutor-29-thread-1) [    ] o.a.s.r.RestManager Registered ManagedResource impl org.apache.solr.rest.schema.analysis.ManagedSynonymFilterFactory$SynonymManager for path /schema/analysis/synonyms/english
   [junit4]   2> 38142 INFO  (coreLoadExecutor-29-thread-1) [    ] o.a.s.r.RestManager Added observer of type org.apache.solr.rest.schema.analysis.ManagedStopFilterFactory to existing ManagedResource /schema/analysis/stopwords/english
   [junit4]   2> 38142 INFO  (coreLoadExecutor-29-thread-1) [    ] o.a.s.r.RestManager Added observer of type org.apache.solr.rest.schema.analysis.ManagedSynonymFilterFactory to existing ManagedResource /schema/analysis/synonyms/english
   [junit4]   2> 38162 INFO  (coreLoadExecutor-29-thread-1) [    ] o.a.s.s.FileExchangeRateProvider Reloading exchange rates from file currency.xml
   [junit4]   2> 38167 INFO  (coreLoadExecutor-29-thread-1) [    ] o.a.s.s.FileExchangeRateProvider Reloading exchange rates from file currency.xml
   [junit4]   2> 38197 INFO  (coreLoadExecutor-29-thread-1) [    ] o.a.s.c.ConfigSetProperties Did not find ConfigSet properties, assuming default properties: Can't find resource 'configsetprops.json' in classpath or 'C:\Users\JenkinsSlave\workspace\Lucene-Solr-5.x-Windows\solr\build\solr-solrj\test\J1\temp\solr.client.solrj.embedded.LargeVolumeBinaryJettyTest_699413EC8B3D3869-001\tempDir-001\collection1'
   [junit4]   2> 38197 INFO  (coreLoadExecutor-29-thread-1) [    ] o.a.s.c.CoreContainer Creating SolrCore 'collection1' using configuration from instancedir C:\Users\JenkinsSlave\workspace\Lucene-Solr-5.x-Windows\solr\build\solr-solrj\test\J1\temp\solr.client.solrj.embedded.LargeVolumeBinaryJettyTest_699413EC8B3D3869-001\tempDir-001\collection1
   [junit4]   2> 38198 INFO  (coreLoadExecutor-29-thread-1) [    x:collection1] o.a.s.c.SolrCore org.apache.solr.core.MockDirectoryFactory
   [junit4]   2> 38198 INFO  (coreLoadExecutor-29-thread-1) [    x:collection1] o.a.s.c.SolrCore [[collection1] ] Opening new SolrCore at [C:\Users\JenkinsSlave\workspace\Lucene-Solr-5.x-Windows\solr\build\solr-solrj\test\J1\temp\solr.client.solrj.embedded.LargeVolumeBinaryJettyTest_699413EC8B3D3869-001\tempDir-001\collection1], dataDir=[C:\Users\JenkinsSlave\workspace\Lucene-Solr-5.x-Windows\solr\build\solr-solrj\test\J1\temp\solr.client.solrj.embedded.LargeVolumeBinaryJettyTest_699413EC8B3D3869-001\tempDir-001\collection1\data\]
   [junit4]   2> 38198 INFO  (coreLoadExecutor-29-thread-1) [    x:collection1] o.a.s.c.JmxMonitoredMap JMX monitoring is enabled. Adding Solr mbeans to JMX Server: com.sun.jmx.mbeanserver.JmxMBeanServer@2da17b
   [junit4]   2> 38205 INFO  (coreLoadExecutor-29-thread-1) [    x:collection1] o.a.s.c.SolrCore [[collection1] ] Added SolrEventListener for newSearcher: [org.apache.solr.core.QuerySenderListener{queries=[]}]
   [junit4]   2> 38205 INFO  (coreLoadExecutor-29-thread-1) [    x:collection1] o.a.s.c.SolrCore [[collection1] ] Added SolrEventListener for firstSearcher: [org.apache.solr.core.QuerySenderListener{queries=[{q=static firstSearcher warming in solrconfig.xml}]}]
   [junit4]   2> 38205 INFO  (coreLoadExecutor-29-thread-1) [    x:collection1] o.a.s.c.SchemaCodecFactory Using default compressionMode: BEST_SPEED
   [junit4]   2> 38206 INFO  (coreLoadExecutor-29-thread-1) [    x:collection1] o.a.s.c.CachingDirectoryFactory return new directory for C:\Users\JenkinsSlave\workspace\Lucene-Solr-5.x-Windows\solr\build\solr-solrj\test\J1\temp\solr.client.solrj.embedded.LargeVolumeBinaryJettyTest_699413EC8B3D3869-001\tempDir-001\collection1\data\
   [junit4]   2> 38206 INFO  (coreLoadExecutor-29-thread-1) [    x:collection1] o.a.s.c.SolrCore New index directory detected: old=null new=C:\Users\JenkinsSlave\workspace\Lucene-Solr-5.x-Windows\solr\build\solr-solrj\test\J1\temp\solr.client.solrj.embedded.LargeVolumeBinaryJettyTest_699413EC8B3D3869-001\tempDir-001\collection1\data\index/
   [junit4]   2> 38206 WARN  (coreLoadExecutor-29-thread-1) [    x:collection1] o.a.s.c.SolrCore [collection1] Solr index directory 'C:\Users\JenkinsSlave\workspace\Lucene-Solr-5.x-Windows\solr\build\solr-solrj\test\J1\temp\solr.client.solrj.embedded.LargeVolumeBinaryJettyTest_699413EC8B3D3869-001\tempDir-001\collection1\data\index' doesn't exist. Creating new index...
   [junit4]   2> 38207 INFO  (coreLoadExecutor-29-thread-1) [    x:collection1] o.a.s.c.CachingDirectoryFactory return new directory for C:\Users\JenkinsSlave\workspace\Lucene-Solr-5.x-Windows\solr\build\solr-solrj\test\J1\temp\solr.client.solrj.embedded.LargeVolumeBinaryJettyTest_699413EC8B3D3869-001\tempDir-001\collection1\data\index
   [junit4]   2> 38207 INFO  (coreLoadExecutor-29-thread-1) [    x:collection1] o.a.s.u.LoggingInfoStream [IFD][coreLoadExecutor-29-thread-1]: init: current segments file is "segments"; deletionPolicy=org.apache.solr.core.IndexDeletionPolicyWrapper@2471c7
   [junit4]   2> 38207 INFO  (coreLoadExecutor-29-thread-1) [    x:collection1] o.a.s.u.LoggingInfoStream [IFD][coreLoadExecutor-29-thread-1]: now checkpoint "" [0 segments ; isCommit = false]
   [junit4]   2> 38207 INFO  (coreLoadExecutor-29-thread-1) [    x:collection1] o.a.s.u.LoggingInfoStream [IFD][coreLoadExecutor-29-thread-1]: 0 msec to checkpoint
   [junit4]   2> 38207 INFO  (coreLoadExecutor-29-thread-1) [    x:collection1] o.a.s.u.LoggingInfoStream [IW][coreLoadExecutor-29-thread-1]: init: create=true
   [junit4]   2> 38207 INFO  (coreLoadExecutor-29-thread-1) [    x:collection1] o.a.s.u.LoggingInfoStream [IW][coreLoadExecutor-29-thread-1]: 
   [junit4]   2> dir=MockDirectoryWrapper(RAMDirectory@3c9e5c lockFactory=org.apache.lucene.store.SingleInstanceLockFactory@1c0d224)
   [junit4]   2> index=
   [junit4]   2> version=5.5.0
   [junit4]   2> analyzer=org.apache.solr.update.SolrIndexConfig$DelayedSchemaAnalyzer
   [junit4]   2> ramBufferSizeMB=100.0
   [junit4]   2> maxBufferedDocs=-1
   [junit4]   2> maxBufferedDeleteTerms=-1
   [junit4]   2> mergedSegmentWarmer=null
   [junit4]   2> delPolicy=org.apache.solr.core.IndexDeletionPolicyWrapper
   [junit4]   2> commit=null
   [junit4]   2> openMode=CREATE
   [junit4]   2> similarity=org.apache.lucene.search.similarities.ClassicSimilarity
   [junit4]   2> mergeScheduler=ConcurrentMergeScheduler: maxThreadCount=-1, maxMergeCount=-1, ioThrottle=true
   [junit4]   2> default WRITE_LOCK_TIMEOUT=0
   [junit4]   2> writeLockTimeout=0
   [junit4]   2> codec=Lucene54
   [junit4]   2> infoStream=org.apache.solr.update.LoggingInfoStream
   [junit4]   2> mergePolicy=[TieredMergePolicy: maxMergeAtOnce=10, maxMergeAtOnceExplicit=30, maxMergedSegmentMB=5120.0, floorSegmentMB=2.0, forceMergeDeletesPctAllowed=10.0, segmentsPerTier=10.0, maxCFSSegmentSizeMB=8.796093022207999E12, noCFSRatio=0.1
   [junit4]   2> indexerThreadPool=org.apache.lucene.index.DocumentsWriterPerThreadPool@a9c711
   [junit4]   2> readerPooling=false
   [junit4]   2> perThreadHardLimitMB=1945
   [junit4]   2> useCompoundFile=false
   [junit4]   2> commitOnClose=true
   [junit4]   2> writer=org.apache.solr.update.SolrIndexWriter@4c6c01
   [junit4]   2> 
   [junit4]   2> 38207 INFO  (coreLoadExecutor-29-thread-1) [    x:collection1] o.a.s.u.LoggingInfoStream [IW][coreLoadExecutor-29-thread-1]: MMapDirectory.UNMAP_SUPPORTED=true
   [junit4]   2> 38207 INFO  (coreLoadExecutor-29-thread-1) [    x:collection1] o.a.s.u.LoggingInfoStream [IW][coreLoadExecutor-29-thread-1]: now flush at close
   [junit4]   2> 38207 INFO  (coreLoadExecutor-29-thread-1) [    x:collection1] o.a.s.u.LoggingInfoStream [IW][coreLoadExecutor-29-thread-1]:   start flush: applyAllDeletes=true
   [junit4]   2> 38207 INFO  (coreLoadExecutor-29-thread-1) [    x:collection1] o.a.s.u.LoggingInfoStream [IW][coreLoadExecutor-29-thread-1]:   index before flush 
   [junit4]   2> 38207 INFO  (coreLoadExecutor-29-thread-1) [    x:collection1] o.a.s.u.LoggingInfoStream [DW][coreLoadExecutor-29-thread-1]: startFullFlush
   [junit4]   2> 38207 INFO  (coreLoadExecutor-29-thread-1) [    x:collection1] o.a.s.u.LoggingInfoStream [DW][coreLoadExecutor-29-thread-1]: coreLoadExecutor-29-thread-1 finishFullFlush success=true
   [junit4]   2> 38207 INFO  (coreLoadExecutor-29-thread-1) [    x:collection1] o.a.s.u.LoggingInfoStream [IW][coreLoadExecutor-29-thread-1]: apply all deletes during flush
   [junit4]   2> 38208 INFO  (coreLoadExecutor-29-thread-1) [    x:collection1] o.a.s.u.LoggingInfoStream [IW][coreLoadExecutor-29-thread-1]: now apply all deletes for all segments maxDoc=0
   [junit4]   2> 38208 INFO  (coreLoadExecutor-29-thread-1) [    x:collection1] o.a.s.u.LoggingInfoStream [BD][coreLoadExecutor-29-thread-1]: prune sis=segments:  minGen=9223372036854775807 packetCount=0
   [junit4]   2> 38208 INFO  (coreLoadExecutor-29-thread-1) [    x:collection1] o.a.s.u.LoggingInfoStream [MS][coreLoadExecutor-29-thread-1]: initDynamicDefaults spins=true maxThreadCount=1 maxMergeCount=6
   [junit4]   2> 38208 INFO  (coreLoadExecutor-29-thread-1) [    x:collection1] o.a.s.u.LoggingInfoStream [MS][coreLoadExecutor-29-thread-1]: updateMergeThreads ioThrottle=true targetMBPerSec=10240.0 MB/sec
   [junit4]   2> 38208 INFO  (coreLoadExecutor-29-thread-1) [    x:collection1] o.a.s.u.LoggingInfoStream [MS][coreLoadExecutor-29-thread-1]: now merge
   [junit4]   2> 38208 INFO  (coreLoadExecutor-29-thread-1) [    x:collection1] o.a.s.u.LoggingInfoStream [MS][coreLoadExecutor-29-thread-1]:   index: 
   [junit4]   2> 38208 INFO  (coreLoadExecutor-29-thread-1) [    x:collection1] o.a.s.u.LoggingInfoStream [MS][coreLoadExecutor-29-thread-1]:   no more merges pending; now return
   [junit4]   2> 38208 INFO  (coreLoadExecutor-29-thread-1) [    x:collection1] o.a.s.u.LoggingInfoStream [IW][coreLoadExecutor-29-thread-1]: waitForMerges
   [junit4]   2> 38208 INFO  (coreLoadExecutor-29-thread-1) [    x:collection1] o.a.s.u.LoggingInfoStream [IW][coreLoadExecutor-29-thread-1]: waitForMerges done
   [junit4]   2> 38208 INFO  (coreLoadExecutor-29-thread-1) [    x:collection1] o.a.s.u.LoggingInfoStream [IW][coreLoadExecutor-29-thread-1]: commit: start
   [junit4]   2> 38208 INFO  (coreLoadExecutor-29-thread-1) [    x:collection1] o.a.s.u.LoggingInfoStream [IW][coreLoadExecutor-29-thread-1]: commit: enter lock
   [junit4]   2> 38208 INFO  (coreLoadExecutor-29-thread-1) [    x:collection1] o.a.s.u.LoggingInfoStream [IW][coreLoadExecutor-29-thread-1]: commit: now prepare
   [junit4]   2> 38208 INFO  (coreLoadExecutor-29-thread-1) [    x:collection1] o.a.s.u.LoggingInfoStream [IW][coreLoadExecutor-29-thread-1]: prepareCommit: flush
   [junit4]   2> 38208 INFO  (coreLoadExecutor-29-thread-1) [    x:collection1] o.a.s.u.LoggingInfoStream [IW][coreLoadExecutor-29-thread-1]:   index before flush 
   [junit4]   2> 38208 INFO  (coreLoadExecutor-29-thread-1) [    x:collection1] o.a.s.u.LoggingInfoStream [DW][coreLoadExecutor-29-thread-1]: startFullFlush
   [junit4]   2> 38208 INFO  (coreLoadExecutor-29-thread-1) [    x:collection1] o.a.s.u.LoggingInfoStream [IW][coreLoadExecutor-29-thread-1]: apply all deletes during flush
   [junit4]   2> 38208 INFO  (coreLoadExecutor-29-thread-1) [    x:collection1] o.a.s.u.LoggingInfoStream [IW][coreLoadExecutor-29-thread-1]: now apply all deletes for all segments maxDoc=0
   [junit4]   2> 38208 INFO  (coreLoadExecutor-29-thread-1) [    x:collection1] o.a.s.u.LoggingInfoStream [BD][coreLoadExecutor-29-thread-1]: prune sis=segments:  minGen=9223372036854775807 packetCount=0
   [junit4]   2> 38208 INFO  (coreLoadExecutor-29-thread-1) [    x:collection1] o.a.s.u.LoggingInfoStream [DW][coreLoadExecutor-29-thread-1]: coreLoadExecutor-29-thread-1 finishFullFlush success=true
   [junit4]   2> 38208 INFO  (coreLoadExecutor-29-thread-1) [    x:collection1] o.a.s.u.LoggingInfoStream [IW][coreLoadExecutor-29-thread-1]: startCommit(): start
   [junit4]   2> 38208 INFO  (coreLoadExecutor-29-thread-1) [    x:collection1] o.a.s.u.LoggingInfoStream [IW][coreLoadExecutor-29-thread-1]: startCommit index= changeCount=2
   [junit4]   2> 38208 INFO  (coreLoadExecutor-29-thread-1) [    x:collection1] o.a.s.u.LoggingInfoStream [IW][coreLoadExecutor-29-thread-1]: startCommit: wrote pending segments file "pending_segments_1"
   [junit4]   2> 38208 INFO  (coreLoadExecutor-29-thread-1) [    x:collection1] o.a.s.u.LoggingInfoStream [IW][coreLoadExecutor-29-thread-1]: done all syncs: []
   [junit4]   2> 38208 INFO  (coreLoadExecutor-29-thread-1) [    x:collection1] o.a.s.u.LoggingInfoStream [IW][coreLoadExecutor-29-thread-1]: commit: pendingCommit != null
   [junit4]   2> 38208 INFO  (coreLoadExecutor-29-thread-1) [    x:collection1] o.a.s.u.LoggingInfoStream [IW][coreLoadExecutor-29-thread-1]: commit: done writing segments file "segments_1"
   [junit4]   2> 38208 INFO  (coreLoadExecutor-29-thread-1) [    x:collection1] o.a.s.u.LoggingInfoStream [IFD][coreLoadExecutor-29-thread-1]: now checkpoint "" [0 segments ; isCommit = true]
   [junit4]   2> 38208 INFO  (coreLoadExecutor-29-thread-1) [    x:collection1] o.a.s.c.SolrDeletionPolicy SolrDeletionPolicy.onCommit: commits: num=1
   [junit4]   2> 	commit{dir=MockDirectoryWrapper(RAMDirectory@3c9e5c lockFactory=org.apache.lucene.store.SingleInstanceLockFactory@1c0d224),segFN=segments_1,generation=1}
   [junit4]   2> 38209 INFO  (coreLoadExecutor-29-thread-1) [    x:collection1] o.a.s.c.SolrDeletionPolicy newest commit generation = 1
   [junit4]   2> 38209 INFO  (coreLoadExecutor-29-thread-1) [    x:collection1] o.a.s.u.LoggingInfoStream [IFD][coreLoadExecutor-29-thread-1]: 0 msec to checkpoint
   [junit4]   2> 38209 INFO  (coreLoadExecutor-29-thread-1) [    x:collection1] o.a.s.u.LoggingInfoStream [IW][coreLoadExecutor-29-thread-1]: commit: took 0.7 msec
   [junit4]   2> 38209 INFO  (coreLoadExecutor-29-thread-1) [    x:collection1] o.a.s.u.LoggingInfoStream [IW][coreLoadExecutor-29-thread-1]: commit: done
   [junit4]   2> 38209 INFO  (coreLoadExecutor-29-thread-1) [    x:collection1] o.a.s.u.LoggingInfoStream [IW][coreLoadExecutor-29-thread-1]: rollback
   [junit4]   2> 38209 INFO  (coreLoadExecutor-29-thread-1) [    x:collection1] o.a.s.u.LoggingInfoStream [IW][coreLoadExecutor-29-thread-1]: all running merges have aborted
   [junit4]   2> 38209 INFO  (coreLoadExecutor-29-thread-1) [    x:collection1] o.a.s.u.LoggingInfoStream [IW][coreLoadExecutor-29-thread-1]: rollback: done finish merges
   [junit4]   2> 38209 INFO  (coreLoadExecutor-29-thread-1) [    x:collection1] o.a.s.u.LoggingInfoStream [DW][coreLoadExecutor-29-thread-1]: abort
   [junit4]   2> 38209 INFO  (coreLoadExecutor-29-thread-1) [    x:collection1] o.a.s.u.LoggingInfoStream [DW][coreLoadExecutor-29-thread-1]: done abort success=true
   [junit4]   2> 38209 INFO  (coreLoadExecutor-29-thread-1) [    x:collection1] o.a.s.u.LoggingInfoStream [IW][coreLoadExecutor-29-thread-1]: rollback: infos=
   [junit4]   2> 38209 INFO  (coreLoadExecutor-29-thread-1) [    x:collection1] o.a.s.u.LoggingInfoStream [IFD][coreLoadExecutor-29-thread-1]: now checkpoint "" [0 segments ; isCommit = false]
   [junit4]   2> 38209 INFO  (coreLoadExecutor-29-thread-1) [    x:collection1] o.a.s.u.LoggingInfoStream [IFD][coreLoadExecutor-29-thread-1]: 0 msec to checkpoint
   [junit4]   2> 38209 INFO  (OldIndexDirectoryCleanupThreadForCore-collection1) [    x:collection1] o.a.s.c.SolrCore Looking for old index directories to cleanup for core collection1 in C:\Users\JenkinsSlave\workspace\Lucene-Solr-5.x-Windows\solr\build\solr-solrj\test\J1\temp\solr.client.solrj.embedded.LargeVolumeBinaryJettyTest_699413EC8B3D3869-001\tempDir-001\collection1\data\
   [junit4]   2> 38209 INFO  (coreLoadExecutor-29-thread-1) [    x:collection1] o.a.s.c.PluginBag queryResponseWriter : 'velocity' created with startup=lazy 
   [junit4]   2> 38209 INFO  (coreLoadExecutor-29-thread-1) [    x:collection1] o.a.s.r.XSLTResponseWriter xsltCacheLifetimeSeconds=5
   [junit4]   2> 38210 WARN  (OldIndexDirectoryCleanupThreadForCore-collection1) [    x:collection1] o.a.s.c.DirectoryFactory C:\Users\JenkinsSlave\workspace\Lucene-Solr-5.x-Windows\solr\build\solr-solrj\test\J1\temp\solr.client.solrj.embedded.LargeVolumeBinaryJettyTest_699413EC8B3D3869-001\tempDir-001\collection1\data\ does not point to a valid data directory; skipping clean-up of old index directories.
   [junit4]   2> 38217 INFO  (coreLoadExecutor-29-thread-1) [    x:collection1] o.a.s.c.SolrCore no updateRequestProcessorChain defined as default, creating implicit default
   [junit4]   2> 38224 INFO  (coreLoadExecutor-29-thread-1) [    x:collection1] o.a.s.h.l.XMLLoader xsltCacheLifetimeSeconds=60
   [junit4]   2> 38228 INFO  (coreLoadExecutor-29-thread-1) [    x:collection1] o.a.s.h.l.XMLLoader xsltCacheLifetimeSeconds=60
   [junit4]   2> 38230 INFO  (coreLoadExecutor-29-thread-1) [    x:collection1] o.a.s.h.l.XMLLoader xsltCacheLifetimeSeconds=60
   [junit4]   2> 38231 INFO  (coreLoadExecutor-29-thread-1) [    x:collection1] o.a.s.h.l.XMLLoader xsltCacheLifetimeSeconds=60
   [junit4]   2> 38239 INFO  (coreLoadExecutor-29-thread-1) [    x:collection1] o.a.s.c.PluginBag requestHandler : '/update/extract' created with startup=lazy 
   [junit4]   2> 38239 INFO  (coreLoadExecutor-29-thread-1) [    x:collection1] o.a.s.c.PluginBag requestHandler : '/analysis/field' created with startup=lazy 
   [junit4]   2> 38239 INFO  (coreLoadExecutor-29-thread-1) [    x:collection1] o.a.s.c.PluginBag requestHandler : '/analysis/document' created with startup=lazy 
   [junit4]   2> 38240 INFO  (coreLoadExecutor-29-thread-1) [    x:collection1] o.a.s.c.PluginBag requestHandler : '/spell' created with startup=lazy 
   [junit4]   2> 38240 INFO  (coreLoadExecutor-29-thread-1) [    x:collection1] o.a.s.c.PluginBag requestHandler : '/suggest' created with startup=lazy 
   [junit4]   2> 38240 INFO  (coreLoadExecutor-29-thread-1) [    x:collection1] o.a.s.c.PluginBag requestHandler : '/tvrh' created with startup=lazy 
   [junit4]   2> 38240 INFO  (coreLoadExecutor-29-thread-1) [    x:collection1] o.a.s.c.PluginBag requestHandler : '/terms' created with startup=lazy 
   [junit4]   2> 38240 INFO  (coreLoadExecutor-29-thread-1) [    x:collection1] o.a.s.c.PluginBag requestHandler : '/elevate' created with startup=lazy 
   [junit4]   2> 38240 INFO  (coreLoadExecutor-29-thread-1) [    x:collection1] o.a.s.c.RequestHandlers Registered paths: /update/json,/update,/debug/dump,/spell,/select,/browse,/update/csv,/tvrh,/admin/segments,/analysis/field,/export,/get,/admin/file,/admin/threads,/elevate,/admin/mbeans,/schema,/replication,/query,/analysis/document,/admin/logging,/suggest,/admin/system,/config,/admin/plugins,/update/json/docs,/admin/ping,/update/extract,/admin/properties,/admin/luke,/terms
   [junit4]   2> 38243 INFO  (coreLoadExecutor-29-thread-1) [    x:collection1] o.a.s.c.SolrCore Using default statsCache cache: org.apache.solr.search.stats.LocalStatsCache
   [junit4]   2> 38244 INFO  (coreLoadExecutor-29-thread-1) [    x:collection1] o.a.s.u.UpdateHandler Using UpdateLog implementation: org.apache.solr.update.UpdateLog
   [junit4]   2> 38244 INFO  (coreLoadExecutor-29-thread-1) [    x:collection1] o.a.s.u.UpdateLog Initializing UpdateLog: dataDir= defaultSyncLevel=FLUSH numRecordsToKeep=100 maxNumLogsToKeep=10 numVersionBuckets=65536
   [junit4]   2> 38245 INFO  (coreLoadExecutor-29-thread-1) [    x:collection1] o.a.s.u.CommitTracker Hard AutoCommit: if uncommited for 15000ms; 
   [junit4]   2> 38245 INFO  (coreLoadExecutor-29-thread-1) [    x:collection1] o.a.s.u.CommitTracker Soft AutoCommit: disabled
   [junit4]   2> 38246 INFO  (coreLoadExecutor-29-thread-1) [    x:collection1] o.a.s.u.LoggingInfoStream [IFD][coreLoadExecutor-29-thread-1]: init: current segments file is "segments_1"; deletionPolicy=org.apache.solr.core.IndexDeletionPolicyWrapper@2471c7
   [junit4]   2> 38246 INFO  (coreLoadExecutor-29-thread-1) [    x:collection1] o.a.s.u.LoggingInfoStream [IFD][coreLoadExecutor-29-thread-1]: init: load commit "segments_1"
   [junit4]   2> 38246 INFO  (coreLoadExecutor-29-thread-1) [    x:collection1] o.a.s.c.SolrDeletionPolicy SolrDeletionPolicy.onInit: commits: num=1
   [junit4]   2> 	commit{dir=MockDirectoryWrapper(RAMDirectory@3c9e5c lockFactory=org.apache.lucene.store.SingleInstanceLockFactory@1c0d224),segFN=segments_1,generation=1}
   [junit4]   2> 38246 INFO  (coreLoadExecutor-29-thread-1) [    x:collection1] o.a.s.c.SolrDeletionPolicy newest commit generation = 1
   [junit4]   2> 38246 INFO  (coreLoadExecutor-29-thread-1) [    x:collection1] o.a.s.u.LoggingInfoStream [IFD][coreLoadExecutor-29-thread-1]: now checkpoint "" [0 segments ; isCommit = false]
   [junit4]   2> 38246 INFO  (coreLoadExecutor-29-thread-1) [    x:collection1] o.a.s.u.LoggingInfoStream [IFD][coreLoadExecutor-29-thread-1]: 0 msec to checkpoint
   [junit4]   2> 38246 INFO  (coreLoadExecutor-29-thread-1) [    x:collection1] o.a.s.u.LoggingInfoStream [IW][coreLoadExecutor-29-thread-1]: init: create=false
   [junit4]   2> 38246 INFO  (coreLoadExecutor-29-thread-1) [    x:collection1] o.a.s.u.LoggingInfoStream [IW][coreLoadExecutor-29-thread-1]: 
   [junit4]   2> dir=MockDirectoryWrapper(RAMDirectory@3c9e5c lockFactory=org.apache.lucene.store.SingleInstanceLockFactory@1c0d224)
   [junit4]   2> index=
   [junit4]   2> version=5.5.0
   [junit4]   2> analyzer=org.apache.solr.update.SolrIndexConfig$DelayedSchemaAnalyzer
   [junit4]   2> ramBufferSizeMB=100.0
   [junit4]   2> maxBufferedDocs=-1
   [junit4]   2> maxBufferedDeleteTerms=-1
   [junit4]   2> mergedSegmentWarmer=null
   [junit4]   2> delPolicy=org.apache.solr.core.IndexDeletionPolicyWrapper
   [junit4]   2> commit=null
   [junit4]   2> openMode=APPEND
   [junit4]   2> similarity=org.apache.lucene.search.similarities.ClassicSimilarity
   [junit4]   2> mergeScheduler=ConcurrentMergeScheduler: maxThreadCount=-1, maxMergeCount=-1, ioThrottle=true
   [junit4]   2> default WRITE_LOCK_TIMEOUT=0
   [junit4]   2> writeLockTimeout=0
   [junit4]   2> codec=Lucene54
   [junit4]   2> infoStream=org.apache.solr.update.LoggingInfoStream
   [junit4]   2> mergePolicy=[TieredMergePolicy: maxMergeAtOnce=10, maxMergeAtOnceExplicit=30, maxMergedSegmentMB=5120.0, floorSegmentMB=2.0, forceMergeDeletesPctAllowed=10.0, segmentsPerTier=10.0, maxCFSSegmentSizeMB=8.796093022207999E12, noCFSRatio=0.1
   [junit4]   2> indexerThreadPool=org.apache.lucene.index.DocumentsWriterPerThreadPool@b5175d
   [junit4]   2> readerPooling=false
   [junit4]   2> perThreadHardLimitMB=1945
   [junit4]   2> useCompoundFile=false
   [junit4]   2> commitOnClose=true
   [junit4]   2> writer=org.apache.solr.update.SolrIndexWriter@110db07
   [junit4]   2> 
   [junit4]   2> 38246 INFO  (coreLoadExecutor-29-thread-1) [    x:collection1] o.a.s.u.LoggingInfoStream [IW][coreLoadExecutor-29-thread-1]: MMapDirectory.UNMAP_SUPPORTED=true
   [junit4]   2> 38246 INFO  (coreLoadExecutor-29-thread-1) [    x:collection1] o.a.s.u.LoggingInfoStream [IW][coreLoadExecutor-29-thread-1]: flush at getReader
   [junit4]   2> 38246 INFO  (coreLoadExecutor-29-thread-1) [    x:collection1] o.a.s.u.LoggingInfoStream [DW][coreLoadExecutor-29-thread-1]: startFullFlush
   [junit4]   2> 38246 INFO  (coreLoadExecutor-29-thread-1) [    x:collection1] o.a.s.u.LoggingInfoStream [IW][coreLoadExecutor-29-thread-1]: apply all deletes during flush
   [junit4]   2> 38246 INFO  (coreLoadExecutor-29-thread-1) [    x:collection1] o.a.s.u.LoggingInfoStream [IW][coreLoadExecutor-29-thread-1]: now apply all deletes for all segments maxDoc=0
   [junit4]   2> 38246 INFO  (coreLoadExecutor-29-thread-1) [    x:collection1] o.a.s.u.LoggingInfoStream [BD][coreLoadExecutor-29-thread-1]: prune sis=segments_1:  minGen=9223372036854775807 packetCount=0
   [junit4]   2> 38246 INFO  (coreLoadExecutor-29-thread-1) [    x:collection1] o.a.s.u.LoggingInfoStream [IW][coreLoadExecutor-29-thread-1]: incRefDeleter for NRT reader version=2 segments=
   [junit4]   2> 38246 INFO  (coreLoadExecutor-29-thread-1) [    x:collection1] o.a.s.u.LoggingInfoStream [IW][coreLoadExecutor-29-thread-1]: return reader version=2 reader=StandardDirectoryReader(segments_1:2:nrt)
   [junit4]   2> 38246 INFO  (coreLoadExecutor-29-thread-1) [    x:collection1] o.a.s.u.LoggingInfoStream [DW][coreLoadExecutor-29-thread-1]: coreLoadExecutor-29-thread-1 finishFullFlush success=true
   [junit4]   2> 38246 INFO  (coreLoadExecutor-29-thread-1) [    x:collection1] o.a.s.u.LoggingInfoStream [IW][coreLoadExecutor-29-thread-1]: getReader took 0 msec
   [junit4]   2> 38246 INFO  (coreLoadExecutor-29-thread-1) [    x:collection1] o.a.s.s.SolrIndexSearcher Opening Searcher@1371f36[collection1] main
   [junit4]   2> 38247 INFO  (coreLoadExecutor-29-thread-1) [    x:collection1] o.a.s.r.ManagedResourceStorage File-based storage initialized to use dir: C:\Users\JenkinsSlave\workspace\Lucene-Solr-5.x-Windows\solr\build\solr-solrj\test\J1\temp\solr.client.solrj.embedded.LargeVolumeBinaryJettyTest_699413EC8B3D3869-001\tempDir-001\collection1\conf
   [junit4]   2> 38247 INFO  (coreLoadExecutor-29-thread-1) [    x:collection1] o.a.s.r.RestManager Initializing RestManager with initArgs: {storageDir=C:\Users\JenkinsSlave\workspace\Lucene-Solr-5.x-Windows\solr\build\solr-solrj\test\J1\temp\solr.client.solrj.embedded.LargeVolumeBinaryJettyTest_699413EC8B3D3869-001\tempDir-001\collection1\conf}
   [junit4]   2> 38247 INFO  (coreLoadExecutor-29-thread-1) [    x:collection1] o.a.s.r.ManagedResourceStorage Reading _rest_managed.json using file:dir=C:\Users\JenkinsSlave\workspace\Lucene-Solr-5.x-Windows\solr\build\solr-solrj\test\J1\temp\solr.client.solrj.embedded.LargeVolumeBinaryJettyTest_699413EC8B3D3869-001\tempDir-001\collection1\conf
   [junit4]   2> 38247 INFO  (coreLoadExecutor-29-thread-1) [    x:collection1] o.a.s.r.ManagedResourceStorage Loaded LinkedHashMap at path _rest_managed.json using file:dir=C:\Users\JenkinsSlave\workspace\Lucene-Solr-5.x-Windows\solr\build\solr-solrj\test\J1\temp\solr.client.solrj.embedded.LargeVolumeBinaryJettyTest_699413EC8B3D3869-001\tempDir-001\collection1\conf
   [junit4]   2> 38247 INFO  (coreLoadExecutor-29-thread-1) [    x:collection1] o.a.s.r.ManagedResource Loaded initArgs {} for /rest/managed
   [junit4]   2> 38247 INFO  (coreLoadExecutor-29-thread-1) [    x:collection1] o.a.s.r.RestManager Initializing 2 registered ManagedResources
   [junit4]   2> 38247 INFO  (coreLoadExecutor-29-thread-1) [    x:collection1] o.a.s.r.ManagedResourceStorage Reading _schema_analysis_stopwords_english.json using file:dir=C:\Users\JenkinsSlave\workspace\Lucene-Solr-5.x-Windows\solr\build\solr-solrj\test\J1\temp\solr.client.solrj.embedded.LargeVolumeBinaryJettyTest_699413EC8B3D3869-001\tempDir-001\collection1\conf
   [junit4]   2> 38248 INFO  (coreLoadExecutor-29-thread-1) [    x:collection1] o.a.s.r.ManagedResourceStorage Loaded LinkedHashMap at path _schema_analysis_stopwords_english.json using file:dir=C:\Users\JenkinsSlave\workspace\Lucene-Solr-5.x-Windows\solr\build\solr-solrj\test\J1\temp\solr.client.solrj.embedded.LargeVolumeBinaryJettyTest_699413EC8B3D3869-001\tempDir-001\collection1\conf
   [junit4]   2> 38248 INFO  (coreLoadExecutor-29-thread-1) [    x:collection1] o.a.s.r.ManagedResource Loaded initArgs {ignoreCase=true} for /schema/analysis/stopwords/english
   [junit4]   2> 38248 INFO  (coreLoadExecutor-29-thread-1) [    x:collection1] o.a.s.r.s.a.ManagedWordSetResource Loaded 35 words for /schema/analysis/stopwords/english
   [junit4]   2> 38248 INFO  (coreLoadExecutor-29-thread-1) [    x:collection1] o.a.s.r.ManagedResource Notified 2 observers of /schema/analysis/stopwords/english
   [junit4]   2> 38248 INFO  (coreLoadExecutor-29-thread-1) [    x:collection1] o.a.s.r.ManagedResourceStorage Reading _schema_analysis_synonyms_english.json using file:dir=C:\Users\JenkinsSlave\workspace\Lucene-Solr-5.x-Windows\solr\build\solr-solrj\test\J1\temp\solr.client.solrj.embedded.LargeVolumeBinaryJettyTest_699413EC8B3D3869-001\tempDir-001\collection1\conf
   [junit4]   2> 38248 INFO  (coreLoadExecutor-29-thread-1) [    x:collection1] o.a.s.r.ManagedResourceStorage Loaded LinkedHashMap at path _schema_analysis_synonyms_english.json using file:dir=C:\Users\JenkinsSlave\workspace\Lucene-Solr-5.x-Windows\solr\build\solr-solrj\test\J1\temp\solr.client.solrj.embedded.LargeVolumeBinaryJettyTest_699413EC8B3D3869-001\tempDir-001\collection1\conf
   [junit4]   2> 38248 INFO  (coreLoadExecutor-29-thread-1) [    x:collection1] o.a.s.r.ManagedResource Loaded initArgs {ignoreCase=true,format=solr} for /schema/analysis/synonyms/english
   [junit4]   2> 38248 INFO  (coreLoadExecutor-29-thread-1) [    x:collection1] o.a.s.r.s.a.ManagedSynonymFilterFactory Loaded 3 synonym mappings for /schema/analysis/synonyms/english
   [junit4]   2> 38249 INFO  (coreLoadExecutor-29-thread-1) [    x:collection1] o.a.s.r.ManagedResource Notified 2 observers of /schema/analysis/synonyms/english
   [junit4]   2> 38249 INFO  (coreLoadExecutor-29-thread-1) [    x:collection1] o.a.s.h.c.SpellCheckComponent Initializing spell checkers
   [junit4]   2> 38249 INFO  (coreLoadExecutor-29-thread-1) [    x:collection1] o.a.s.s.DirectSolrSpellChecker init: {name=default,field=text,classname=solr.DirectSolrSpellChecker,distanceMeasure=internal,accuracy=0.5,maxEdits=2,minPrefix=1,maxInspections=5,minQueryLength=4,maxQueryFrequency=0.01}
   [junit4]   2> 38249 INFO  (coreLoadExecutor-29-thread-1) [    x:collection1] o.a.s.h.c.SpellCheckComponent No queryConverter defined, using default converter
   [junit4]   2> 38249 INFO  (coreLoadExecutor-29-thread-1) [    x:collection1] o.a.s.h.c.SuggestComponent Initializing SuggestComponent
   [junit4]   2> 38249 INFO  (coreLoadExecutor-29-thread-1) [    x:collection1] o.a.s.s.s.SolrSuggester init: {name=mySuggester,lookupImpl=FuzzyLookupFactory,dictionaryImpl=DocumentDictionaryFactory,field=cat,weightField=price,suggestAnalyzerFieldType=string,buildOnStartup=false}
   [junit4]   2> 38250 INFO  (coreLoadExecutor-29-thread-1) [    x:collection1] o.a.s.s.s.SolrSuggester Dictionary loaded with params: {name=mySuggester,lookupImpl=FuzzyLookupFactory,dictionaryImpl=DocumentDictionaryFactory,field=cat,weightField=price,suggestAnalyzerFieldType=string,buildOnStartup=false}
   [junit4]   2> 38250 INFO  (coreLoadExecutor-29-thread-1) [    x:collection1] o.a.s.h.c.QueryElevationComponent Loading QueryElevation from: C:\Users\JenkinsSlave\workspace\Lucene-Solr-5.x-Windows\solr\build\solr-solrj\test\J1\temp\solr.client.solrj.embedded.LargeVolumeBinaryJettyTest_699413EC8B3D3869-001\tempDir-001\collection1\conf\elevate.xml
   [junit4]   2> 38256 INFO  (coreLoadExecutor-29-thread-1) [    x:collection1] o.a.s.h.ReplicationHandler Commits will be reserved for  10000
   [junit4]   2> 38257 INFO  (searcherExecutor-30-thread-1-processing-x:collection1) [    x:collection1] o.a.s.c.QuerySenderListener QuerySenderListener sending requests to Searcher@1371f36[collection1] main{ExitableDirectoryReader(UninvertingDirectoryReader())}
   [junit4]   2> 38258 INFO  (searcherExecutor-30-thread-1-processing-x:collection1) [    x:collection1] o.a.s.c.S.Request [collection1]  webapp=null path=null params={distrib=false&q=static+firstSearcher+warming+in+solrconfig.xml&event=firstSearcher} hits=0 status=0 QTime=1
   [junit4]   2> 38258 INFO  (searcherExecutor-30-thread-1-processing-x:collection1) [    x:collection1] o.a.s.c.QuerySenderListener QuerySenderListener done.
   [junit4]   2> 38258 INFO  (searcherExecutor-30-thread-1-processing-x:collection1) [    x:collection1] o.a.s.h.c.SpellCheckComponent Loading spell index for spellchecker: default
   [junit4]   2> 38258 INFO  (searcherExecutor-30-thread-1-processing-x:collection1) [    x:collection1] o.a.s.h.c.SpellCheckComponent Loading spell index for spellchecker: wordbreak
   [junit4]   2> 38261 INFO  (searcherExecutor-30-thread-1-processing-x:collection1) [    x:collection1] o.a.s.c.SolrCore [collection1] Registered new searcher Searcher@1371f36[collection1] main{ExitableDirectoryReader(UninvertingDirectoryReader())}
   [junit4]   2> 38261 INFO  (coreLoadExecutor-29-thread-1) [    x:collection1] o.a.s.u.UpdateLog Looking up max value of version field to seed version buckets
   [junit4]   2> 38261 INFO  (coreLoadExecutor-29-thread-1) [    x:collection1] o.a.s.u.VersionInfo Refreshing highest value of _version_ for 65536 version buckets from index
   [junit4]   2> 38261 INFO  (coreLoadExecutor-29-thread-1) [    x:collection1] o.a.s.u.VersionInfo No terms found for _version_, cannot seed version bucket highest value from index
   [junit4]   2> 38261 INFO  (coreLoadExecutor-29-thread-1) [    x:collection1] o.a.s.u.UpdateLog Could not find max version in index or recent updates, using new clock 1523105535095734272
   [junit4]   2> 38262 INFO  (coreLoadExecutor-29-thread-1) [    x:collection1] o.a.s.u.UpdateLog Took 1.0ms to seed version buckets with highest version 1523105535095734272
   [junit4]   2> 38263 INFO  (coreLoadExecutor-29-thread-1) [    x:collection1] o.a.s.c.CoreContainer registering core: collection1
   [junit4]   2> 38364 INFO  (SUITE-LargeVolumeBinaryJettyTest-seed#[699413EC8B3D3869]-worker) [    ] o.a.s.SolrJettyTestBase Jetty Assigned Port#55041
   [junit4]   2> 38368 INFO  (TEST-LargeVolumeBinaryJettyTest.testMultiThreaded-seed#[699413EC8B3D3869]) [    ] o.a.s.SolrTestCaseJ4 ###Starting testMultiThreaded
   [junit4]   2> 38375 INFO  (qtp29431509-87) [    x:collection1] o.a.s.u.LoggingInfoStream [DW][qtp29431509-87]: anyChanges? numDocsInRam=0 deletes=true hasTickets:false pendingChangesInFullFlush: false
   [junit4]   2> 38375 INFO  (qtp29431509-87) [    x:collection1] o.a.s.u.LoggingInfoStream [DW][qtp29431509-87]: anyChanges? numDocsInRam=0 deletes=true hasTickets:false pendingChangesInFullFlush: false
   [junit4]   2> 38375 INFO  (qtp29431509-87) [    x:collection1] o.a.s.u.LoggingInfoStream [IW][qtp29431509-87]: nrtIsCurrent: infoVersion matches: true; DW changes: true; BD changes: false
   [junit4]   2> 38375 INFO  (qtp29431509-87) [    x:collection1] o.a.s.u.LoggingInfoStream [IW][qtp29431509-87]: flush at getReader
   [junit4]   2> 38375 INFO  (qtp29431509-87) [    x:collection1] o.a.s.u.LoggingInfoStream [DW][qtp29431509-87]: startFullFlush
   [junit4]   2> 38375 INFO  (qtp29431509-87) [    x:collection1] o.a.s.u.LoggingInfoStream [DW][qtp29431509-87]: anyChanges? numDocsInRam=0 deletes=true hasTickets:false pendingChangesInFullFlush: false
   [junit4]   2> 38375 INFO  (qtp29431509-87) [    x:collection1] o.a.s.u.LoggingInfoStream [DW][qtp29431509-87]: qtp29431509-87: flush naked frozen global deletes
   [junit4]   2> 38375 INFO  (qtp29431509-87) [    x:collection1] o.a.s.u.LoggingInfoStream [BD][qtp29431509-87]: push deletes  1 deleted queries bytesUsed=80 segmentPrivate?=false delGen=2 packetCount=1 totBytesUsed=80
   [junit4]   2> 38375 INFO  (qtp29431509-87) [    x:collection1] o.a.s.u.LoggingInfoStream [DW][qtp29431509-87]: flush: push buffered updates:  1 deleted queries bytesUsed=80
   [junit4]   2> 38375 INFO  (qtp29431509-87) [    x:collection1] o.a.s.u.LoggingInfoStream [IW][qtp29431509-87]: apply all deletes during flush
   [junit4]   2> 38375 INFO  (qtp29431509-87) [    x:collection1] o.a.s.u.LoggingInfoStream [IW][qtp29431509-87]: now apply all deletes for all segments maxDoc=0
   [junit4]   2> 38375 INFO  (qtp29431509-87) [    x:collection1] o.a.s.u.LoggingInfoStream [BD][qtp29431509-87]: prune sis=segments_1:  minGen=9223372036854775807 packetCount=1
   [junit4]   2> 38375 INFO  (qtp29431509-87) [    x:collection1] o.a.s.u.LoggingInfoStream [BD][qtp29431509-87]: pruneDeletes: prune 1 packets; 0 packets remain
   [junit4]   2> 38375 INFO  (qtp29431509-87) [    x:collection1] o.a.s.u.LoggingInfoStream [IW][qtp29431509-87]: incRefDeleter for NRT reader version=2 segments=
   [junit4]   2> 38375 INFO  (qtp29431509-87) [    x:collection1] o.a.s.u.LoggingInfoStream [IW][qtp29431509-87]: return reader version=2 reader=StandardDirectoryReader(segments_1:2:nrt)
   [junit4]   2> 38375 INFO  (qtp29431509-87) [    x:collection1] o.a.s.u.LoggingInfoStream [DW][qtp29431509-87]: qtp29431509-87 finishFullFlush success=true
   [junit4]   2> 38375 INFO  (qtp29431509-87) [    x:collection1] o.a.s.u.LoggingInfoStream [IW][qtp29431509-87]: getReader took 0 msec
   [junit4]   2> 38375 INFO  (qtp29431509-87) [    x:collection1] o.a.s.u.LoggingInfoStream [IW][qtp29431509-87]: decRefDeleter for NRT reader version=2 segments=
   [junit4]   2> 38375 INFO  (qtp29431509-87) [    x:collection1] o.a.s.u.p.LogUpdateProcessorFactory [collection1]  webapp=/solr path=/update params={wt=javabin&version=2}{deleteByQuery=*:* (-1523105535213174784)} 0 3
   [junit4]   2> 38378 INFO  (TEST-LargeVolumeBinaryJettyTest.testMultiThreaded-seed#[699413EC8B3D3869]) [    ] o.a.s.c.s.LargeVolumeTestBase Started thread: 0
   [junit4]   2> 38378 INFO  (TEST-LargeVolumeBinaryJettyTest.testMultiThreaded-seed#[699413EC8B3D3869]) [    ] o.a.s.c.s.LargeVolumeTestBase Started thread: 1
   [junit4]   2> 38380 INFO  (TEST-LargeVolumeBinaryJettyTest.testMultiThreaded-seed#[699413EC8B3D3869]) [    ] o.a.s.c.s.LargeVolumeTestBase Started thread: 2
   [junit4]   2> 38382 INFO  (TEST-LargeVolumeBinaryJettyTest.testMultiThreaded-seed#[699413EC8B3D3869]) [    ] o.a.s.c.s.LargeVolumeTestBase Started thread: 3
   [junit4]   2> 38382 INFO  (TEST-LargeVolumeBinaryJettyTest.testMultiThreaded-seed#[699413EC8B3D3869]) [    ] o.a.s.c.s.LargeVolumeTestBase Started thread: 4
   [junit4]   2> 38447 INFO  (qtp29431509-92) [    x:collection1] o.a.s.u.p.LogUpdateProcessorFactory [collection1]  webapp=/solr path=/update params={wt=javabin&version=2}{add=[T3:0 (1523105535258263553), T3:1 (1523105535258263556), T3:2 (1523105535259312128), T3:3 (1523105535259312130), T3:4 (1523105535259312132), T3:5 (1523105535259312134), T3:6 (1523105535259312136), T3:7 (1523105535259312138), T3:8 (1523105535259312140), T3:9 (1523105535260360704), ... (100 adds)]} 0 31
   [junit4]   2> 38462 INFO  (qtp29431509-88) [    x:collection1] o.a.s.u.p.LogUpdateProcessorFactory [collection1]  webapp=/solr path=/update params={wt=javabin&version=2}{add=[T1:0 (1523105535225757696), T1:1 (1523105535229952000), T1:2 (1523105535229952001), T1:3 (1523105535229952002), T1:4 (1523105535229952003), T1:5 (1523105535229952004), T1:6 (1523105535231000576), T1:7 (1523105535231000577), T1:8 (1523105535231000578), T1:9 (1523105535232049152), ... (100 adds)]} 0 76
   [junit4]   2> 38478 INFO  (qtp29431509-91) [    x:collection1] o.a.s.u.p.LogUpdateProcessorFactory [collection1]  webapp=/solr path=/update params={wt=javabin&version=2}{add=[T4:0 (1523105535249874952), T4:1 (1523105535250923521), T4:2 (1523105535250923524), T4:3 (1523105535251972096), T4:4 (1523105535251972099), T4:5 (1523105535256166409), T4:6 (1523105535258263554), T4:7 (1523105535258263557), T4:8 (1523105535260360711), T4:9 (1523105535261409281), ... (100 adds)]} 0 82
   [junit4]   2> 38479 INFO  (qtp29431509-91) [    x:collection1] o.a.s.u.DirectUpdateHandler2 start commit{,optimize=false,openSearcher=true,waitSearcher=true,expungeDeletes=false,softCommit=false,prepareCommit=false}
   [junit4]   2> 38479 INFO  (qtp29431509-91) [    x:collection1] o.a.s.u.LoggingInfoStream [IW][qtp29431509-91]: commit: start
   [junit4]   2> 38479 INFO  (qtp29431509-91) [    x:collection1] o.a.s.u.LoggingInfoStream [IW][qtp29431509-91]: commit: enter lock
   [junit4]   2> 38479 INFO  (qtp29431509-91) [    x:collection1] o.a.s.u.LoggingInfoStream [IW][qtp29431509-91]: commit: now prepare
   [junit4]   2> 38479 INFO  (qtp29431509-91) [    x:collection1] o.a.s.u.LoggingInfoStream [IW][qtp29431509-91]: prepareCommit: flush
   [junit4]   2> 38479 INFO  (qtp29431509-91) [    x:collection1] o.a.s.u.LoggingInfoStream [IW][qtp29431509-91]:   index before flush 
   [junit4]   2> 38479 INFO  (qtp29431509-91) [    x:collection1] o.a.s.u.LoggingInfoStream [DW][qtp29431509-91]: startFullFlush
   [junit4]   2> 38479 INFO  (qtp29431509-91) [    x:collection1] o.a.s.u.LoggingInfoStream [DW][qtp29431509-91]: anyChanges? numDocsInRam=476 deletes=true hasTickets:false pendingChangesInFullFlush: false
   [junit4]   2> 38480 INFO  (qtp29431509-91) [    x:collection1] o.a.s.u.LoggingInfoStream [DWFC][qtp29431509-91]: addFlushableState DocumentsWriterPerThread [pendingDeletes=gen=0 475 deleted terms (unique count=475) bytesUsed=66926, segment=_0, aborted=false, numDocsInRAM=203, deleteQueue=DWDQ: [ generation: 2 ]]
   [junit4]   2> 38480 INFO  (qtp29431509-91) [    x:collection1] o.a.s.u.LoggingInfoStream [DWFC][qtp29431509-91]: addFlushableState DocumentsWriterPerThread [pendingDeletes=gen=0 294 deleted terms (unique count=294) bytesUsed=41425, segment=_2, aborted=false, numDocsInRAM=138, deleteQueue=DWDQ: [ generation: 2 ]]
   [junit4]   2> 38480 INFO  (qtp29431509-91) [    x:collection1] o.a.s.u.LoggingInfoStream [DWFC][qtp29431509-91]: addFlushableState DocumentsWriterPerThread [pendingDeletes=gen=0 371 deleted terms (unique count=371) bytesUsed=52273, segment=_1, aborted=false, numDocsInRAM=98, deleteQueue=DWDQ: [ generation: 2 ]]
   [junit4]   2> 38480 INFO  (qtp29431509-91) [    x:collection1] o.a.s.u.LoggingInfoStream [DWFC][qtp29431509-91]: addFlushableState DocumentsWriterPerThread [pendingDeletes=gen=0 44 deleted terms (unique count=44) bytesUsed=6194, segment=_3, aborted=false, numDocsInRAM=37, deleteQueue=DWDQ: [ generation: 2 ]]
   [junit4]   2> 38484 INFO  (qtp29431509-91) [    x:collection1] o.a.s.u.LoggingInfoStream [DWPT][qtp29431509-91]: flush postings as segment _0 numDocs=203
   [junit4]   2> 38489 INFO  (qtp29431509-91) [    x:collection1] o.a.s.u.LoggingInfoStream [DWPT][qtp29431509-91]: new segment has 0 deleted docs
   [junit4]   2> 38489 INFO  (qtp29431509-91) [    x:collection1] o.a.s.u.LoggingInfoStream [DWPT][qtp29431509-91]: new segment has no vectors; norms; no docValues; prox; freqs
   [junit4]   2> 38489 INFO  (qtp29431509-91) [    x:collection1] o.a.s.u.LoggingInfoStream [DWPT][qtp29431509-91]: flushedFiles=[_0_Lucene50_0.tip, _0.fdx, _0_Lucene50_0.pos, _0.nvm, _0.fdt, _0_Lucene50_0.doc, _0.fnm, _0.nvd, _0_Lucene50_0.tim]
   [junit4]   2> 38489 INFO  (qtp29431509-91) [    x:collection1] o.a.s.u.LoggingInfoStream [DWPT][qtp29431509-91]: flushed codec=Lucene54
   [junit4]   2> 38489 INFO  (qtp29431509-91) [    x:collection1] o.a.s.u.LoggingInfoStream [DWPT][qtp29431509-91]: flushed: segment=_0 ramUsed=0.171 MB newFlushedSize=0.006 MB docs/MB=31,548.974
   [junit4]   2> 38490 INFO  (qtp29431509-91) [    x:collection1] o.a.s.u.LoggingInfoStream [DWPT][qtp29431509-91]: flush postings as segment _2 numDocs=138
   [junit4]   2> 38495 INFO  (qtp29431509-91) [    x:collection1] o.a.s.u.LoggingInfoStream [DWPT][qtp29431509-91]: new segment has 0 deleted docs
   [junit4]   2> 38495 INFO  (qtp29431509-91) [    x:collection1] o.a.s.u.LoggingInfoStream [DWPT][qtp29431509-91]: new segment has no vectors; norms; no docValues; prox; freqs
   [junit4]   2> 38495 INFO  (qtp29431509-91) [    x:collection1] o.a.s.u.LoggingInfoStream [DWPT][qtp29431509-91]: flushedFiles=[_2_Lucene50_0.doc, _2.fnm, _2.fdx, _2_Lucene50_0.tim, _2_Lucene50_0.pos, _2.fdt, _2.nvm, _2.nvd, _2_Lucene50_0.tip]
   [junit4]   2> 38495 INFO  (qtp29431509-91) [    x:collection1] o.a.s.u.LoggingInfoStream [DWPT][qtp29431509-91]: flushed codec=Lucene54
   [junit4]   2> 38495 INFO  (qtp29431509-91) [    x:collection1] o.a.s.u.LoggingInfoStream [DWPT][qtp29431509-91]: flushed: segment=_2 ramUsed=0.156 MB newFlushedSize=0.005 MB docs/MB=29,033.605
   [junit4]   2> 38495 INFO  (qtp29431509-91) [    x:collection1] o.a.s.u.LoggingInfoStream [DWPT][qtp29431509-91]: flush postings as segment _1 numDocs=98
   [junit4]   2> 38500 INFO  (qtp29431509-91) [    x:collection1] o.a.s.u.LoggingInfoStream [DWPT][qtp29431509-91]: new segment has 0 deleted docs
   [junit4]   2> 38500 INFO  (qtp29431509-91) [    x:collection1] o.a.s.u.LoggingInfoStream [DWPT][qtp29431509-91]: new segment has no vectors; norms; no docValues; prox; freqs
   [junit4]   2> 38500 INFO  (qtp29431509-91) [    x:collection1] o.a.s.u.LoggingInfoStream [DWPT][qtp29431509-91]: flushedFiles=[_1.fdx, _1.nvm, _1_Lucene50_0.tip, _1_Lucene50_0.pos, _1_Lucene50_0.tim, _1.fdt, _1.nvd, _1_Lucene50_0.doc, _1.fnm]
   [junit4]   2> 38500 INFO  (qtp29431509-91) [    x:collection1] o.a.s.u.LoggingInfoStream [DWPT][qtp29431509-91]: flushed codec=Lucene54
   [junit4]   2> 38500 INFO  (qtp29431509-91) [    x:collection1] o.a.s.u.LoggingInfoStream [DWPT][qtp29431509-91]: flushed: segment=_1 ramUsed=0.163 MB newFlushedSize=0.004 MB docs/MB=23,504.22
   [junit4]   2> 38500 INFO  (qtp29431509-91) [    x:collection1] o.a.s.u.LoggingInfoStream [DWPT][qtp29431509-91]: flush postings as segment _3 numDocs=37
   [junit4]   2> 38503 INFO  (qtp29431509-91) [    x:collection1] o.a.s.u.LoggingInfoStream [DWPT][qtp29431509-91]: new segment has 0 deleted docs
   [junit4]   2> 38503 INFO  (qtp29431509-91) [    x:collection1] o.a.s.u.LoggingInfoStream [DWPT][qtp29431509-91]: new segment has no vectors; norms; no docValues; prox; freqs
   [junit4]   2> 38503 INFO  (qtp29431509-91) [    x:collection1] o.a.s.u.LoggingInfoStream [DWPT][qtp29431509-91]: flushedFiles=[_3.fdx, _3.nvm, _3.fdt, _3.nvd, _3_Lucene50_0.doc, _3_Lucene50_0.tip, _3.fnm, _3_Lucene50_0.pos, _3_Lucene50_0.tim]
   [junit4]   2> 38503 INFO  (qtp29431509-91) [    x:collection1] o.a.s.u.LoggingInfoStream [DWPT][qtp29431509-91]: flushed codec=Lucene54
   [junit4]   2> 38503 INFO  (qtp29431509-91) [    x:collection1] o.a.s.u.LoggingInfoStream [DWPT][qtp29431509-91]: flushed: segment=_3 ramUsed=0.141 MB newFlushedSize=0.002 MB docs/MB=15,365.272
   [junit4]   2> 38503 INFO  (qtp29431509-91) [    x:collection1] o.a.s.u.LoggingInfoStream [DW][qtp29431509-91]: publishFlushedSegment seg-private updates=null
   [junit4]   2> 38503 INFO  (qtp29431509-91) [    x:collection1] o.a.s.u.LoggingInfoStream [IW][qtp29431509-91]: publishFlushedSegment
   [junit4]   2> 38504 INFO  (qtp29431509-91) [    x:collection1] o.a.s.u.LoggingInfoStream [BD][qtp29431509-91]: push deletes  476 deleted terms (unique count=476) bytesUsed=2096 segmentPrivate?=false delGen=4 packetCount=1 totBytesUsed=2096
   [junit4]   2> 38504 INFO  (qtp29431509-91) [    x:collection1] o.a.s.u.LoggingInfoStream [IW][qtp29431509-91]: publish sets newSegment delGen=5 seg=_0(5.5.0):C203
   [junit4]   2> 38504 INFO  (qtp29431509-91) [    x:collection1] o.a.s.u.LoggingInfoStream [IFD][qtp29431509-91]: now checkpoint "_0(5.5.0):C203" [1 segments ; isCommit = false]
   [junit4]   2> 38504 INFO  (qtp29431509-91) [    x:collection1] o.a.s.u.LoggingInfoStream [IFD][qtp29431509-91]: 0 msec to checkpoint
   [junit4]   2> 38504 INFO  (qtp29431509-91) [    x:collection1] o.a.s.u.LoggingInfoStream [DW][qtp29431509-91]: publishFlushedSegment seg-private updates=null
   [junit4]   2> 38504 INFO  (qtp29431509-91) [    x:collection1] o.a.s.u.LoggingInfoStream [IW][qtp29431509-91]: publishFlushedSegment
   [junit4]   2> 38504 INFO  (qtp29431509-91) [    x:collection1] o.a.s.u.LoggingInfoStream [IW][qtp29431509-91]: publish sets newSegment delGen=6 seg=_2(5.5.0):C138
   [junit4]   2> 38504 INFO  (qtp29431509-91) [    x:collection1] o.a.s.u.LoggingInfoStream [IFD][qtp29431509-91]: now checkpoint "_0(5.5.0):C203 _2(5.5.0):C138" [2 segments ; isCommit = false]
   [junit4]   2> 38504 INFO  (qtp29431509-91) [    x:collection1] o.a.s.u.LoggingInfoStream [IFD][qtp29431509-91]: 0 msec to checkpoint
   [junit4]   2> 38504 INFO  (qtp29431509-91) [    x:collection1] o.a.s.u.LoggingInfoStream [DW][qtp29431509-91]: publishFlushedSegment seg-private updates=null
   [junit4]   2> 38504 INFO  (qtp29431509-91) [    x:collection1] o.a.s.u.LoggingInfoStream [IW][qtp29431509-91]: publishFlushedSegment
   [junit4]   2> 38504 INFO  (qtp29431509-91) [    x:collection1] o.a.s.u.LoggingInfoStream [IW][qtp29431509-91]: publish sets newSegment delGen=7 seg=_1(5.5.0):C98
   [junit4]   2> 38504 INFO  (qtp29431509-91) [    x:collection1] o.a.s.u.LoggingInfoStream [IFD][qtp29431509-91]: now checkpoint "_0(5.5.0):C203 _2(5.5.0):C138 _1(5.5.0):C98" [3 segments ; isCommit = false]
   [junit4]   2> 38504 INFO  (qtp29431509-91) [    x:collection1] o.a.s.u.LoggingInfoStream [IFD][qtp29431509-91]: 0 msec to checkpoint
   [junit4]   2> 38504 INFO  (qtp29431509-91) [    x:collection1] o.a.s.u.LoggingInfoStream [DW][qtp29431509-91]: publishFlushedSegment seg-private updates=null
   [junit4]   2> 38504 INFO  (qtp29431509-91) [    x:collection1] o.a.s.u.LoggingInfoStream [IW][qtp29431509-91]: publishFlushedSegment
   [junit4]   2> 38504 INFO  (qtp29431509-91) [    x:collection1] o.a.s.u.LoggingInfoStream [IW][qtp29431509-91]: publish sets newSegment delGen=8 seg=_3(5.5.0):C37
   [junit4]   2> 38504 INFO  (qtp29431509-91) [    x:collection1] o.a.s.u.LoggingInfoStream [IFD][qtp29431509-91]: now checkpoint "_0(5.5.0):C203 _2(5.5.0):C138 _1(5.5.0):C98 _3(5.5.0):C37" [4 segments ; isCommit = false]
   [junit4]   2> 38505 INFO  (qtp29431509-91) [    x:collection1] o.a.s.u.LoggingInfoStream [IFD][qtp29431509-91]: 0 msec to checkpoint
   [junit4]   2> 38505 INFO  (qtp29431509-91) [    x:collection1] o.a.s.u.LoggingInfoStream [IW][qtp29431509-91]: apply all deletes during flush
   [junit4]   2> 38505 INFO  (qtp29431509-91) [    x:collection1] o.a.s.u.LoggingInfoStream [IW][qtp29431509-91]: now apply all deletes for all segments maxDoc=476
   [junit4]   2> 38505 INFO  (qtp29431509-91) [    x:collection1] o.a.s.u.LoggingInfoStream [BD][qtp29431509-91]: applyDeletes: open segment readers took 0 msec
   [junit4]   2> 38505 INFO  (qtp29431509-91) [    x:collection1] o.a.s.u.LoggingInfoStream [BD][qtp29431509-91]: applyDeletes: infos=[_0(5.5.0):C203, _2(5.5.0):C138, _1(5.5.0):C98, _3(5.5.0):C37] packetCount=1
   [junit4]   2> 38505 INFO  (qtp29431509-91) [    x:collection1] o.a.s.u.LoggingInfoStream [BD][qtp29431509-91]: applyDeletes took 0 msec for 4 segments, 0 newly deleted docs (query deletes), 0 visited terms, allDeleted=null
   [junit4]   2> 38505 INFO  (qtp29431509-91) [    x:collection1] o.a.s.u.LoggingInfoStream [BD][qtp29431509-91]: prune sis=segments_1: _0(5.5.0):C203 _2(5.5.0):C138 _1(5.5.0):C98 _3(5.5.0):C37 minGen=5 packetCount=1
   [junit4]   2> 38505 INFO  (qtp29431509-91) [    x:collection1] o.a.s.u.LoggingInfoStream [BD][qtp29431509-91]: pruneDeletes: prune 1 packets; 0 packets remain
   [junit4]   2> 38505 INFO  (qtp29431509-91) [    x:collection1] o.a.s.u.LoggingInfoStream [DW][qtp29431509-91]: qtp29431509-91 finishFullFlush success=true
   [junit4]   2> 38505 INFO  (qtp29431509-91) [    x:collection1] o.a.s.u.LoggingInfoStream [TMP][qtp29431509-91]: findMerges: 4 segments
   [junit4]   2> 38505 INFO  (qtp29431509-91) [    x:collection1] o.a.s.u.LoggingInfoStream [TMP][qtp29431509-91]:   seg=_0(5.5.0):C203 size=0.007 MB [floored]
   [junit4]   2> 38505 INFO  (qtp29431509-91) [    x:collection1] o.a.s.u.LoggingInfoStream [TMP][qtp29431509-91]:   seg=_2(5.5.0):C138 size=0.005 MB [floored]
   [junit4]   2> 38505 INFO  (qtp29431509-91) [    x:collection1] o.a.s.u.LoggingInfoStream [TMP][qtp29431509-91]:   seg=_1(5.5.0):C98 size=0.004 MB [floored]
   [junit4]   2> 38505 INFO  (qtp29431509-91) [    x:collection1] o.a.s.u.LoggingInfoStream [TMP][qtp29431509-91]:   seg=_3(5.5.0):C37 size=0.002 MB [floored]
   [junit4]   2> 38505 INFO  (qtp29431509-91) [    x:collection1] o.a.s.u.LoggingInfoStream [TMP][qtp29431509-91]:   allowedSegmentCount=1 vs count=4 (eligible count=4) tooBigCount=0
   [junit4]   2> 38506 INFO  (qtp29431509-91) [    x:collection1] o.a.s.u.LoggingInfoStream [MS][qtp29431509-91]: initDynamicDefaults spins=true maxThreadCount=1 maxMergeCount=6
   [junit4]   2> 38506 INFO  (qtp29431509-91) [    x:collection1] o.a.s.u.LoggingInfoStream [MS][qtp29431509-91]: now merge
   [junit4]   2> 38506 INFO  (qtp29431509-91) [    x:collection1] o.a.s.u.LoggingInfoStream [MS][qtp29431509-91]:   index: _0(5.5.0):C203 _2(5.5.0):C138 _1(5.5.0):C98 _3(5.5.0):C37
   [junit4]   2> 38506 INFO  (qtp29431509-91) [    x:collection1] o.a.s.u.LoggingInfoStream [MS][qtp29431509-91]:   no more merges pending; now return
   [junit4]   2> 38506 INFO  (qtp29431509-91) [    x:collection1] o.a.s.u.LoggingInfoStream [IW][qtp29431509-91]: startCommit(): start
   [junit4]   2> 38506 INFO  (qtp29431509-91) [    x:collection1] o.a.s.u.LoggingInfoStream [IW][qtp29431509-91]: startCommit index=_0(5.5.0):C203 _2(5.5.0):C138 _1(5.5.0):C98 _3(5.5.0):C37 changeCount=10
   [junit4]   2> 38506 INFO  (qtp29431509-91) [    x:collection1] o.a.s.u.LoggingInfoStream [IW][qtp29431509-91]: startCommit: wrote pending segments file "pending_segments_2"
   [junit4]   2> 38506 INFO  (qtp29431509-91) [    x:collection1] o.a.s.u.LoggingInfoStream [IW][qtp29431509-91]: done all syncs: [_0_Lucene50_0.tip, _0.fdx, _2.fdx, _1_Lucene50_0.tip, _1.si, _3.fdt, _0.si, _1_Lucene50_0.pos, _2.fnm, _2_Lucene50_0.doc, _0_Lucene50_0.pos, _2_Lucene50_0.pos, _0.nvm, _3_Lucene50_0.doc, _0.fdt, _3.fnm, _0.fnm, _2.nvm, _0_Lucene50_0.tim, _1.fdx, _1.nvm, _2_Lucene50_0.tim, _3.nvd, _1_Lucene50_0.tim, _2.fdt, _3_Lucene50_0.tip, _1.fdt, _1.nvd, _3_Lucene50_0.pos, _0.nvd, _2.nvd, _3.fdx, _3.nvm, _3.si, _2.si, _0_Lucene50_0.doc, _1.fnm, _1_Lucene50_0.doc, _3_Lucene50_0.tim, _2_Lucene50_0.tip]
   [junit4]   2> 38507 INFO  (qtp29431509-91) [    x:collection1] o.a.s.u.LoggingInfoStream [IW][qtp29431509-91]: commit: pendingCommit != null
   [junit4]   2> 38507 INFO  (qtp29431509-91) [    x:collection1] o.a.s.u.LoggingInfoStream [IW][qtp29431509-91]: commit: done writing segments file "segments_2"
   [junit4]   2> 38507 INFO  (qtp29431509-91) [    x:collection1] o.a.s.u.LoggingInfoStream [IFD][qtp29431509-91]: now checkpoint "_0(5.5.0):C203 _2(5.5.0):C138 _1(5.5.0):C98 _3(5.5.0):C37" [4 segments ; isCommit = true]
   [junit4]   2> 38507 INFO  (qtp29431509-91) [    x:collection1] o.a.s.c.SolrDeletionPolicy SolrDeletionPolicy.onCommit: commits: num=2
   [junit4]   2> 	commit{dir=MockDirectoryWrapper(RAMDirectory@3c9e5c lockFactory=org.apache.lucene.store.SingleInstanceLockFactory@1c0d224),segFN=segments_1,generation=1}
   [junit4]   2> 	commit{dir=MockDirectoryWrapper(RAMDirectory@3c9e5c lockFactory=org.apache.lucene.store.SingleInstanceLockFactory@1c0d224),segFN=segments_2,generation=2}
   [junit4]   2> 38507 INFO  (qtp29431509-91) [    x:collection1] o.a.s.c.SolrDeletionPolicy newest commit generation = 2
   [junit4]   2> 38507 INFO  (qtp29431509-91) [    x:collection1] o.a.s.u.LoggingInfoStream [IFD][qtp29431509-91]: deleteCommits: now decRef commit "segments_1"
   [junit4]   2> 38507 INFO  (qtp29431509-91) [    x:collection1] o.a.s.u.LoggingInfoStream [IFD][qtp29431509-91]: delete "segments_1"
   [junit4]   2> 38507 INFO  (qtp29431509-91) [    x:collection1] o.a.s.u.LoggingInfoStream [IFD][qtp29431509-91]: 0 msec to checkpoint
   [junit4]   2> 38507 INFO  (qtp29431509-91) [    x:collection1] o.a.s.u.LoggingInfoStream [IW][qtp29431509-91]: commit: took 28.5 msec
   [junit4]   2> 38507 INFO  (qtp29431509-91) [    x:collection1] o.a.s.u.LoggingInfoStream [IW][qtp29431509-91]: commit: done
   [junit4]   2> 38509 INFO  (qtp29431509-91) [    x:collection1] o.a.s.u.LoggingInfoStream [IW][qtp29431509-91]: nrtIsCurrent: infoVersion matches: false; DW changes: false; BD changes: false
   [junit4]   2> 38509 INFO  (qtp29431509-91) [    x:collection1] o.a.s.u.LoggingInfoStream [IW][qtp29431509-91]: flush at getReader
   [junit4]   2> 38509 INFO  (qtp29431509-91) [    x:collection1] o.a.s.u.LoggingInfoStream [DW][qtp29431509-91]: startFullFlush
   [junit4]   2> 38509 INFO  (qtp29431509-91) [    x:collection1] o.a.s.u.LoggingInfoStream [IW][qtp29431509-91]: apply all deletes during flush
   [junit4]   2> 38509 INFO  (qtp29431509-91) [    x:collection1] o.a.s.u.LoggingInfoStream [IW][qtp29431509-91]: now apply all deletes for all segments maxDoc=476
   [junit4]   2> 38509 INFO  (qtp29431509-91) [    x:collection1] o.a.s.u.LoggingInfoStream [BD][qtp29431509-91]: applyDeletes: open segment readers took 0 msec
   [junit4]   2> 38509 INFO  (qtp29431509-91) [    x:collection1] o.a.s.u.LoggingInfoStream [BD][qtp29431509-91]: applyDeletes: no segments; skipping
   [junit4]   2> 38509 INFO  (qtp29431509-91) [    x:collection1] o.a.s.u.LoggingInfoStream [BD][qtp29431509-91]: prune sis=segments_2: _0(5.5.0):C203 _2(5.5.0):C138 _1(5.5.0):C98 _3(5.5.0):C37 minGen=5 packetCount=0
   [junit4]   2> 38515 INFO  (qtp29431509-89) [    x:collection1] o.a.s.u.p.LogUpdateProcessorFactory [collection1]  webapp=/solr path=/update params={wt=javabin&version=2}{add=[T0:0 (1523105535232049156), T0:1 (1523105535233097728), T0:2 (1523105535233097729), T0:3 (1523105535233097731), T0:4 (1523105535234146304), T0:5 (1523105535234146306), T0:6 (1523105535235194881), T0:7 (1523105535235194882), T0:8 (1523105535236243456), T0:9 (1523105535236243457), ... (100 adds)]} 0 127
   [junit4]   2> 38519 INFO  (qtp29431509-91) [    x:collection1] o.a.s.u.LoggingInfoStream [IW][qtp29431509-91]: incRefDeleter for NRT reader version=12 segments=_0(5.5.0):C203 _2(5.5.0):C138 _1(5.5.0):C98 _3(5.5.0):C37
   [junit4]   2> 38519 INFO  (qtp29431509-91) [    x:collection1] o.a.s.u.LoggingInfoStream [IW][qtp29431509-91]: return reader version=12 reader=StandardDirectoryReader(segments_2:12:nrt _0(5.5.0):C203 _2(5.5.0):C138 _1(5.5.0):C98 _3(5.5.0):C37)
   [junit4]   2> 38519 INFO  (qtp29431509-91) [    x:collection1] o.a.s.u.LoggingInfoStream [DW][qtp29431509-91]: qtp29431509-91 finishFullFlush success=true
   [junit4]   2> 38519 INFO  (qtp29431509-91) [    x:collection1] o.a.s.u.LoggingInfoStream [IW][qtp29431509-91]: getReader took 10 msec
   [junit4]   2> 38519 INFO  (qtp29431509-91) [    x:collection1] o.a.s.s.SolrIndexSearcher Opening Searcher@cdc8e7[collection1] main
   [junit4]   2> 38520 INFO  (qtp29431509-91) [    x:collection1] o.a.s.u.DirectUpdateHandler2 end_commit_flush
   [junit4]   2> 38520 INFO  (qtp29431509-92) [    x:collection1] o.a.s.u.DirectUpdateHandler2 start commit{,optimize=false,openSearcher=true,waitSearcher=true,expungeDeletes=false,softCommit=false,prepareCommit=false}
   [junit4]   2> 38520 INFO  (qtp29431509-92) [    x:collection1] o.a.s.u.LoggingInfoStream [IW][qtp29431509-92]: commit: start
   [junit4]   2> 38520 INFO  (qtp29431509-92) [    x:collection1] o.a.s.u.LoggingInfoStream [IW][qtp29431509-92]: commit: enter lock
   [junit4]   2> 38520 INFO  (qtp29431509-92) [    x:collection1] o.a.s.u.LoggingInfoStream [IW][qtp29431509-92]: commit: now prepare
   [junit4]   2> 38520 INFO  (qtp29431509-92) [    x:collection1] o.a.s.u.LoggingInfoStream [IW][qtp29431509-92]: prepareCommit: flush
   [junit4]   2> 38521 INFO  (qtp29431509-92) [    x:collection1] o.a.s.u.LoggingInfoStream [IW][qtp29431509-92]:   index before flush _0(5.5.0):C203 _2(5.5.0):C138 _1(5.5.0):C98 _3(5.5.0):C37
   [junit4]   2> 38521 INFO  (qtp29431509-92) [    x:collection1] o.a.s.u.LoggingInfoStream [DW][qtp29431509-92]: startFullFlush
   [junit4]   2> 38521 INFO  (qtp29431509-92) [    x:collection1] o.a.s.u.LoggingInfoStream [DW][qtp29431509-92]: anyChanges? numDocsInRam=18 deletes=true hasTickets:false pendingChangesInFullFlush: false
   [junit4]   2> 38521 INFO  (qtp29431509-92) [    x:collection1] o.a.s.u.LoggingInfoStream [DWFC][qtp29431509-92]: addFlushableState DocumentsWriterPerThread [pendingDeletes=gen=0, segment=_4, aborted=false, numDocsInRAM=1, deleteQueue=DWDQ: [ generation: 4 ]]
   [junit4]   2> 38522 INFO  (qtp29431509-92) [    x:collection1] o.a.s.u.LoggingInfoStream [DWFC][qtp29431509-92]: addFlushableState DocumentsWriterPerThread [pendingDeletes=gen=0 17 deleted terms (unique count=17) bytesUsed=2397, segment=_5, aborted=false, numDocsInRAM=18, deleteQueue=DWDQ: [ generation: 4 ]]
   [junit4]   2> 38522 INFO  (qtp29431509-92) [    x:collection1] o.a.s.u.LoggingInfoStream [DWPT][qtp29431509-92]: flush postings as segment _4 numDocs=1
   [junit4]   2> 38523 INFO  (qtp29431509-92) [    x:collection1] o.a.s.u.LoggingInfoStream [DWPT][qtp29431509-92]: new segment has 0 deleted docs
   [junit4]   2> 38523 INFO  (qtp29431509-92) [    x:collection1] o.a.s.u.LoggingInfoStream [DWPT][qtp29431509-92]: new segment has no vectors; norms; no docValues; prox; freqs
   [junit4]   2> 38523 INFO  (qtp29431509-92) [    x:collection1] o.a.s.u.LoggingInfoStream [DWPT][qtp29431509-92]: flushedFiles=[_4.nvm, _4.fdt, _4_Lucene50_0.pos, _4.fnm, _4.nvd, _4_Lucene50_0.tim, _4.fdx, _4_Lucene50_0.doc, _4_Lucene50_0.tip]
   [junit4]   2> 38523 INFO  (qtp29431509-92) [    x:collection1] o.a.s.u.LoggingInfoStream [DWPT][qtp29431509-92]: flushed codec=Lucene54
   [junit4]   2> 38523 INFO  (qtp29431509-92) [    x:collection1] o.a.s.u.LoggingInfoStream [DWPT][qtp29431509-92]: flushed: segment=_4 ramUsed=0.095 MB newFlushedSize=0.001 MB docs/MB=743.671
   [junit4]   2> 38523 INFO  (qtp29431509-92) [    x:collection1] o.a.s.u.LoggingInfoStream [DWPT][qtp29431509-92]: flush postings as segment _5 numDocs=18
   [junit4]   2> 38525 INFO  (qtp29431509-92) [    x:collection1] o.a.s.u.LoggingInfoStream [DWPT][qtp29431509-92]: new segment has 0 deleted docs
   [junit4]   2> 38525 INFO  (qtp29431509-92) [    x:collection1] o.a.s.u.LoggingInfoStream [DWPT][qtp29431509-92]: new segment has no vectors; norms; no docValues; prox; freqs
   [junit4]   2> 38525 INFO  (qtp29431509-92) [    x:collection1] o.a.s.u.LoggingInfoStream [DWPT][qtp29431509-92]: flushedFiles=[_5.fdx, _5_Lucene50_0.tim, _5.fdt, _5.nvm, _5_Lucene50_0.pos, _5.nvd, _5.fnm, _5_Lucene50_0.doc, _5_Lucene50_0.tip]
   [junit4]   2> 38525 INFO  (qtp29431509-92) [    x:collection1] o.a.s.u.LoggingInfoStream [DWPT][qtp29431509-92]: flushed codec=Lucene54
   [junit4]   2> 38525 INFO  (qtp29431509-92) [    x:collection1] o.a.s.u.LoggingInfoStream [DWPT][qtp29431509-92]: flushed: segment=_5 ramUsed=0.099 MB newFlushedSize=0.002 MB docs/MB=9,234.035
   [junit4]   2> 38525 INFO  (qtp29431509-92) [    x:collection1] o.a.s.u.LoggingInfoStream [DW][qtp29431509-92]: publishFlushedSegment seg-private updates=null
   [junit4]   2> 38526 INFO  (qtp29431509-92) [    x:collection1] o.a.s.u.LoggingInfoStream [IW][qtp29431509-92]: publishFlushedSegment
   [junit4]   2> 38526 INFO  (qtp29431509-92) [    x:collection1] o.a.s.u.LoggingInfoStream [BD][qtp29431509-92]: push deletes  19 deleted terms (unique count=19) bytesUsed=1072 segmentPrivate?=false delGen=11 packetCount=1 totBytesUsed=1072
   [junit4]   2> 38526 INFO  (qtp29431509-92) [    x:collection1] o.a.s.u.LoggingInfoStream [IW][qtp29431509-92]: publish sets newSegment delGen=12 seg=_4(5.5.0):C1
   [junit4]   2> 38526 INFO  (qtp29431509-92) [    x:collection1] o.a.s.u.LoggingInfoStream [IFD][qtp29431509-92]: now checkpoint "_0(5.5.0):C203 _2(5.5.0):C138 _1(5.5.0):C98 _3(5.5.0):C37 _4(5.5.0):C1" [5 segments ; isCommit = false]
   [junit4]   2> 38526 INFO  (qtp29431509-92) [    x:collection1] o.a.s.u.LoggingInfoStream [IFD][qtp29431509-92]: 0 msec to checkpoint
   [junit4]   2> 38526 INFO  (qtp29431509-92) [    x:collection1] o.a.s.u.LoggingInfoStream [DW][qtp29431509-92]: publishFlushedSegment seg-private updates=null
   [junit4]   2> 38526 INFO  (qtp29431509-92) [    x:collection1] o.a.s.u.LoggingInfoStream [IW][qtp29431509-92]: publishFlushedSegment
   [junit4]   2> 38526 INFO  (qtp29431509-92) [    x:collection1] o.a.s.u.LoggingInfoStream [IW][qtp29431509-92]: publish sets newSegment delGen=13 seg=_5(5.5.0):C18
   [junit4]   2> 38526 INFO  (qtp29431509-92) [    x:collection1] o.a.s.u.LoggingInfoStream [IFD][qtp29431509-92]: now checkpoint "_0(5.5.0):C203 _2(5.5.0):C138 _1(5.5.0):C98 _3(5.5.0):C37 _4(5.5.0):C1 _5(5.5.0):C18" [6 segments ; isCommit = false]
   [junit4]   2> 38526 INFO  (qtp29431509-92) [    x:collection1] o.a.s.u.LoggingInfoStream [IFD][qtp29431509-92]: 0 msec to checkpoint
   [junit4]   2> 38526 INFO  (qtp29431509-92) [    x:collection1] o.a.s.u.LoggingInfoStream [IW][qtp29431509-92]: apply all deletes during flush
   [junit4]   2> 38526 INFO  (qtp29431509-92) [    x:collection1] o.a.s.u.LoggingInfoStream [IW][qtp29431509-92]: now apply all deletes for all segments maxDoc=495
   [junit4]   2> 38526 INFO  (qtp29431509-92) [    x:collection1] o.a.s.u.LoggingInfoStream [BD][qtp29431509-92]: applyDeletes: open segment readers took 0 msec
   [junit4]   2> 38526 INFO  (qtp29431509-92) [    x:collection1] o.a.s.u.LoggingInfoStream [BD][qtp29431509-92]: applyDeletes: infos=[_0(5.5.0):C203, _2(5.5.0):C138, _1(5.5.0):C98, _3(5.5.0):C37, _4(5.5.0):C1, _5(5.5.0):C18] packetCount=1
   [junit4]   2> 38528 INFO  (qtp29431509-92) [    x:collection1] o.a.s.u.LoggingInfoStream [BD][qtp29431509-92]: applyTermDeletes took 0.4 msec for 6 segments and 1 packets; 19 del terms visited; 46 seg terms visited
   [junit4]   2> 38528 INFO  (qtp29431509-92) [    x:collection1] o.a.s.u.LoggingInfoStream [BD][qtp29431509-92]: applyDeletes: 0 new deleted documents
   [junit4]   2> 38528 INFO  (qtp29431509-92) [    x:collection1] o.a.s.u.LoggingInfoStream [BD][qtp29431509-92]: applyDeletes took 2 msec for 6 segments, 0 newly deleted docs (query deletes), 19 visited terms, allDeleted=null
   [junit4]   2> 38528 INFO  (qtp29431509-92) [    x:collection1] o.a.s.u.LoggingInfoStream [BD][qtp29431509-92]: prune sis=segments_2: _0(5.5.0):C203 _2(5.5.0):C138 _1(5.5.0):C98 _3(5.5.0):C37 _4(5.5.0):C1 _5(5.5.0):C18 minGen=14 packetCount=1
   [junit4]   2> 38528 INFO  (qtp29431509-92) [    x:collection1] o.a.s.u.LoggingInfoStream [BD][qtp29431509-92]: pruneDeletes: prune 1 packets; 0 packets remain
   [junit4]   2> 38528 INFO  (qtp29431509-92) 

[...truncated too long message...]

e.solr.update.TransactionLog.<init>(TransactionLog.java:143)
   [junit4]   2> 	at org.apache.solr.update.UpdateLog.ensureLog(UpdateLog.java:863)
   [junit4]   2> 	at org.apache.solr.update.UpdateLog.add(UpdateLog.java:424)
   [junit4]   2> 	at org.apache.solr.update.UpdateLog.add(UpdateLog.java:410)
   [junit4]   2> 	at org.apache.solr.update.DirectUpdateHandler2.doNormalUpdate(DirectUpdateHandler2.java:303)
   [junit4]   2> 	at org.apache.solr.update.DirectUpdateHandler2.addDoc0(DirectUpdateHandler2.java:215)
   [junit4]   2> 	at org.apache.solr.update.DirectUpdateHandler2.addDoc(DirectUpdateHandler2.java:170)
   [junit4]   2> 	at org.apache.solr.update.processor.RunUpdateProcessor.processAdd(RunUpdateProcessorFactory.java:69)
   [junit4]   2> 	at org.apache.solr.update.processor.UpdateRequestProcessor.processAdd(UpdateRequestProcessor.java:49)
   [junit4]   2> 	at org.apache.solr.update.processor.DistributedUpdateProcessor.doLocalAdd(DistributedUpdateProcessor.java:929)
   [junit4]   2> 	at org.apache.solr.update.processor.DistributedUpdateProcessor.versionAdd(DistributedUpdateProcessor.java:1084)
   [junit4]   2> 	at org.apache.solr.update.processor.DistributedUpdateProcessor.processAdd(DistributedUpdateProcessor.java:707)
   [junit4]   2> 	at org.apache.solr.update.processor.LogUpdateProcessorFactory$LogUpdateProcessor.processAdd(LogUpdateProcessorFactory.java:104)
   [junit4]   2> 	at org.apache.solr.handler.loader.XMLLoader.processUpdate(XMLLoader.java:251)
   [junit4]   2> 	at org.apache.solr.handler.loader.XMLLoader.load(XMLLoader.java:178)
   [junit4]   2> 	at org.apache.solr.handler.UpdateRequestHandler$1.load(UpdateRequestHandler.java:95)
   [junit4]   2> 	at org.apache.solr.handler.ContentStreamHandlerBase.handleRequestBody(ContentStreamHandlerBase.java:70)
   [junit4]   2> 	at org.apache.solr.handler.RequestHandlerBase.handleRequest(RequestHandlerBase.java:156)
   [junit4]   2> 	at org.apache.solr.core.SolrCore.execute(SolrCore.java:2062)
   [junit4]   2> 	at org.apache.solr.servlet.HttpSolrCall.execute(HttpSolrCall.java:658)
   [junit4]   2> 	at org.apache.solr.servlet.HttpSolrCall.call(HttpSolrCall.java:457)
   [junit4]   2> 	at org.apache.solr.servlet.SolrDispatchFilter.doFilter(SolrDispatchFilter.java:226)
   [junit4]   2> 	at org.apache.solr.servlet.SolrDispatchFilter.doFilter(SolrDispatchFilter.java:184)
   [junit4]   2> 	at org.eclipse.jetty.servlet.ServletHandler$CachedChain.doFilter(ServletHandler.java:1652)
   [junit4]   2> 	at org.apache.solr.client.solrj.embedded.JettySolrRunner$DebugFilter.doFilter(JettySolrRunner.java:110)
   [junit4]   2> 	at org.eclipse.jetty.servlet.ServletHandler$CachedChain.doFilter(ServletHandler.java:1652)
   [junit4]   2> 	at org.eclipse.jetty.servlets.UserAgentFilter.doFilter(UserAgentFilter.java:83)
   [junit4]   2> 	at org.eclipse.jetty.servlets.GzipFilter.doFilter(GzipFilter.java:300)
   [junit4]   2> 	at org.eclipse.jetty.servlet.ServletHandler$CachedChain.doFilter(ServletHandler.java:1652)
   [junit4]   2> 	at org.eclipse.jetty.servlet.ServletHandler.doHandle(ServletHandler.java:585)
   [junit4]   2> 	at org.eclipse.jetty.server.session.SessionHandler.doHandle(SessionHandler.java:221)
   [junit4]   2> 	at org.eclipse.jetty.server.handler.ContextHandler.doHandle(ContextHandler.java:1127)
   [junit4]   2> 	at org.eclipse.jetty.servlet.ServletHandler.doScope(ServletHandler.java:515)
   [junit4]   2> 	at org.eclipse.jetty.server.session.SessionHandler.doScope(SessionHandler.java:185)
   [junit4]   2> 	at org.eclipse.jetty.server.handler.ContextHandler.doScope(ContextHandler.java:1061)
   [junit4]   2> 	at org.eclipse.jetty.server.handler.ScopedHandler.handle(ScopedHandler.java:141)
   [junit4]   2> 	at org.eclipse.jetty.server.handler.HandlerWrapper.handle(HandlerWrapper.java:97)
   [junit4]   2> 	at org.eclipse.jetty.server.Server.handle(Server.java:499)
   [junit4]   2> 	at org.eclipse.jetty.server.HttpChannel.handle(HttpChannel.java:310)
   [junit4]   2> 	at org.eclipse.jetty.server.HttpConnection.onFillable(HttpConnection.java:257)
   [junit4]   2> 	at org.eclipse.jetty.io.AbstractConnection$2.run(AbstractConnection.java:540)
   [junit4]   2> 	at org.eclipse.jetty.util.thread.QueuedThreadPool.runJob(QueuedThreadPool.java:635)
   [junit4]   2> 	at org.eclipse.jetty.util.thread.QueuedThreadPool$3.run(QueuedThreadPool.java:555)
   [junit4]   2> 	at java.lang.Thread.run(Thread.java:745)
   [junit4]   2> 
   [junit4]   2> NOTE: test params are: codec=CheapBastard, sim=RandomSimilarityProvider(queryNorm=true,coord=crazy): {}, locale=en_PH, timezone=Asia/Novokuznetsk
   [junit4]   2> NOTE: Windows 7 6.1 x86/Oracle Corporation 1.7.0_80 (32-bit)/cpus=3,threads=1,free=81009448,total=191102976
   [junit4]   2> NOTE: All tests run in this JVM: [SolrPingTest, SolrExceptionTest, SolrExampleStreamingBinaryTest, TestZkConfigManager, LargeVolumeBinaryJettyTest]
   [junit4]   2> NOTE: reproduce with: ant test  -Dtestcase=LargeVolumeBinaryJettyTest -Dtests.seed=699413EC8B3D3869 -Dtests.slow=true -Dtests.locale=en_PH -Dtests.timezone=Asia/Novokuznetsk -Dtests.asserts=true -Dtests.file.encoding=US-ASCII
   [junit4] ERROR   0.00s J1 | LargeVolumeBinaryJettyTest (suite) <<<
   [junit4]    > Throwable #1: java.lang.AssertionError: ObjectTracker found 1 object(s) that were not released!!! [TransactionLog]
   [junit4]    > 	at __randomizedtesting.SeedInfo.seed([699413EC8B3D3869]:0)
   [junit4]    > 	at org.apache.solr.SolrTestCaseJ4.afterClass(SolrTestCaseJ4.java:228)
   [junit4]    > 	at java.lang.Thread.run(Thread.java:745)Throwable #2: java.io.IOException: Could not remove the following files (in the order of attempts):
   [junit4]    >    C:\Users\JenkinsSlave\workspace\Lucene-Solr-5.x-Windows\solr\build\solr-solrj\test\J1\temp\solr.client.solrj.embedded.LargeVolumeBinaryJettyTest_699413EC8B3D3869-001\tempDir-001\collection1\data\tlog\tlog.0000000000000000002: java.nio.file.FileSystemException: C:\Users\JenkinsSlave\workspace\Lucene-Solr-5.x-Windows\solr\build\solr-solrj\test\J1\temp\solr.client.solrj.embedded.LargeVolumeBinaryJettyTest_699413EC8B3D3869-001\tempDir-001\collection1\data\tlog\tlog.0000000000000000002: The process cannot access the file because it is being used by another process.
   [junit4]    >    C:\Users\JenkinsSlave\workspace\Lucene-Solr-5.x-Windows\solr\build\solr-solrj\test\J1\temp\solr.client.solrj.embedded.LargeVolumeBinaryJettyTest_699413EC8B3D3869-001\tempDir-001\collection1\data\tlog: java.nio.file.DirectoryNotEmptyException: C:\Users\JenkinsSlave\workspace\Lucene-Solr-5.x-Windows\solr\build\solr-solrj\test\J1\temp\solr.client.solrj.embedded.LargeVolumeBinaryJettyTest_699413EC8B3D3869-001\tempDir-001\collection1\data\tlog
   [junit4]    >    C:\Users\JenkinsSlave\workspace\Lucene-Solr-5.x-Windows\solr\build\solr-solrj\test\J1\temp\solr.client.solrj.embedded.LargeVolumeBinaryJettyTest_699413EC8B3D3869-001\tempDir-001\collection1\data: java.nio.file.DirectoryNotEmptyException: C:\Users\JenkinsSlave\workspace\Lucene-Solr-5.x-Windows\solr\build\solr-solrj\test\J1\temp\solr.client.solrj.embedded.LargeVolumeBinaryJettyTest_699413EC8B3D3869-001\tempDir-001\collection1\data
   [junit4]    >    C:\Users\JenkinsSlave\workspace\Lucene-Solr-5.x-Windows\solr\build\solr-solrj\test\J1\temp\solr.client.solrj.embedded.LargeVolumeBinaryJettyTest_699413EC8B3D3869-001\tempDir-001\collection1: java.nio.file.DirectoryNotEmptyException: C:\Users\JenkinsSlave\workspace\Lucene-Solr-5.x-Windows\solr\build\solr-solrj\test\J1\temp\solr.client.solrj.embedded.LargeVolumeBinaryJettyTest_699413EC8B3D3869-001\tempDir-001\collection1
   [junit4]    >    C:\Users\JenkinsSlave\workspace\Lucene-Solr-5.x-Windows\solr\build\solr-solrj\test\J1\temp\solr.client.solrj.embedded.LargeVolumeBinaryJettyTest_699413EC8B3D3869-001\tempDir-001: java.nio.file.DirectoryNotEmptyException: C:\Users\JenkinsSlave\workspace\Lucene-Solr-5.x-Windows\solr\build\solr-solrj\test\J1\temp\solr.client.solrj.embedded.LargeVolumeBinaryJettyTest_699413EC8B3D3869-001\tempDir-001
   [junit4]    >    C:\Users\JenkinsSlave\workspace\Lucene-Solr-5.x-Windows\solr\build\solr-solrj\test\J1\temp\solr.client.solrj.embedded.LargeVolumeBinaryJettyTest_699413EC8B3D3869-001: java.nio.file.DirectoryNotEmptyException: C:\Users\JenkinsSlave\workspace\Lucene-Solr-5.x-Windows\solr\build\solr-solrj\test\J1\temp\solr.client.solrj.embedded.LargeVolumeBinaryJettyTest_699413EC8B3D3869-001
   [junit4]    > 	at org.apache.lucene.util.IOUtils.rm(IOUtils.java:295)
   [junit4]    > 	at java.lang.Thread.run(Thread.java:745)
   [junit4] Completed [15/69 (1!)] on J1 in 1.82s, 1 test, 1 failure, 1 error <<< FAILURES!

[...truncated 173 lines...]
BUILD FAILED
C:\Users\JenkinsSlave\workspace\Lucene-Solr-5.x-Windows\build.xml:794: The following error occurred while executing this line:
C:\Users\JenkinsSlave\workspace\Lucene-Solr-5.x-Windows\build.xml:738: The following error occurred while executing this line:
C:\Users\JenkinsSlave\workspace\Lucene-Solr-5.x-Windows\build.xml:59: The following error occurred while executing this line:
C:\Users\JenkinsSlave\workspace\Lucene-Solr-5.x-Windows\solr\build.xml:246: The following error occurred while executing this line:
C:\Users\JenkinsSlave\workspace\Lucene-Solr-5.x-Windows\solr\common-build.xml:526: The following error occurred while executing this line:
C:\Users\JenkinsSlave\workspace\Lucene-Solr-5.x-Windows\lucene\common-build.xml:1444: The following error occurred while executing this line:
C:\Users\JenkinsSlave\workspace\Lucene-Solr-5.x-Windows\lucene\common-build.xml:1000: There were test failures: 69 suites, 477 tests, 2 suite-level errors [seed: 699413EC8B3D3869]

Total time: 84 minutes 58 seconds
Build step 'Invoke Ant' marked build as failure
Archiving artifacts
[WARNINGS] Skipping publisher since build result is FAILURE
Recording test results
Email was triggered for: Failure - Any
Sending email for trigger: Failure - Any



Mime
View raw message