lucene-dev mailing list archives

Site index · List index
Message view « Date » · « Thread »
Top « Date » · « Thread »
From Policeman Jenkins Server <jenk...@thetaphi.de>
Subject [JENKINS-EA] Lucene-Solr-5.x-Linux (64bit/jdk-9-ea+95) - Build # 15208 - Failure!
Date Sun, 10 Jan 2016 12:32:52 GMT
Build: http://jenkins.thetaphi.de/job/Lucene-Solr-5.x-Linux/15208/
Java: 64bit/jdk-9-ea+95 -XX:+UseCompressedOops -XX:+UseSerialGC -XX:-CompactStrings

1 tests failed.
FAILED:  junit.framework.TestSuite.org.apache.solr.handler.TestReplicationHandler

Error Message:
ObjectTracker found 2 object(s) that were not released!!! [NRTCachingDirectory, NRTCachingDirectory]

Stack Trace:
java.lang.AssertionError: ObjectTracker found 2 object(s) that were not released!!! [NRTCachingDirectory, NRTCachingDirectory]
	at __randomizedtesting.SeedInfo.seed([3FB87A43D8500100]:0)
	at org.junit.Assert.fail(Assert.java:93)
	at org.junit.Assert.assertTrue(Assert.java:43)
	at org.junit.Assert.assertNull(Assert.java:551)
	at org.apache.solr.SolrTestCaseJ4.afterClass(SolrTestCaseJ4.java:228)
	at sun.reflect.NativeMethodAccessorImpl.invoke0(Native Method)
	at sun.reflect.NativeMethodAccessorImpl.invoke(NativeMethodAccessorImpl.java:62)
	at sun.reflect.DelegatingMethodAccessorImpl.invoke(DelegatingMethodAccessorImpl.java:43)
	at java.lang.reflect.Method.invoke(Method.java:520)
	at com.carrotsearch.randomizedtesting.RandomizedRunner.invoke(RandomizedRunner.java:1764)
	at com.carrotsearch.randomizedtesting.RandomizedRunner$7.evaluate(RandomizedRunner.java:834)
	at com.carrotsearch.randomizedtesting.rules.StatementAdapter.evaluate(StatementAdapter.java:36)
	at com.carrotsearch.randomizedtesting.rules.SystemPropertiesRestoreRule$1.evaluate(SystemPropertiesRestoreRule.java:57)
	at org.apache.lucene.util.AbstractBeforeAfterRule$1.evaluate(AbstractBeforeAfterRule.java:46)
	at com.carrotsearch.randomizedtesting.rules.StatementAdapter.evaluate(StatementAdapter.java:36)
	at org.apache.lucene.util.TestRuleStoreClassName$1.evaluate(TestRuleStoreClassName.java:42)
	at com.carrotsearch.randomizedtesting.rules.NoShadowingOrOverridesOnMethodsRule$1.evaluate(NoShadowingOrOverridesOnMethodsRule.java:40)
	at com.carrotsearch.randomizedtesting.rules.NoShadowingOrOverridesOnMethodsRule$1.evaluate(NoShadowingOrOverridesOnMethodsRule.java:40)
	at com.carrotsearch.randomizedtesting.rules.StatementAdapter.evaluate(StatementAdapter.java:36)
	at com.carrotsearch.randomizedtesting.rules.StatementAdapter.evaluate(StatementAdapter.java:36)
	at com.carrotsearch.randomizedtesting.rules.StatementAdapter.evaluate(StatementAdapter.java:36)
	at org.apache.lucene.util.TestRuleAssertionsRequired$1.evaluate(TestRuleAssertionsRequired.java:54)
	at org.apache.lucene.util.TestRuleMarkFailure$1.evaluate(TestRuleMarkFailure.java:48)
	at org.apache.lucene.util.TestRuleIgnoreAfterMaxFailures$1.evaluate(TestRuleIgnoreAfterMaxFailures.java:65)
	at org.apache.lucene.util.TestRuleIgnoreTestSuites$1.evaluate(TestRuleIgnoreTestSuites.java:55)
	at com.carrotsearch.randomizedtesting.rules.StatementAdapter.evaluate(StatementAdapter.java:36)
	at com.carrotsearch.randomizedtesting.ThreadLeakControl$StatementRunner.run(ThreadLeakControl.java:367)
	at java.lang.Thread.run(Thread.java:747)




Build Log:
[...truncated 9956 lines...]
   [junit4] Suite: org.apache.solr.handler.TestReplicationHandler
   [junit4]   2> Creating dataDir: /home/jenkins/workspace/Lucene-Solr-5.x-Linux/solr/build/solr-core/test/J0/temp/solr.handler.TestReplicationHandler_3FB87A43D8500100-001/init-core-data-001
   [junit4]   2> 149027 INFO  (TEST-TestReplicationHandler.doTestDetails-seed#[3FB87A43D8500100]) [    ] o.a.s.SolrTestCaseJ4 ###Starting doTestDetails
   [junit4]   2> 149027 INFO  (TEST-TestReplicationHandler.doTestDetails-seed#[3FB87A43D8500100]) [    ] o.a.s.SolrTestCaseJ4 Writing core.properties file to /home/jenkins/workspace/Lucene-Solr-5.x-Linux/solr/build/solr-core/test/J0/temp/solr.handler.TestReplicationHandler_3FB87A43D8500100-001/solr-instance-001/collection1
   [junit4]   2> 149030 INFO  (TEST-TestReplicationHandler.doTestDetails-seed#[3FB87A43D8500100]) [    ] o.e.j.s.Server jetty-9.2.13.v20150730
   [junit4]   2> 149031 INFO  (TEST-TestReplicationHandler.doTestDetails-seed#[3FB87A43D8500100]) [    ] o.e.j.s.h.ContextHandler Started o.e.j.s.ServletContextHandler@66454510{/solr,null,AVAILABLE}
   [junit4]   2> 149033 INFO  (TEST-TestReplicationHandler.doTestDetails-seed#[3FB87A43D8500100]) [    ] o.e.j.s.ServerConnector Started ServerConnector@45f7fa58{HTTP/1.1}{127.0.0.1:54247}
   [junit4]   2> 149033 INFO  (TEST-TestReplicationHandler.doTestDetails-seed#[3FB87A43D8500100]) [    ] o.e.j.s.Server Started @150782ms
   [junit4]   2> 149033 INFO  (TEST-TestReplicationHandler.doTestDetails-seed#[3FB87A43D8500100]) [    ] o.a.s.c.s.e.JettySolrRunner Jetty properties: {solr.data.dir=/home/jenkins/workspace/Lucene-Solr-5.x-Linux/solr/build/solr-core/test/J0/temp/solr.handler.TestReplicationHandler_3FB87A43D8500100-001/solr-instance-001/collection1/data, hostContext=/solr, hostPort=54247}
   [junit4]   2> 149033 INFO  (TEST-TestReplicationHandler.doTestDetails-seed#[3FB87A43D8500100]) [    ] o.a.s.s.SolrDispatchFilter SolrDispatchFilter.init(): sun.misc.Launcher$AppClassLoader@694f9431
   [junit4]   2> 149033 INFO  (TEST-TestReplicationHandler.doTestDetails-seed#[3FB87A43D8500100]) [    ] o.a.s.c.SolrResourceLoader new SolrResourceLoader for directory: '/home/jenkins/workspace/Lucene-Solr-5.x-Linux/solr/build/solr-core/test/J0/temp/solr.handler.TestReplicationHandler_3FB87A43D8500100-001/solr-instance-001'
   [junit4]   2> 149033 INFO  (TEST-TestReplicationHandler.doTestDetails-seed#[3FB87A43D8500100]) [    ] o.a.s.c.SolrResourceLoader JNDI not configured for solr (NoInitialContextEx)
   [junit4]   2> 149033 INFO  (TEST-TestReplicationHandler.doTestDetails-seed#[3FB87A43D8500100]) [    ] o.a.s.c.SolrResourceLoader solr home defaulted to 'solr/' (could not find system property or JNDI)
   [junit4]   2> 149034 INFO  (TEST-TestReplicationHandler.doTestDetails-seed#[3FB87A43D8500100]) [    ] o.a.s.c.SolrXmlConfig Loading container configuration from /home/jenkins/workspace/Lucene-Solr-5.x-Linux/solr/build/solr-core/test/J0/temp/solr.handler.TestReplicationHandler_3FB87A43D8500100-001/solr-instance-001/solr.xml
   [junit4]   2> 149036 INFO  (TEST-TestReplicationHandler.doTestDetails-seed#[3FB87A43D8500100]) [    ] o.a.s.c.CorePropertiesLocator Config-defined core root directory: /home/jenkins/workspace/Lucene-Solr-5.x-Linux/solr/build/solr-core/test/J0/temp/solr.handler.TestReplicationHandler_3FB87A43D8500100-001/solr-instance-001/.
   [junit4]   2> 149037 INFO  (TEST-TestReplicationHandler.doTestDetails-seed#[3FB87A43D8500100]) [    ] o.a.s.c.CoreContainer New CoreContainer 1186209433
   [junit4]   2> 149037 INFO  (TEST-TestReplicationHandler.doTestDetails-seed#[3FB87A43D8500100]) [    ] o.a.s.c.CoreContainer Loading cores into CoreContainer [instanceDir=/home/jenkins/workspace/Lucene-Solr-5.x-Linux/solr/build/solr-core/test/J0/temp/solr.handler.TestReplicationHandler_3FB87A43D8500100-001/solr-instance-001]
   [junit4]   2> 149037 WARN  (TEST-TestReplicationHandler.doTestDetails-seed#[3FB87A43D8500100]) [    ] o.a.s.c.CoreContainer Couldn't add files from /home/jenkins/workspace/Lucene-Solr-5.x-Linux/solr/build/solr-core/test/J0/temp/solr.handler.TestReplicationHandler_3FB87A43D8500100-001/solr-instance-001/lib to classpath: /home/jenkins/workspace/Lucene-Solr-5.x-Linux/solr/build/solr-core/test/J0/temp/solr.handler.TestReplicationHandler_3FB87A43D8500100-001/solr-instance-001/lib
   [junit4]   2> 149037 INFO  (TEST-TestReplicationHandler.doTestDetails-seed#[3FB87A43D8500100]) [    ] o.a.s.h.c.HttpShardHandlerFactory created with socketTimeout : 90000,urlScheme : ,connTimeout : 15000,maxConnectionsPerHost : 20,maxConnections : 10000,corePoolSize : 0,maximumPoolSize : 2147483647,maxThreadIdleTime : 5,sizeOfQueue : -1,fairnessPolicy : false,useRetries : false,
   [junit4]   2> 149038 INFO  (TEST-TestReplicationHandler.doTestDetails-seed#[3FB87A43D8500100]) [    ] o.a.s.u.UpdateShardHandler Creating UpdateShardHandler HTTP client with params: socketTimeout=340000&connTimeout=45000&retry=true
   [junit4]   2> 149039 INFO  (TEST-TestReplicationHandler.doTestDetails-seed#[3FB87A43D8500100]) [    ] o.a.s.l.LogWatcher SLF4J impl is org.slf4j.impl.Log4jLoggerFactory
   [junit4]   2> 149039 INFO  (TEST-TestReplicationHandler.doTestDetails-seed#[3FB87A43D8500100]) [    ] o.a.s.l.LogWatcher Registering Log Listener [Log4j (org.slf4j.impl.Log4jLoggerFactory)]
   [junit4]   2> 149039 INFO  (TEST-TestReplicationHandler.doTestDetails-seed#[3FB87A43D8500100]) [    ] o.a.s.c.CoreContainer Security conf doesn't exist. Skipping setup for authorization module.
   [junit4]   2> 149039 INFO  (TEST-TestReplicationHandler.doTestDetails-seed#[3FB87A43D8500100]) [    ] o.a.s.c.CoreContainer No authentication plugin used.
   [junit4]   2> 149039 INFO  (TEST-TestReplicationHandler.doTestDetails-seed#[3FB87A43D8500100]) [    ] o.a.s.c.CorePropertiesLocator Looking for core definitions underneath /home/jenkins/workspace/Lucene-Solr-5.x-Linux/solr/build/solr-core/test/J0/temp/solr.handler.TestReplicationHandler_3FB87A43D8500100-001/solr-instance-001/.
   [junit4]   2> 149040 INFO  (TEST-TestReplicationHandler.doTestDetails-seed#[3FB87A43D8500100]) [    ] o.a.s.c.CoreDescriptor Created CoreDescriptor: {name=collection1, config=solrconfig.xml, loadOnStartup=true, schema=schema.xml, configSetProperties=configsetprops.json, transient=false, dataDir=data/}
   [junit4]   2> 149040 INFO  (TEST-TestReplicationHandler.doTestDetails-seed#[3FB87A43D8500100]) [    ] o.a.s.c.CorePropertiesLocator Found core collection1 in /home/jenkins/workspace/Lucene-Solr-5.x-Linux/solr/build/solr-core/test/J0/temp/solr.handler.TestReplicationHandler_3FB87A43D8500100-001/solr-instance-001/./collection1
   [junit4]   2> 149040 INFO  (TEST-TestReplicationHandler.doTestDetails-seed#[3FB87A43D8500100]) [    ] o.a.s.c.CorePropertiesLocator Found 1 core definitions
   [junit4]   2> 149040 INFO  (coreLoadExecutor-471-thread-1) [    ] o.a.s.c.SolrResourceLoader new SolrResourceLoader for directory: '/home/jenkins/workspace/Lucene-Solr-5.x-Linux/solr/build/solr-core/test/J0/temp/solr.handler.TestReplicationHandler_3FB87A43D8500100-001/solr-instance-001/collection1'
   [junit4]   2> 149040 INFO  (TEST-TestReplicationHandler.doTestDetails-seed#[3FB87A43D8500100]) [    ] o.a.s.s.SolrDispatchFilter user.dir=/home/jenkins/workspace/Lucene-Solr-5.x-Linux/solr/build/solr-core/test/J0
   [junit4]   2> 149040 INFO  (TEST-TestReplicationHandler.doTestDetails-seed#[3FB87A43D8500100]) [    ] o.a.s.s.SolrDispatchFilter SolrDispatchFilter.init() done
   [junit4]   2> 149040 INFO  (coreLoadExecutor-471-thread-1) [    ] o.a.s.c.SolrResourceLoader JNDI not configured for solr (NoInitialContextEx)
   [junit4]   2> 149040 INFO  (coreLoadExecutor-471-thread-1) [    ] o.a.s.c.SolrResourceLoader solr home defaulted to 'solr/' (could not find system property or JNDI)
   [junit4]   2> 149045 INFO  (coreLoadExecutor-471-thread-1) [    ] o.a.s.c.SolrConfig current version of requestparams : -1
   [junit4]   2> 149047 INFO  (coreLoadExecutor-471-thread-1) [    ] o.a.s.c.SolrConfig Using Lucene MatchVersion: 5.5.0
   [junit4]   2> 149051 INFO  (coreLoadExecutor-471-thread-1) [    ] o.a.s.c.SolrConfig Loaded SolrConfig: solrconfig.xml
   [junit4]   2> 149053 INFO  (coreLoadExecutor-471-thread-1) [    ] o.a.s.s.IndexSchema [collection1] Schema name=test
   [junit4]   2> 149055 INFO  (coreLoadExecutor-471-thread-1) [    ] o.a.s.s.IndexSchema unique key field: id
   [junit4]   2> 149055 INFO  (coreLoadExecutor-471-thread-1) [    ] o.a.s.c.ConfigSetProperties Did not find ConfigSet properties, assuming default properties: Can't find resource 'configsetprops.json' in classpath or '/home/jenkins/workspace/Lucene-Solr-5.x-Linux/solr/build/solr-core/test/J0/temp/solr.handler.TestReplicationHandler_3FB87A43D8500100-001/solr-instance-001/collection1'
   [junit4]   2> 149055 INFO  (coreLoadExecutor-471-thread-1) [    ] o.a.s.c.CoreContainer Creating SolrCore 'collection1' using configuration from instancedir /home/jenkins/workspace/Lucene-Solr-5.x-Linux/solr/build/solr-core/test/J0/temp/solr.handler.TestReplicationHandler_3FB87A43D8500100-001/solr-instance-001/./collection1
   [junit4]   2> 149056 INFO  (coreLoadExecutor-471-thread-1) [    ] o.a.s.c.SolrCore org.apache.solr.core.MockDirectoryFactory
   [junit4]   2> 149056 INFO  (coreLoadExecutor-471-thread-1) [    ] o.a.s.c.SolrCore [[collection1] ] Opening new SolrCore at [/home/jenkins/workspace/Lucene-Solr-5.x-Linux/solr/build/solr-core/test/J0/temp/solr.handler.TestReplicationHandler_3FB87A43D8500100-001/solr-instance-001/collection1], dataDir=[/home/jenkins/workspace/Lucene-Solr-5.x-Linux/solr/build/solr-core/test/J0/temp/solr.handler.TestReplicationHandler_3FB87A43D8500100-001/solr-instance-001/./collection1/data/]
   [junit4]   2> 149056 INFO  (coreLoadExecutor-471-thread-1) [    ] o.a.s.c.SolrCore JMX monitoring not detected for core: collection1
   [junit4]   2> 149056 INFO  (coreLoadExecutor-471-thread-1) [    ] o.a.s.c.CachingDirectoryFactory return new directory for /home/jenkins/workspace/Lucene-Solr-5.x-Linux/solr/build/solr-core/test/J0/temp/solr.handler.TestReplicationHandler_3FB87A43D8500100-001/solr-instance-001/./collection1/data
   [junit4]   2> 149056 INFO  (coreLoadExecutor-471-thread-1) [    ] o.a.s.c.SolrCore New index directory detected: old=null new=/home/jenkins/workspace/Lucene-Solr-5.x-Linux/solr/build/solr-core/test/J0/temp/solr.handler.TestReplicationHandler_3FB87A43D8500100-001/solr-instance-001/./collection1/data/index/
   [junit4]   2> 149056 WARN  (coreLoadExecutor-471-thread-1) [    ] o.a.s.c.SolrCore [collection1] Solr index directory '/home/jenkins/workspace/Lucene-Solr-5.x-Linux/solr/build/solr-core/test/J0/temp/solr.handler.TestReplicationHandler_3FB87A43D8500100-001/solr-instance-001/./collection1/data/index' doesn't exist. Creating new index...
   [junit4]   2> 149056 INFO  (coreLoadExecutor-471-thread-1) [    ] o.a.s.c.CachingDirectoryFactory return new directory for /home/jenkins/workspace/Lucene-Solr-5.x-Linux/solr/build/solr-core/test/J0/temp/solr.handler.TestReplicationHandler_3FB87A43D8500100-001/solr-instance-001/./collection1/data/index
   [junit4]   2> 149057 INFO  (coreLoadExecutor-471-thread-1) [    ] o.a.s.u.RandomMergePolicy RandomMergePolicy wrapping class org.apache.lucene.index.TieredMergePolicy: [TieredMergePolicy: maxMergeAtOnce=45, maxMergeAtOnceExplicit=37, maxMergedSegmentMB=30.7646484375, floorSegmentMB=1.791015625, forceMergeDeletesPctAllowed=23.07294175016255, segmentsPerTier=33.0, maxCFSSegmentSizeMB=8.796093022207999E12, noCFSRatio=1.0
   [junit4]   2> 149057 INFO  (coreLoadExecutor-471-thread-1) [    ] o.a.s.c.SolrDeletionPolicy SolrDeletionPolicy.onCommit: commits: num=1
   [junit4]   2> 	commit{dir=MockDirectoryWrapper(RAMDirectory@2bab13bd lockFactory=org.apache.lucene.store.SingleInstanceLockFactory@6dc5038b),segFN=segments_1,generation=1}
   [junit4]   2> 149057 INFO  (coreLoadExecutor-471-thread-1) [    ] o.a.s.c.SolrDeletionPolicy newest commit generation = 1
   [junit4]   2> 149057 INFO  (OldIndexDirectoryCleanupThreadForCore-collection1) [    ] o.a.s.c.SolrCore Looking for old index directories to cleanup for core collection1 in /home/jenkins/workspace/Lucene-Solr-5.x-Linux/solr/build/solr-core/test/J0/temp/solr.handler.TestReplicationHandler_3FB87A43D8500100-001/solr-instance-001/./collection1/data/
   [junit4]   2> 149058 INFO  (coreLoadExecutor-471-thread-1) [    ] o.a.s.c.SolrCore no updateRequestProcessorChain defined as default, creating implicit default
   [junit4]   2> 149059 INFO  (coreLoadExecutor-471-thread-1) [    ] o.a.s.h.l.XMLLoader xsltCacheLifetimeSeconds=60
   [junit4]   2> 149060 INFO  (coreLoadExecutor-471-thread-1) [    ] o.a.s.h.l.XMLLoader xsltCacheLifetimeSeconds=60
   [junit4]   2> 149060 INFO  (coreLoadExecutor-471-thread-1) [    ] o.a.s.h.l.XMLLoader xsltCacheLifetimeSeconds=60
   [junit4]   2> 149061 INFO  (coreLoadExecutor-471-thread-1) [    ] o.a.s.h.l.XMLLoader xsltCacheLifetimeSeconds=60
   [junit4]   2> 149064 INFO  (coreLoadExecutor-471-thread-1) [    ] o.a.s.c.PluginBag requestHandler : 'lazy' created with startup=lazy 
   [junit4]   2> 149064 INFO  (coreLoadExecutor-471-thread-1) [    ] o.a.s.c.RequestHandlers Registered paths: /admin/mbeans,standard,lazy,/update/csv,/update/json/docs,/admin/luke,/admin/segments,/get,/admin/system,/replication,/admin/properties,defaults,/config,/schema,/admin/plugins,/admin/logging,/update/json,/admin/threads,/admin/ping,/update,/admin/file
   [junit4]   2> 149064 INFO  (coreLoadExecutor-471-thread-1) [    ] o.a.s.c.SolrCore Using default statsCache cache: org.apache.solr.search.stats.LocalStatsCache
   [junit4]   2> 149064 INFO  (coreLoadExecutor-471-thread-1) [    ] o.a.s.u.CommitTracker Hard AutoCommit: disabled
   [junit4]   2> 149064 INFO  (coreLoadExecutor-471-thread-1) [    ] o.a.s.u.CommitTracker Soft AutoCommit: disabled
   [junit4]   2> 149064 INFO  (coreLoadExecutor-471-thread-1) [    ] o.a.s.u.RandomMergePolicy RandomMergePolicy wrapping class org.apache.lucene.index.TieredMergePolicy: [TieredMergePolicy: maxMergeAtOnce=26, maxMergeAtOnceExplicit=46, maxMergedSegmentMB=7.46875, floorSegmentMB=0.24609375, forceMergeDeletesPctAllowed=12.708931079609142, segmentsPerTier=47.0, maxCFSSegmentSizeMB=8.796093022207999E12, noCFSRatio=0.8819188765567367
   [junit4]   2> 149065 INFO  (coreLoadExecutor-471-thread-1) [    ] o.a.s.c.SolrDeletionPolicy SolrDeletionPolicy.onInit: commits: num=1
   [junit4]   2> 	commit{dir=MockDirectoryWrapper(RAMDirectory@2bab13bd lockFactory=org.apache.lucene.store.SingleInstanceLockFactory@6dc5038b),segFN=segments_1,generation=1}
   [junit4]   2> 149065 INFO  (coreLoadExecutor-471-thread-1) [    ] o.a.s.c.SolrDeletionPolicy newest commit generation = 1
   [junit4]   2> 149065 INFO  (coreLoadExecutor-471-thread-1) [    ] o.a.s.s.SolrIndexSearcher Opening Searcher@61234455[collection1] main
   [junit4]   2> 149065 INFO  (coreLoadExecutor-471-thread-1) [    ] o.a.s.r.ManagedResourceStorage File-based storage initialized to use dir: /home/jenkins/workspace/Lucene-Solr-5.x-Linux/solr/build/solr-core/test/J0/temp/solr.handler.TestReplicationHandler_3FB87A43D8500100-001/solr-instance-001/collection1/conf
   [junit4]   2> 149065 INFO  (coreLoadExecutor-471-thread-1) [    ] o.a.s.r.RestManager Initializing RestManager with initArgs: {storageDir=/home/jenkins/workspace/Lucene-Solr-5.x-Linux/solr/build/solr-core/test/J0/temp/solr.handler.TestReplicationHandler_3FB87A43D8500100-001/solr-instance-001/collection1/conf}
   [junit4]   2> 149065 INFO  (coreLoadExecutor-471-thread-1) [    ] o.a.s.r.ManagedResourceStorage Reading _rest_managed.json using file:dir=/home/jenkins/workspace/Lucene-Solr-5.x-Linux/solr/build/solr-core/test/J0/temp/solr.handler.TestReplicationHandler_3FB87A43D8500100-001/solr-instance-001/collection1/conf
   [junit4]   2> 149065 INFO  (coreLoadExecutor-471-thread-1) [    ] o.a.s.r.RestManager Initializing 0 registered ManagedResources
   [junit4]   2> 149066 INFO  (coreLoadExecutor-471-thread-1) [    ] o.a.s.h.ReplicationHandler Replication enabled for following config files: schema.xml,xslt/dummy.xsl
   [junit4]   2> 149066 INFO  (coreLoadExecutor-471-thread-1) [    ] o.a.s.h.ReplicationHandler Commits will be reserved for  10000
   [junit4]   2> 149066 INFO  (searcherExecutor-472-thread-1) [    ] o.a.s.c.SolrCore [collection1] Registered new searcher Searcher@61234455[collection1] main{ExitableDirectoryReader(UninvertingDirectoryReader())}
   [junit4]   2> 149066 INFO  (coreLoadExecutor-471-thread-1) [    ] o.a.s.c.CoreContainer registering core: collection1
   [junit4]   2> 149541 INFO  (TEST-TestReplicationHandler.doTestDetails-seed#[3FB87A43D8500100]) [    ] o.a.s.SolrTestCaseJ4 Writing core.properties file to /home/jenkins/workspace/Lucene-Solr-5.x-Linux/solr/build/solr-core/test/J0/temp/solr.handler.TestReplicationHandler_3FB87A43D8500100-001/solr-instance-002/collection1
   [junit4]   2> 149543 INFO  (TEST-TestReplicationHandler.doTestDetails-seed#[3FB87A43D8500100]) [    ] o.e.j.s.Server jetty-9.2.13.v20150730
   [junit4]   2> 149544 INFO  (TEST-TestReplicationHandler.doTestDetails-seed#[3FB87A43D8500100]) [    ] o.e.j.s.h.ContextHandler Started o.e.j.s.ServletContextHandler@7f64f0b6{/solr,null,AVAILABLE}
   [junit4]   2> 149544 INFO  (TEST-TestReplicationHandler.doTestDetails-seed#[3FB87A43D8500100]) [    ] o.e.j.s.ServerConnector Started ServerConnector@76884380{HTTP/1.1}{127.0.0.1:60567}
   [junit4]   2> 149544 INFO  (TEST-TestReplicationHandler.doTestDetails-seed#[3FB87A43D8500100]) [    ] o.e.j.s.Server Started @151293ms
   [junit4]   2> 149544 INFO  (TEST-TestReplicationHandler.doTestDetails-seed#[3FB87A43D8500100]) [    ] o.a.s.c.s.e.JettySolrRunner Jetty properties: {solr.data.dir=/home/jenkins/workspace/Lucene-Solr-5.x-Linux/solr/build/solr-core/test/J0/temp/solr.handler.TestReplicationHandler_3FB87A43D8500100-001/solr-instance-002/collection1/data, hostContext=/solr, hostPort=60567}
   [junit4]   2> 149544 INFO  (TEST-TestReplicationHandler.doTestDetails-seed#[3FB87A43D8500100]) [    ] o.a.s.s.SolrDispatchFilter SolrDispatchFilter.init(): sun.misc.Launcher$AppClassLoader@694f9431
   [junit4]   2> 149545 INFO  (TEST-TestReplicationHandler.doTestDetails-seed#[3FB87A43D8500100]) [    ] o.a.s.c.SolrResourceLoader new SolrResourceLoader for directory: '/home/jenkins/workspace/Lucene-Solr-5.x-Linux/solr/build/solr-core/test/J0/temp/solr.handler.TestReplicationHandler_3FB87A43D8500100-001/solr-instance-002'
   [junit4]   2> 149545 INFO  (TEST-TestReplicationHandler.doTestDetails-seed#[3FB87A43D8500100]) [    ] o.a.s.c.SolrResourceLoader JNDI not configured for solr (NoInitialContextEx)
   [junit4]   2> 149545 INFO  (TEST-TestReplicationHandler.doTestDetails-seed#[3FB87A43D8500100]) [    ] o.a.s.c.SolrResourceLoader solr home defaulted to 'solr/' (could not find system property or JNDI)
   [junit4]   2> 149545 INFO  (TEST-TestReplicationHandler.doTestDetails-seed#[3FB87A43D8500100]) [    ] o.a.s.c.SolrXmlConfig Loading container configuration from /home/jenkins/workspace/Lucene-Solr-5.x-Linux/solr/build/solr-core/test/J0/temp/solr.handler.TestReplicationHandler_3FB87A43D8500100-001/solr-instance-002/solr.xml
   [junit4]   2> 149563 INFO  (TEST-TestReplicationHandler.doTestDetails-seed#[3FB87A43D8500100]) [    ] o.a.s.c.CorePropertiesLocator Config-defined core root directory: /home/jenkins/workspace/Lucene-Solr-5.x-Linux/solr/build/solr-core/test/J0/temp/solr.handler.TestReplicationHandler_3FB87A43D8500100-001/solr-instance-002/.
   [junit4]   2> 149563 INFO  (TEST-TestReplicationHandler.doTestDetails-seed#[3FB87A43D8500100]) [    ] o.a.s.c.CoreContainer New CoreContainer 1198989843
   [junit4]   2> 149563 INFO  (TEST-TestReplicationHandler.doTestDetails-seed#[3FB87A43D8500100]) [    ] o.a.s.c.CoreContainer Loading cores into CoreContainer [instanceDir=/home/jenkins/workspace/Lucene-Solr-5.x-Linux/solr/build/solr-core/test/J0/temp/solr.handler.TestReplicationHandler_3FB87A43D8500100-001/solr-instance-002]
   [junit4]   2> 149563 WARN  (TEST-TestReplicationHandler.doTestDetails-seed#[3FB87A43D8500100]) [    ] o.a.s.c.CoreContainer Couldn't add files from /home/jenkins/workspace/Lucene-Solr-5.x-Linux/solr/build/solr-core/test/J0/temp/solr.handler.TestReplicationHandler_3FB87A43D8500100-001/solr-instance-002/lib to classpath: /home/jenkins/workspace/Lucene-Solr-5.x-Linux/solr/build/solr-core/test/J0/temp/solr.handler.TestReplicationHandler_3FB87A43D8500100-001/solr-instance-002/lib
   [junit4]   2> 149564 INFO  (TEST-TestReplicationHandler.doTestDetails-seed#[3FB87A43D8500100]) [    ] o.a.s.h.c.HttpShardHandlerFactory created with socketTimeout : 90000,urlScheme : ,connTimeout : 15000,maxConnectionsPerHost : 20,maxConnections : 10000,corePoolSize : 0,maximumPoolSize : 2147483647,maxThreadIdleTime : 5,sizeOfQueue : -1,fairnessPolicy : false,useRetries : false,
   [junit4]   2> 149564 INFO  (TEST-TestReplicationHandler.doTestDetails-seed#[3FB87A43D8500100]) [    ] o.a.s.u.UpdateShardHandler Creating UpdateShardHandler HTTP client with params: socketTimeout=340000&connTimeout=45000&retry=true
   [junit4]   2> 149564 INFO  (TEST-TestReplicationHandler.doTestDetails-seed#[3FB87A43D8500100]) [    ] o.a.s.l.LogWatcher SLF4J impl is org.slf4j.impl.Log4jLoggerFactory
   [junit4]   2> 149564 INFO  (TEST-TestReplicationHandler.doTestDetails-seed#[3FB87A43D8500100]) [    ] o.a.s.l.LogWatcher Registering Log Listener [Log4j (org.slf4j.impl.Log4jLoggerFactory)]
   [junit4]   2> 149564 INFO  (TEST-TestReplicationHandler.doTestDetails-seed#[3FB87A43D8500100]) [    ] o.a.s.c.CoreContainer Security conf doesn't exist. Skipping setup for authorization module.
   [junit4]   2> 149565 INFO  (TEST-TestReplicationHandler.doTestDetails-seed#[3FB87A43D8500100]) [    ] o.a.s.c.CoreContainer No authentication plugin used.
   [junit4]   2> 149565 INFO  (TEST-TestReplicationHandler.doTestDetails-seed#[3FB87A43D8500100]) [    ] o.a.s.c.CorePropertiesLocator Looking for core definitions underneath /home/jenkins/workspace/Lucene-Solr-5.x-Linux/solr/build/solr-core/test/J0/temp/solr.handler.TestReplicationHandler_3FB87A43D8500100-001/solr-instance-002/.
   [junit4]   2> 149566 INFO  (TEST-TestReplicationHandler.doTestDetails-seed#[3FB87A43D8500100]) [    ] o.a.s.c.CoreDescriptor Created CoreDescriptor: {name=collection1, config=solrconfig.xml, loadOnStartup=true, schema=schema.xml, configSetProperties=configsetprops.json, transient=false, dataDir=data/}
   [junit4]   2> 149566 INFO  (TEST-TestReplicationHandler.doTestDetails-seed#[3FB87A43D8500100]) [    ] o.a.s.c.CorePropertiesLocator Found core collection1 in /home/jenkins/workspace/Lucene-Solr-5.x-Linux/solr/build/solr-core/test/J0/temp/solr.handler.TestReplicationHandler_3FB87A43D8500100-001/solr-instance-002/./collection1
   [junit4]   2> 149567 INFO  (TEST-TestReplicationHandler.doTestDetails-seed#[3FB87A43D8500100]) [    ] o.a.s.c.CorePropertiesLocator Found 1 core definitions
   [junit4]   2> 149567 INFO  (coreLoadExecutor-481-thread-1) [    ] o.a.s.c.SolrResourceLoader new SolrResourceLoader for directory: '/home/jenkins/workspace/Lucene-Solr-5.x-Linux/solr/build/solr-core/test/J0/temp/solr.handler.TestReplicationHandler_3FB87A43D8500100-001/solr-instance-002/collection1'
   [junit4]   2> 149567 INFO  (TEST-TestReplicationHandler.doTestDetails-seed#[3FB87A43D8500100]) [    ] o.a.s.s.SolrDispatchFilter user.dir=/home/jenkins/workspace/Lucene-Solr-5.x-Linux/solr/build/solr-core/test/J0
   [junit4]   2> 149567 INFO  (TEST-TestReplicationHandler.doTestDetails-seed#[3FB87A43D8500100]) [    ] o.a.s.s.SolrDispatchFilter SolrDispatchFilter.init() done
   [junit4]   2> 149567 INFO  (coreLoadExecutor-481-thread-1) [    ] o.a.s.c.SolrResourceLoader JNDI not configured for solr (NoInitialContextEx)
   [junit4]   2> 149567 INFO  (coreLoadExecutor-481-thread-1) [    ] o.a.s.c.SolrResourceLoader solr home defaulted to 'solr/' (could not find system property or JNDI)
   [junit4]   2> 149572 INFO  (coreLoadExecutor-481-thread-1) [    ] o.a.s.c.SolrConfig current version of requestparams : -1
   [junit4]   2> 149573 INFO  (coreLoadExecutor-481-thread-1) [    ] o.a.s.c.SolrConfig Using Lucene MatchVersion: 5.5.0
   [junit4]   2> 149576 INFO  (coreLoadExecutor-481-thread-1) [    ] o.a.s.c.SolrConfig Loaded SolrConfig: solrconfig.xml
   [junit4]   2> 149579 INFO  (coreLoadExecutor-481-thread-1) [    ] o.a.s.s.IndexSchema [collection1] Schema name=test
   [junit4]   2> 149580 INFO  (coreLoadExecutor-481-thread-1) [    ] o.a.s.s.IndexSchema unique key field: id
   [junit4]   2> 149581 INFO  (coreLoadExecutor-481-thread-1) [    ] o.a.s.c.ConfigSetProperties Did not find ConfigSet properties, assuming default properties: Can't find resource 'configsetprops.json' in classpath or '/home/jenkins/workspace/Lucene-Solr-5.x-Linux/solr/build/solr-core/test/J0/temp/solr.handler.TestReplicationHandler_3FB87A43D8500100-001/solr-instance-002/collection1'
   [junit4]   2> 149581 INFO  (coreLoadExecutor-481-thread-1) [    ] o.a.s.c.CoreContainer Creating SolrCore 'collection1' using configuration from instancedir /home/jenkins/workspace/Lucene-Solr-5.x-Linux/solr/build/solr-core/test/J0/temp/solr.handler.TestReplicationHandler_3FB87A43D8500100-001/solr-instance-002/./collection1
   [junit4]   2> 149581 INFO  (coreLoadExecutor-481-thread-1) [    ] o.a.s.c.SolrCore org.apache.solr.core.MockDirectoryFactory
   [junit4]   2> 149581 INFO  (coreLoadExecutor-481-thread-1) [    ] o.a.s.c.SolrCore [[collection1] ] Opening new SolrCore at [/home/jenkins/workspace/Lucene-Solr-5.x-Linux/solr/build/solr-core/test/J0/temp/solr.handler.TestReplicationHandler_3FB87A43D8500100-001/solr-instance-002/collection1], dataDir=[/home/jenkins/workspace/Lucene-Solr-5.x-Linux/solr/build/solr-core/test/J0/temp/solr.handler.TestReplicationHandler_3FB87A43D8500100-001/solr-instance-002/./collection1/data/]
   [junit4]   2> 149581 INFO  (coreLoadExecutor-481-thread-1) [    ] o.a.s.c.SolrCore JMX monitoring not detected for core: collection1
   [junit4]   2> 149581 INFO  (coreLoadExecutor-481-thread-1) [    ] o.a.s.c.CachingDirectoryFactory return new directory for /home/jenkins/workspace/Lucene-Solr-5.x-Linux/solr/build/solr-core/test/J0/temp/solr.handler.TestReplicationHandler_3FB87A43D8500100-001/solr-instance-002/./collection1/data
   [junit4]   2> 149581 INFO  (coreLoadExecutor-481-thread-1) [    ] o.a.s.c.SolrCore New index directory detected: old=null new=/home/jenkins/workspace/Lucene-Solr-5.x-Linux/solr/build/solr-core/test/J0/temp/solr.handler.TestReplicationHandler_3FB87A43D8500100-001/solr-instance-002/./collection1/data/index/
   [junit4]   2> 149581 WARN  (coreLoadExecutor-481-thread-1) [    ] o.a.s.c.SolrCore [collection1] Solr index directory '/home/jenkins/workspace/Lucene-Solr-5.x-Linux/solr/build/solr-core/test/J0/temp/solr.handler.TestReplicationHandler_3FB87A43D8500100-001/solr-instance-002/./collection1/data/index' doesn't exist. Creating new index...
   [junit4]   2> 149582 INFO  (coreLoadExecutor-481-thread-1) [    ] o.a.s.c.CachingDirectoryFactory return new directory for /home/jenkins/workspace/Lucene-Solr-5.x-Linux/solr/build/solr-core/test/J0/temp/solr.handler.TestReplicationHandler_3FB87A43D8500100-001/solr-instance-002/./collection1/data/index
   [junit4]   2> 149582 INFO  (coreLoadExecutor-481-thread-1) [    ] o.a.s.u.RandomMergePolicy RandomMergePolicy wrapping class org.apache.lucene.index.TieredMergePolicy: [TieredMergePolicy: maxMergeAtOnce=45, maxMergeAtOnceExplicit=37, maxMergedSegmentMB=30.7646484375, floorSegmentMB=1.791015625, forceMergeDeletesPctAllowed=23.07294175016255, segmentsPerTier=33.0, maxCFSSegmentSizeMB=8.796093022207999E12, noCFSRatio=1.0
   [junit4]   2> 149582 INFO  (coreLoadExecutor-481-thread-1) [    ] o.a.s.c.SolrDeletionPolicy SolrDeletionPolicy.onCommit: commits: num=1
   [junit4]   2> 	commit{dir=MockDirectoryWrapper(RAMDirectory@2e9f92ad lockFactory=org.apache.lucene.store.SingleInstanceLockFactory@5e2a7a3b),segFN=segments_1,generation=1}
   [junit4]   2> 149582 INFO  (coreLoadExecutor-481-thread-1) [    ] o.a.s.c.SolrDeletionPolicy newest commit generation = 1
   [junit4]   2> 149582 INFO  (OldIndexDirectoryCleanupThreadForCore-collection1) [    ] o.a.s.c.SolrCore Looking for old index directories to cleanup for core collection1 in /home/jenkins/workspace/Lucene-Solr-5.x-Linux/solr/build/solr-core/test/J0/temp/solr.handler.TestReplicationHandler_3FB87A43D8500100-001/solr-instance-002/./collection1/data/
   [junit4]   2> 149584 INFO  (coreLoadExecutor-481-thread-1) [    ] o.a.s.c.SolrCore no updateRequestProcessorChain defined as default, creating implicit default
   [junit4]   2> 149585 INFO  (coreLoadExecutor-481-thread-1) [    ] o.a.s.h.l.XMLLoader xsltCacheLifetimeSeconds=60
   [junit4]   2> 149585 INFO  (coreLoadExecutor-481-thread-1) [    ] o.a.s.h.l.XMLLoader xsltCacheLifetimeSeconds=60
   [junit4]   2> 149585 INFO  (coreLoadExecutor-481-thread-1) [    ] o.a.s.h.l.XMLLoader xsltCacheLifetimeSeconds=60
   [junit4]   2> 149586 INFO  (coreLoadExecutor-481-thread-1) [    ] o.a.s.h.l.XMLLoader xsltCacheLifetimeSeconds=60
   [junit4]   2> 149586 INFO  (coreLoadExecutor-481-thread-1) [    ] o.a.s.c.PluginBag requestHandler : 'lazy' created with startup=lazy 
   [junit4]   2> 149587 INFO  (coreLoadExecutor-481-thread-1) [    ] o.a.s.c.RequestHandlers Registered paths: /admin/mbeans,standard,lazy,/update/csv,/update/json/docs,/admin/luke,/admin/segments,/get,/admin/system,/replication,/admin/properties,defaults,/config,/schema,/admin/plugins,/admin/logging,/update/json,/admin/threads,/admin/ping,/update,/admin/file
   [junit4]   2> 149587 INFO  (coreLoadExecutor-481-thread-1) [    ] o.a.s.c.SolrCore Using default statsCache cache: org.apache.solr.search.stats.LocalStatsCache
   [junit4]   2> 149587 INFO  (coreLoadExecutor-481-thread-1) [    ] o.a.s.u.CommitTracker Hard AutoCommit: disabled
   [junit4]   2> 149587 INFO  (coreLoadExecutor-481-thread-1) [    ] o.a.s.u.CommitTracker Soft AutoCommit: disabled
   [junit4]   2> 149587 INFO  (coreLoadExecutor-481-thread-1) [    ] o.a.s.u.RandomMergePolicy RandomMergePolicy wrapping class org.apache.lucene.index.TieredMergePolicy: [TieredMergePolicy: maxMergeAtOnce=26, maxMergeAtOnceExplicit=46, maxMergedSegmentMB=7.46875, floorSegmentMB=0.24609375, forceMergeDeletesPctAllowed=12.708931079609142, segmentsPerTier=47.0, maxCFSSegmentSizeMB=8.796093022207999E12, noCFSRatio=0.8819188765567367
   [junit4]   2> 149587 INFO  (coreLoadExecutor-481-thread-1) [    ] o.a.s.c.SolrDeletionPolicy SolrDeletionPolicy.onInit: commits: num=1
   [junit4]   2> 	commit{dir=MockDirectoryWrapper(RAMDirectory@2e9f92ad lockFactory=org.apache.lucene.store.SingleInstanceLockFactory@5e2a7a3b),segFN=segments_1,generation=1}
   [junit4]   2> 149587 INFO  (coreLoadExecutor-481-thread-1) [    ] o.a.s.c.SolrDeletionPolicy newest commit generation = 1
   [junit4]   2> 149587 INFO  (coreLoadExecutor-481-thread-1) [    ] o.a.s.s.SolrIndexSearcher Opening Searcher@6f50b6c[collection1] main
   [junit4]   2> 149588 INFO  (coreLoadExecutor-481-thread-1) [    ] o.a.s.r.ManagedResourceStorage File-based storage initialized to use dir: /home/jenkins/workspace/Lucene-Solr-5.x-Linux/solr/build/solr-core/test/J0/temp/solr.handler.TestReplicationHandler_3FB87A43D8500100-001/solr-instance-002/collection1/conf
   [junit4]   2> 149588 INFO  (coreLoadExecutor-481-thread-1) [    ] o.a.s.r.RestManager Initializing RestManager with initArgs: {storageDir=/home/jenkins/workspace/Lucene-Solr-5.x-Linux/solr/build/solr-core/test/J0/temp/solr.handler.TestReplicationHandler_3FB87A43D8500100-001/solr-instance-002/collection1/conf}
   [junit4]   2> 149588 INFO  (coreLoadExecutor-481-thread-1) [    ] o.a.s.r.ManagedResourceStorage Reading _rest_managed.json using file:dir=/home/jenkins/workspace/Lucene-Solr-5.x-Linux/solr/build/solr-core/test/J0/temp/solr.handler.TestReplicationHandler_3FB87A43D8500100-001/solr-instance-002/collection1/conf
   [junit4]   2> 149588 INFO  (coreLoadExecutor-481-thread-1) [    ] o.a.s.r.RestManager Initializing 0 registered ManagedResources
   [junit4]   2> 149591 INFO  (coreLoadExecutor-481-thread-1) [    ] o.a.s.h.ReplicationHandler Poll scheduled at an interval of 1000ms
   [junit4]   2> 149591 INFO  (searcherExecutor-482-thread-1) [    ] o.a.s.c.SolrCore [collection1] Registered new searcher Searcher@6f50b6c[collection1] main{ExitableDirectoryReader(UninvertingDirectoryReader())}
   [junit4]   2> 149591 INFO  (coreLoadExecutor-481-thread-1) [    ] o.a.s.c.CoreContainer registering core: collection1
   [junit4]   2> 149593 INFO  (qtp829410491-1370) [    ] o.a.s.c.S.Request [collection1]  webapp=/solr path=/replication params={qt=/replication&wt=javabin&version=2&command=indexversion} status=0 QTime=0
   [junit4]   2> 150071 INFO  (qtp829410491-1371) [    ] o.a.s.c.S.Request [collection1]  webapp=/solr path=/select params={q=*:*&sort=id+desc&wt=javabin&version=2} hits=0 status=0 QTime=2
   [junit4]   2> 150074 INFO  (qtp829410491-1372) [    ] o.a.s.c.S.Request [collection1]  webapp=/solr path=/replication params={_trace=getDetails&qt=/replication&wt=javabin&version=2&command=details} status=0 QTime=1
   [junit4]   2> 150078 INFO  (qtp829410491-1370) [    ] o.a.s.c.S.Request [collection1]  webapp=/solr path=/replication params={slave=false&qt=/replication&wt=javabin&version=2&command=details} status=0 QTime=0
   [junit4]   2> 150079 INFO  (qtp1212623646-1388) [    ] o.a.s.c.S.Request [collection1]  webapp=/solr path=/replication params={_trace=getDetails&qt=/replication&wt=javabin&version=2&command=details} status=0 QTime=2
   [junit4]   2> 150082 INFO  (qtp829410491-1371) [    ] o.a.s.u.p.LogUpdateProcessorFactory [collection1]  webapp=/solr path=/update params={wt=javabin&version=2}{add=[0]} 0 2
   [junit4]   2> 150084 INFO  (qtp829410491-1372) [    ] o.a.s.u.DirectUpdateHandler2 start commit{,optimize=false,openSearcher=true,waitSearcher=true,expungeDeletes=false,softCommit=false,prepareCommit=false}
   [junit4]   2> 150087 INFO  (qtp829410491-1372) [    ] o.a.s.c.SolrDeletionPolicy SolrDeletionPolicy.onCommit: commits: num=2
   [junit4]   2> 	commit{dir=MockDirectoryWrapper(RAMDirectory@2bab13bd lockFactory=org.apache.lucene.store.SingleInstanceLockFactory@6dc5038b),segFN=segments_1,generation=1}
   [junit4]   2> 	commit{dir=MockDirectoryWrapper(RAMDirectory@2bab13bd lockFactory=org.apache.lucene.store.SingleInstanceLockFactory@6dc5038b),segFN=segments_2,generation=2}
   [junit4]   2> 150087 INFO  (qtp829410491-1372) [    ] o.a.s.c.SolrDeletionPolicy newest commit generation = 2
   [junit4]   2> 150088 INFO  (qtp829410491-1372) [    ] o.a.s.s.SolrIndexSearcher Opening Searcher@a55b87f[collection1] main
   [junit4]   2> 150088 INFO  (qtp829410491-1372) [    ] o.a.s.u.DirectUpdateHandler2 end_commit_flush
   [junit4]   2> 150088 INFO  (searcherExecutor-472-thread-1) [    ] o.a.s.c.SolrCore [collection1] Registered new searcher Searcher@a55b87f[collection1] main{ExitableDirectoryReader(UninvertingDirectoryReader(Uninverting(_0(5.5.0):C1)))}
   [junit4]   2> 150088 INFO  (qtp829410491-1372) [    ] o.a.s.u.p.LogUpdateProcessorFactory [collection1]  webapp=/solr path=/update params={waitSearcher=true&commit=true&softCommit=false&wt=javabin&version=2}{commit=} 0 4
   [junit4]   2> 150096 WARN  (explicit-fetchindex-cmd) [    ] o.a.s.h.IndexFetcher 'masterUrl' must be specified without the /replication suffix
   [junit4]   2> 150099 INFO  (qtp829410491-1370) [    ] o.a.s.c.S.Request [collection1]  webapp=/solr path=/replication params={qt=/replication&wt=javabin&version=2&command=indexversion} status=0 QTime=0
   [junit4]   2> 150099 INFO  (explicit-fetchindex-cmd) [    ] o.a.s.h.IndexFetcher Master's generation: 2
   [junit4]   2> 150099 INFO  (explicit-fetchindex-cmd) [    ] o.a.s.h.IndexFetcher Slave's generation: 1
   [junit4]   2> 150099 INFO  (explicit-fetchindex-cmd) [    ] o.a.s.h.IndexFetcher Starting replication process
   [junit4]   2> 150104 INFO  (qtp829410491-1371) [    ] o.a.s.c.S.Request [collection1]  webapp=/solr path=/replication params={generation=2&qt=/replication&wt=javabin&version=2&command=filelist} status=0 QTime=3
   [junit4]   2> 150105 INFO  (explicit-fetchindex-cmd) [    ] o.a.s.h.IndexFetcher Number of files in latest index in master: 8
   [junit4]   2> 150105 INFO  (explicit-fetchindex-cmd) [    ] o.a.s.c.CachingDirectoryFactory return new directory for /home/jenkins/workspace/Lucene-Solr-5.x-Linux/solr/build/solr-core/test/J0/temp/solr.handler.TestReplicationHandler_3FB87A43D8500100-001/solr-instance-002/./collection1/data/index.20160110150726350
   [junit4]   2> 150105 INFO  (explicit-fetchindex-cmd) [    ] o.a.s.u.DefaultSolrCoreState Rollback old IndexWriter... core=collection1
   [junit4]   2> 150107 INFO  (explicit-fetchindex-cmd) [    ] o.a.s.u.RandomMergePolicy RandomMergePolicy wrapping class org.apache.lucene.index.AlcoholicMergePolicy: [AlcoholicMergePolicy: minMergeSize=0, mergeFactor=10, maxMergeSize=867735418, maxMergeSizeForForcedMerge=9223372036854775807, calibrateSizeByDeletes=true, maxMergeDocs=2147483647, maxCFSSegmentSizeMB=8.796093022207999E12, noCFSRatio=0.1]
   [junit4]   2> 150108 INFO  (explicit-fetchindex-cmd) [    ] o.a.s.c.SolrDeletionPolicy SolrDeletionPolicy.onInit: commits: num=1
   [junit4]   2> 	commit{dir=MockDirectoryWrapper(RAMDirectory@2e9f92ad lockFactory=org.apache.lucene.store.SingleInstanceLockFactory@5e2a7a3b),segFN=segments_1,generation=1}
   [junit4]   2> 150108 INFO  (explicit-fetchindex-cmd) [    ] o.a.s.c.SolrDeletionPolicy newest commit generation = 1
   [junit4]   2> 150108 INFO  (explicit-fetchindex-cmd) [    ] o.a.s.u.DefaultSolrCoreState New IndexWriter is ready to be used.
   [junit4]   2> 150108 INFO  (explicit-fetchindex-cmd) [    ] o.a.s.c.SolrDeletionPolicy SolrDeletionPolicy.onCommit: commits: num=1
   [junit4]   2> 	commit{dir=MockDirectoryWrapper(RAMDirectory@2e9f92ad lockFactory=org.apache.lucene.store.SingleInstanceLockFactory@5e2a7a3b),segFN=segments_1,generation=1}
   [junit4]   2> 150108 INFO  (explicit-fetchindex-cmd) [    ] o.a.s.c.SolrDeletionPolicy newest commit generation = 1
   [junit4]   2> 150108 INFO  (explicit-fetchindex-cmd) [    ] o.a.s.u.DefaultSolrCoreState Rollback old IndexWriter... core=collection1
   [junit4]   2> 150108 INFO  (explicit-fetchindex-cmd) [    ] o.a.s.h.IndexFetcher Starting download (fullCopy=false) to MockDirectoryWrapper(RAMDirectory@622ac693 lockFactory=org.apache.lucene.store.SingleInstanceLockFactory@5962626f)
   [junit4]   2> 150115 INFO  (qtp829410491-1372) [    ] o.a.s.c.S.Request [collection1]  webapp=/solr path=/replication params={generation=2&qt=/replication&file=_0.si&checksum=true&wt=filestream&command=filecontent} status=0 QTime=1
   [junit4]   2> 150117 INFO  (qtp829410491-1370) [    ] o.a.s.c.S.Request [collection1]  webapp=/solr path=/replication params={generation=2&qt=/replication&file=_0.nvd&checksum=true&wt=filestream&command=filecontent} status=0 QTime=0
   [junit4]   2> 150120 INFO  (qtp829410491-1371) [    ] o.a.s.c.S.Request [collection1]  webapp=/solr path=/replication params={generation=2&qt=/replication&file=_0.fdx&checksum=true&wt=filestream&command=filecontent} status=0 QTime=0
   [junit4]   2> 150122 INFO  (qtp829410491-1372) [    ] o.a.s.c.S.Request [collection1]  webapp=/solr path=/replication params={generation=2&qt=/replication&file=_0_Memory_0.ram&checksum=true&wt=filestream&command=filecontent} status=0 QTime=0
   [junit4]   2> 150124 INFO  (qtp829410491-1370) [    ] o.a.s.c.S.Request [collection1]  webapp=/solr path=/replication params={generation=2&qt=/replication&file=_0.fdt&checksum=true&wt=filestream&command=filecontent} status=0 QTime=0
   [junit4]   2> 150126 INFO  (qtp829410491-1371) [    ] o.a.s.c.S.Request [collection1]  webapp=/solr path=/replication params={generation=2&qt=/replication&file=_0.fnm&checksum=true&wt=filestream&command=filecontent} status=0 QTime=0
   [junit4]   2> 150128 INFO  (qtp829410491-1372) [    ] o.a.s.c.S.Request [collection1]  webapp=/solr path=/replication params={generation=2&qt=/replication&file=_0.nvm&checksum=true&wt=filestream&command=filecontent} status=0 QTime=0
   [junit4]   2> 150130 INFO  (qtp829410491-1370) [    ] o.a.s.c.S.Request [collection1]  webapp=/solr path=/replication params={generation=2&qt=/replication&file=segments_2&checksum=true&wt=filestream&command=filecontent} status=0 QTime=0
   [junit4]   2> 150131 INFO  (explicit-fetchindex-cmd) [    ] o.a.s.h.IndexFetcher Total time taken for download (fullCopy=false,bytesDownloaded=1324) : 0 secs (null bytes/sec) to MockDirectoryWrapper(RAMDirectory@622ac693 lockFactory=org.apache.lucene.store.SingleInstanceLockFactory@5962626f)
   [junit4]   2> 150132 INFO  (explicit-fetchindex-cmd) [    ] o.a.s.u.RandomMergePolicy RandomMergePolicy wrapping class org.apache.lucene.index.LogByteSizeMergePolicy: [LogByteSizeMergePolicy: minMergeSize=1677721, mergeFactor=27, maxMergeSize=2147483648, maxMergeSizeForForcedMerge=9223372036854775807, calibrateSizeByDeletes=false, maxMergeDocs=2147483647, maxCFSSegmentSizeMB=8.796093022207999E12, noCFSRatio=0.5597487660538917]
   [junit4]   2> 150133 INFO  (explicit-fetchindex-cmd) [    ] o.a.s.c.SolrDeletionPolicy SolrDeletionPolicy.onInit: commits: num=2
   [junit4]   2> 	commit{dir=MockDirectoryWrapper(RAMDirectory@2e9f92ad lockFactory=org.apache.lucene.store.SingleInstanceLockFactory@5e2a7a3b),segFN=segments_1,generation=1}
   [junit4]   2> 	commit{dir=MockDirectoryWrapper(RAMDirectory@2e9f92ad lockFactory=org.apache.lucene.store.SingleInstanceLockFactory@5e2a7a3b),segFN=segments_2,generation=2}
   [junit4]   2> 150134 INFO  (explicit-fetchindex-cmd) [    ] o.a.s.c.SolrDeletionPolicy newest commit generation = 2
   [junit4]   2> 150134 INFO  (explicit-fetchindex-cmd) [    ] o.a.s.u.DefaultSolrCoreState New IndexWriter is ready to be used.
   [junit4]   2> 150135 INFO  (explicit-fetchindex-cmd) [    ] o.a.s.s.SolrIndexSearcher Opening Searcher@67f6a585[collection1] main
   [junit4]   2> 150135 INFO  (searcherExecutor-482-thread-1) [    ] o.a.s.c.SolrCore [collection1] Registered new searcher Searcher@67f6a585[collection1] main{ExitableDirectoryReader(UninvertingDirectoryReader(Uninverting(_0(5.5.0):C1)))}
   [junit4]   2> 150135 INFO  (explicit-fetchindex-cmd) [    ] o.a.s.c.CachingDirectoryFactory looking to close /home/jenkins/workspace/Lucene-Solr-5.x-Linux/solr/build/solr-core/test/J0/temp/solr.handler.TestReplicationHandler_3FB87A43D8500100-001/solr-instance-002/./collection1/data/index.20160110150726350 [CachedDir<<refCount=0;path=/home/jenkins/workspace/Lucene-Solr-5.x-Linux/solr/build/solr-core/test/J0/temp/solr.handler.TestReplicationHandler_3FB87A43D8500100-001/solr-instance-002/./collection1/data/index.20160110150726350;done=true>>]
   [junit4]   2> 150135 INFO  (explicit-fetchindex-cmd) [    ] o.a.s.c.CachingDirectoryFactory Closing directory: /home/jenkins/workspace/Lucene-Solr-5.x-Linux/solr/build/solr-core/test/J0/temp/solr.handler.TestReplicationHandler_3FB87A43D8500100-001/solr-instance-002/./collection1/data/index.20160110150726350
   [junit4]   2> 150135 INFO  (qtp1212623646-1389) [    ] o.a.s.c.S.Request [collection1]  webapp=/solr path=/replication params={wait=true&masterUrl=http://127.0.0.1:54247/solr/collection1/replication&command=fetchindex} status=0 QTime=39
   [junit4]   2> 150144 INFO  (qtp829410491-1371) [    ] o.a.s.c.S.Request [collection1]  webapp=/solr path=/replication params={slave=false&qt=/replication&wt=javabin&version=2&command=details} status=0 QTime=0
   [junit4]   2> 150145 INFO  (qtp1212623646-1390) [    ] o.a.s.c.S.Request [collection1]  webapp=/solr path=/replication params={_trace=getDetails&qt=/replication&wt=javabin&version=2&command=details} status=0 QTime=4
   [junit4]   2> 150148 INFO  (qtp829410491-1372) [    ] o.a.s.u.p.LogUpdateProcessorFactory [collection1]  webapp=/solr path=/update params={wt=javabin&version=2}{add=[1]} 0 1
   [junit4]   2> 150149 INFO  (qtp829410491-1370) [    ] o.a.s.u.DirectUpdateHandler2 start commit{,optimize=false,openSearcher=true,waitSearcher=true,expungeDeletes=false,softCommit=false,prepareCommit=false}
   [junit4]   2> 150161 INFO  (qtp829410491-1370) [    ] o.a.s.c.SolrDeletionPolicy SolrDeletionPolicy.onCommit: commits: num=3
   [junit4]   2> 	commit{dir=MockDirectoryWrapper(RAMDirectory@2bab13bd lockFactory=org.apache.lucene.store.SingleInstanceLockFactory@6dc5038b),segFN=segments_1,generation=1}
   [junit4]   2> 	commit{dir=MockDirectoryWrapper(RAMDirectory@2bab13bd lockFactory=org.apache.lucene.store.SingleInstanceLockFactory@6dc5038b),segFN=segments_2,generation=2}
   [junit4]   2> 	commit{dir=MockDirectoryWrapper(RAMDirectory@2bab13bd lockFactory=org.apache.lucene.store.SingleInstanceLockFactory@6dc5038b),segFN=segments_3,generation=3}
   [junit4]   2> 150161 INFO  (qtp829410491-1370) [    ] o.a.s.c.SolrDeletionPolicy newest commit generation = 3
   [junit4]   2> 150161 INFO  (qtp829410491-1370) [    ] o.a.s.s.SolrIndexSearcher Opening Searcher@7924e43f[collection1] main
   [junit4]   2> 150162 INFO  (qtp829410491-1370) [    ] o.a.s.u.DirectUpdateHandler2 end_commit_flush
   [junit4]   2> 150162 INFO  (searcherExecutor-472-thread-1) [    ] o.a.s.c.SolrCore [collection1] Registered new searcher Searcher@7924e43f[collection1] main{ExitableDirectoryReader(UninvertingDirectoryReader(Uninverting(_0(5.5.0):C1) Uninverting(_1(5.5.0):C1)))}
   [junit4]   2> 150162 INFO  (qtp829410491-1370) [    ] o.a.s.u.p.LogUpdateProcessorFactory [collection1]  webapp=/solr path=/update params={waitSearcher=true&commit=true&softCommit=false&wt=javabin&version=2}{commit=} 0 12
   [junit4]   2> 150163 WARN  (explicit-fetchindex-cmd) [    ] o.a.s.h.IndexFetcher 'masterUrl' must be specified without the /replication suffix
   [junit4]   2> 150165 INFO  (qtp829410491-1371) [    ] o.a.s.c.S.Request [collection1]  webapp=/solr path=/replication params={qt=/replication&wt=javabin&version=2&command=indexversion} status=0 QTime=0
   [junit4]   2> 150165 INFO  (explicit-fetchindex-cmd) [    ] o.a.s.h.IndexFetcher Master's generation: 3
   [junit4]   2> 150166 INFO  (explicit-fetchindex-cmd) [    ] o.a.s.h.IndexFetcher Slave's generation: 2
   [junit4]   2> 150166 INFO  (explicit-fetchindex-cmd) [    ] o.a.s.h.IndexFetcher Starting replication process
   [junit4]   2> 150169 INFO  (qtp829410491-1372) [    ] o.a.s.c.S.Request [collection1]  webapp=/solr path=/replication params={generation=3&qt=/replication&wt=javabin&version=2&command=filelist} status=0 QTime=2
   [junit4]   2> 150170 INFO  (explicit-fetchindex-cmd) [    ] o.a.s.h.IndexFetcher Number of files in latest index in master: 15
   [junit4]   2> 150170 INFO  (explicit-fetchindex-cmd) [    ] o.a.s.c.CachingDirectoryFactory return new directory for /home/jenkins/workspace/Lucene-Solr-5.x-Linux/solr/build/solr-core/test/J0/temp/solr.handler.TestReplicationHandler_3FB87A43D8500100-001/solr-instance-002/./collection1/data/index.20160110150726415
   [junit4]   2> 150171 INFO  (explicit-fetchindex-cmd) [    ] o.a.s.u.DefaultSolrCoreState Rollback old IndexWriter... core=collection1
   [junit4]   2> 150171 INFO  (explicit-fetchindex-cmd) [    ] o.a.s.u.RandomMergePolicy RandomMergePolicy wrapping class org.apache.lucene.index.AlcoholicMergePolicy: [AlcoholicMergePolicy: minMergeSize=0, mergeFactor=10, maxMergeSize=867735418, maxMergeSizeForForcedMerge=9223372036854775807, calibrateSizeByDeletes=true, maxMergeDocs=2147483647, maxCFSSegmentSizeMB=8.796093022207999E12, noCFSRatio=0.1]
   [junit4]   2> 150171 INFO  (explicit-fetchindex-cmd) [    ] o.a.s.c.SolrDeletionPolicy SolrDeletionPolicy.onInit: commits: num=1
   [junit4]   2> 	commit{dir=MockDirectoryWrapper(RAMDirectory@2e9f92ad lockFactory=org.apache.lucene.store.SingleInstanceLockFactory@5e2a7a3b),segFN=segments_2,generation=2}
   [junit4]   2> 150171 INFO  (explicit-fetchindex-cmd) [    ] o.a.s.c.SolrDeletionPolicy newest commit generation = 2
   [junit4]   2> 150171 INFO  (explicit-fetchindex-cmd) [    ] o.a.s.u.DefaultSolrCoreState New IndexWriter is ready to be used.
   [junit4]   2> 150171 INFO  (explicit-fetchindex-cmd) [    ] o.a.s.c.SolrDeletionPolicy SolrDeletionPolicy.onCommit: commits: num=1
   [junit4]   2> 	commit{dir=MockDirectoryWrapper(RAMDirectory@2e9f92ad lockFactory=org.apache.lucene.store.SingleInstanceLockFactory@5e2a7a3b),segFN=segments_2,generation=2}
   [junit4]   2> 150171 INFO  (explicit-fetchindex-cmd) [    ] o.a.s.c.SolrDeletionPolicy newest commit generation = 2
   [junit4]   2> 150172 INFO  (explicit-fetchindex-cmd) [    ] o.a.s.u.DefaultSolrCoreState Rollback old IndexWriter... core=collection1
   [junit4]   2> 150172 INFO  (explicit-fetchindex-cmd) [    ] o.a.s.h.IndexFetcher Starting download (fullCopy=false) to MockDirectoryWrapper(RAMDirectory@46b060da lockFactory=org.apache.lucene.store.SingleInstanceLockFactory@7be11949)
   [junit4]   2> 150172 INFO  (explicit-fetchindex-cmd) [    ] o.a.s.h.IndexFetcher Skipping download for _0.si because it already exists
   [junit4]   2> 150172 INFO  (explicit-fetchindex-cmd) [    ] o.a.s.h.IndexFetcher Skipping download for _0.nvd because it already exists
   [junit4]   2> 150172 INFO  (explicit-fetchindex-cmd) [    ] o.a.s.h.IndexFetcher Skipping download for _0.fdx because it already exists
   [junit4]   2> 150172 INFO  (explicit-fetchindex-cmd) [    ] o.a.s.h.IndexFetcher Skipping download for _0_Memory_0.ram because it already exists
   [junit4]   2> 150172 INFO  (explicit-fetchindex-cmd) [    ] o.a.s.h.IndexFetcher Skipping download for _0.fdt because it already exists
   [junit4]   2> 150172 INFO  (explicit-fetchindex-cmd) [    ] o.a.s.h.IndexFetcher Skipping download for _0.fnm because it already exists
   [junit4]   2> 150172 INFO  (explicit-fetchindex-cmd) [    ] o.a.s.h.IndexFetcher Skipping download for _0.nvm because it already exists
   [junit4]   2> 150174 INFO  (qtp829410491-1370) [    ] o.a.s.c.S.Request [collection1]  webapp=/solr path=/replication params={generation=3&qt=/replication&file=_1.si&checksum=true&wt=filestream&command=filecontent} status=0 QTime=0
   [junit4]   2> 150176 INFO  (qtp829410491-1371) [    ] o.a.s.c.S.Request [collection1]  webapp=/solr path=/replication params={generation=3&qt=/replication&file=_1.nvd&checksum=true&wt=filestream&command=filecontent} status=0 QTime=0
   [junit4]   2> 150179 INFO  (qtp829410491-1372) [    ] o.a.s.c.S.Request [collection1]  webapp=/solr path=/replication params={generation=3&qt=/replication&file=_1_Memory_0.ram&checksum=true&wt=filestream&command=filecontent} status=0 QTime=0
   [junit4]   2> 150181 INFO  (qtp829410491-1370) [    ] o.a.s.c.S.Request [collection1]  webapp=/solr path=/replication params={generation=3&qt=/replication&file=_1.fdx&checksum=true&wt=filestream&command=filecontent} status=0 QTime=0
   [junit4]   2> 150183 INFO  (qtp829410491-1371) [    ] o.a.s.c.S.Request [collection1]  webapp=/solr path=/replication params={generation=3&qt=/replication&file=_1.fnm&checksum=true&wt=filestream&command=filecontent} status=0 QTime=0
   [junit4]   2> 150185 INFO  (qtp829410491-1372) [    ] o.a.s.c.S.Request [collection1]  webapp=/solr path=/replication params={generation=3&qt=/replication&file=_1.nvm&checksum=true&wt=filestream&command=filecontent} status=0 QTime=0
   [junit4]   2> 150187 INFO  (qtp829410491-1370) [    ] o.a.s.c.S.Request [collection1]  webapp=/solr path=/replication params={generation=3&qt=/replication&file=_1.fdt&checksum=true&wt=filestream&command=filecontent} status=0 QTime=0
   [junit4]   2> 150189 INFO  (qtp829410491-1371) [    ] o.a.s.c.S.Request [collection1]  webapp=/solr path=/replication params={generation=3&qt=/replication&file=segments_3&checksum=true&wt=filestream&command=filecontent} status=0 QTime=0
   [junit4]   2> 150189 INFO  (explicit-fetchindex-cmd) [    ] o.a.s.h.IndexFetcher Total time taken for download (fullCopy=false,bytesDownloaded=1387) : 0 secs (null bytes/sec) to MockDirectoryWrapper(RAMDirectory@46b060da lockFactory=org.apache.lucene.store.SingleInstanceLockFactory@7be11949)
   [junit4]   2> 150191 INFO  (explicit-fetchindex-cmd) [    ] o.a.s.u.RandomMergePolicy RandomMergePolicy wrapping class org.apache.lucene.index.LogByteSizeMergePolicy: [LogByteSizeMergePolicy: minMergeSize=1677721, mergeFactor=27, maxMergeSize=2147483648, maxMergeSizeForForcedMerge=9223372036854775807, calibrateSizeByDeletes=false, maxMergeDocs=2147483647, maxCFSSegmentSizeMB=8.796093022207999E12, noCFSRatio=0.5597487660538917]
   [junit4]   2> 150191 INFO  (explicit-fetchindex-cmd) [    ] o.a.s.c.SolrDeletionPolicy SolrDeletionPolicy.onInit: commits: num=2
   [junit4]   2> 	commit{dir=MockDirectoryWrapper(RAMDirectory@2e9f92ad lockFactory=org.apache.lucene.store.SingleInstanceLockFactory@5e2a7a3b),segFN=segments_2,generation=2}
   [junit4]   2> 	commit{dir=MockDirectoryWrapper(RAMDirectory@2e9f92ad lockFactory=org.apache.lucene.store.SingleInstanceLockFactory@5e2a7a3b),segFN=segments_3,generation=3}
   [junit4]   2> 150191 INFO  (explicit-fetchindex-cmd) [    ] o.a.s.c.SolrDeletionPolicy newest commit generation = 3
   [junit4]   2> 150191 INFO  (explicit-fetchindex-cmd) [    ] o.a.s.u.DefaultSolrCoreState New IndexWriter is ready to be used.
   [junit4]   2> 150192 INFO  (explicit-fetchindex-cmd) [    ] o.a.s.s.SolrIndexSearcher Opening Searcher@58d95cc2[collection1] main
   [junit4]   2> 150192 INFO  (searcherExecutor-482-thread-1) [    ] o.a.s.c.SolrCore [collection1] Registered new searcher Searcher@58d95cc2[collection1] main{ExitableDirectoryReader(UninvertingDirectoryReader(Uninverting(_0(5.5.0):C1) Uninverting(_1(5.5.0):C1)))}
   [junit4]   2> 150192 INFO  (explicit-fetchindex-cmd) [    ] o.a.s.c.CachingDirectoryFactory looking to close /home/jenkins/workspace/Lucene-Solr-5.x-Linux/solr/build/solr-core/test/J0/temp/solr.handler.TestReplicationHandler_3FB87A43D8500100-001/solr-instance-002/./collection1/data/index.20160110150726415 [CachedDir<<refCount=0;path=/home/jenkins/workspace/Lucene-Solr-5.x-Linux/solr/build/solr-core/test/J0/temp/solr.handler.TestReplicationHandler_3FB87A43D8500100-001/solr-instance-002/./collection1/data/index.20160110150726415;done=true>>]
   [junit4]   2> 150192 INFO  (explicit-fetchindex-cmd) [    ] o.a.s.c.CachingDirectoryFactory Closing directory: /home/jenkins/workspace/Lucene-Solr-5.x-Linux/solr/build/solr-core/test/J0/temp/solr.handler.TestReplicationHandler_3FB87A43D8500100-001/solr-instance-002/./collection1/data/index.20160110150726415
   [junit4]   2> 150192 INFO  (qtp1212623646-1388) [    ] o.a.s.c.S.Request [collection1]  webapp=/solr path=/replication params={wait=true&masterUrl=http://127.0.0.1:54247/solr/collection1/replication&command=fetchindex} status=0 QTime=29
   [junit4]   2> 150199 INFO  (qtp829410491-1372) [    ] o.a.s.c.S.Request [collection1]  webapp=/solr path=/replication params={slave=false&qt=/replication&wt=javabin&version=2&command=details} status=0 QTime=0
   [junit4]   2> 150199 INFO  (qtp1212623646-1389) [    ] o.a.s.c.S.Request [collection1]  webapp=/solr path=/replication params={_trace=getDetails&qt=/replication&wt=javabin&version=2&command=details} status=0 QTime=3
   [junit4]   2> 150201 INFO  (qtp829410491-1370) [    ] o.a.s.u.p.LogUpdateProcessorFactory [collection1]  webapp=/solr path=/update params={wt=javabin&version=2}{add=[2]} 0 0
   [junit4]   2> 150203 INFO  (qtp829410491-1371) [    ] o.a.s.u.DirectUpdateHandler2 start commit{,optimize=false,openSearcher=true,waitSearcher=true,expungeDeletes=false,softCommit=false,prepareCommit=false}
   [junit4]   2> 150206 INFO  (qtp829410491-1371) [    ] o.a.s.c.SolrDeletionPolicy SolrDeletionPolicy.onCommit: commits: num=4
   [junit4]   2> 	commit{dir=MockDirectoryWrapper(RAMDirectory@2bab13bd lockFactory=org.apache.lucene.store.SingleInstanceLockFactory@6dc5038b),segFN=segments_1,generation=1}
   [junit4]   2> 	commit{dir=MockDirectoryWrapper(RAMDirectory@2bab13bd lockFactory=org.apache.lucene.store.SingleInstanceLockFactory@6dc5038b),segFN=segments_2,generation=2}
   [junit4]   2> 	commit{dir=MockDirectoryWrapper(RAMDirectory@2bab13bd lockFactory=org.apache.lucene.store.SingleInstanceLockFactory@6dc5038b),segFN=segments_3,generation=3}
   [junit4]   2> 	commit{dir=MockDirectoryWrapper(RAMDirectory@2bab13bd lockFactory=org.apache.lucene.store.SingleInstanceLockFactory@6dc5038b),segFN=segments_4,generation=4}
   [junit4]   2> 150206 INFO  (qtp829410491-1371) [    ] o.a.s.c.SolrDeletionPolicy newest commit generation = 4
   [junit4]   2> 150206 INFO  (qtp829410491-1371) [    ] o.a.s.s.SolrIndexSearcher Opening Searcher@519d2967[collection1] main
   [junit4]   2> 150207 INFO  (qtp829410491-1371) [    ] o.a.s.u.DirectUpdateHandler2 end_commit_flush
   [junit4]   2> 150207 INFO  (searcherExecutor-472-thread-1) [    ] o.a.s.c.SolrCore [collection1] Registered new searcher Searcher@519d2967[collection1] main{ExitableDirectoryReader(UninvertingDirectoryReader(Uninverting(_0(5.5.0):C1) Uninverting(_1(5.5.0):C1) Uninverting(_2(5.5.0):C1)))}
   [junit4]   2> 150207 INFO  (qtp829410491-1371) [    ] o.a.s.u.p.LogUpdateProcessorFactory [collection1]  webapp=/solr path=/update params={waitSearcher=true&commit=true&softCommit=false&wt=javabin&version=2}{commit=} 0 3
   [junit4]   2> 150208 WARN  (explicit-fetchindex-cmd) [    ] o.a.s.h.IndexFetcher 'masterUrl' must be specified without the /replication suffix
   [junit4]   2> 150210 INFO  (qtp829410491-1372) [    ] o.a.s.c.S.Request [collection1]  webapp=/solr path=/replication params={qt=/replication&wt=javabin&version=2&command=indexversion} status=0 QTime=0
   [junit4]   2> 150210 INFO  (explicit-fetchindex-cmd) [    ] o.a.s.h.IndexFetcher Master's generation: 4
   [junit4]   2> 150210 INFO  (explicit-fetchindex-cmd) [    ] o.a.s.h.IndexFetcher Slave's generation: 3
   [junit4]   2> 150210 INFO  (explicit-fetchindex-cmd) [    ] o.a.s.h.IndexFetcher Starting replication process
   [junit4]   2> 150213 INFO  (qtp829410491-1370) [    ] o.a.s.c.S.Request [collection1]  webapp=/solr path=/replication params={generation=4&qt=/replication&wt=javabin&version=2&command=filelist} status=0 QTime=1
   [junit4]   2> 150213 INFO  (explicit-fetchindex-cmd) [    ] o.a.s.h.IndexFetcher Number of files in latest index in master: 22
   [junit4]   2> 150213 INFO  (explicit-fetchindex-cmd) [    ] o.a.s.c.CachingDirectoryFactory return new directory for /home/jenkins/workspace/Lucene-Solr-5.x-Linux/solr/build/solr-core/test/J0/temp/solr.handler.TestReplicationHandler_3FB87A43D8500100-001/solr-instance-002/./collection1/data/index.20160110150726458
   [junit4]   2> 150214 INFO  (explicit-fetchindex-cmd) [    ] o.a.s.u.DefaultSolrCoreState Rollback old IndexWriter... core=collection1
   [junit4]   2> 150214 INFO  (explicit-fetchindex-cmd) [    ] o.a.s.u.RandomMergePolicy RandomMergePolicy wrapping class org.apache.lucene.index.AlcoholicMergePolicy: [AlcoholicMergePolicy: minMergeSize=0, mergeFactor=10, maxMergeSize=867735418, maxMergeSizeForForcedMerge=9223372036854775807, calibrateSizeByDeletes=true, maxMergeDocs=2147483647, maxCFSSegmentSizeMB=8.796093022207999E12, noCFSRatio=0.1]
   [junit4]   2> 150215 INFO  (explicit-fetchindex-cmd) [    ] o.a.s.c.SolrDeletionPolicy SolrDeletionPolicy.onInit: commits: num=1
   [junit4]   2> 	commit{dir=MockDirectoryWrapper(RAMDirectory@2e9f92ad lockFactory=org.apache.lucene.store.SingleInstanceLockFactory@5e2a7a3b),segFN=segments_3,generation=3}
   [junit4]   2> 150215 INFO  (explicit-fetchindex-cmd) [    ] o.a.s.c.SolrDeletionPolicy newest commit generation = 3
   [junit4]   2> 150215 INFO  (explicit-fetchindex-cmd) [    ] o.a.s.u.DefaultSolrCoreState New IndexWriter is ready to be used.
   [junit4]   2> 150215 INFO  (explicit-fetchindex-cmd) [    ] o.a.s.c.SolrDeletionPolicy SolrDeletionPolicy.onCommit: commits: num=1
   [junit4]   2> 	commit{dir=MockDirectoryWrapper(RAMDirectory@2e9f92ad lockFactory=org.apache.lucene.store.SingleInstanceLockFactory@5e2a7a3b),segFN=segments_3,generation=3}
   [junit4]   2> 150215 INFO  (explicit-fetchindex-cmd) [    ] o.a.s.c.SolrDeletionPolicy newest commit generation = 3
   [junit4]   2> 150215 INFO  (explicit-fetchindex-cmd) [    ] o.a.s.u.DefaultSolrCoreState Rollback old IndexWriter... core=collection1
   [junit4]   2> 150215 INFO  (explicit-fetchindex-cmd) [    ] o.a.s.h.IndexFetcher Starting download (fullCopy=false) to MockDirectoryWrapper(RAMDirectory@36f16a9e lockFactory=org.apache.lucene.store.SingleInstanceLockFactory@45bdf3d2)
   [junit4]   2> 150215 INFO  (explicit-fetchindex-cmd) [    ] o.a.s.h.IndexFetcher Skipping download for _0.si because it already exists
   [junit4]   2> 150215 INFO  (explicit-fetchindex-cmd) [    ] o.a.s.h.IndexFetcher Skipping download for _0.nvd because it already exists
   [junit4]   2> 150215 INFO  (explicit-fetchindex-cmd) [    ] o.a.s.h.IndexFetcher Skipping download for _0.fdx because it already exists
   [junit4]   2> 150215 INFO  (explicit-fetchindex-cmd) [    ] o.a.s.h.IndexFetcher Skipping download for _0_Memory_0.ram because it already exists
   [junit4]   2> 150215 INFO  (explicit-fetchindex-cmd) [    ] o.a.s.h.IndexFetcher Skipping download for _0.fdt because it already exists
   [junit4]   2> 150215 INFO  (explicit-fetchindex-cmd) [    ] o.a.s.h.IndexFetcher Skipping download for _0.fnm because it already exists
   [junit4]   2> 150215 INFO  (explicit-fetchindex-cmd) [    ] o.a.s.h.IndexFetcher Skipping download for _0.nvm because it already exists
   [junit4]   2> 150215 INFO  (explicit-fetchindex-cmd) [    ] o.a.s.h.IndexFetcher Skipping download for _1.si because it already exists
   [junit4]   2> 150215 INFO  (explicit-fetchindex-cmd) [    ] o.a.s.h.IndexFetcher Skipping download for _1.nvd because it already exists
   [junit4]   2> 150215 INFO  (explicit-fetchindex-cmd) [    ] o.a.s.h.IndexFetcher Skipping download for _1_Memory_0.ram because it already exists
   [junit4]   2> 150215 INFO  (explicit-fetchindex-cmd) [    ] o.a.s.h.IndexFetcher Skipping download for _1.fdx because it already exists
   [junit4]   2> 150215 INFO  (explicit-fetchindex-cmd) [    ] o.a.s.h.IndexFetcher Skipping download for _1.fnm because it already exists
   [junit4]   2> 150215 INFO  (explicit-fetchindex-cmd) [    ] o.a.s.h.IndexFetcher Skipping download for _1.nvm because it already exists
   [junit4]   2> 150215 INFO  (explicit-fetchindex-cmd) [    ] o.a.s.h.IndexFetcher Skipping download for _1.fdt because it already exists
   [junit4]   2> 150217 INFO  (qtp829410491-1371) [    ] o.a.s.c.S.Request [collection1]  webapp=/solr path=/replication params={generation=4&qt=/replication&file=_2.nvd&checksum=true&wt=filestream&command=filecontent} status=0 QTime=0
   [junit4]   2> 150219 INFO  (qtp829410491-1372) [    ] o.a.s.c.S.Request [collection1]  webapp=/solr path=/replication params={generation=4&qt=/replication&file=_2.si&checksum=true&wt=filestream&command=filecontent} status=0 QTime=0
   [junit4]   2> 150221 INFO  (qtp829410491-1370) [    ] o.a.s.c.S.Request [collection1]  webapp=/solr path=/replication params={generation=4&qt=/replication&file=_2.fdt&checksum=true&wt=filestream&command=filecontent} status=0 QTime=0
   [junit4]   2> 150223 INFO  (qtp829410491-1371) [    ] o.a.s.c.S.Request [collection1]  webapp=/solr path=/replication params={generation=4&qt=/replication&file=_2.fnm&checksum=true&wt=filestream&command=filecontent} status=0 QTime=0
   [junit4]   2> 150225 INFO  (qtp829410491-1372) [    ] o.a.s.c.S.Request [collection1]  webapp=/solr path=/replication params={generation=4&qt=/replication&file=_2.nvm&checksum=true&wt=filestream&command=filecontent} status=0 QTime=0
   [junit4]   2> 150227 INFO  (qtp829410491-1370) [    ] o.a.s.c.S.Request [collection1]  webapp=/solr path=/replication params={generation=4&qt=/replication&file=_2_Memory_0.ram&checksum=true&wt=filestream&command=filecontent} status=0 QTime=0
   [junit4]   2> 150229 INFO  (qtp829410491-1371) [    ] o.a.s.c.S.Request [collection1]  webapp=/solr path=/replication params={generation=4&qt=/replication&file=_2.fdx&checksum=true&wt=filestream&command=filecontent} status=0 QTime=0
   [junit4]   2> 150231 INFO  (qtp829410491-1372) [    ] o.a.s.c.S.Request [collection1]  webapp=/solr path=/replication params={generation=4&qt=/replication&file=segments_4&checksum=true&wt=filestream&command=filecontent} status=0 QTime=0
   [junit4]   2> 150231 INFO  (explicit-fetchindex-cmd) [    ] o.a.s.h.IndexFetcher Total time taken for download (fullCopy=false,bytesDownloaded=1450) : 0 secs (null bytes/sec) to MockDirectoryWrapper(RAMDirectory@36f16a9e lockFactory=org.apache.lucene.store.SingleInstanceLockFactory@45bdf3d2)
   [junit4]   2> 150232 INFO  (explicit-fetchindex-cmd) [    ] o.a.s.u.RandomMergePolicy RandomMergePolicy wrapping class org.apache.lucene.index.LogByteSizeMergePolicy: [LogByteSizeMergePolicy: minMergeSize=1677721, mergeFactor=27, maxMergeSize=2147483648, maxMergeSizeForForcedMerge=9223372036854775807, calibrateSizeByDeletes=false, maxMergeDocs=2147483647, maxCFSSegmentSizeMB=8.796093022207999E12, noCFSRatio=0.5597487660538917]
   [junit4]   2> 150233 INFO  (explicit-fetchindex-cmd) [    ] o.a.s.c.SolrDeletionPolicy SolrDeletionPolicy.onInit: commits: num=2
   [junit4]   2> 	commit{dir=MockDirectoryWrapper(RAMDirectory@2e9f92ad lockFactory=org.apache.lucene.store.SingleInstanceLockFactory@5e2a7a3b),segFN=segments_3,generation=3}
   [junit4]   2> 	commit{dir=MockDirectoryWrapper(RAMDirectory@2e9f92ad lockFactory=org.apache.lucene.store.SingleInstanceLockFactory@5e2a7a3b),segFN=segments_4,generation=4}
   [junit4]   2> 150233 INFO  (explicit-fetchindex-cmd) [    ] o.a.s.c.SolrDeletionPolicy newest commit generation = 4
   [junit4]   2> 150233 INFO  (explicit-fetchindex-cmd) [    ] o.a.s.u.DefaultSolrCoreState New IndexWriter is ready to be used.
   [junit4]   2> 150234 INFO  (explicit-fetchindex-cmd) [    ] o.a.s.s.SolrIndexSearcher Opening Searcher@6b753696[collection1] main
   [junit4]   2> 150235 INFO  (searcherExecutor-482-thread-1) [    ] o.a.s.c.SolrCore [collection1] Registered new searcher Searcher@6b753696[collection1] main{ExitableDirectoryReader(UninvertingDirectoryReader(Uninverting(_0(5.5.0):C1) Uninverting(_1(5.5.0):C1) Uninverting(_2(5.5.0):C1)))}
   [junit4]   2> 150235 INFO  (explicit-fetchindex-cmd) [    ] o.a.s.c.CachingDirectoryFactory looking to close /home/jenkins/workspace/Lucene-Solr-5.x-Linux/solr/build/solr-core/test/J0/temp/solr.handler.TestReplicationHandler_3FB87A43D8500100-001/solr-instance-002/./collection1/data/index.20160110150726458 [CachedDir<<refCount=0;path=/home/jenkins/workspace/Lucene-Solr-5.x-Linux/solr/build/solr-core/test/J0/temp/solr.handler.TestReplicationHandler_3FB87A43D8500100-001/solr-instance-002/./collection1/data/index.20160110150726458;done=true>>]
   [junit4]   2> 150235 INFO  (explicit-fetchindex-cmd) [    ] o.a.s.c.CachingDirectoryFactory Closing directory: /home/jenkins/workspace/Lucene-Solr-5.x-Linux/solr/build/solr-core/test/J0/temp/solr.handler.TestReplicationHandler_3FB87A43D8500100-001/solr-instance-002/./collection1/data/index.20160110150726458
   [junit4]   2> 150235 INFO  (qtp1212623646-1390) [    ] o.a.s.c.S.Request [collection1]  webapp=/solr path=/replication params={wait=true&masterUrl=http://127.0.0.1:54247/solr/collection1/replication&command=fetchindex} status=0 QTime=27
   [junit4]   2> 150237 INFO  (TEST-TestReplicationHandler.doTestDetails-seed#[3FB87A43D8500100]) [    ] o.a.s.SolrTestCaseJ4 Writing core.properties file to /home/jenkins/workspace/Lucene-Solr-5.x-Linux/solr/build/solr-core/test/J0/temp/solr.handler.TestReplicationHandler_3FB87A43D8500100-001/solr-instance-003/collection1
   [junit4]   2> 150240 INFO  (TEST-TestReplicationHandler.doTestDetails-seed#[3FB87A43D8500100]) [    ] o.e.j.s.Server jetty-9.2.13.v20150730
   [junit4]   2> 150240 INFO  (TEST-TestReplicationHandler.doTestDetails-seed#[3FB87A43D8500100]) [    ] o.e.j.s.h.ContextHandler Started o.e.j.s.ServletContextHandler@20ba5b02{/solr,null,AVAILABLE}
   [junit4]   2> 150240 INFO  (TEST-TestReplicationHandler.doTestDetails-seed#[3FB87A43D8500100]) [    ] o.e.j.s.ServerConnector Started ServerConnector@24d8f2bf{HTTP/1.1}{127.0.0.1:44773}
   [junit4]   2> 150240 INFO  (TEST-TestReplicationHandler.doTestDetails-seed#[3FB87A43D8500100]) [    ] o.e.j.s.Server Started @151989ms
   [junit4]   2> 150241 INFO  (TEST-TestReplicationHandler.doTestDetails-seed#[3FB87A43D8500100]) [    ] o.a.s.c.s.e.JettySolrRunner Jetty properties: {solr.data.dir=/home/jenkins/workspace/Lucene-Solr-5.x-Linux/solr/build/solr-core/test/J0/temp/solr.handler.TestReplicationHandler_3FB87A43D8500100-001/solr-instance-003/collection1/data, hostContext=/solr, hostPort=44773}
   [junit4]   2> 150241 INFO  (TEST-TestReplicationHandler.doTestDetails-seed#[3FB87A43D8500100]) [    ] o.a.s.s.SolrDispatchFilter SolrDispatchFilter.init(): sun.misc.Launcher$AppClassLoader@694f9431
   [junit4]   2> 150241 INFO  (TEST-TestReplicationHandler.doTestDetails-seed#[3FB87A43D8500100]) [    ] o.a.s.c.SolrResourceLoader new SolrResourceLoader for directory: '/home/jenkins/workspace/Lucene-Solr-5.x-Linux/solr/build/solr-core/test/J0/temp/solr.handler.TestReplicationHandler_3FB87A43D8500100-001/solr-instance-003'
   [junit4]   2> 150241 INFO  (TEST-TestReplicationHandler.doTestDetails-seed#[3FB87A43D8500100]) [    ] o.a.s.c.SolrResourceLoader JNDI not configured for solr (NoInitialContextEx)
   [junit4]   2> 150241 INFO  (TEST-TestReplicationHandler.doTestDetails-seed#[3FB87A43D8500100]) [    ] o.a.s.c.SolrResourceLoader solr home defaulted to 'solr/' (could not find system property or JNDI)
   [junit4]   2> 150241 INFO  (TEST-TestReplicationHandler.doTestDetails-seed#[3FB87A43D8500100]) [    ] o.a.s.c.SolrXmlConfig Loading container configuration from /home/jenkins/workspace/Lucene-Solr-5.x-Linux/solr/build/solr-core/test/J0/temp/solr.handler.TestReplicationHandler_3FB87A43D8500100-001/solr-instance-003/solr.xml
   [junit4]   2> 150245 INFO  (TEST-TestReplicationHandler.doTestDetails-seed#[3FB87A43D8500100]) [    ] o.a.s.c.CorePropertiesLocator Config-defined core root directory: /home/jenkins/workspace/Lucene-Solr-5.x-Linux/solr/build/solr-core/test/J0/temp/solr.handler.TestReplicationHandler_3FB87A43D8500100-001/solr-instance-003/.
   [junit4]   2> 150245 INFO  (TEST-TestReplicationHandler.doTestDetails-seed#[3FB87A43D8500100]) [    ] o.a.s.c.CoreContainer New CoreContainer 979718533
   [junit4]   2> 150245 INFO  (TEST-TestReplicationHandler.doTestDetails-seed#[3FB87A43D8500100]) [    ] o.a.s.c.CoreContainer Loading cores into CoreContainer [instanceDir=/home/jenkins/workspace/Lucene-Solr-5.x-Linux/solr/build/solr-core/test/J0/temp/solr.handler.TestReplicationHandler_3FB87A43D8500100-001/solr-instance-003]
   [junit4]   2> 150245 WARN  (TEST-TestReplicationHandler.doTestDetails-seed#[3FB87A43D8500100]) [    ] o.a.s.c.CoreContainer Couldn't add files from /home/jenkins/workspace/Lucene-Solr-5.x-Linux/solr/build/solr-core/test/J0/temp/solr.handler.TestReplicationHandler_3FB87A43D8500100-001/solr-instance-003/lib to classpath: /home/jenkins/workspace/Lucene-Solr-5.x-Linux/solr/build/solr-core/test/J0/temp/solr.handler.TestReplicationHandler_3FB87A43D8500100-001/solr-instance-003/lib
   [junit4]   2> 150245 INFO  (TEST-TestReplicationHandler.doTestDetails-seed#[3FB87A43D8500100]) [    ] o.a.s.h.c.HttpShardHandlerFactory created with socketTimeout : 90000,urlScheme : ,connTimeout : 15000,maxConnectionsPerHost : 20,maxConnections : 10000,corePoolSize : 0,maximumPoolSize : 2147483647,maxThreadIdleTime : 5,sizeOfQueue : -1,fairnessPolicy : false,useRetries : false,
   [junit4]   2> 150246 INFO  (TEST-TestReplicationHandler.doTestDetails-seed#[3FB87A43D8500100]) [    ] o.a.s.u.UpdateShardHandler Creating UpdateShardHandler HTTP client with params: socketTimeout=340000&connTimeout=45000&retry=true
   [junit4]   2> 150246 INFO  (TEST-TestReplicationHandler.doTestDetails-seed#[3FB87A43D8500100]) [    ] o.a.s.l.LogWatcher SLF4J impl is org.slf4j.impl.Log4jLoggerFactory
   [junit4]   2> 150246 INFO  (TEST-TestReplicationHandler.doTestDetails-seed#[3FB87A43D8500100]) [    ] o.a.s.l.LogWatcher Registering Log Listener [Log4j (org.slf4j.impl.Log4jLoggerFactory)]
   [junit4]   2> 150246 INFO  (TEST-TestReplicationHandler.doTestDetails-seed#[3FB87A43D8500100]) [    ] o.a.s.c.CoreContainer Security conf doesn't exist. Skipping setup for authorization module.
   [junit4]   2> 150246 INFO  (TEST-TestReplicationHandler.doTestDetails-seed#[3FB87A43D8500100]) [    ] o.a.s.c.CoreContainer No authentication plugin used.
   [junit4]   2> 150247 INFO  (TEST-TestReplicationHandler.doTestDetails-seed#[3FB87A43D8500100]) [    ] o.a.s.c.CorePropertiesLocator Looking for core definitions underneath /home/jenkins/workspace/Lucene-Solr-5.x-Linux/solr/build/solr-core/test/J0/temp/solr.handler.TestReplicationHandler_3FB87A43D8500100-001/solr-instance-003/.
   [junit4]   2> 150247 INFO  (TEST-TestReplicationHandler.doTestDetails-seed#[3FB87A43D8500100]) [    ] o.a.s.c.CoreDescriptor Created CoreDescriptor: {name=collection1, config=solrconfig.xml, loadOnStartup=true, schema=schema.xml, configSetProperties=configsetprops.json, transient=false, dataDir=data/}
   [junit4]   2> 150247 INFO  (TEST-TestReplicationHandler.doTestDetails-seed#[3FB87A43D8500100]) [    ] o.a.s.c.CorePropertiesLocator Found core collection1 in /home/jenkins/workspace/Lucene-Solr-5.x-Linux/solr/build/solr-core/test/J0/temp/solr.handler.TestReplicationHandler_3FB87A43D8500100-001/solr-instance-003/./collection1
   [junit4]   2> 150247 INFO  (TEST-TestReplicationHandler.doTestDetails-seed#[3FB87A43D8500100]) [    ] o.a.s.c.CorePropertiesLocator Found 1 core definitions
   [junit4]   2> 150248 INFO  (coreLoadExecutor-495-thread-1) [    ] o.a.s.c.SolrResourceLoader new SolrResourceLoader for directory: '/home/jenkins/workspace/Lucene-Solr-5.x-Linux/solr/build/solr-core/test/J0/temp/solr.handler.TestReplicationHandler_3FB87A43D8500100-001/solr-instance-003/collection1'
   [junit4]   2> 150248 INFO  (TEST-TestReplicationHandler.doTestDetails-seed#[3FB87A43D8500100]) [    ] o.a.s.s.SolrDispatchFilter user.dir=/home/jenkins/workspace/Lucene-Solr-5.x-Linux/solr/build/solr-core/test/J0
   [junit4]   2> 150248 INFO  (TEST-TestReplicationHandler.doTestDetails-seed#[3FB87A43D8500100]) [    ] o.a.s.s.SolrDispatchFilter SolrDispatchFilter.init() done
   [junit4]   2> 150248 INFO  (coreLoadExecutor-495-thread-1) [    ] o.a.s.c.SolrResourceLoader JNDI not configured for solr (NoInitialContextEx)
   [junit4]   2> 150248 INFO  (coreLoadExecutor-495-thread-1) [    ] o.a.s.c.SolrResourceLoader solr home defaulted to 'solr/' (could not find system property or JNDI)
   [junit4]   2> 150255 INFO  (coreLoadExecutor-495-thread-1) [    ] o.a.s.c.SolrConfig current version of requestparams : -1
   [junit4]   2> 150257 INFO  (coreLoadExecutor-495-thread-1) [    ] o.a.s.c.SolrConfig Using Lucene MatchVersion: 5.5.0
   [junit4]   2> 150279 INFO  (coreLoadExecutor-495-thread-1) [    ] o.a.s.c.SolrConfig Loaded SolrConfig: solrconfig.xml
   [junit4]   2> 150281 INFO  (coreLoadExecutor-495-thread-1) [    ] o.a.s.s.IndexSchema [collection1] Schema name=test
   [junit4]   2> 150283 INFO  (coreLoadExecutor-495-thread-1) [    ] o.a.s.s.IndexSchema unique key field: id
   [junit4]   2> 150284 INFO  (coreLoadExecutor-495-thread-1) [    ] o.a.s.c.ConfigSetProperties Did not find ConfigSet properties, assuming default properties: Can't find resource 'configsetprops.json' in classpath or '/home/jenkins/workspace/Lucene-Solr-5.x-Linux/solr/build/solr-core/test/J0/temp/solr.handler.TestReplicationHandler_3FB87A43D8500100-001/solr-instance-003/collection1'
   [junit4]   2> 150284 INFO  (coreLoadExecutor-495-thread-1) [    ] o.a.s.c.CoreContainer Creating SolrCore 'collection1' using configuration from instancedir /home/jenkins/workspace/Lucene-Solr-5.x-Linux/solr/build/solr-core/test/J0/temp/solr.handler.TestReplicationHandler_3FB87A43D8500100-001/solr-instance-003/./collection1
   [junit4]   2> 150284 INFO  (coreLoadExecutor-495-thread-1) [    ] o.a.s.c.SolrCore org.apache.solr.core.MockDirectoryFactory
   [junit4]   2> 150284 INFO  (coreLoadExecutor-495-thread-1) [    ] o.a.s.c.SolrCore [[collection1] ] Opening new SolrCore at [/home/jenkins/workspace/Lucene-Solr-5.x-Linux/solr/build/solr-core/test/J0/temp/solr.handler.TestReplicationHandler_3FB87A43D8500100-001/solr-instance-003/collection1], dataDir=[/home/jenkins/workspace/Lucene-Solr-5.x-Linux/solr/build/solr-core/test/J0/temp/solr.handler.TestReplicationHandler_3FB87A43D8500100-001/solr-instance-003/./collection1/data/]
   [junit4]   2> 150284 INFO  (coreLoadExecutor-495-thread-1) [    ] o.a.s.c.SolrCore JMX monitoring not detected for core: collection1
   [junit4]   2> 150285 INFO  (coreLoadExecutor-495-thread-1) [    ] o.a.s.c.CachingDirectoryFactory return new directory for /home/jenkins/workspace/Lucene-Solr-5.x-Linux/solr/build/solr-core/test/J0/temp/solr.handler.TestReplicationHandler_3FB87A43D8500100-001/solr-instance-003/./collection1/data
   [junit4]   2> 150285 INFO  (coreLoadExecutor-495-thread-1) [    ] o.a.s.c.SolrCore New index directory detected: old=null new=/home/jenkins/workspace/Lucene-Solr-5.x-Linux/solr/build/solr-core/test/J0/temp/solr.handler.TestReplicationHandler_3FB87A43D8500100-001/solr-instance-003/./collection1/data/index/
   [junit4]   2> 150285 WARN  (coreLoadExecutor-495-thread-1) [    ] o.a.s.c.SolrCore [collection1] Solr index directory '/home/jenkins/workspace/Lucene-Solr-5.x-Linux/solr/build/solr-core/test/J0/temp/solr.handler.TestReplicationHandler_3FB87A43D8500100-001/solr-instance-003/./collection1/data/index' doesn't exist. Creating new index...
   [junit4]   2> 150286 INFO  (coreLoadExecutor-495-thread-1) [    ] o.a.s.c.CachingDirectoryFactory return new directory for /home/jenkins/workspace/Lucene-Solr-5.x-Linux/solr/build/solr-core/test/J0/temp/solr.handler.TestReplicationHandler_3FB87A43D8500100-001/solr-instance-003/./collection1/data/index
   [junit4]   2> 150286 INFO  (coreLoadExecutor-495-thread-1) [    ] o.a.s.u.RandomMergePolicy RandomMergePolicy wrapping class org.apache.lucene.index.TieredMergePolicy: [TieredMergePolicy: maxMergeAtOnce=45, maxMergeAtOnceExplicit=37, maxMergedSegmentMB=30.7646484375, floorSegmentMB=1.791015625, forceMergeDeletesPctAllowed=23.07294175016255, segmentsPerTier=33.0, maxCFSSegmentSizeMB=8.796093022207999E12, noCFSRatio=1.0
   [junit4]   2> 150287 INFO  (coreLoadExecutor-495-thread-1) [    ] o.a.s.c.SolrDeletionPolicy SolrDeletionPolicy.onCommit: commits: num=1
   [junit4]   2> 	commit{dir=MockDirectoryWrapper(RAMDirectory@534b05d1 lockFactory=org.apache.lucene.store.SingleInstanceLockFactory@737c8ea4),segFN=segments_1,generation=1}
   [junit4]   2> 150287 INFO  (coreLoadExecutor-495-thread-1) [    ] o.a.s.c.SolrDeletionPolicy newest commit generation = 1
   [junit4]   2> 150287 INFO  (OldIndexDirectoryCleanupThreadForCore-collection1) [    ] o.a.s.c.SolrCore Looking for old index directories to cleanup for core collection1 in /home/jenkins/workspace/Lucene-Solr-5.x-Linux/solr/build/solr-core/test/J0/temp/solr.handler.TestReplicationHandler_3FB87A43D8500100-001/solr-instance-003/./collection1/data/
   [junit4]   2> 150288 INFO  (coreLoadExecutor-495-thread-1) [    ] o.a.s.c.SolrCore no updateRequestProcessorChain defined as default, creating implicit default
   [junit4]   2> 150290 INFO  (coreLoadExecutor-495-thread-1) [    ] o.a.s.h.l.XMLLoader xsltCacheLifetimeSeconds=60
   [junit4]   2> 150291 INFO  (coreLoadExecutor-495-thread-1) [    ] o.a.s.h.l.XMLLoader xsltCacheLifetimeSeconds=60
   [junit4]   2> 150292 INFO  (coreLoadExecutor-495-thread-1) [    ] o.a.s.h.l.XMLLoader xsltCacheLifetimeSeconds=60
   [junit4]   2> 150292 INFO  (coreLoadExecutor-495-thread-1) [    ] o.a.s.h.l.XMLLoader xsltCacheLifetimeSeconds=60
   [junit4]   2> 150293 INFO  (coreLoadExecutor-495-thread-1) [    ] o.a.s.c.PluginBag requestHandler : 'lazy' created with startup=lazy 
   [junit4]   2> 150293 INFO  (coreLoadExecutor-495-thread-1) [    ] o.a.s.c.RequestHandlers Registered paths: /admin/mbeans,standard,lazy,/update/csv,/update/json/docs,/admin/luke,/admin/segments,/get,/admin/system,/replication,/admin/properties,defaults,/config,/schema,/admin/plugins,/admin/logging,/update/json,/admin/threads,/admin/ping,/update,/admin/file
   [junit4]   2> 150293 INFO  (coreLoadExecutor-495-thread-1) [    ] o.a.s.c.SolrCore Using default statsCache cache: org.apache.solr.search.stats.LocalStatsCache
   [junit4]   2> 150294 INFO  (coreLoadExecutor-495-thread-1) [    ] o.a.s.u.CommitTracker Hard AutoCommit: disabled
   [junit4]   2> 150294 INFO  (coreLoadExecutor-495-thread-1) [    ] o.a.s.u.CommitTracker Soft AutoCommit: disabled
   [junit4]   2> 150294 INFO  (coreLoadExecutor-495-thread-1) [    ] o.a.s.u.RandomMergePolicy RandomMergePolicy wrapping class org.apache.lucene.index.TieredMergePolicy: [TieredMergePolicy: maxMergeAtOnce=26, maxMergeAtOnceExplicit=46, maxMergedSegmentMB=7.46875, floorSegmentMB=0.24609375, forceMergeDeletesPctAllowed=12.708931079609142, segmentsPerTier=47.0, maxCFSSegmentSizeMB=8.796093022207999E12, noCFSRatio=0.8819188765567367
   [junit4]   2> 150294 INFO  (coreLoadExecutor-495-thread-1) [    ] o.a.s.c.SolrDeletionPolicy SolrDeletionPolicy.onInit: commits: num=1
   [junit4]   2> 	commit{dir=MockDirectoryWrapper(RAMDirectory@534b05d1 lockFactory=org.apache.lucene.store.SingleInstanceLockFactory@737c8ea4),segFN=segments_1,generation=1}
   [junit4]   2> 150294 INFO  (coreLoadExecutor-495-thread-1) [    ] o.a.s.c.SolrDeletionPolicy newest commit generation = 1
   [junit4]   2> 150294 INFO  (coreLoadExecutor-495-thread-1) [    ] o.a.s.s.SolrIndexSearcher Opening Searcher@62e322f8[collection1] main
   [junit4]   2> 150294 INFO  (coreLoadExecutor-495-thread-1) [    ] o.a.s.r.ManagedResourceStorage File-based storage initialized to use dir: /home/jenkins/workspace/Lucene-Solr-5.x-Linux/solr/build/solr-core/test/J0/temp/solr.handler.TestReplicationHandler_3FB87A43D8500100-001/solr-instance-003/collection1/conf
   [junit4]   2> 150294 INFO  (coreLoadExecutor-495-thread-1) [    ] o.a.s.r.RestManager Initializing RestManager with initArgs: {storageDir=/home/jenkins/workspace/Lucene-Solr-5.x-Linux/solr/build/solr-core/test/J0/temp/solr.handler.TestReplicationHandler_3FB87A43D8500100-001/solr-instance-003/collection1/conf}
   [junit4]   2> 150294 INFO  (coreLoadExecutor-495-thread-1) [    ] o.a.s.r.ManagedResourceStorage Reading _rest_managed.json using file:dir=/home/jenkins/workspace/Lucene-Solr-5.x-Linux/solr/build/solr-core/test/J0/temp/solr.handler.TestReplicationHandler_3FB87A43D8500100-001/solr-instance-003/collection1/conf
   [junit4]   2> 150295 INFO  (coreLoadExecutor-495-thread-1) [    ] o.a.s.r.RestManager Initializing 0 registered ManagedResources
   [junit4]   2> 150295 WARN  (coreLoadExecutor-495-thread-1) [    ] o.a.s.h.IndexFetcher 'masterUrl' must be specified without the /replication suffix
   [junit4]   2> 150296 INFO  (coreLoadExecutor-495-thread-1) [    ] o.a.s.h.ReplicationHandler  No value set for 'pollInterval'. Timer Task not started.
   [junit4]   2> 150296 INFO  (coreLoadExecutor-495-thread-1) [    ] o.a.s.h.ReplicationHandler Replication enabled for following config files: schema.xml
   [junit4]   2> 150296 INFO  (coreLoadExecutor-495-thread-1) [    ] o.a.s.h.ReplicationHandler Commits will be reserved for  10000
   [junit4]   2> 150296 INFO  (searcherExecutor-496-thread-1) [    ] o.a.s.c.SolrCore [collection1] Registered new searcher Searcher@62e322f8[collection1] main{ExitableDirectoryReader(UninvertingDirectoryReader())}
   [junit4]   2> 150296 INFO  (coreLoadExecutor-495-thread-1) [    ] o.a.s.c.CoreContainer registering core: collection1
   [junit4]   2> 150592 INFO  (qtp829410491-1370) [    ] o.a.s.c.S.Request [collection1]  webapp=/solr path=/replication params={qt=/replication&wt=javabin&version=2&command=indexversion} status=0 QTime=0
   [junit4]   2> 150593 INFO  (indexFetcher-486-thread-1) [    ] o.a.s.h.IndexFetcher Slave in sync with master.
   [junit4]   2> 150756 WARN  (qtp1363812972-1416) [    ] o.a.s.h.ReplicationHandler Exception while invoking 'details' method for replication on master 
   [junit4]   2> org.apache.solr.client.solrj.impl.HttpSolrClient$RemoteSolrException: Error from server at http://127.0.0.1:54247/solr: Expected mime type application/octet-stream but got text/html. <html>
   [junit4]   2> <head>
   [junit4]   2> <meta http-equiv="Content-Type" content="text/html;charset=ISO-8859-1"/>
   [junit4]   2> <title>Error 404 </title>
   [junit4]   2> </head>
   [junit4]   2> <body>
   [junit4]   2> <h2>HTTP ERROR: 404</h2>
   [junit4]   2> <p>Problem accessing /solr/replication. Reason:
   [junit4]   2> <pre>    Can not find: /solr/replication</pre></p>
   [junit4]   2> <hr /><i><small>Powered by Jetty://</small></i>
   [junit4]   2> </body>
   [junit4]   2> </html>
   [junit4]   2> 
   [junit4]   2> 	at org.apache.solr.client.solrj.impl.HttpSolrClient.executeMethod(HttpSolrClient.java:543)
   [junit4]   2> 	at org.apache.solr.client.solrj.impl.HttpSolrClient.request(HttpSolrClient.java:241)
   [junit4]   2> 	at org.apache.solr.client.solrj.impl.HttpSolrClient.request(HttpSolrClient.java:230)
   [junit4]   2> 	at org.apache.solr.client.solrj.SolrClient.request(SolrClient.java:1220)
   [junit4]   2> 	at org.apache.solr.handler.IndexFetcher.getDetails(IndexFetcher.java:1588)
   [junit4]   2> 	at org.apache.solr.handler.ReplicationHandler.getReplicationDetails(ReplicationHandler.java:831)
   [junit4]   2> 	at org.apache.solr.handler.ReplicationHandler.handleRequestBody(ReplicationHandler.java:310)
   [junit4]   2> 	at org.apache.solr.handler.RequestHandlerBase.handleRequest(RequestHandlerBase.java:156)
   [junit4]   2> 	at org.apache.solr.core.SolrCore.execute(SolrCore.java:2062)
   [junit4]   2> 	at org.apache.solr.servlet.HttpSolrCall.execute(HttpSolrCall.java:658)
   [junit4]   2> 	at org.apache.solr.servlet.HttpSolrCall.call(HttpSolrCall.java:457)
   [junit4]   2> 	at org.apache.solr.servlet.SolrDispatchFilter.doFilter(SolrDispatchFilter.java:226)
   [junit4]   2> 	at org.apache.solr.servlet.SolrDispatchFilter.doFilter(SolrDispatchFilter.java:184)
   [junit4]   2> 	at org.eclipse.jetty.servlet.ServletHandler$CachedChain.doFilter(ServletHandler.java:1652)
   [junit4]   2> 	at org.apache.solr.client.solrj.embedded.JettySolrRunner$DebugFilter.doFilter(JettySolrRunner.java:110)
   [junit4]   2> 	at org.eclipse.jetty.servlet.ServletHandler$CachedChain.doFilter(ServletHandler.java:1652)
   [junit4]   2> 	at org.eclipse.jetty.servlets.UserAgentFilter.doFilter(UserAgentFilter.java:83)
   [junit4]   2> 	at org.eclipse.jetty.servlets.GzipFilter.doFilter(GzipFilter.java:364)
   [junit4]   2> 	at org.eclipse.jetty.servlet.ServletHandler$CachedChain.doFilter(ServletHandler.java:1652)
   [junit4]   2> 	at org.eclipse.jetty.servlet.ServletHandler.doHandle(ServletHandler.java:585)
   [junit4]   2>

[...truncated too long message...]

ryFactory Closing directory: /home/jenkins/workspace/Lucene-Solr-5.x-Linux/solr/build/solr-core/test/J0/temp/solr.handler.TestReplicationHandler_3FB87A43D8500100-001/solr-instance-027/./collection1/data
   [junit4]   2> 245166 INFO  (TEST-TestReplicationHandler.doTestIndexAndConfigAliasReplication-seed#[3FB87A43D8500100]) [    ] o.a.s.c.CachingDirectoryFactory looking to close /home/jenkins/workspace/Lucene-Solr-5.x-Linux/solr/build/solr-core/test/J0/temp/solr.handler.TestReplicationHandler_3FB87A43D8500100-001/solr-instance-027/./collection1/data/index [CachedDir<<refCount=0;path=/home/jenkins/workspace/Lucene-Solr-5.x-Linux/solr/build/solr-core/test/J0/temp/solr.handler.TestReplicationHandler_3FB87A43D8500100-001/solr-instance-027/./collection1/data/index;done=false>>]
   [junit4]   2> 245166 INFO  (TEST-TestReplicationHandler.doTestIndexAndConfigAliasReplication-seed#[3FB87A43D8500100]) [    ] o.a.s.c.CachingDirectoryFactory Closing directory: /home/jenkins/workspace/Lucene-Solr-5.x-Linux/solr/build/solr-core/test/J0/temp/solr.handler.TestReplicationHandler_3FB87A43D8500100-001/solr-instance-027/./collection1/data/index
   [junit4]   2> 245167 INFO  (TEST-TestReplicationHandler.doTestIndexAndConfigAliasReplication-seed#[3FB87A43D8500100]) [    ] o.e.j.s.h.ContextHandler Stopped o.e.j.s.ServletContextHandler@4c78ff39{/solr,null,UNAVAILABLE}
   [junit4]   2> 245167 INFO  (TEST-TestReplicationHandler.doTestIndexAndConfigAliasReplication-seed#[3FB87A43D8500100]) [    ] o.e.j.s.ServerConnector Stopped ServerConnector@45e1a8bd{HTTP/1.1}{127.0.0.1:0}
   [junit4]   2> 245167 INFO  (TEST-TestReplicationHandler.doTestIndexAndConfigAliasReplication-seed#[3FB87A43D8500100]) [    ] o.a.s.c.CoreContainer Shutting down CoreContainer instance=2100882875
   [junit4]   2> 245167 INFO  (TEST-TestReplicationHandler.doTestIndexAndConfigAliasReplication-seed#[3FB87A43D8500100]) [    ] o.a.s.c.SolrCore [collection1]  CLOSING SolrCore org.apache.solr.core.SolrCore@41229fb5
   [junit4]   2> 245168 INFO  (TEST-TestReplicationHandler.doTestIndexAndConfigAliasReplication-seed#[3FB87A43D8500100]) [    ] o.a.s.u.DirectUpdateHandler2 closing DirectUpdateHandler2{commits=1,autocommits=0,soft autocommits=0,optimizes=0,rollbacks=0,expungeDeletes=0,docsPending=0,adds=0,deletesById=0,deletesByQuery=0,errors=0,cumulative_adds=1,cumulative_deletesById=0,cumulative_deletesByQuery=0,cumulative_errors=0}
   [junit4]   2> 245168 INFO  (TEST-TestReplicationHandler.doTestIndexAndConfigAliasReplication-seed#[3FB87A43D8500100]) [    ] o.a.s.u.SolrCoreState Closing SolrCoreState
   [junit4]   2> 245168 INFO  (TEST-TestReplicationHandler.doTestIndexAndConfigAliasReplication-seed#[3FB87A43D8500100]) [    ] o.a.s.u.DefaultSolrCoreState SolrCoreState ref count has reached 0 - closing IndexWriter
   [junit4]   2> 245168 INFO  (TEST-TestReplicationHandler.doTestIndexAndConfigAliasReplication-seed#[3FB87A43D8500100]) [    ] o.a.s.u.DefaultSolrCoreState closing IndexWriter with IndexWriterCloser
   [junit4]   2> 245169 INFO  (TEST-TestReplicationHandler.doTestIndexAndConfigAliasReplication-seed#[3FB87A43D8500100]) [    ] o.a.s.c.SolrCore [collection1] Closing main searcher on request.
   [junit4]   2> 245169 INFO  (TEST-TestReplicationHandler.doTestIndexAndConfigAliasReplication-seed#[3FB87A43D8500100]) [    ] o.a.s.c.CachingDirectoryFactory Closing MockDirectoryFactory - 2 directories currently being tracked
   [junit4]   2> 245169 INFO  (TEST-TestReplicationHandler.doTestIndexAndConfigAliasReplication-seed#[3FB87A43D8500100]) [    ] o.a.s.c.CachingDirectoryFactory looking to close /home/jenkins/workspace/Lucene-Solr-5.x-Linux/solr/build/solr-core/test/J0/temp/solr.handler.TestReplicationHandler_3FB87A43D8500100-001/solr-instance-028/./collection1/data [CachedDir<<refCount=0;path=/home/jenkins/workspace/Lucene-Solr-5.x-Linux/solr/build/solr-core/test/J0/temp/solr.handler.TestReplicationHandler_3FB87A43D8500100-001/solr-instance-028/./collection1/data;done=false>>]
   [junit4]   2> 245169 INFO  (TEST-TestReplicationHandler.doTestIndexAndConfigAliasReplication-seed#[3FB87A43D8500100]) [    ] o.a.s.c.CachingDirectoryFactory Closing directory: /home/jenkins/workspace/Lucene-Solr-5.x-Linux/solr/build/solr-core/test/J0/temp/solr.handler.TestReplicationHandler_3FB87A43D8500100-001/solr-instance-028/./collection1/data
   [junit4]   2> 245169 INFO  (TEST-TestReplicationHandler.doTestIndexAndConfigAliasReplication-seed#[3FB87A43D8500100]) [    ] o.a.s.c.CachingDirectoryFactory looking to close /home/jenkins/workspace/Lucene-Solr-5.x-Linux/solr/build/solr-core/test/J0/temp/solr.handler.TestReplicationHandler_3FB87A43D8500100-001/solr-instance-028/./collection1/data/index.20160110150901272 [CachedDir<<refCount=0;path=/home/jenkins/workspace/Lucene-Solr-5.x-Linux/solr/build/solr-core/test/J0/temp/solr.handler.TestReplicationHandler_3FB87A43D8500100-001/solr-instance-028/./collection1/data/index.20160110150901272;done=false>>]
   [junit4]   2> 245169 INFO  (TEST-TestReplicationHandler.doTestIndexAndConfigAliasReplication-seed#[3FB87A43D8500100]) [    ] o.a.s.c.CachingDirectoryFactory Closing directory: /home/jenkins/workspace/Lucene-Solr-5.x-Linux/solr/build/solr-core/test/J0/temp/solr.handler.TestReplicationHandler_3FB87A43D8500100-001/solr-instance-028/./collection1/data/index.20160110150901272
   [junit4]   2> 245169 INFO  (TEST-TestReplicationHandler.doTestIndexAndConfigAliasReplication-seed#[3FB87A43D8500100]) [    ] o.e.j.s.h.ContextHandler Stopped o.e.j.s.ServletContextHandler@1a6e97f0{/solr,null,UNAVAILABLE}
   [junit4]   2> 245171 INFO  (SUITE-TestReplicationHandler-seed#[3FB87A43D8500100]-worker) [    ] o.a.s.SolrTestCaseJ4 ###deleteCore
   [junit4]   2> ObjectTracker found 2 object(s) that were not released!!! [NRTCachingDirectory, NRTCachingDirectory]
   [junit4]   2> org.apache.solr.common.util.ObjectReleaseTracker$ObjectTrackerException
   [junit4]   2> 	at org.apache.solr.common.util.ObjectReleaseTracker.track(ObjectReleaseTracker.java:43)
   [junit4]   2> 	at org.apache.solr.core.CachingDirectoryFactory.get(CachingDirectoryFactory.java:352)
   [junit4]   2> 	at org.apache.solr.handler.IndexFetcher.fetchLatestIndex(IndexFetcher.java:368)
   [junit4]   2> 	at org.apache.solr.handler.IndexFetcher.fetchLatestIndex(IndexFetcher.java:258)
   [junit4]   2> 	at org.apache.solr.handler.ReplicationHandler.doFetch(ReplicationHandler.java:385)
   [junit4]   2> 	at org.apache.solr.handler.ReplicationHandler$1.run(ReplicationHandler.java:273)
   [junit4]   2> 
   [junit4]   2> org.apache.solr.common.util.ObjectReleaseTracker$ObjectTrackerException
   [junit4]   2> 	at org.apache.solr.common.util.ObjectReleaseTracker.track(ObjectReleaseTracker.java:43)
   [junit4]   2> 	at org.apache.solr.core.CachingDirectoryFactory.get(CachingDirectoryFactory.java:352)
   [junit4]   2> 	at org.apache.solr.handler.IndexFetcher.fetchLatestIndex(IndexFetcher.java:368)
   [junit4]   2> 	at org.apache.solr.handler.IndexFetcher.fetchLatestIndex(IndexFetcher.java:258)
   [junit4]   2> 	at org.apache.solr.handler.ReplicationHandler.doFetch(ReplicationHandler.java:385)
   [junit4]   2> 	at org.apache.solr.handler.ReplicationHandler$1.run(ReplicationHandler.java:273)
   [junit4]   2> 
   [junit4]   2> NOTE: test params are: codec=Asserting(Lucene54): {name=PostingsFormat(name=Memory doPackFST= false), id=PostingsFormat(name=Memory doPackFST= false), newname=PostingsFormat(name=Memory doPackFST= false)}, docValues:{}, sim=DefaultSimilarity, locale=es_PY, timezone=Indian/Antananarivo
   [junit4]   2> NOTE: Linux 3.19.0-42-generic amd64/Oracle Corporation 9-ea (64-bit)/cpus=12,threads=1,free=408911128,total=509018112
   [junit4]   2> NOTE: All tests run in this JVM: [ConfigSetsAPITest, TestDistribIDF, CloudExitableDirectoryReaderTest, TestSerializedLuceneMatchVersion, TestReplicaProperties, DeleteInactiveReplicaTest, TestCloudInspectUtil, TestIBSimilarityFactory, TestReplicationHandler]
   [junit4]   2> NOTE: reproduce with: ant test  -Dtestcase=TestReplicationHandler -Dtests.seed=3FB87A43D8500100 -Dtests.multiplier=3 -Dtests.slow=true -Dtests.locale=es_PY -Dtests.timezone=Indian/Antananarivo -Dtests.asserts=true -Dtests.file.encoding=US-ASCII
   [junit4] ERROR   0.00s J0 | TestReplicationHandler (suite) <<<
   [junit4]    > Throwable #1: java.lang.AssertionError: ObjectTracker found 2 object(s) that were not released!!! [NRTCachingDirectory, NRTCachingDirectory]
   [junit4]    > 	at __randomizedtesting.SeedInfo.seed([3FB87A43D8500100]:0)
   [junit4]    > 	at org.apache.solr.SolrTestCaseJ4.afterClass(SolrTestCaseJ4.java:228)
   [junit4]    > 	at java.lang.Thread.run(Thread.java:747)
   [junit4] Completed [43/563 (1!)] on J0 in 96.24s, 13 tests, 1 failure <<< FAILURES!

[...truncated 1639 lines...]
BUILD FAILED
/home/jenkins/workspace/Lucene-Solr-5.x-Linux/build.xml:794: The following error occurred while executing this line:
/home/jenkins/workspace/Lucene-Solr-5.x-Linux/build.xml:738: The following error occurred while executing this line:
/home/jenkins/workspace/Lucene-Solr-5.x-Linux/build.xml:59: The following error occurred while executing this line:
/home/jenkins/workspace/Lucene-Solr-5.x-Linux/solr/build.xml:233: The following error occurred while executing this line:
/home/jenkins/workspace/Lucene-Solr-5.x-Linux/solr/common-build.xml:526: The following error occurred while executing this line:
/home/jenkins/workspace/Lucene-Solr-5.x-Linux/lucene/common-build.xml:1444: The following error occurred while executing this line:
/home/jenkins/workspace/Lucene-Solr-5.x-Linux/lucene/common-build.xml:1000: There were test failures: 563 suites (7 ignored), 2236 tests, 1 suite-level error, 84 ignored (39 assumptions) [seed: 3FB87A43D8500100]

Total time: 48 minutes 16 seconds
Build step 'Invoke Ant' marked build as failure
Archiving artifacts
[WARNINGS] Skipping publisher since build result is FAILURE
Recording test results
Email was triggered for: Failure - Any
Sending email for trigger: Failure - Any



Mime
View raw message