lucene-dev mailing list archives

Site index · List index
Message view « Date » · « Thread »
Top « Date » · « Thread »
From Apache Jenkins Server <jenk...@builds.apache.org>
Subject [JENKINS] Lucene-Solr-NightlyTests-trunk - Build # 915 - Still Failing
Date Wed, 20 Jan 2016 17:36:40 GMT
Build: https://builds.apache.org/job/Lucene-Solr-NightlyTests-trunk/915/

2 tests failed.
FAILED:  org.apache.lucene.index.TestIndexWriterDelete.testUpdatesOnDiskFull

Error Message:
Test abandoned because suite timeout was reached.

Stack Trace:
java.lang.Exception: Test abandoned because suite timeout was reached.
	at __randomizedtesting.SeedInfo.seed([428829B40B50F31F]:0)


FAILED:  junit.framework.TestSuite.org.apache.lucene.index.TestIndexWriterDelete

Error Message:
Suite timeout exceeded (>= 7200000 msec).

Stack Trace:
java.lang.Exception: Suite timeout exceeded (>= 7200000 msec).
	at __randomizedtesting.SeedInfo.seed([428829B40B50F31F]:0)




Build Log:
[...truncated 1797 lines...]
   [junit4] Suite: org.apache.lucene.index.TestIndexWriterDelete
   [junit4]   2> jan 20, 2016 9:31:09 PM com.carrotsearch.randomizedtesting.ThreadLeakControl$2
evaluate
   [junit4]   2> WARNING: Suite execution timed out: org.apache.lucene.index.TestIndexWriterDelete
   [junit4]   2>    1) Thread[id=1, name=main, state=WAITING, group=main]
   [junit4]   2>         at java.lang.Object.wait(Native Method)
   [junit4]   2>         at java.lang.Thread.join(Thread.java:1245)
   [junit4]   2>         at java.lang.Thread.join(Thread.java:1319)
   [junit4]   2>         at com.carrotsearch.randomizedtesting.RandomizedRunner.runSuite(RandomizedRunner.java:601)
   [junit4]   2>         at com.carrotsearch.randomizedtesting.RandomizedRunner.run(RandomizedRunner.java:450)
   [junit4]   2>         at com.carrotsearch.ant.tasks.junit4.slave.SlaveMain.execute(SlaveMain.java:243)
   [junit4]   2>         at com.carrotsearch.ant.tasks.junit4.slave.SlaveMain.main(SlaveMain.java:354)
   [junit4]   2>         at com.carrotsearch.ant.tasks.junit4.slave.SlaveMainSafe.main(SlaveMainSafe.java:10)
   [junit4]   2>    2) Thread[id=835, name=TEST-TestIndexWriterDelete.testUpdatesOnDiskFull-seed#[428829B40B50F31F],
state=TIMED_WAITING, group=TGRP-TestIndexWriterDelete]
   [junit4]   2>         at org.apache.lucene.search.Weight$DefaultBulkScorer.scoreAll(Weight.java:219)
   [junit4]   2>         at org.apache.lucene.search.Weight$DefaultBulkScorer.score(Weight.java:172)
   [junit4]   2>         at org.apache.lucene.search.BulkScorer.score(BulkScorer.java:39)
   [junit4]   2>         at org.apache.lucene.search.AssertingBulkScorer.score(AssertingBulkScorer.java:70)
   [junit4]   2>         at org.apache.lucene.search.IndexSearcher.search(IndexSearcher.java:669)
   [junit4]   2>         at org.apache.lucene.search.AssertingIndexSearcher.search(AssertingIndexSearcher.java:92)
   [junit4]   2>         at org.apache.lucene.search.IndexSearcher.search(IndexSearcher.java:473)
   [junit4]   2>         at org.apache.lucene.search.IndexSearcher.search(IndexSearcher.java:592)
   [junit4]   2>         at org.apache.lucene.search.IndexSearcher.searchAfter(IndexSearcher.java:450)
   [junit4]   2>         at org.apache.lucene.search.IndexSearcher.search(IndexSearcher.java:461)
   [junit4]   2>         at org.apache.lucene.index.TestIndexWriterDelete.doTestOperationsOnDiskFull(TestIndexWriterDelete.java:664)
   [junit4]   2>         at org.apache.lucene.index.TestIndexWriterDelete.testUpdatesOnDiskFull(TestIndexWriterDelete.java:486)
   [junit4]   2>         at sun.reflect.NativeMethodAccessorImpl.invoke0(Native Method)
   [junit4]   2>         at sun.reflect.NativeMethodAccessorImpl.invoke(NativeMethodAccessorImpl.java:62)
   [junit4]   2>         at sun.reflect.DelegatingMethodAccessorImpl.invoke(DelegatingMethodAccessorImpl.java:43)
   [junit4]   2>         at java.lang.reflect.Method.invoke(Method.java:497)
   [junit4]   2>         at com.carrotsearch.randomizedtesting.RandomizedRunner.invoke(RandomizedRunner.java:1764)
   [junit4]   2>         at com.carrotsearch.randomizedtesting.RandomizedRunner$8.evaluate(RandomizedRunner.java:871)
   [junit4]   2>         at com.carrotsearch.randomizedtesting.RandomizedRunner$9.evaluate(RandomizedRunner.java:907)
   [junit4]   2>         at com.carrotsearch.randomizedtesting.RandomizedRunner$10.evaluate(RandomizedRunner.java:921)
   [junit4]   2>         at org.apache.lucene.util.TestRuleSetupTeardownChained$1.evaluate(TestRuleSetupTeardownChained.java:50)
   [junit4]   2>         at org.apache.lucene.util.AbstractBeforeAfterRule$1.evaluate(AbstractBeforeAfterRule.java:46)
   [junit4]   2>         at org.apache.lucene.util.TestRuleThreadAndTestName$1.evaluate(TestRuleThreadAndTestName.java:49)
   [junit4]   2>         at org.apache.lucene.util.TestRuleIgnoreAfterMaxFailures$1.evaluate(TestRuleIgnoreAfterMaxFailures.java:65)
   [junit4]   2>         at org.apache.lucene.util.TestRuleMarkFailure$1.evaluate(TestRuleMarkFailure.java:48)
   [junit4]   2>         at com.carrotsearch.randomizedtesting.rules.StatementAdapter.evaluate(StatementAdapter.java:36)
   [junit4]   2>         at com.carrotsearch.randomizedtesting.ThreadLeakControl$StatementRunner.run(ThreadLeakControl.java:367)
   [junit4]   2>         at com.carrotsearch.randomizedtesting.ThreadLeakControl.forkTimeoutingTask(ThreadLeakControl.java:809)
   [junit4]   2>         at com.carrotsearch.randomizedtesting.ThreadLeakControl$3.evaluate(ThreadLeakControl.java:460)
   [junit4]   2>         at com.carrotsearch.randomizedtesting.RandomizedRunner.runSingleTest(RandomizedRunner.java:880)
   [junit4]   2>         at com.carrotsearch.randomizedtesting.RandomizedRunner$5.evaluate(RandomizedRunner.java:781)
   [junit4]   2>         at com.carrotsearch.randomizedtesting.RandomizedRunner$6.evaluate(RandomizedRunner.java:816)
   [junit4]   2>         at com.carrotsearch.randomizedtesting.RandomizedRunner$7.evaluate(RandomizedRunner.java:827)
   [junit4]   2>         at org.apache.lucene.util.AbstractBeforeAfterRule$1.evaluate(AbstractBeforeAfterRule.java:46)
   [junit4]   2>         at com.carrotsearch.randomizedtesting.rules.StatementAdapter.evaluate(StatementAdapter.java:36)
   [junit4]   2>         at org.apache.lucene.util.TestRuleStoreClassName$1.evaluate(TestRuleStoreClassName.java:42)
   [junit4]   2>         at com.carrotsearch.randomizedtesting.rules.NoShadowingOrOverridesOnMethodsRule$1.evaluate(NoShadowingOrOverridesOnMethodsRule.java:40)
   [junit4]   2>         at com.carrotsearch.randomizedtesting.rules.NoShadowingOrOverridesOnMethodsRule$1.evaluate(NoShadowingOrOverridesOnMethodsRule.java:40)
   [junit4]   2>         at com.carrotsearch.randomizedtesting.rules.StatementAdapter.evaluate(StatementAdapter.java:36)
   [junit4]   2>         at com.carrotsearch.randomizedtesting.rules.StatementAdapter.evaluate(StatementAdapter.java:36)
   [junit4]   2>         at com.carrotsearch.randomizedtesting.rules.StatementAdapter.evaluate(StatementAdapter.java:36)
   [junit4]   2>         at org.apache.lucene.util.TestRuleAssertionsRequired$1.evaluate(TestRuleAssertionsRequired.java:54)
   [junit4]   2>         at org.apache.lucene.util.TestRuleMarkFailure$1.evaluate(TestRuleMarkFailure.java:48)
   [junit4]   2>         at org.apache.lucene.util.TestRuleIgnoreAfterMaxFailures$1.evaluate(TestRuleIgnoreAfterMaxFailures.java:65)
   [junit4]   2>         at org.apache.lucene.util.TestRuleIgnoreTestSuites$1.evaluate(TestRuleIgnoreTestSuites.java:55)
   [junit4]   2>         at com.carrotsearch.randomizedtesting.rules.StatementAdapter.evaluate(StatementAdapter.java:36)
   [junit4]   2>         at com.carrotsearch.randomizedtesting.ThreadLeakControl$StatementRunner.run(ThreadLeakControl.java:367)
   [junit4]   2>         at java.lang.Thread.run(Thread.java:745)
   [junit4]   2>    3) Thread[id=9, name=JUnit4-serializer-daemon, state=TIMED_WAITING,
group=main]
   [junit4]   2>         at java.lang.Thread.sleep(Native Method)
   [junit4]   2>         at com.carrotsearch.ant.tasks.junit4.events.Serializer$1.run(Serializer.java:47)
   [junit4]   2>    4) Thread[id=834, name=SUITE-TestIndexWriterDelete-seed#[428829B40B50F31F],
state=RUNNABLE, group=TGRP-TestIndexWriterDelete]
   [junit4]   2>         at java.lang.Thread.getStackTrace(Thread.java:1552)
   [junit4]   2>         at com.carrotsearch.randomizedtesting.ThreadLeakControl$4.run(ThreadLeakControl.java:688)
   [junit4]   2>         at com.carrotsearch.randomizedtesting.ThreadLeakControl$4.run(ThreadLeakControl.java:685)
   [junit4]   2>         at java.security.AccessController.doPrivileged(Native Method)
   [junit4]   2>         at com.carrotsearch.randomizedtesting.ThreadLeakControl.getStackTrace(ThreadLeakControl.java:685)
   [junit4]   2>         at com.carrotsearch.randomizedtesting.ThreadLeakControl.getThreadsWithTraces(ThreadLeakControl.java:701)
   [junit4]   2>         at com.carrotsearch.randomizedtesting.ThreadLeakControl.formatThreadStacksFull(ThreadLeakControl.java:681)
   [junit4]   2>         at com.carrotsearch.randomizedtesting.ThreadLeakControl.access$1000(ThreadLeakControl.java:64)
   [junit4]   2>         at com.carrotsearch.randomizedtesting.ThreadLeakControl$2.evaluate(ThreadLeakControl.java:414)
   [junit4]   2>         at com.carrotsearch.randomizedtesting.RandomizedRunner.runSuite(RandomizedRunner.java:681)
   [junit4]   2>         at com.carrotsearch.randomizedtesting.RandomizedRunner.access$200(RandomizedRunner.java:140)
   [junit4]   2>         at com.carrotsearch.randomizedtesting.RandomizedRunner$2.run(RandomizedRunner.java:591)
   [junit4]   2> NOTE: download the large Jenkins line-docs file by running 'ant get-jenkins-line-docs'
in the lucene directory.
   [junit4]   2> NOTE: reproduce with: ant test  -Dtestcase=TestIndexWriterDelete -Dtests.method=testUpdatesOnDiskFull
-Dtests.seed=428829B40B50F31F -Dtests.multiplier=2 -Dtests.nightly=true -Dtests.slow=true
-Dtests.linedocsfile=/x1/jenkins/lucene-data/enwiki.random.lines.txt -Dtests.locale=nl-BE
-Dtests.timezone=Etc/GMT-4 -Dtests.asserts=true -Dtests.file.encoding=ISO-8859-1
   [junit4] ERROR   7162s J0 | TestIndexWriterDelete.testUpdatesOnDiskFull <<<
   [junit4]    > Throwable #1: java.lang.Exception: Test abandoned because suite timeout
was reached.
   [junit4]    > 	at __randomizedtesting.SeedInfo.seed([428829B40B50F31F]:0)
   [junit4]   2> jan 20, 2016 9:31:09 PM com.carrotsearch.randomizedtesting.ThreadLeakControl
checkThreadLeaks
   [junit4]   2> WARNING: Will linger awaiting termination of 1 leaked thread(s).
   [junit4]   2> jan 20, 2016 9:31:29 PM com.carrotsearch.randomizedtesting.ThreadLeakControl
checkThreadLeaks
   [junit4]   2> SEVERE: 1 thread leaked from SUITE scope at org.apache.lucene.index.TestIndexWriterDelete:

   [junit4]   2>    1) Thread[id=835, name=TEST-TestIndexWriterDelete.testUpdatesOnDiskFull-seed#[428829B40B50F31F],
state=TIMED_WAITING, group=TGRP-TestIndexWriterDelete]
   [junit4]   2>         at java.lang.Thread.sleep(Native Method)
   [junit4]   2>         at org.apache.lucene.store.SlowClosingMockIndexInputWrapper.close(SlowClosingMockIndexInputWrapper.java:40)
   [junit4]   2>         at org.apache.lucene.index.IndexWriter.slowFileExists(IndexWriter.java:4773)
   [junit4]   2>         at org.apache.lucene.index.IndexWriter.filesExist(IndexWriter.java:4314)
   [junit4]   2>         at org.apache.lucene.index.IndexWriter.<init>(IndexWriter.java:941)
   [junit4]   2>         at org.apache.lucene.index.TestIndexWriterDelete.doTestOperationsOnDiskFull(TestIndexWriterDelete.java:536)
   [junit4]   2>         at org.apache.lucene.index.TestIndexWriterDelete.testUpdatesOnDiskFull(TestIndexWriterDelete.java:486)
   [junit4]   2>         at sun.reflect.NativeMethodAccessorImpl.invoke0(Native Method)
   [junit4]   2>         at sun.reflect.NativeMethodAccessorImpl.invoke(NativeMethodAccessorImpl.java:62)
   [junit4]   2>         at sun.reflect.DelegatingMethodAccessorImpl.invoke(DelegatingMethodAccessorImpl.java:43)
   [junit4]   2>         at java.lang.reflect.Method.invoke(Method.java:497)
   [junit4]   2>         at com.carrotsearch.randomizedtesting.RandomizedRunner.invoke(RandomizedRunner.java:1764)
   [junit4]   2>         at com.carrotsearch.randomizedtesting.RandomizedRunner$8.evaluate(RandomizedRunner.java:871)
   [junit4]   2>         at com.carrotsearch.randomizedtesting.RandomizedRunner$9.evaluate(RandomizedRunner.java:907)
   [junit4]   2>         at com.carrotsearch.randomizedtesting.RandomizedRunner$10.evaluate(RandomizedRunner.java:921)
   [junit4]   2>         at org.apache.lucene.util.TestRuleSetupTeardownChained$1.evaluate(TestRuleSetupTeardownChained.java:50)
   [junit4]   2>         at org.apache.lucene.util.AbstractBeforeAfterRule$1.evaluate(AbstractBeforeAfterRule.java:46)
   [junit4]   2>         at org.apache.lucene.util.TestRuleThreadAndTestName$1.evaluate(TestRuleThreadAndTestName.java:49)
   [junit4]   2>         at org.apache.lucene.util.TestRuleIgnoreAfterMaxFailures$1.evaluate(TestRuleIgnoreAfterMaxFailures.java:65)
   [junit4]   2>         at org.apache.lucene.util.TestRuleMarkFailure$1.evaluate(TestRuleMarkFailure.java:48)
   [junit4]   2>         at com.carrotsearch.randomizedtesting.rules.StatementAdapter.evaluate(StatementAdapter.java:36)
   [junit4]   2>         at com.carrotsearch.randomizedtesting.ThreadLeakControl$StatementRunner.run(ThreadLeakControl.java:367)
   [junit4]   2>         at com.carrotsearch.randomizedtesting.ThreadLeakControl.forkTimeoutingTask(ThreadLeakControl.java:809)
   [junit4]   2>         at com.carrotsearch.randomizedtesting.ThreadLeakControl$3.evaluate(ThreadLeakControl.java:460)
   [junit4]   2>         at com.carrotsearch.randomizedtesting.RandomizedRunner.runSingleTest(RandomizedRunner.java:880)
   [junit4]   2>         at com.carrotsearch.randomizedtesting.RandomizedRunner$5.evaluate(RandomizedRunner.java:781)
   [junit4]   2>         at com.carrotsearch.randomizedtesting.RandomizedRunner$6.evaluate(RandomizedRunner.java:816)
   [junit4]   2>         at com.carrotsearch.randomizedtesting.RandomizedRunner$7.evaluate(RandomizedRunner.java:827)
   [junit4]   2>         at org.apache.lucene.util.AbstractBeforeAfterRule$1.evaluate(AbstractBeforeAfterRule.java:46)
   [junit4]   2>         at com.carrotsearch.randomizedtesting.rules.StatementAdapter.evaluate(StatementAdapter.java:36)
   [junit4]   2>         at org.apache.lucene.util.TestRuleStoreClassName$1.evaluate(TestRuleStoreClassName.java:42)
   [junit4]   2>         at com.carrotsearch.randomizedtesting.rules.NoShadowingOrOverridesOnMethodsRule$1.evaluate(NoShadowingOrOverridesOnMethodsRule.java:40)
   [junit4]   2>         at com.carrotsearch.randomizedtesting.rules.NoShadowingOrOverridesOnMethodsRule$1.evaluate(NoShadowingOrOverridesOnMethodsRule.java:40)
   [junit4]   2>         at com.carrotsearch.randomizedtesting.rules.StatementAdapter.evaluate(StatementAdapter.java:36)
   [junit4]   2>         at com.carrotsearch.randomizedtesting.rules.StatementAdapter.evaluate(StatementAdapter.java:36)
   [junit4]   2>         at com.carrotsearch.randomizedtesting.rules.StatementAdapter.evaluate(StatementAdapter.java:36)
   [junit4]   2>         at org.apache.lucene.util.TestRuleAssertionsRequired$1.evaluate(TestRuleAssertionsRequired.java:54)
   [junit4]   2>         at org.apache.lucene.util.TestRuleMarkFailure$1.evaluate(TestRuleMarkFailure.java:48)
   [junit4]   2>         at org.apache.lucene.util.TestRuleIgnoreAfterMaxFailures$1.evaluate(TestRuleIgnoreAfterMaxFailures.java:65)
   [junit4]   2>         at org.apache.lucene.util.TestRuleIgnoreTestSuites$1.evaluate(TestRuleIgnoreTestSuites.java:55)
   [junit4]   2>         at com.carrotsearch.randomizedtesting.rules.StatementAdapter.evaluate(StatementAdapter.java:36)
   [junit4]   2>         at com.carrotsearch.randomizedtesting.ThreadLeakControl$StatementRunner.run(ThreadLeakControl.java:367)
   [junit4]   2>         at java.lang.Thread.run(Thread.java:745)
   [junit4]   2> jan 20, 2016 9:31:29 PM com.carrotsearch.randomizedtesting.ThreadLeakControl
tryToInterruptAll
   [junit4]   2> INFO: Starting to interrupt leaked threads:
   [junit4]   2>    1) Thread[id=835, name=TEST-TestIndexWriterDelete.testUpdatesOnDiskFull-seed#[428829B40B50F31F],
state=TIMED_WAITING, group=TGRP-TestIndexWriterDelete]
   [junit4]   2> NOTE: leaving temporary files on disk at: /x1/jenkins/jenkins-slave/workspace/Lucene-Solr-NightlyTests-trunk/lucene/build/core/test/J0/temp/lucene.index.TestIndexWriterDelete_428829B40B50F31F-001
   [junit4]   2> Jan 20, 2016 5:31:29 PM com.carrotsearch.randomizedtesting.ThreadLeakControl
tryToInterruptAll
   [junit4]   2> INFO: All leaked threads terminated.
   [junit4]   2> NOTE: test params are: codec=Asserting(Lucene60): {field=FST50, city=PostingsFormat(name=LuceneFixedGap),
contents=FST50, id=PostingsFormat(name=LuceneFixedGap), body=FST50, value=Lucene50(blocksize=128),
content=Lucene50(blocksize=128)}, docValues:{dv=DocValuesFormat(name=Direct)}, sim=RandomSimilarity(queryNorm=false,coord=no):
{contents=DFR I(ne)Z(0.3), city=DFR I(ne)B1, id=IB LL-DZ(0.3), body=DFR I(F)B2, content=DFR
I(F)B1}, locale=nl-BE, timezone=Etc/GMT-4
   [junit4]   2> NOTE: Linux 3.13.0-52-generic amd64/Oracle Corporation 1.8.0_66 (64-bit)/cpus=4,threads=1,free=50965920,total=258998272
   [junit4]   2> NOTE: All tests run in this JVM: [TestThreadedForceMerge, TestToken, TestSpanBoostQuery,
TestPerFieldPostingsFormat, TestTermRangeQuery, TestSpanNearQuery, TestMutableValues, TestQueryCachingPolicy,
TestManyFields, TestDoc, TestQueryBuilder, TestAutomatonQuery, TestOperations, TestBooleanMinShouldMatch,
TestSumDocFreq, TestIndexWriterMaxDocs, TestReaderWrapperDVTypeCheck, TestBlendedTermQuery,
TestFilterDirectory, TestTermVectors, TestTryDelete, TestNumericDocValuesUpdates, TestTrackingDirectoryWrapper,
TestNoMergePolicy, TestDeterminism, TestMultiPhraseEnum, TestForTooMuchCloning, TestDocValuesIndexing,
TestDeterminizeLexicon, TestTermsEnum, TestWeakIdentityMap, TestIndexWriterWithThreads, TestIndexWriterLockRelease,
TestTermdocPerf, TestByteBlockPool, TestCharsRef, TestPhraseQuery, TestBM25Similarity, TestIndexWriter,
TestStringHelper, TestTwoPhaseCommitTool, TestTermScorer, TestFieldValueQuery, TestMixedDocValuesUpdates,
TestBinaryDocValuesUpdates, TestMultiFields, TestSameTokenSamePosition, TestSizeBoundedForceMerge,
TestMultiDocValues, TestIndexWriterDelete]
   [junit4]   2> NOTE: download the large Jenkins line-docs file by running 'ant get-jenkins-line-docs'
in the lucene directory.
   [junit4]   2> NOTE: reproduce with: ant test  -Dtestcase=TestIndexWriterDelete -Dtests.seed=428829B40B50F31F
-Dtests.multiplier=2 -Dtests.nightly=true -Dtests.slow=true -Dtests.linedocsfile=/x1/jenkins/lucene-data/enwiki.random.lines.txt
-Dtests.locale=nl-BE -Dtests.timezone=Etc/GMT-4 -Dtests.asserts=true -Dtests.file.encoding=ISO-8859-1
   [junit4] ERROR   0.00s J0 | TestIndexWriterDelete (suite) <<<
   [junit4]    > Throwable #1: java.lang.Exception: Suite timeout exceeded (>= 7200000
msec).
   [junit4]    > 	at __randomizedtesting.SeedInfo.seed([428829B40B50F31F]:0)
   [junit4] Completed [389/406 (1!)] on J0 in 7220.22s, 20 tests, 2 errors <<< FAILURES!

[...truncated 68 lines...]
BUILD FAILED
/x1/jenkins/jenkins-slave/workspace/Lucene-Solr-NightlyTests-trunk/build.xml:791: The following
error occurred while executing this line:
/x1/jenkins/jenkins-slave/workspace/Lucene-Solr-NightlyTests-trunk/build.xml:728: The following
error occurred while executing this line:
/x1/jenkins/jenkins-slave/workspace/Lucene-Solr-NightlyTests-trunk/build.xml:59: The following
error occurred while executing this line:
/x1/jenkins/jenkins-slave/workspace/Lucene-Solr-NightlyTests-trunk/lucene/build.xml:50: The
following error occurred while executing this line:
/x1/jenkins/jenkins-slave/workspace/Lucene-Solr-NightlyTests-trunk/lucene/common-build.xml:1424:
The following error occurred while executing this line:
/x1/jenkins/jenkins-slave/workspace/Lucene-Solr-NightlyTests-trunk/lucene/common-build.xml:981:
There were test failures: 406 suites (1 ignored), 3322 tests, 1 suite-level error, 1 error,
29 ignored (25 assumptions) [seed: 428829B40B50F31F]

Total time: 142 minutes 24 seconds
Build step 'Invoke Ant' marked build as failure
Archiving artifacts
No prior successful build to compare, so performing full copy of artifacts
Recording test results
Email was triggered for: Failure - Any
Sending email for trigger: Failure - Any



Mime
View raw message