lucene-dev mailing list archives

Site index · List index
Message view « Date » · « Thread »
Top « Date » · « Thread »
From Policeman Jenkins Server <jenk...@thetaphi.de>
Subject [JENKINS] Lucene-Solr-5.x-Linux (64bit/jdk1.7.0_80) - Build # 15135 - Still Failing!
Date Mon, 04 Jan 2016 10:17:16 GMT
Build: http://jenkins.thetaphi.de/job/Lucene-Solr-5.x-Linux/15135/
Java: 64bit/jdk1.7.0_80 -XX:-UseCompressedOops -XX:+UseConcMarkSweepGC

5 tests failed.
FAILED:  org.apache.solr.cloud.BasicDistributedZk2Test.test

Error Message:
No live SolrServers available to handle this request:[http://127.0.0.1:50698/collection1, http://127.0.0.1:57370/collection1]

Stack Trace:
org.apache.solr.client.solrj.SolrServerException: No live SolrServers available to handle this request:[http://127.0.0.1:50698/collection1, http://127.0.0.1:57370/collection1]
	at __randomizedtesting.SeedInfo.seed([40885DE05505D283:C8DC623AFBF9BF7B]:0)
	at org.apache.solr.client.solrj.impl.LBHttpSolrClient.request(LBHttpSolrClient.java:352)
	at org.apache.solr.client.solrj.impl.CloudSolrClient.sendRequest(CloudSolrClient.java:1100)
	at org.apache.solr.client.solrj.impl.CloudSolrClient.requestWithRetryOnStaleState(CloudSolrClient.java:871)
	at org.apache.solr.client.solrj.impl.CloudSolrClient.request(CloudSolrClient.java:807)
	at org.apache.solr.client.solrj.SolrRequest.process(SolrRequest.java:150)
	at org.apache.solr.client.solrj.SolrClient.query(SolrClient.java:943)
	at org.apache.solr.client.solrj.SolrClient.query(SolrClient.java:958)
	at org.apache.solr.cloud.AbstractFullDistribZkTestBase.queryServer(AbstractFullDistribZkTestBase.java:1378)
	at org.apache.solr.BaseDistributedSearchTestCase.query(BaseDistributedSearchTestCase.java:610)
	at org.apache.solr.BaseDistributedSearchTestCase.query(BaseDistributedSearchTestCase.java:592)
	at org.apache.solr.BaseDistributedSearchTestCase.query(BaseDistributedSearchTestCase.java:571)
	at org.apache.solr.cloud.BasicDistributedZk2Test.brindDownShardIndexSomeDocsAndRecover(BasicDistributedZk2Test.java:280)
	at org.apache.solr.cloud.BasicDistributedZk2Test.test(BasicDistributedZk2Test.java:98)
	at sun.reflect.NativeMethodAccessorImpl.invoke0(Native Method)
	at sun.reflect.NativeMethodAccessorImpl.invoke(NativeMethodAccessorImpl.java:57)
	at sun.reflect.DelegatingMethodAccessorImpl.invoke(DelegatingMethodAccessorImpl.java:43)
	at java.lang.reflect.Method.invoke(Method.java:606)
	at com.carrotsearch.randomizedtesting.RandomizedRunner.invoke(RandomizedRunner.java:1764)
	at com.carrotsearch.randomizedtesting.RandomizedRunner$8.evaluate(RandomizedRunner.java:871)
	at com.carrotsearch.randomizedtesting.RandomizedRunner$9.evaluate(RandomizedRunner.java:907)
	at com.carrotsearch.randomizedtesting.RandomizedRunner$10.evaluate(RandomizedRunner.java:921)
	at org.apache.solr.BaseDistributedSearchTestCase$ShardsRepeatRule$ShardsFixedStatement.callStatement(BaseDistributedSearchTestCase.java:965)
	at org.apache.solr.BaseDistributedSearchTestCase$ShardsRepeatRule$ShardsStatement.evaluate(BaseDistributedSearchTestCase.java:940)
	at com.carrotsearch.randomizedtesting.rules.SystemPropertiesRestoreRule$1.evaluate(SystemPropertiesRestoreRule.java:57)
	at org.apache.lucene.util.TestRuleSetupTeardownChained$1.evaluate(TestRuleSetupTeardownChained.java:50)
	at org.apache.lucene.util.AbstractBeforeAfterRule$1.evaluate(AbstractBeforeAfterRule.java:46)
	at org.apache.lucene.util.TestRuleThreadAndTestName$1.evaluate(TestRuleThreadAndTestName.java:49)
	at org.apache.lucene.util.TestRuleIgnoreAfterMaxFailures$1.evaluate(TestRuleIgnoreAfterMaxFailures.java:65)
	at org.apache.lucene.util.TestRuleMarkFailure$1.evaluate(TestRuleMarkFailure.java:48)
	at com.carrotsearch.randomizedtesting.rules.StatementAdapter.evaluate(StatementAdapter.java:36)
	at com.carrotsearch.randomizedtesting.ThreadLeakControl$StatementRunner.run(ThreadLeakControl.java:367)
	at com.carrotsearch.randomizedtesting.ThreadLeakControl.forkTimeoutingTask(ThreadLeakControl.java:809)
	at com.carrotsearch.randomizedtesting.ThreadLeakControl$3.evaluate(ThreadLeakControl.java:460)
	at com.carrotsearch.randomizedtesting.RandomizedRunner.runSingleTest(RandomizedRunner.java:880)
	at com.carrotsearch.randomizedtesting.RandomizedRunner$5.evaluate(RandomizedRunner.java:781)
	at com.carrotsearch.randomizedtesting.RandomizedRunner$6.evaluate(RandomizedRunner.java:816)
	at com.carrotsearch.randomizedtesting.RandomizedRunner$7.evaluate(RandomizedRunner.java:827)
	at com.carrotsearch.randomizedtesting.rules.StatementAdapter.evaluate(StatementAdapter.java:36)
	at com.carrotsearch.randomizedtesting.rules.SystemPropertiesRestoreRule$1.evaluate(SystemPropertiesRestoreRule.java:57)
	at org.apache.lucene.util.AbstractBeforeAfterRule$1.evaluate(AbstractBeforeAfterRule.java:46)
	at com.carrotsearch.randomizedtesting.rules.StatementAdapter.evaluate(StatementAdapter.java:36)
	at org.apache.lucene.util.TestRuleStoreClassName$1.evaluate(TestRuleStoreClassName.java:42)
	at com.carrotsearch.randomizedtesting.rules.NoShadowingOrOverridesOnMethodsRule$1.evaluate(NoShadowingOrOverridesOnMethodsRule.java:40)
	at com.carrotsearch.randomizedtesting.rules.NoShadowingOrOverridesOnMethodsRule$1.evaluate(NoShadowingOrOverridesOnMethodsRule.java:40)
	at com.carrotsearch.randomizedtesting.rules.StatementAdapter.evaluate(StatementAdapter.java:36)
	at com.carrotsearch.randomizedtesting.rules.StatementAdapter.evaluate(StatementAdapter.java:36)
	at com.carrotsearch.randomizedtesting.rules.StatementAdapter.evaluate(StatementAdapter.java:36)
	at org.apache.lucene.util.TestRuleAssertionsRequired$1.evaluate(TestRuleAssertionsRequired.java:54)
	at org.apache.lucene.util.TestRuleMarkFailure$1.evaluate(TestRuleMarkFailure.java:48)
	at org.apache.lucene.util.TestRuleIgnoreAfterMaxFailures$1.evaluate(TestRuleIgnoreAfterMaxFailures.java:65)
	at org.apache.lucene.util.TestRuleIgnoreTestSuites$1.evaluate(TestRuleIgnoreTestSuites.java:55)
	at com.carrotsearch.randomizedtesting.rules.StatementAdapter.evaluate(StatementAdapter.java:36)
	at com.carrotsearch.randomizedtesting.ThreadLeakControl$StatementRunner.run(ThreadLeakControl.java:367)
	at java.lang.Thread.run(Thread.java:745)
Caused by: org.apache.solr.client.solrj.impl.HttpSolrClient$RemoteSolrException: Error from server at http://127.0.0.1:57370/collection1: no servers hosting shard: shard1
	at org.apache.solr.client.solrj.impl.HttpSolrClient.executeMethod(HttpSolrClient.java:575)
	at org.apache.solr.client.solrj.impl.HttpSolrClient.request(HttpSolrClient.java:241)
	at org.apache.solr.client.solrj.impl.HttpSolrClient.request(HttpSolrClient.java:230)
	at org.apache.solr.client.solrj.impl.LBHttpSolrClient.doRequest(LBHttpSolrClient.java:372)
	at org.apache.solr.client.solrj.impl.LBHttpSolrClient.request(LBHttpSolrClient.java:325)
	... 53 more


FAILED:  org.apache.solr.cloud.BasicDistributedZkTest.test

Error Message:
.response.numFound:1!=0

Stack Trace:
junit.framework.AssertionFailedError: .response.numFound:1!=0
	at __randomizedtesting.SeedInfo.seed([40885DE05505D283:C8DC623AFBF9BF7B]:0)
	at junit.framework.Assert.fail(Assert.java:50)
	at org.apache.solr.BaseDistributedSearchTestCase.compareSolrResponses(BaseDistributedSearchTestCase.java:893)
	at org.apache.solr.BaseDistributedSearchTestCase.compareResponses(BaseDistributedSearchTestCase.java:912)
	at org.apache.solr.BaseDistributedSearchTestCase.queryAndCompare(BaseDistributedSearchTestCase.java:655)
	at org.apache.solr.cloud.AbstractFullDistribZkTestBase.queryAndCompareReplicas(AbstractFullDistribZkTestBase.java:1042)
	at org.apache.solr.cloud.AbstractFullDistribZkTestBase.queryAndCompareShards(AbstractFullDistribZkTestBase.java:1059)
	at org.apache.solr.cloud.BasicDistributedZkTest.test(BasicDistributedZkTest.java:165)
	at sun.reflect.NativeMethodAccessorImpl.invoke0(Native Method)
	at sun.reflect.NativeMethodAccessorImpl.invoke(NativeMethodAccessorImpl.java:57)
	at sun.reflect.DelegatingMethodAccessorImpl.invoke(DelegatingMethodAccessorImpl.java:43)
	at java.lang.reflect.Method.invoke(Method.java:606)
	at com.carrotsearch.randomizedtesting.RandomizedRunner.invoke(RandomizedRunner.java:1764)
	at com.carrotsearch.randomizedtesting.RandomizedRunner$8.evaluate(RandomizedRunner.java:871)
	at com.carrotsearch.randomizedtesting.RandomizedRunner$9.evaluate(RandomizedRunner.java:907)
	at com.carrotsearch.randomizedtesting.RandomizedRunner$10.evaluate(RandomizedRunner.java:921)
	at org.apache.solr.BaseDistributedSearchTestCase$ShardsRepeatRule$ShardsFixedStatement.callStatement(BaseDistributedSearchTestCase.java:965)
	at org.apache.solr.BaseDistributedSearchTestCase$ShardsRepeatRule$ShardsStatement.evaluate(BaseDistributedSearchTestCase.java:940)
	at com.carrotsearch.randomizedtesting.rules.SystemPropertiesRestoreRule$1.evaluate(SystemPropertiesRestoreRule.java:57)
	at org.apache.lucene.util.TestRuleSetupTeardownChained$1.evaluate(TestRuleSetupTeardownChained.java:50)
	at org.apache.lucene.util.AbstractBeforeAfterRule$1.evaluate(AbstractBeforeAfterRule.java:46)
	at org.apache.lucene.util.TestRuleThreadAndTestName$1.evaluate(TestRuleThreadAndTestName.java:49)
	at org.apache.lucene.util.TestRuleIgnoreAfterMaxFailures$1.evaluate(TestRuleIgnoreAfterMaxFailures.java:65)
	at org.apache.lucene.util.TestRuleMarkFailure$1.evaluate(TestRuleMarkFailure.java:48)
	at com.carrotsearch.randomizedtesting.rules.StatementAdapter.evaluate(StatementAdapter.java:36)
	at com.carrotsearch.randomizedtesting.ThreadLeakControl$StatementRunner.run(ThreadLeakControl.java:367)
	at com.carrotsearch.randomizedtesting.ThreadLeakControl.forkTimeoutingTask(ThreadLeakControl.java:809)
	at com.carrotsearch.randomizedtesting.ThreadLeakControl$3.evaluate(ThreadLeakControl.java:460)
	at com.carrotsearch.randomizedtesting.RandomizedRunner.runSingleTest(RandomizedRunner.java:880)
	at com.carrotsearch.randomizedtesting.RandomizedRunner$5.evaluate(RandomizedRunner.java:781)
	at com.carrotsearch.randomizedtesting.RandomizedRunner$6.evaluate(RandomizedRunner.java:816)
	at com.carrotsearch.randomizedtesting.RandomizedRunner$7.evaluate(RandomizedRunner.java:827)
	at com.carrotsearch.randomizedtesting.rules.StatementAdapter.evaluate(StatementAdapter.java:36)
	at com.carrotsearch.randomizedtesting.rules.SystemPropertiesRestoreRule$1.evaluate(SystemPropertiesRestoreRule.java:57)
	at org.apache.lucene.util.AbstractBeforeAfterRule$1.evaluate(AbstractBeforeAfterRule.java:46)
	at com.carrotsearch.randomizedtesting.rules.StatementAdapter.evaluate(StatementAdapter.java:36)
	at org.apache.lucene.util.TestRuleStoreClassName$1.evaluate(TestRuleStoreClassName.java:42)
	at com.carrotsearch.randomizedtesting.rules.NoShadowingOrOverridesOnMethodsRule$1.evaluate(NoShadowingOrOverridesOnMethodsRule.java:40)
	at com.carrotsearch.randomizedtesting.rules.NoShadowingOrOverridesOnMethodsRule$1.evaluate(NoShadowingOrOverridesOnMethodsRule.java:40)
	at com.carrotsearch.randomizedtesting.rules.StatementAdapter.evaluate(StatementAdapter.java:36)
	at com.carrotsearch.randomizedtesting.rules.StatementAdapter.evaluate(StatementAdapter.java:36)
	at com.carrotsearch.randomizedtesting.rules.StatementAdapter.evaluate(StatementAdapter.java:36)
	at org.apache.lucene.util.TestRuleAssertionsRequired$1.evaluate(TestRuleAssertionsRequired.java:54)
	at org.apache.lucene.util.TestRuleMarkFailure$1.evaluate(TestRuleMarkFailure.java:48)
	at org.apache.lucene.util.TestRuleIgnoreAfterMaxFailures$1.evaluate(TestRuleIgnoreAfterMaxFailures.java:65)
	at org.apache.lucene.util.TestRuleIgnoreTestSuites$1.evaluate(TestRuleIgnoreTestSuites.java:55)
	at com.carrotsearch.randomizedtesting.rules.StatementAdapter.evaluate(StatementAdapter.java:36)
	at com.carrotsearch.randomizedtesting.ThreadLeakControl$StatementRunner.run(ThreadLeakControl.java:367)
	at java.lang.Thread.run(Thread.java:745)


FAILED:  org.apache.solr.cloud.CleanupOldIndexTest.test

Error Message:
There are still nodes recoverying - waited for 120 seconds

Stack Trace:
java.lang.AssertionError: There are still nodes recoverying - waited for 120 seconds
	at __randomizedtesting.SeedInfo.seed([40885DE05505D283:C8DC623AFBF9BF7B]:0)
	at org.junit.Assert.fail(Assert.java:93)
	at org.apache.solr.cloud.AbstractDistribZkTestBase.waitForRecoveriesToFinish(AbstractDistribZkTestBase.java:175)
	at org.apache.solr.cloud.AbstractFullDistribZkTestBase.waitForRecoveriesToFinish(AbstractFullDistribZkTestBase.java:837)
	at org.apache.solr.cloud.AbstractFullDistribZkTestBase.waitForThingsToLevelOut(AbstractFullDistribZkTestBase.java:1393)
	at org.apache.solr.cloud.CleanupOldIndexTest.test(CleanupOldIndexTest.java:116)
	at sun.reflect.NativeMethodAccessorImpl.invoke0(Native Method)
	at sun.reflect.NativeMethodAccessorImpl.invoke(NativeMethodAccessorImpl.java:57)
	at sun.reflect.DelegatingMethodAccessorImpl.invoke(DelegatingMethodAccessorImpl.java:43)
	at java.lang.reflect.Method.invoke(Method.java:606)
	at com.carrotsearch.randomizedtesting.RandomizedRunner.invoke(RandomizedRunner.java:1764)
	at com.carrotsearch.randomizedtesting.RandomizedRunner$8.evaluate(RandomizedRunner.java:871)
	at com.carrotsearch.randomizedtesting.RandomizedRunner$9.evaluate(RandomizedRunner.java:907)
	at com.carrotsearch.randomizedtesting.RandomizedRunner$10.evaluate(RandomizedRunner.java:921)
	at org.apache.solr.BaseDistributedSearchTestCase$ShardsRepeatRule$ShardsFixedStatement.callStatement(BaseDistributedSearchTestCase.java:965)
	at org.apache.solr.BaseDistributedSearchTestCase$ShardsRepeatRule$ShardsStatement.evaluate(BaseDistributedSearchTestCase.java:940)
	at com.carrotsearch.randomizedtesting.rules.SystemPropertiesRestoreRule$1.evaluate(SystemPropertiesRestoreRule.java:57)
	at org.apache.lucene.util.TestRuleSetupTeardownChained$1.evaluate(TestRuleSetupTeardownChained.java:50)
	at org.apache.lucene.util.AbstractBeforeAfterRule$1.evaluate(AbstractBeforeAfterRule.java:46)
	at org.apache.lucene.util.TestRuleThreadAndTestName$1.evaluate(TestRuleThreadAndTestName.java:49)
	at org.apache.lucene.util.TestRuleIgnoreAfterMaxFailures$1.evaluate(TestRuleIgnoreAfterMaxFailures.java:65)
	at org.apache.lucene.util.TestRuleMarkFailure$1.evaluate(TestRuleMarkFailure.java:48)
	at com.carrotsearch.randomizedtesting.rules.StatementAdapter.evaluate(StatementAdapter.java:36)
	at com.carrotsearch.randomizedtesting.ThreadLeakControl$StatementRunner.run(ThreadLeakControl.java:367)
	at com.carrotsearch.randomizedtesting.ThreadLeakControl.forkTimeoutingTask(ThreadLeakControl.java:809)
	at com.carrotsearch.randomizedtesting.ThreadLeakControl$3.evaluate(ThreadLeakControl.java:460)
	at com.carrotsearch.randomizedtesting.RandomizedRunner.runSingleTest(RandomizedRunner.java:880)
	at com.carrotsearch.randomizedtesting.RandomizedRunner$5.evaluate(RandomizedRunner.java:781)
	at com.carrotsearch.randomizedtesting.RandomizedRunner$6.evaluate(RandomizedRunner.java:816)
	at com.carrotsearch.randomizedtesting.RandomizedRunner$7.evaluate(RandomizedRunner.java:827)
	at com.carrotsearch.randomizedtesting.rules.StatementAdapter.evaluate(StatementAdapter.java:36)
	at com.carrotsearch.randomizedtesting.rules.SystemPropertiesRestoreRule$1.evaluate(SystemPropertiesRestoreRule.java:57)
	at org.apache.lucene.util.AbstractBeforeAfterRule$1.evaluate(AbstractBeforeAfterRule.java:46)
	at com.carrotsearch.randomizedtesting.rules.StatementAdapter.evaluate(StatementAdapter.java:36)
	at org.apache.lucene.util.TestRuleStoreClassName$1.evaluate(TestRuleStoreClassName.java:42)
	at com.carrotsearch.randomizedtesting.rules.NoShadowingOrOverridesOnMethodsRule$1.evaluate(NoShadowingOrOverridesOnMethodsRule.java:40)
	at com.carrotsearch.randomizedtesting.rules.NoShadowingOrOverridesOnMethodsRule$1.evaluate(NoShadowingOrOverridesOnMethodsRule.java:40)
	at com.carrotsearch.randomizedtesting.rules.StatementAdapter.evaluate(StatementAdapter.java:36)
	at com.carrotsearch.randomizedtesting.rules.StatementAdapter.evaluate(StatementAdapter.java:36)
	at com.carrotsearch.randomizedtesting.rules.StatementAdapter.evaluate(StatementAdapter.java:36)
	at org.apache.lucene.util.TestRuleAssertionsRequired$1.evaluate(TestRuleAssertionsRequired.java:54)
	at org.apache.lucene.util.TestRuleMarkFailure$1.evaluate(TestRuleMarkFailure.java:48)
	at org.apache.lucene.util.TestRuleIgnoreAfterMaxFailures$1.evaluate(TestRuleIgnoreAfterMaxFailures.java:65)
	at org.apache.lucene.util.TestRuleIgnoreTestSuites$1.evaluate(TestRuleIgnoreTestSuites.java:55)
	at com.carrotsearch.randomizedtesting.rules.StatementAdapter.evaluate(StatementAdapter.java:36)
	at com.carrotsearch.randomizedtesting.ThreadLeakControl$StatementRunner.run(ThreadLeakControl.java:367)
	at java.lang.Thread.run(Thread.java:745)


FAILED:  org.apache.solr.cloud.DistributedVersionInfoTest.test

Error Message:
Doc with id=1 not found in http://127.0.0.1:46954/c8n_vers_1x3_shard1_replica1 due to: Path not found: /id; rsp={doc=null}

Stack Trace:
java.lang.AssertionError: Doc with id=1 not found in http://127.0.0.1:46954/c8n_vers_1x3_shard1_replica1 due to: Path not found: /id; rsp={doc=null}
	at __randomizedtesting.SeedInfo.seed([40885DE05505D283:C8DC623AFBF9BF7B]:0)
	at org.junit.Assert.fail(Assert.java:93)
	at org.junit.Assert.assertTrue(Assert.java:43)
	at org.apache.solr.cloud.DistributedVersionInfoTest.assertDocExists(DistributedVersionInfoTest.java:367)
	at org.apache.solr.cloud.DistributedVersionInfoTest.assertDocsExistInAllReplicas(DistributedVersionInfoTest.java:334)
	at org.apache.solr.cloud.DistributedVersionInfoTest.testReplicaVersionHandling(DistributedVersionInfoTest.java:100)
	at org.apache.solr.cloud.DistributedVersionInfoTest.test(DistributedVersionInfoTest.java:75)
	at sun.reflect.NativeMethodAccessorImpl.invoke0(Native Method)
	at sun.reflect.NativeMethodAccessorImpl.invoke(NativeMethodAccessorImpl.java:57)
	at sun.reflect.DelegatingMethodAccessorImpl.invoke(DelegatingMethodAccessorImpl.java:43)
	at java.lang.reflect.Method.invoke(Method.java:606)
	at com.carrotsearch.randomizedtesting.RandomizedRunner.invoke(RandomizedRunner.java:1764)
	at com.carrotsearch.randomizedtesting.RandomizedRunner$8.evaluate(RandomizedRunner.java:871)
	at com.carrotsearch.randomizedtesting.RandomizedRunner$9.evaluate(RandomizedRunner.java:907)
	at com.carrotsearch.randomizedtesting.RandomizedRunner$10.evaluate(RandomizedRunner.java:921)
	at org.apache.solr.BaseDistributedSearchTestCase$ShardsRepeatRule$ShardsFixedStatement.callStatement(BaseDistributedSearchTestCase.java:965)
	at org.apache.solr.BaseDistributedSearchTestCase$ShardsRepeatRule$ShardsStatement.evaluate(BaseDistributedSearchTestCase.java:940)
	at com.carrotsearch.randomizedtesting.rules.SystemPropertiesRestoreRule$1.evaluate(SystemPropertiesRestoreRule.java:57)
	at org.apache.lucene.util.TestRuleSetupTeardownChained$1.evaluate(TestRuleSetupTeardownChained.java:50)
	at org.apache.lucene.util.AbstractBeforeAfterRule$1.evaluate(AbstractBeforeAfterRule.java:46)
	at org.apache.lucene.util.TestRuleThreadAndTestName$1.evaluate(TestRuleThreadAndTestName.java:49)
	at org.apache.lucene.util.TestRuleIgnoreAfterMaxFailures$1.evaluate(TestRuleIgnoreAfterMaxFailures.java:65)
	at org.apache.lucene.util.TestRuleMarkFailure$1.evaluate(TestRuleMarkFailure.java:48)
	at com.carrotsearch.randomizedtesting.rules.StatementAdapter.evaluate(StatementAdapter.java:36)
	at com.carrotsearch.randomizedtesting.ThreadLeakControl$StatementRunner.run(ThreadLeakControl.java:367)
	at com.carrotsearch.randomizedtesting.ThreadLeakControl.forkTimeoutingTask(ThreadLeakControl.java:809)
	at com.carrotsearch.randomizedtesting.ThreadLeakControl$3.evaluate(ThreadLeakControl.java:460)
	at com.carrotsearch.randomizedtesting.RandomizedRunner.runSingleTest(RandomizedRunner.java:880)
	at com.carrotsearch.randomizedtesting.RandomizedRunner$5.evaluate(RandomizedRunner.java:781)
	at com.carrotsearch.randomizedtesting.RandomizedRunner$6.evaluate(RandomizedRunner.java:816)
	at com.carrotsearch.randomizedtesting.RandomizedRunner$7.evaluate(RandomizedRunner.java:827)
	at com.carrotsearch.randomizedtesting.rules.StatementAdapter.evaluate(StatementAdapter.java:36)
	at com.carrotsearch.randomizedtesting.rules.SystemPropertiesRestoreRule$1.evaluate(SystemPropertiesRestoreRule.java:57)
	at org.apache.lucene.util.AbstractBeforeAfterRule$1.evaluate(AbstractBeforeAfterRule.java:46)
	at com.carrotsearch.randomizedtesting.rules.StatementAdapter.evaluate(StatementAdapter.java:36)
	at org.apache.lucene.util.TestRuleStoreClassName$1.evaluate(TestRuleStoreClassName.java:42)
	at com.carrotsearch.randomizedtesting.rules.NoShadowingOrOverridesOnMethodsRule$1.evaluate(NoShadowingOrOverridesOnMethodsRule.java:40)
	at com.carrotsearch.randomizedtesting.rules.NoShadowingOrOverridesOnMethodsRule$1.evaluate(NoShadowingOrOverridesOnMethodsRule.java:40)
	at com.carrotsearch.randomizedtesting.rules.StatementAdapter.evaluate(StatementAdapter.java:36)
	at com.carrotsearch.randomizedtesting.rules.StatementAdapter.evaluate(StatementAdapter.java:36)
	at com.carrotsearch.randomizedtesting.rules.StatementAdapter.evaluate(StatementAdapter.java:36)
	at org.apache.lucene.util.TestRuleAssertionsRequired$1.evaluate(TestRuleAssertionsRequired.java:54)
	at org.apache.lucene.util.TestRuleMarkFailure$1.evaluate(TestRuleMarkFailure.java:48)
	at org.apache.lucene.util.TestRuleIgnoreAfterMaxFailures$1.evaluate(TestRuleIgnoreAfterMaxFailures.java:65)
	at org.apache.lucene.util.TestRuleIgnoreTestSuites$1.evaluate(TestRuleIgnoreTestSuites.java:55)
	at com.carrotsearch.randomizedtesting.rules.StatementAdapter.evaluate(StatementAdapter.java:36)
	at com.carrotsearch.randomizedtesting.ThreadLeakControl$StatementRunner.run(ThreadLeakControl.java:367)
	at java.lang.Thread.run(Thread.java:745)


FAILED:  org.apache.solr.cloud.TestAuthenticationFramework.testCollectionCreateSearchDelete

Error Message:
expected:<1> but was:<0>

Stack Trace:
java.lang.AssertionError: expected:<1> but was:<0>
	at __randomizedtesting.SeedInfo.seed([40885DE05505D283:E372F345D2ED3826]:0)
	at org.junit.Assert.fail(Assert.java:93)
	at org.junit.Assert.failNotEquals(Assert.java:647)
	at org.junit.Assert.assertEquals(Assert.java:128)
	at org.junit.Assert.assertEquals(Assert.java:472)
	at org.junit.Assert.assertEquals(Assert.java:456)
	at org.apache.solr.cloud.TestMiniSolrCloudCluster.testCollectionCreateSearchDelete(TestMiniSolrCloudCluster.java:159)
	at sun.reflect.NativeMethodAccessorImpl.invoke0(Native Method)
	at sun.reflect.NativeMethodAccessorImpl.invoke(NativeMethodAccessorImpl.java:57)
	at sun.reflect.DelegatingMethodAccessorImpl.invoke(DelegatingMethodAccessorImpl.java:43)
	at java.lang.reflect.Method.invoke(Method.java:606)
	at com.carrotsearch.randomizedtesting.RandomizedRunner.invoke(RandomizedRunner.java:1764)
	at com.carrotsearch.randomizedtesting.RandomizedRunner$8.evaluate(RandomizedRunner.java:871)
	at com.carrotsearch.randomizedtesting.RandomizedRunner$9.evaluate(RandomizedRunner.java:907)
	at com.carrotsearch.randomizedtesting.RandomizedRunner$10.evaluate(RandomizedRunner.java:921)
	at com.carrotsearch.randomizedtesting.rules.SystemPropertiesRestoreRule$1.evaluate(SystemPropertiesRestoreRule.java:57)
	at org.apache.lucene.util.TestRuleSetupTeardownChained$1.evaluate(TestRuleSetupTeardownChained.java:50)
	at org.apache.lucene.util.AbstractBeforeAfterRule$1.evaluate(AbstractBeforeAfterRule.java:46)
	at org.apache.lucene.util.TestRuleThreadAndTestName$1.evaluate(TestRuleThreadAndTestName.java:49)
	at org.apache.lucene.util.TestRuleIgnoreAfterMaxFailures$1.evaluate(TestRuleIgnoreAfterMaxFailures.java:65)
	at org.apache.lucene.util.TestRuleMarkFailure$1.evaluate(TestRuleMarkFailure.java:48)
	at com.carrotsearch.randomizedtesting.rules.StatementAdapter.evaluate(StatementAdapter.java:36)
	at com.carrotsearch.randomizedtesting.ThreadLeakControl$StatementRunner.run(ThreadLeakControl.java:367)
	at com.carrotsearch.randomizedtesting.ThreadLeakControl.forkTimeoutingTask(ThreadLeakControl.java:809)
	at com.carrotsearch.randomizedtesting.ThreadLeakControl$3.evaluate(ThreadLeakControl.java:460)
	at com.carrotsearch.randomizedtesting.RandomizedRunner.runSingleTest(RandomizedRunner.java:880)
	at com.carrotsearch.randomizedtesting.RandomizedRunner$5.evaluate(RandomizedRunner.java:781)
	at com.carrotsearch.randomizedtesting.RandomizedRunner$6.evaluate(RandomizedRunner.java:816)
	at com.carrotsearch.randomizedtesting.RandomizedRunner$7.evaluate(RandomizedRunner.java:827)
	at com.carrotsearch.randomizedtesting.rules.StatementAdapter.evaluate(StatementAdapter.java:36)
	at com.carrotsearch.randomizedtesting.rules.SystemPropertiesRestoreRule$1.evaluate(SystemPropertiesRestoreRule.java:57)
	at org.apache.lucene.util.AbstractBeforeAfterRule$1.evaluate(AbstractBeforeAfterRule.java:46)
	at com.carrotsearch.randomizedtesting.rules.StatementAdapter.evaluate(StatementAdapter.java:36)
	at org.apache.lucene.util.TestRuleStoreClassName$1.evaluate(TestRuleStoreClassName.java:42)
	at com.carrotsearch.randomizedtesting.rules.NoShadowingOrOverridesOnMethodsRule$1.evaluate(NoShadowingOrOverridesOnMethodsRule.java:40)
	at com.carrotsearch.randomizedtesting.rules.NoShadowingOrOverridesOnMethodsRule$1.evaluate(NoShadowingOrOverridesOnMethodsRule.java:40)
	at com.carrotsearch.randomizedtesting.rules.StatementAdapter.evaluate(StatementAdapter.java:36)
	at com.carrotsearch.randomizedtesting.rules.StatementAdapter.evaluate(StatementAdapter.java:36)
	at com.carrotsearch.randomizedtesting.rules.StatementAdapter.evaluate(StatementAdapter.java:36)
	at org.apache.lucene.util.TestRuleAssertionsRequired$1.evaluate(TestRuleAssertionsRequired.java:54)
	at org.apache.lucene.util.TestRuleMarkFailure$1.evaluate(TestRuleMarkFailure.java:48)
	at org.apache.lucene.util.TestRuleIgnoreAfterMaxFailures$1.evaluate(TestRuleIgnoreAfterMaxFailures.java:65)
	at org.apache.lucene.util.TestRuleIgnoreTestSuites$1.evaluate(TestRuleIgnoreTestSuites.java:55)
	at com.carrotsearch.randomizedtesting.rules.StatementAdapter.evaluate(StatementAdapter.java:36)
	at com.carrotsearch.randomizedtesting.ThreadLeakControl$StatementRunner.run(ThreadLeakControl.java:367)
	at java.lang.Thread.run(Thread.java:745)




Build Log:
[...truncated 10550 lines...]
   [junit4] Suite: org.apache.solr.cloud.BasicDistributedZkTest
   [junit4]   2> Creating dataDir: /home/jenkins/workspace/Lucene-Solr-5.x-Linux/solr/build/solr-core/test/J1/temp/solr.cloud.BasicDistributedZkTest_40885DE05505D283-001/init-core-data-001
   [junit4]   2> 849289 INFO  (SUITE-BasicDistributedZkTest-seed#[40885DE05505D283]-worker) [    ] o.a.s.BaseDistributedSearchTestCase Setting hostContext system property: /
   [junit4]   2> 849293 INFO  (TEST-BasicDistributedZkTest.test-seed#[40885DE05505D283]) [    ] o.a.s.c.ZkTestServer STARTING ZK TEST SERVER
   [junit4]   2> 849293 INFO  (Thread-2188) [    ] o.a.s.c.ZkTestServer client port:0.0.0.0/0.0.0.0:0
   [junit4]   2> 849293 INFO  (Thread-2188) [    ] o.a.s.c.ZkTestServer Starting server
   [junit4]   2> 849393 INFO  (TEST-BasicDistributedZkTest.test-seed#[40885DE05505D283]) [    ] o.a.s.c.ZkTestServer start zk server on port:41554
   [junit4]   2> 849393 INFO  (TEST-BasicDistributedZkTest.test-seed#[40885DE05505D283]) [    ] o.a.s.c.c.SolrZkClient Using default ZkCredentialsProvider
   [junit4]   2> 849394 INFO  (TEST-BasicDistributedZkTest.test-seed#[40885DE05505D283]) [    ] o.a.s.c.c.ConnectionManager Waiting for client to connect to ZooKeeper
   [junit4]   2> 849397 INFO  (zkCallback-651-thread-1) [    ] o.a.s.c.c.ConnectionManager Watcher org.apache.solr.common.cloud.ConnectionManager@32121760 name:ZooKeeperConnection Watcher:127.0.0.1:41554 got event WatchedEvent state:SyncConnected type:None path:null path:null type:None
   [junit4]   2> 849397 INFO  (TEST-BasicDistributedZkTest.test-seed#[40885DE05505D283]) [    ] o.a.s.c.c.ConnectionManager Client is connected to ZooKeeper
   [junit4]   2> 849398 INFO  (TEST-BasicDistributedZkTest.test-seed#[40885DE05505D283]) [    ] o.a.s.c.c.SolrZkClient Using default ZkACLProvider
   [junit4]   2> 849398 INFO  (TEST-BasicDistributedZkTest.test-seed#[40885DE05505D283]) [    ] o.a.s.c.c.SolrZkClient makePath: /solr
   [junit4]   2> 849400 INFO  (TEST-BasicDistributedZkTest.test-seed#[40885DE05505D283]) [    ] o.a.s.c.c.SolrZkClient Using default ZkCredentialsProvider
   [junit4]   2> 849400 INFO  (TEST-BasicDistributedZkTest.test-seed#[40885DE05505D283]) [    ] o.a.s.c.c.ConnectionManager Waiting for client to connect to ZooKeeper
   [junit4]   2> 849401 INFO  (zkCallback-652-thread-1) [    ] o.a.s.c.c.ConnectionManager Watcher org.apache.solr.common.cloud.ConnectionManager@31dea925 name:ZooKeeperConnection Watcher:127.0.0.1:41554/solr got event WatchedEvent state:SyncConnected type:None path:null path:null type:None
   [junit4]   2> 849401 INFO  (TEST-BasicDistributedZkTest.test-seed#[40885DE05505D283]) [    ] o.a.s.c.c.ConnectionManager Client is connected to ZooKeeper
   [junit4]   2> 849402 INFO  (TEST-BasicDistributedZkTest.test-seed#[40885DE05505D283]) [    ] o.a.s.c.c.SolrZkClient Using default ZkACLProvider
   [junit4]   2> 849402 INFO  (TEST-BasicDistributedZkTest.test-seed#[40885DE05505D283]) [    ] o.a.s.c.c.SolrZkClient makePath: /collections/collection1
   [junit4]   2> 849403 INFO  (TEST-BasicDistributedZkTest.test-seed#[40885DE05505D283]) [    ] o.a.s.c.c.SolrZkClient makePath: /collections/collection1/shards
   [junit4]   2> 849404 INFO  (TEST-BasicDistributedZkTest.test-seed#[40885DE05505D283]) [    ] o.a.s.c.c.SolrZkClient makePath: /collections/control_collection
   [junit4]   2> 849404 INFO  (TEST-BasicDistributedZkTest.test-seed#[40885DE05505D283]) [    ] o.a.s.c.c.SolrZkClient makePath: /collections/control_collection/shards
   [junit4]   2> 849405 INFO  (TEST-BasicDistributedZkTest.test-seed#[40885DE05505D283]) [    ] o.a.s.c.AbstractZkTestCase put /home/jenkins/workspace/Lucene-Solr-5.x-Linux/solr/core/src/test-files/solr/collection1/conf/solrconfig-tlog.xml to /configs/conf1/solrconfig.xml
   [junit4]   2> 849405 INFO  (TEST-BasicDistributedZkTest.test-seed#[40885DE05505D283]) [    ] o.a.s.c.c.SolrZkClient makePath: /configs/conf1/solrconfig.xml
   [junit4]   2> 849407 INFO  (TEST-BasicDistributedZkTest.test-seed#[40885DE05505D283]) [    ] o.a.s.c.AbstractZkTestCase put /home/jenkins/workspace/Lucene-Solr-5.x-Linux/solr/core/src/test-files/solr/collection1/conf/schema.xml to /configs/conf1/schema.xml
   [junit4]   2> 849407 INFO  (TEST-BasicDistributedZkTest.test-seed#[40885DE05505D283]) [    ] o.a.s.c.c.SolrZkClient makePath: /configs/conf1/schema.xml
   [junit4]   2> 849409 INFO  (TEST-BasicDistributedZkTest.test-seed#[40885DE05505D283]) [    ] o.a.s.c.AbstractZkTestCase put /home/jenkins/workspace/Lucene-Solr-5.x-Linux/solr/core/src/test-files/solr/collection1/conf/solrconfig.snippet.randomindexconfig.xml to /configs/conf1/solrconfig.snippet.randomindexconfig.xml
   [junit4]   2> 849409 INFO  (TEST-BasicDistributedZkTest.test-seed#[40885DE05505D283]) [    ] o.a.s.c.c.SolrZkClient makePath: /configs/conf1/solrconfig.snippet.randomindexconfig.xml
   [junit4]   2> 849410 INFO  (TEST-BasicDistributedZkTest.test-seed#[40885DE05505D283]) [    ] o.a.s.c.AbstractZkTestCase put /home/jenkins/workspace/Lucene-Solr-5.x-Linux/solr/core/src/test-files/solr/collection1/conf/stopwords.txt to /configs/conf1/stopwords.txt
   [junit4]   2> 849410 INFO  (TEST-BasicDistributedZkTest.test-seed#[40885DE05505D283]) [    ] o.a.s.c.c.SolrZkClient makePath: /configs/conf1/stopwords.txt
   [junit4]   2> 849411 INFO  (TEST-BasicDistributedZkTest.test-seed#[40885DE05505D283]) [    ] o.a.s.c.AbstractZkTestCase put /home/jenkins/workspace/Lucene-Solr-5.x-Linux/solr/core/src/test-files/solr/collection1/conf/protwords.txt to /configs/conf1/protwords.txt
   [junit4]   2> 849411 INFO  (TEST-BasicDistributedZkTest.test-seed#[40885DE05505D283]) [    ] o.a.s.c.c.SolrZkClient makePath: /configs/conf1/protwords.txt
   [junit4]   2> 849412 INFO  (TEST-BasicDistributedZkTest.test-seed#[40885DE05505D283]) [    ] o.a.s.c.AbstractZkTestCase put /home/jenkins/workspace/Lucene-Solr-5.x-Linux/solr/core/src/test-files/solr/collection1/conf/currency.xml to /configs/conf1/currency.xml
   [junit4]   2> 849412 INFO  (TEST-BasicDistributedZkTest.test-seed#[40885DE05505D283]) [    ] o.a.s.c.c.SolrZkClient makePath: /configs/conf1/currency.xml
   [junit4]   2> 849419 INFO  (TEST-BasicDistributedZkTest.test-seed#[40885DE05505D283]) [    ] o.a.s.c.AbstractZkTestCase put /home/jenkins/workspace/Lucene-Solr-5.x-Linux/solr/core/src/test-files/solr/collection1/conf/enumsConfig.xml to /configs/conf1/enumsConfig.xml
   [junit4]   2> 849419 INFO  (TEST-BasicDistributedZkTest.test-seed#[40885DE05505D283]) [    ] o.a.s.c.c.SolrZkClient makePath: /configs/conf1/enumsConfig.xml
   [junit4]   2> 849420 INFO  (TEST-BasicDistributedZkTest.test-seed#[40885DE05505D283]) [    ] o.a.s.c.AbstractZkTestCase put /home/jenkins/workspace/Lucene-Solr-5.x-Linux/solr/core/src/test-files/solr/collection1/conf/open-exchange-rates.json to /configs/conf1/open-exchange-rates.json
   [junit4]   2> 849420 INFO  (TEST-BasicDistributedZkTest.test-seed#[40885DE05505D283]) [    ] o.a.s.c.c.SolrZkClient makePath: /configs/conf1/open-exchange-rates.json
   [junit4]   2> 849421 INFO  (TEST-BasicDistributedZkTest.test-seed#[40885DE05505D283]) [    ] o.a.s.c.AbstractZkTestCase put /home/jenkins/workspace/Lucene-Solr-5.x-Linux/solr/core/src/test-files/solr/collection1/conf/mapping-ISOLatin1Accent.txt to /configs/conf1/mapping-ISOLatin1Accent.txt
   [junit4]   2> 849421 INFO  (TEST-BasicDistributedZkTest.test-seed#[40885DE05505D283]) [    ] o.a.s.c.c.SolrZkClient makePath: /configs/conf1/mapping-ISOLatin1Accent.txt
   [junit4]   2> 849422 INFO  (TEST-BasicDistributedZkTest.test-seed#[40885DE05505D283]) [    ] o.a.s.c.AbstractZkTestCase put /home/jenkins/workspace/Lucene-Solr-5.x-Linux/solr/core/src/test-files/solr/collection1/conf/old_synonyms.txt to /configs/conf1/old_synonyms.txt
   [junit4]   2> 849422 INFO  (TEST-BasicDistributedZkTest.test-seed#[40885DE05505D283]) [    ] o.a.s.c.c.SolrZkClient makePath: /configs/conf1/old_synonyms.txt
   [junit4]   2> 849423 INFO  (TEST-BasicDistributedZkTest.test-seed#[40885DE05505D283]) [    ] o.a.s.c.AbstractZkTestCase put /home/jenkins/workspace/Lucene-Solr-5.x-Linux/solr/core/src/test-files/solr/collection1/conf/synonyms.txt to /configs/conf1/synonyms.txt
   [junit4]   2> 849423 INFO  (TEST-BasicDistributedZkTest.test-seed#[40885DE05505D283]) [    ] o.a.s.c.c.SolrZkClient makePath: /configs/conf1/synonyms.txt
   [junit4]   2> 849478 INFO  (TEST-BasicDistributedZkTest.test-seed#[40885DE05505D283]) [    ] o.a.s.SolrTestCaseJ4 Writing core.properties file to /home/jenkins/workspace/Lucene-Solr-5.x-Linux/solr/build/solr-core/test/J1/temp/solr.cloud.BasicDistributedZkTest_40885DE05505D283-001/control-001/cores/collection1
   [junit4]   2> 849480 INFO  (TEST-BasicDistributedZkTest.test-seed#[40885DE05505D283]) [    ] o.e.j.s.Server jetty-9.2.13.v20150730
   [junit4]   2> 849481 INFO  (TEST-BasicDistributedZkTest.test-seed#[40885DE05505D283]) [    ] o.e.j.s.h.ContextHandler Started o.e.j.s.ServletContextHandler@d3dbd5e{/,null,AVAILABLE}
   [junit4]   2> 849481 INFO  (TEST-BasicDistributedZkTest.test-seed#[40885DE05505D283]) [    ] o.e.j.s.ServerConnector Started ServerConnector@2258727b{HTTP/1.1}{127.0.0.1:56882}
   [junit4]   2> 849481 INFO  (TEST-BasicDistributedZkTest.test-seed#[40885DE05505D283]) [    ] o.e.j.s.Server Started @851192ms
   [junit4]   2> 849481 INFO  (TEST-BasicDistributedZkTest.test-seed#[40885DE05505D283]) [    ] o.a.s.c.s.e.JettySolrRunner Jetty properties: {solr.data.dir=/home/jenkins/workspace/Lucene-Solr-5.x-Linux/solr/build/solr-core/test/J1/temp/solr.cloud.BasicDistributedZkTest_40885DE05505D283-001/tempDir-001/control/data, coreRootDirectory=/home/jenkins/workspace/Lucene-Solr-5.x-Linux/solr/build/solr-core/test/J1/temp/solr.cloud.BasicDistributedZkTest_40885DE05505D283-001/control-001/cores, hostContext=/, hostPort=56882}
   [junit4]   2> 849481 INFO  (TEST-BasicDistributedZkTest.test-seed#[40885DE05505D283]) [    ] o.a.s.s.SolrDispatchFilter SolrDispatchFilter.init(): sun.misc.Launcher$AppClassLoader@43036651
   [junit4]   2> 849481 INFO  (TEST-BasicDistributedZkTest.test-seed#[40885DE05505D283]) [    ] o.a.s.c.SolrResourceLoader new SolrResourceLoader for directory: '/home/jenkins/workspace/Lucene-Solr-5.x-Linux/solr/build/solr-core/test/J1/temp/solr.cloud.BasicDistributedZkTest_40885DE05505D283-001/control-001'
   [junit4]   2> 849482 INFO  (TEST-BasicDistributedZkTest.test-seed#[40885DE05505D283]) [    ] o.a.s.c.SolrResourceLoader JNDI not configured for solr (NoInitialContextEx)
   [junit4]   2> 849482 INFO  (TEST-BasicDistributedZkTest.test-seed#[40885DE05505D283]) [    ] o.a.s.c.SolrResourceLoader solr home defaulted to 'solr/' (could not find system property or JNDI)
   [junit4]   2> 849482 INFO  (TEST-BasicDistributedZkTest.test-seed#[40885DE05505D283]) [    ] o.a.s.c.c.SolrZkClient Using default ZkCredentialsProvider
   [junit4]   2> 849490 INFO  (TEST-BasicDistributedZkTest.test-seed#[40885DE05505D283]) [    ] o.a.s.c.c.ConnectionManager Waiting for client to connect to ZooKeeper
   [junit4]   2> 849494 INFO  (zkCallback-653-thread-1) [    ] o.a.s.c.c.ConnectionManager Watcher org.apache.solr.common.cloud.ConnectionManager@351842ca name:ZooKeeperConnection Watcher:127.0.0.1:41554/solr got event WatchedEvent state:SyncConnected type:None path:null path:null type:None
   [junit4]   2> 849494 INFO  (TEST-BasicDistributedZkTest.test-seed#[40885DE05505D283]) [    ] o.a.s.c.c.ConnectionManager Client is connected to ZooKeeper
   [junit4]   2> 849494 INFO  (TEST-BasicDistributedZkTest.test-seed#[40885DE05505D283]) [    ] o.a.s.c.c.SolrZkClient Using default ZkACLProvider
   [junit4]   2> 849495 INFO  (TEST-BasicDistributedZkTest.test-seed#[40885DE05505D283]) [    ] o.a.s.s.SolrDispatchFilter Loading solr.xml from SolrHome (not found in ZooKeeper)
   [junit4]   2> 849495 INFO  (TEST-BasicDistributedZkTest.test-seed#[40885DE05505D283]) [    ] o.a.s.c.SolrXmlConfig Loading container configuration from /home/jenkins/workspace/Lucene-Solr-5.x-Linux/solr/build/solr-core/test/J1/temp/solr.cloud.BasicDistributedZkTest_40885DE05505D283-001/control-001/solr.xml
   [junit4]   2> 849504 INFO  (TEST-BasicDistributedZkTest.test-seed#[40885DE05505D283]) [    ] o.a.s.c.CorePropertiesLocator Config-defined core root directory: /home/jenkins/workspace/Lucene-Solr-5.x-Linux/solr/build/solr-core/test/J1/temp/solr.cloud.BasicDistributedZkTest_40885DE05505D283-001/control-001/cores
   [junit4]   2> 849505 INFO  (TEST-BasicDistributedZkTest.test-seed#[40885DE05505D283]) [    ] o.a.s.c.CoreContainer New CoreContainer 1512149001
   [junit4]   2> 849505 INFO  (TEST-BasicDistributedZkTest.test-seed#[40885DE05505D283]) [    ] o.a.s.c.CoreContainer Loading cores into CoreContainer [instanceDir=/home/jenkins/workspace/Lucene-Solr-5.x-Linux/solr/build/solr-core/test/J1/temp/solr.cloud.BasicDistributedZkTest_40885DE05505D283-001/control-001]
   [junit4]   2> 849505 WARN  (TEST-BasicDistributedZkTest.test-seed#[40885DE05505D283]) [    ] o.a.s.c.CoreContainer Couldn't add files from /home/jenkins/workspace/Lucene-Solr-5.x-Linux/solr/build/solr-core/test/J1/temp/solr.cloud.BasicDistributedZkTest_40885DE05505D283-001/control-001/lib to classpath: /home/jenkins/workspace/Lucene-Solr-5.x-Linux/solr/build/solr-core/test/J1/temp/solr.cloud.BasicDistributedZkTest_40885DE05505D283-001/control-001/lib
   [junit4]   2> 849505 INFO  (TEST-BasicDistributedZkTest.test-seed#[40885DE05505D283]) [    ] o.a.s.h.c.HttpShardHandlerFactory created with socketTimeout : 90000,urlScheme : ,connTimeout : 15000,maxConnectionsPerHost : 20,maxConnections : 10000,corePoolSize : 0,maximumPoolSize : 2147483647,maxThreadIdleTime : 5,sizeOfQueue : -1,fairnessPolicy : false,useRetries : false,
   [junit4]   2> 849506 INFO  (TEST-BasicDistributedZkTest.test-seed#[40885DE05505D283]) [    ] o.a.s.u.UpdateShardHandler Creating UpdateShardHandler HTTP client with params: socketTimeout=340000&connTimeout=45000&retry=true
   [junit4]   2> 849506 INFO  (TEST-BasicDistributedZkTest.test-seed#[40885DE05505D283]) [    ] o.a.s.l.LogWatcher SLF4J impl is org.slf4j.impl.Log4jLoggerFactory
   [junit4]   2> 849506 INFO  (TEST-BasicDistributedZkTest.test-seed#[40885DE05505D283]) [    ] o.a.s.l.LogWatcher Registering Log Listener [Log4j (org.slf4j.impl.Log4jLoggerFactory)]
   [junit4]   2> 849506 INFO  (TEST-BasicDistributedZkTest.test-seed#[40885DE05505D283]) [    ] o.a.s.c.ZkContainer Zookeeper client=127.0.0.1:41554/solr
   [junit4]   2> 849506 INFO  (TEST-BasicDistributedZkTest.test-seed#[40885DE05505D283]) [    ] o.a.s.c.ZkController zkHost includes chroot
   [junit4]   2> 849506 INFO  (TEST-BasicDistributedZkTest.test-seed#[40885DE05505D283]) [    ] o.a.s.c.c.SolrZkClient Using default ZkCredentialsProvider
   [junit4]   2> 849507 INFO  (TEST-BasicDistributedZkTest.test-seed#[40885DE05505D283]) [    ] o.a.s.c.c.ConnectionManager Waiting for client to connect to ZooKeeper
   [junit4]   2> 849513 INFO  (zkCallback-655-thread-1) [    ] o.a.s.c.c.ConnectionManager Watcher org.apache.solr.common.cloud.ConnectionManager@1733f391 name:ZooKeeperConnection Watcher:127.0.0.1:41554 got event WatchedEvent state:SyncConnected type:None path:null path:null type:None
   [junit4]   2> 849513 INFO  (TEST-BasicDistributedZkTest.test-seed#[40885DE05505D283]) [    ] o.a.s.c.c.ConnectionManager Client is connected to ZooKeeper
   [junit4]   2> 849513 INFO  (TEST-BasicDistributedZkTest.test-seed#[40885DE05505D283]) [    ] o.a.s.c.c.SolrZkClient Using default ZkACLProvider
   [junit4]   2> 849522 INFO  (TEST-BasicDistributedZkTest.test-seed#[40885DE05505D283]) [n:127.0.0.1:56882_    ] o.a.s.c.c.ConnectionManager Waiting for client to connect to ZooKeeper
   [junit4]   2> 849523 INFO  (zkCallback-656-thread-1-processing-n:127.0.0.1:56882_) [n:127.0.0.1:56882_    ] o.a.s.c.c.ConnectionManager Watcher org.apache.solr.common.cloud.ConnectionManager@73336c4f name:ZooKeeperConnection Watcher:127.0.0.1:41554/solr got event WatchedEvent state:SyncConnected type:None path:null path:null type:None
   [junit4]   2> 849523 INFO  (TEST-BasicDistributedZkTest.test-seed#[40885DE05505D283]) [n:127.0.0.1:56882_    ] o.a.s.c.c.ConnectionManager Client is connected to ZooKeeper
   [junit4]   2> 849524 INFO  (TEST-BasicDistributedZkTest.test-seed#[40885DE05505D283]) [n:127.0.0.1:56882_    ] o.a.s.c.c.SolrZkClient makePath: /overseer/queue
   [junit4]   2> 849525 INFO  (TEST-BasicDistributedZkTest.test-seed#[40885DE05505D283]) [n:127.0.0.1:56882_    ] o.a.s.c.c.SolrZkClient makePath: /overseer/collection-queue-work
   [junit4]   2> 849526 INFO  (TEST-BasicDistributedZkTest.test-seed#[40885DE05505D283]) [n:127.0.0.1:56882_    ] o.a.s.c.c.SolrZkClient makePath: /overseer/collection-map-running
   [junit4]   2> 849527 INFO  (TEST-BasicDistributedZkTest.test-seed#[40885DE05505D283]) [n:127.0.0.1:56882_    ] o.a.s.c.c.SolrZkClient makePath: /overseer/collection-map-completed
   [junit4]   2> 849528 INFO  (TEST-BasicDistributedZkTest.test-seed#[40885DE05505D283]) [n:127.0.0.1:56882_    ] o.a.s.c.c.SolrZkClient makePath: /overseer/collection-map-failure
   [junit4]   2> 849529 INFO  (TEST-BasicDistributedZkTest.test-seed#[40885DE05505D283]) [n:127.0.0.1:56882_    ] o.a.s.c.c.SolrZkClient makePath: /live_nodes
   [junit4]   2> 849529 INFO  (TEST-BasicDistributedZkTest.test-seed#[40885DE05505D283]) [n:127.0.0.1:56882_    ] o.a.s.c.c.SolrZkClient makePath: /aliases.json
   [junit4]   2> 849530 INFO  (TEST-BasicDistributedZkTest.test-seed#[40885DE05505D283]) [n:127.0.0.1:56882_    ] o.a.s.c.c.SolrZkClient makePath: /clusterstate.json
   [junit4]   2> 849531 INFO  (TEST-BasicDistributedZkTest.test-seed#[40885DE05505D283]) [n:127.0.0.1:56882_    ] o.a.s.c.c.SolrZkClient makePath: /security.json
   [junit4]   2> 849531 INFO  (TEST-BasicDistributedZkTest.test-seed#[40885DE05505D283]) [n:127.0.0.1:56882_    ] o.a.s.c.ZkController Register node as live in ZooKeeper:/live_nodes/127.0.0.1:56882_
   [junit4]   2> 849531 INFO  (TEST-BasicDistributedZkTest.test-seed#[40885DE05505D283]) [n:127.0.0.1:56882_    ] o.a.s.c.c.SolrZkClient makePath: /live_nodes/127.0.0.1:56882_
   [junit4]   2> 849532 INFO  (TEST-BasicDistributedZkTest.test-seed#[40885DE05505D283]) [n:127.0.0.1:56882_    ] o.a.s.c.c.SolrZkClient makePath: /overseer_elect
   [junit4]   2> 849533 INFO  (TEST-BasicDistributedZkTest.test-seed#[40885DE05505D283]) [n:127.0.0.1:56882_    ] o.a.s.c.c.SolrZkClient makePath: /overseer_elect/election
   [junit4]   2> 849533 INFO  (TEST-BasicDistributedZkTest.test-seed#[40885DE05505D283]) [n:127.0.0.1:56882_    ] o.a.s.c.Overseer Overseer (id=null) closing
   [junit4]   2> 849534 INFO  (TEST-BasicDistributedZkTest.test-seed#[40885DE05505D283]) [n:127.0.0.1:56882_    ] o.a.s.c.LeaderElector Joined leadership election with path: /overseer_elect/election/95151820973801476-127.0.0.1:56882_-n_0000000000
   [junit4]   2> 849534 INFO  (TEST-BasicDistributedZkTest.test-seed#[40885DE05505D283]) [n:127.0.0.1:56882_    ] o.a.s.c.OverseerElectionContext I am going to be the leader 127.0.0.1:56882_
   [junit4]   2> 849534 INFO  (TEST-BasicDistributedZkTest.test-seed#[40885DE05505D283]) [n:127.0.0.1:56882_    ] o.a.s.c.c.SolrZkClient makePath: /overseer_elect/leader
   [junit4]   2> 849535 INFO  (TEST-BasicDistributedZkTest.test-seed#[40885DE05505D283]) [n:127.0.0.1:56882_    ] o.a.s.c.Overseer Overseer (id=95151820973801476-127.0.0.1:56882_-n_0000000000) starting
   [junit4]   2> 849536 INFO  (TEST-BasicDistributedZkTest.test-seed#[40885DE05505D283]) [n:127.0.0.1:56882_    ] o.a.s.c.c.SolrZkClient makePath: /overseer/queue-work
   [junit4]   2> 849539 INFO  (TEST-BasicDistributedZkTest.test-seed#[40885DE05505D283]) [n:127.0.0.1:56882_    ] o.a.s.c.OverseerAutoReplicaFailoverThread Starting OverseerAutoReplicaFailoverThread autoReplicaFailoverWorkLoopDelay=10000 autoReplicaFailoverWaitAfterExpiration=30000 autoReplicaFailoverBadNodeExpiration=60000
   [junit4]   2> 849542 INFO  (OverseerStateUpdate-95151820973801476-127.0.0.1:56882_-n_0000000000) [n:127.0.0.1:56882_    ] o.a.s.c.Overseer Starting to work on the main queue
   [junit4]   2> 849543 INFO  (OverseerStateUpdate-95151820973801476-127.0.0.1:56882_-n_0000000000) [n:127.0.0.1:56882_    ] o.a.s.c.c.ZkStateReader Updating cluster state from ZooKeeper... 
   [junit4]   2> 849550 INFO  (OverseerCollectionConfigSetProcessor-95151820973801476-127.0.0.1:56882_-n_0000000000) [n:127.0.0.1:56882_    ] o.a.s.c.OverseerTaskProcessor Process current queue of overseer operations
   [junit4]   2> 849557 INFO  (TEST-BasicDistributedZkTest.test-seed#[40885DE05505D283]) [n:127.0.0.1:56882_    ] o.a.s.c.c.ZkStateReader Updating cluster state from ZooKeeper... 
   [junit4]   2> 849571 INFO  (TEST-BasicDistributedZkTest.test-seed#[40885DE05505D283]) [n:127.0.0.1:56882_    ] o.a.s.c.CoreContainer Security conf doesn't exist. Skipping setup for authorization module.
   [junit4]   2> 849571 INFO  (TEST-BasicDistributedZkTest.test-seed#[40885DE05505D283]) [n:127.0.0.1:56882_    ] o.a.s.c.CoreContainer No authentication plugin used.
   [junit4]   2> 849572 INFO  (TEST-BasicDistributedZkTest.test-seed#[40885DE05505D283]) [n:127.0.0.1:56882_    ] o.a.s.c.CorePropertiesLocator Looking for core definitions underneath /home/jenkins/workspace/Lucene-Solr-5.x-Linux/solr/build/solr-core/test/J1/temp/solr.cloud.BasicDistributedZkTest_40885DE05505D283-001/control-001/cores
   [junit4]   2> 849572 INFO  (TEST-BasicDistributedZkTest.test-seed#[40885DE05505D283]) [n:127.0.0.1:56882_    ] o.a.s.c.CoreDescriptor Created CoreDescriptor: {configSetProperties=configsetprops.json, dataDir=data/, collection=control_collection, coreNodeName=, loadOnStartup=true, schema=schema.xml, transient=false, name=collection1, shard=, config=solrconfig.xml}
   [junit4]   2> 849572 INFO  (TEST-BasicDistributedZkTest.test-seed#[40885DE05505D283]) [n:127.0.0.1:56882_    ] o.a.s.c.CorePropertiesLocator Found core collection1 in /home/jenkins/workspace/Lucene-Solr-5.x-Linux/solr/build/solr-core/test/J1/temp/solr.cloud.BasicDistributedZkTest_40885DE05505D283-001/control-001/cores/collection1
   [junit4]   2> 849572 INFO  (TEST-BasicDistributedZkTest.test-seed#[40885DE05505D283]) [n:127.0.0.1:56882_    ] o.a.s.c.CorePropertiesLocator Found 1 core definitions
   [junit4]   2> 849573 INFO  (coreLoadExecutor-2612-thread-1-processing-n:127.0.0.1:56882_) [n:127.0.0.1:56882_ c:control_collection   x:collection1] o.a.s.c.ZkController publishing state=down
   [junit4]   2> 849573 INFO  (coreLoadExecutor-2612-thread-1-processing-n:127.0.0.1:56882_) [n:127.0.0.1:56882_ c:control_collection   x:collection1] o.a.s.c.ZkController numShards not found on descriptor - reading it from system property
   [junit4]   2> 849573 INFO  (TEST-BasicDistributedZkTest.test-seed#[40885DE05505D283]) [n:127.0.0.1:56882_    ] o.a.s.s.SolrDispatchFilter user.dir=/home/jenkins/workspace/Lucene-Solr-5.x-Linux/solr/build/solr-core/test/J1
   [junit4]   2> 849573 INFO  (TEST-BasicDistributedZkTest.test-seed#[40885DE05505D283]) [n:127.0.0.1:56882_    ] o.a.s.s.SolrDispatchFilter SolrDispatchFilter.init() done
   [junit4]   2> 849574 INFO  (coreLoadExecutor-2612-thread-1-processing-n:127.0.0.1:56882_) [n:127.0.0.1:56882_ c:control_collection   x:collection1] o.a.s.c.ZkController look for our core node name
   [junit4]   2> 849574 INFO  (OverseerStateUpdate-95151820973801476-127.0.0.1:56882_-n_0000000000) [n:127.0.0.1:56882_    ] o.a.s.c.Overseer processMessage: queueSize: 1, message = {
   [junit4]   2>   "operation":"state",
   [junit4]   2>   "base_url":"http://127.0.0.1:56882",
   [junit4]   2>   "numShards":"1",
   [junit4]   2>   "shard":null,
   [junit4]   2>   "core":"collection1",
   [junit4]   2>   "node_name":"127.0.0.1:56882_",
   [junit4]   2>   "state":"down",
   [junit4]   2>   "roles":null,
   [junit4]   2>   "collection":"control_collection"} current state version: 0
   [junit4]   2> 849575 INFO  (OverseerStateUpdate-95151820973801476-127.0.0.1:56882_-n_0000000000) [n:127.0.0.1:56882_    ] o.a.s.c.o.ReplicaMutator Update state numShards=1 message={
   [junit4]   2>   "operation":"state",
   [junit4]   2>   "base_url":"http://127.0.0.1:56882",
   [junit4]   2>   "numShards":"1",
   [junit4]   2>   "shard":null,
   [junit4]   2>   "core":"collection1",
   [junit4]   2>   "node_name":"127.0.0.1:56882_",
   [junit4]   2>   "state":"down",
   [junit4]   2>   "roles":null,
   [junit4]   2>   "collection":"control_collection"}
   [junit4]   2> 849575 INFO  (OverseerStateUpdate-95151820973801476-127.0.0.1:56882_-n_0000000000) [n:127.0.0.1:56882_    ] o.a.s.c.o.ClusterStateMutator building a new cName: control_collection
   [junit4]   2> 849575 INFO  (OverseerStateUpdate-95151820973801476-127.0.0.1:56882_-n_0000000000) [n:127.0.0.1:56882_    ] o.a.s.c.o.ReplicaMutator Assigning new node to shard shard=shard1
   [junit4]   2> 849576 INFO  (zkCallback-656-thread-1-processing-n:127.0.0.1:56882_) [n:127.0.0.1:56882_    ] o.a.s.c.c.ZkStateReader A cluster state change: [WatchedEvent state:SyncConnected type:NodeDataChanged path:/clusterstate.json], has occurred - updating... (live nodes size: [1])
   [junit4]   2> 849576 INFO  (zkCallback-656-thread-2-processing-n:127.0.0.1:56882_) [n:127.0.0.1:56882_    ] o.a.s.c.c.ZkStateReader A cluster state change: [WatchedEvent state:SyncConnected type:NodeDataChanged path:/clusterstate.json], has occurred - updating... (live nodes size: [1])
   [junit4]   2> 850575 INFO  (coreLoadExecutor-2612-thread-1-processing-n:127.0.0.1:56882_) [n:127.0.0.1:56882_ c:control_collection   x:collection1] o.a.s.c.ZkController waiting to find shard id in clusterstate for collection1
   [junit4]   2> 850575 INFO  (coreLoadExecutor-2612-thread-1-processing-n:127.0.0.1:56882_) [n:127.0.0.1:56882_ c:control_collection   x:collection1] o.a.s.c.ZkController Check for collection zkNode:control_collection
   [junit4]   2> 850575 INFO  (coreLoadExecutor-2612-thread-1-processing-n:127.0.0.1:56882_) [n:127.0.0.1:56882_ c:control_collection   x:collection1] o.a.s.c.ZkController Collection zkNode exists
   [junit4]   2> 850575 INFO  (coreLoadExecutor-2612-thread-1-processing-n:127.0.0.1:56882_) [n:127.0.0.1:56882_ c:control_collection   x:collection1] o.a.s.c.c.ZkStateReader Load collection config from: [/collections/control_collection]
   [junit4]   2> 850576 INFO  (coreLoadExecutor-2612-thread-1-processing-n:127.0.0.1:56882_) [n:127.0.0.1:56882_ c:control_collection   x:collection1] o.a.s.c.c.ZkStateReader path=[/collections/control_collection] [configName]=[conf1] specified config exists in ZooKeeper
   [junit4]   2> 850576 INFO  (coreLoadExecutor-2612-thread-1-processing-n:127.0.0.1:56882_) [n:127.0.0.1:56882_ c:control_collection   x:collection1] o.a.s.c.SolrResourceLoader new SolrResourceLoader for directory: '/home/jenkins/workspace/Lucene-Solr-5.x-Linux/solr/build/solr-core/test/J1/temp/solr.cloud.BasicDistributedZkTest_40885DE05505D283-001/control-001/cores/collection1'
   [junit4]   2> 850576 INFO  (coreLoadExecutor-2612-thread-1-processing-n:127.0.0.1:56882_) [n:127.0.0.1:56882_ c:control_collection   x:collection1] o.a.s.c.SolrResourceLoader JNDI not configured for solr (NoInitialContextEx)
   [junit4]   2> 850576 INFO  (coreLoadExecutor-2612-thread-1-processing-n:127.0.0.1:56882_) [n:127.0.0.1:56882_ c:control_collection   x:collection1] o.a.s.c.SolrResourceLoader solr home defaulted to 'solr/' (could not find system property or JNDI)
   [junit4]   2> 850577 INFO  (coreLoadExecutor-2612-thread-1-processing-n:127.0.0.1:56882_) [n:127.0.0.1:56882_ c:control_collection   x:collection1] o.a.s.c.Config loaded config solrconfig.xml with version 0 
   [junit4]   2> 850583 INFO  (coreLoadExecutor-2612-thread-1-processing-n:127.0.0.1:56882_) [n:127.0.0.1:56882_ c:control_collection   x:collection1] o.a.s.c.SolrConfig current version of requestparams : -1
   [junit4]   2> 850596 INFO  (coreLoadExecutor-2612-thread-1-processing-n:127.0.0.1:56882_) [n:127.0.0.1:56882_ c:control_collection   x:collection1] o.a.s.c.SolrConfig Using Lucene MatchVersion: 5.5.0
   [junit4]   2> 850623 INFO  (coreLoadExecutor-2612-thread-1-processing-n:127.0.0.1:56882_) [n:127.0.0.1:56882_ c:control_collection   x:collection1] o.a.s.c.SolrConfig Loaded SolrConfig: solrconfig.xml
   [junit4]   2> 850630 INFO  (coreLoadExecutor-2612-thread-1-processing-n:127.0.0.1:56882_) [n:127.0.0.1:56882_ c:control_collection   x:collection1] o.a.s.s.IndexSchema [collection1] Schema name=test
   [junit4]   2> 850875 INFO  (coreLoadExecutor-2612-thread-1-processing-n:127.0.0.1:56882_) [n:127.0.0.1:56882_ c:control_collection   x:collection1] o.a.s.s.OpenExchangeRatesOrgProvider Initialized with rates=open-exchange-rates.json, refreshInterval=1440.
   [junit4]   2> 850882 INFO  (coreLoadExecutor-2612-thread-1-processing-n:127.0.0.1:56882_) [n:127.0.0.1:56882_ c:control_collection   x:collection1] o.a.s.s.IndexSchema default search field in schema is text
   [junit4]   2> 850884 INFO  (coreLoadExecutor-2612-thread-1-processing-n:127.0.0.1:56882_) [n:127.0.0.1:56882_ c:control_collection   x:collection1] o.a.s.s.IndexSchema unique key field: id
   [junit4]   2> 850889 INFO  (coreLoadExecutor-2612-thread-1-processing-n:127.0.0.1:56882_) [n:127.0.0.1:56882_ c:control_collection   x:collection1] o.a.s.s.FileExchangeRateProvider Reloading exchange rates from file currency.xml
   [junit4]   2> 850892 INFO  (coreLoadExecutor-2612-thread-1-processing-n:127.0.0.1:56882_) [n:127.0.0.1:56882_ c:control_collection   x:collection1] o.a.s.s.FileExchangeRateProvider Reloading exchange rates from file currency.xml
   [junit4]   2> 850894 INFO  (coreLoadExecutor-2612-thread-1-processing-n:127.0.0.1:56882_) [n:127.0.0.1:56882_ c:control_collection   x:collection1] o.a.s.s.OpenExchangeRatesOrgProvider Reloading exchange rates from open-exchange-rates.json
   [junit4]   2> 850895 WARN  (coreLoadExecutor-2612-thread-1-processing-n:127.0.0.1:56882_) [n:127.0.0.1:56882_ c:control_collection   x:collection1] o.a.s.s.OpenExchangeRatesOrgProvider Unknown key IMPORTANT NOTE
   [junit4]   2> 850895 WARN  (coreLoadExecutor-2612-thread-1-processing-n:127.0.0.1:56882_) [n:127.0.0.1:56882_ c:control_collection   x:collection1] o.a.s.s.OpenExchangeRatesOrgProvider Expected key, got STRING
   [junit4]   2> 850895 INFO  (coreLoadExecutor-2612-thread-1-processing-n:127.0.0.1:56882_) [n:127.0.0.1:56882_ c:control_collection   x:collection1] o.a.s.s.OpenExchangeRatesOrgProvider Reloading exchange rates from open-exchange-rates.json
   [junit4]   2> 850895 WARN  (coreLoadExecutor-2612-thread-1-processing-n:127.0.0.1:56882_) [n:127.0.0.1:56882_ c:control_collection   x:collection1] o.a.s.s.OpenExchangeRatesOrgProvider Unknown key IMPORTANT NOTE
   [junit4]   2> 850895 WARN  (coreLoadExecutor-2612-thread-1-processing-n:127.0.0.1:56882_) [n:127.0.0.1:56882_ c:control_collection   x:collection1] o.a.s.s.OpenExchangeRatesOrgProvider Expected key, got STRING
   [junit4]   2> 850896 INFO  (coreLoadExecutor-2612-thread-1-processing-n:127.0.0.1:56882_) [n:127.0.0.1:56882_ c:control_collection   x:collection1] o.a.s.c.ConfigSetProperties Did not find ConfigSet properties, assuming default properties: Can't find resource 'configsetprops.json' in classpath or '/configs/conf1', cwd=/home/jenkins/workspace/Lucene-Solr-5.x-Linux/solr/build/solr-core/test/J1
   [junit4]   2> 850896 INFO  (coreLoadExecutor-2612-thread-1-processing-n:127.0.0.1:56882_) [n:127.0.0.1:56882_ c:control_collection   x:collection1] o.a.s.c.CoreContainer Creating SolrCore 'collection1' using configuration from collection control_collection
   [junit4]   2> 850896 INFO  (coreLoadExecutor-2612-thread-1-processing-n:127.0.0.1:56882_) [n:127.0.0.1:56882_ c:control_collection s:shard1 r:core_node1 x:collection1] o.a.s.c.SolrCore org.apache.solr.core.MockDirectoryFactory
   [junit4]   2> 850897 INFO  (coreLoadExecutor-2612-thread-1-processing-n:127.0.0.1:56882_) [n:127.0.0.1:56882_ c:control_collection s:shard1 r:core_node1 x:collection1] o.a.s.c.SolrCore [[collection1] ] Opening new SolrCore at [/home/jenkins/workspace/Lucene-Solr-5.x-Linux/solr/build/solr-core/test/J1/temp/solr.cloud.BasicDistributedZkTest_40885DE05505D283-001/control-001/cores/collection1], dataDir=[/home/jenkins/workspace/Lucene-Solr-5.x-Linux/solr/build/solr-core/test/J1/temp/solr.cloud.BasicDistributedZkTest_40885DE05505D283-001/control-001/cores/collection1/data/]
   [junit4]   2> 850897 INFO  (coreLoadExecutor-2612-thread-1-processing-n:127.0.0.1:56882_) [n:127.0.0.1:56882_ c:control_collection s:shard1 r:core_node1 x:collection1] o.a.s.c.JmxMonitoredMap JMX monitoring is enabled. Adding Solr mbeans to JMX Server: com.sun.jmx.mbeanserver.JmxMBeanServer@62858024
   [junit4]   2> 850897 INFO  (coreLoadExecutor-2612-thread-1-processing-n:127.0.0.1:56882_) [n:127.0.0.1:56882_ c:control_collection s:shard1 r:core_node1 x:collection1] o.a.s.c.CachingDirectoryFactory return new directory for /home/jenkins/workspace/Lucene-Solr-5.x-Linux/solr/build/solr-core/test/J1/temp/solr.cloud.BasicDistributedZkTest_40885DE05505D283-001/control-001/cores/collection1/data
   [junit4]   2> 850897 INFO  (coreLoadExecutor-2612-thread-1-processing-n:127.0.0.1:56882_) [n:127.0.0.1:56882_ c:control_collection s:shard1 r:core_node1 x:collection1] o.a.s.c.SolrCore New index directory detected: old=null new=/home/jenkins/workspace/Lucene-Solr-5.x-Linux/solr/build/solr-core/test/J1/temp/solr.cloud.BasicDistributedZkTest_40885DE05505D283-001/control-001/cores/collection1/data/index/
   [junit4]   2> 850897 WARN  (coreLoadExecutor-2612-thread-1-processing-n:127.0.0.1:56882_) [n:127.0.0.1:56882_ c:control_collection s:shard1 r:core_node1 x:collection1] o.a.s.c.SolrCore [collection1] Solr index directory '/home/jenkins/workspace/Lucene-Solr-5.x-Linux/solr/build/solr-core/test/J1/temp/solr.cloud.BasicDistributedZkTest_40885DE05505D283-001/control-001/cores/collection1/data/index' doesn't exist. Creating new index...
   [junit4]   2> 850898 INFO  (coreLoadExecutor-2612-thread-1-processing-n:127.0.0.1:56882_) [n:127.0.0.1:56882_ c:control_collection s:shard1 r:core_node1 x:collection1] o.a.s.c.CachingDirectoryFactory return new directory for /home/jenkins/workspace/Lucene-Solr-5.x-Linux/solr/build/solr-core/test/J1/temp/solr.cloud.BasicDistributedZkTest_40885DE05505D283-001/control-001/cores/collection1/data/index
   [junit4]   2> 850898 INFO  (coreLoadExecutor-2612-thread-1-processing-n:127.0.0.1:56882_) [n:127.0.0.1:56882_ c:control_collection s:shard1 r:core_node1 x:collection1] o.a.s.u.RandomMergePolicy RandomMergePolicy wrapping class org.apache.lucene.index.LogDocMergePolicy: [LogDocMergePolicy: minMergeSize=1000, mergeFactor=21, maxMergeSize=9223372036854775807, maxMergeSizeForForcedMerge=9223372036854775807, calibrateSizeByDeletes=false, maxMergeDocs=2147483647, maxCFSSegmentSizeMB=8.796093022207999E12, noCFSRatio=0.0]
   [junit4]   2> 850898 INFO  (coreLoadExecutor-2612-thread-1-processing-n:127.0.0.1:56882_) [n:127.0.0.1:56882_ c:control_collection s:shard1 r:core_node1 x:collection1] o.a.s.c.SolrDeletionPolicy SolrDeletionPolicy.onCommit: commits: num=1
   [junit4]   2> 	commit{dir=MockDirectoryWrapper(RAMDirectory@3b115ac6 lockFactory=org.apache.lucene.store.SingleInstanceLockFactory@705e9b75),segFN=segments_1,generation=1}
   [junit4]   2> 850898 INFO  (coreLoadExecutor-2612-thread-1-processing-n:127.0.0.1:56882_) [n:127.0.0.1:56882_ c:control_collection s:shard1 r:core_node1 x:collection1] o.a.s.c.SolrDeletionPolicy newest commit generation = 1
   [junit4]   2> 850899 INFO  (OldIndexDirectoryCleanupThreadForCore-collection1) [n:127.0.0.1:56882_ c:control_collection s:shard1 r:core_node1 x:collection1] o.a.s.c.SolrCore Looking for old index directories to cleanup for core collection1 in /home/jenkins/workspace/Lucene-Solr-5.x-Linux/solr/build/solr-core/test/J1/temp/solr.cloud.BasicDistributedZkTest_40885DE05505D283-001/control-001/cores/collection1/data/
   [junit4]   2> 850899 WARN  (OldIndexDirectoryCleanupThreadForCore-collection1) [n:127.0.0.1:56882_ c:control_collection s:shard1 r:core_node1 x:collection1] o.a.s.c.DirectoryFactory /home/jenkins/workspace/Lucene-Solr-5.x-Linux/solr/build/solr-core/test/J1/temp/solr.cloud.BasicDistributedZkTest_40885DE05505D283-001/control-001/cores/collection1/data/ does not point to a valid data directory; skipping clean-up of old index directories.
   [junit4]   2> 850902 INFO  (coreLoadExecutor-2612-thread-1-processing-n:127.0.0.1:56882_) [n:127.0.0.1:56882_ c:control_collection s:shard1 r:core_node1 x:collection1] o.a.s.u.p.UpdateRequestProcessorChain creating updateRequestProcessorChain "nodistrib"
   [junit4]   2> 850902 INFO  (coreLoadExecutor-2612-thread-1-processing-n:127.0.0.1:56882_) [n:127.0.0.1:56882_ c:control_collection s:shard1 r:core_node1 x:collection1] o.a.s.u.p.UpdateRequestProcessorChain creating updateRequestProcessorChain "dedupe"
   [junit4]   2> 850902 INFO  (coreLoadExecutor-2612-thread-1-processing-n:127.0.0.1:56882_) [n:127.0.0.1:56882_ c:control_collection s:shard1 r:core_node1 x:collection1] o.a.s.u.p.UpdateRequestProcessorChain inserting DistributedUpdateProcessorFactory into updateRequestProcessorChain "dedupe"
   [junit4]   2> 850902 INFO  (coreLoadExecutor-2612-thread-1-processing-n:127.0.0.1:56882_) [n:127.0.0.1:56882_ c:control_collection s:shard1 r:core_node1 x:collection1] o.a.s.u.p.UpdateRequestProcessorChain creating updateRequestProcessorChain "stored_sig"
   [junit4]   2> 850902 INFO  (coreLoadExecutor-2612-thread-1-processing-n:127.0.0.1:56882_) [n:127.0.0.1:56882_ c:control_collection s:shard1 r:core_node1 x:collection1] o.a.s.u.p.UpdateRequestProcessorChain inserting DistributedUpdateProcessorFactory into updateRequestProcessorChain "stored_sig"
   [junit4]   2> 850902 INFO  (coreLoadExecutor-2612-thread-1-processing-n:127.0.0.1:56882_) [n:127.0.0.1:56882_ c:control_collection s:shard1 r:core_node1 x:collection1] o.a.s.u.p.UpdateRequestProcessorChain creating updateRequestProcessorChain "distrib-dup-test-chain-explicit"
   [junit4]   2> 850903 INFO  (coreLoadExecutor-2612-thread-1-processing-n:127.0.0.1:56882_) [n:127.0.0.1:56882_ c:control_collection s:shard1 r:core_node1 x:collection1] o.a.s.u.p.UpdateRequestProcessorChain creating updateRequestProcessorChain "distrib-dup-test-chain-implicit"
   [junit4]   2> 850903 INFO  (coreLoadExecutor-2612-thread-1-processing-n:127.0.0.1:56882_) [n:127.0.0.1:56882_ c:control_collection s:shard1 r:core_node1 x:collection1] o.a.s.u.p.UpdateRequestProcessorChain inserting DistributedUpdateProcessorFactory into updateRequestProcessorChain "distrib-dup-test-chain-implicit"
   [junit4]   2> 850903 INFO  (coreLoadExecutor-2612-thread-1-processing-n:127.0.0.1:56882_) [n:127.0.0.1:56882_ c:control_collection s:shard1 r:core_node1 x:collection1] o.a.s.c.SolrCore no updateRequestProcessorChain defined as default, creating implicit default
   [junit4]   2> 850903 WARN  (coreLoadExecutor-2612-thread-1-processing-n:127.0.0.1:56882_) [n:127.0.0.1:56882_ c:control_collection s:shard1 r:core_node1 x:collection1] o.a.s.c.RequestHandlers INVALID paramSet a in requestHandler {type = requestHandler,name = /dump,class = DumpRequestHandler,args = {defaults={a=A,b=B}}}
   [junit4]   2> 850906 INFO  (coreLoadExecutor-2612-thread-1-processing-n:127.0.0.1:56882_) [n:127.0.0.1:56882_ c:control_collection s:shard1 r:core_node1 x:collection1] o.a.s.h.l.XMLLoader xsltCacheLifetimeSeconds=60
   [junit4]   2> 850907 INFO  (coreLoadExecutor-2612-thread-1-processing-n:127.0.0.1:56882_) [n:127.0.0.1:56882_ c:control_collection s:shard1 r:core_node1 x:collection1] o.a.s.h.l.XMLLoader xsltCacheLifetimeSeconds=60
   [junit4]   2> 850908 INFO  (coreLoadExecutor-2612-thread-1-processing-n:127.0.0.1:56882_) [n:127.0.0.1:56882_ c:control_collection s:shard1 r:core_node1 x:collection1] o.a.s.h.l.XMLLoader xsltCacheLifetimeSeconds=60
   [junit4]   2> 850910 INFO  (coreLoadExecutor-2612-thread-1-processing-n:127.0.0.1:56882_) [n:127.0.0.1:56882_ c:control_collection s:shard1 r:core_node1 x:collection1] o.a.s.h.l.XMLLoader xsltCacheLifetimeSeconds=60
   [junit4]   2> 850913 INFO  (coreLoadExecutor-2612-thread-1-processing-n:127.0.0.1:56882_) [n:127.0.0.1:56882_ c:control_collection s:shard1 r:core_node1 x:collection1] o.a.s.c.RequestHandlers Registered paths: /update/csv,/admin/mbeans,/admin/file,/dump,/admin/properties,/update,/admin/plugins,/replication,/schema,/update/json/docs,/update/json,/admin/logging,/get,/admin/threads,/admin/luke,standard,/admin/ping,/admin/system,/admin/segments,/config
   [junit4]   2> 850915 INFO  (coreLoadExecutor-2612-thread-1-processing-n:127.0.0.1:56882_) [n:127.0.0.1:56882_ c:control_collection s:shard1 r:core_node1 x:collection1] o.a.s.c.SolrCore Using default statsCache cache: org.apache.solr.search.stats.LocalStatsCache
   [junit4]   2> 850915 INFO  (coreLoadExecutor-2612-thread-1-processing-n:127.0.0.1:56882_) [n:127.0.0.1:56882_ c:control_collection s:shard1 r:core_node1 x:collection1] o.a.s.u.UpdateHandler Using UpdateLog implementation: org.apache.solr.update.UpdateLog
   [junit4]   2> 850915 INFO  (coreLoadExecutor-2612-thread-1-processing-n:127.0.0.1:56882_) [n:127.0.0.1:56882_ c:control_collection s:shard1 r:core_node1 x:collection1] o.a.s.u.UpdateLog Initializing UpdateLog: dataDir= defaultSyncLevel=FLUSH numRecordsToKeep=100 maxNumLogsToKeep=10 numVersionBuckets=65536
   [junit4]   2> 850916 INFO  (coreLoadExecutor-2612-thread-1-processing-n:127.0.0.1:56882_) [n:127.0.0.1:56882_ c:control_collection s:shard1 r:core_node1 x:collection1] o.a.s.u.CommitTracker Hard AutoCommit: disabled
   [junit4]   2> 850916 INFO  (coreLoadExecutor-2612-thread-1-processing-n:127.0.0.1:56882_) [n:127.0.0.1:56882_ c:control_collection s:shard1 r:core_node1 x:collection1] o.a.s.u.CommitTracker Soft AutoCommit: disabled
   [junit4]   2> 850917 INFO  (coreLoadExecutor-2612-thread-1-processing-n:127.0.0.1:56882_) [n:127.0.0.1:56882_ c:control_collection s:shard1 r:core_node1 x:collection1] o.a.s.u.RandomMergePolicy RandomMergePolicy wrapping class org.apache.lucene.index.MockRandomMergePolicy: org.apache.lucene.index.MockRandomMergePolicy@2f8fb557
   [junit4]   2> 850917 INFO  (coreLoadExecutor-2612-thread-1-processing-n:127.0.0.1:56882_) [n:127.0.0.1:56882_ c:control_collection s:shard1 r:core_node1 x:collection1] o.a.s.c.SolrDeletionPolicy SolrDeletionPolicy.onInit: commits: num=1
   [junit4]   2> 	commit{dir=MockDirectoryWrapper(RAMDirectory@3b115ac6 lockFactory=org.apache.lucene.store.SingleInstanceLockFactory@705e9b75),segFN=segments_1,generation=1}
   [junit4]   2> 850917 INFO  (coreLoadExecutor-2612-thread-1-processing-n:127.0.0.1:56882_) [n:127.0.0.1:56882_ c:control_collection s:shard1 r:core_node1 x:collection1] o.a.s.c.SolrDeletionPolicy newest commit generation = 1
   [junit4]   2> 850917 INFO  (coreLoadExecutor-2612-thread-1-processing-n:127.0.0.1:56882_) [n:127.0.0.1:56882_ c:control_collection s:shard1 r:core_node1 x:collection1] o.a.s.s.SolrIndexSearcher Opening Searcher@c67382d[collection1] main
   [junit4]   2> 850917 INFO  (coreLoadExecutor-2612-thread-1-processing-n:127.0.0.1:56882_) [n:127.0.0.1:56882_ c:control_collection s:shard1 r:core_node1 x:collection1] o.a.s.c.c.ZkStateReader Load collection config from: [/collections/control_collection]
   [junit4]   2> 850918 INFO  (coreLoadExecutor-2612-thread-1-processing-n:127.0.0.1:56882_) [n:127.0.0.1:56882_ c:control_collection s:shard1 r:core_node1 x:collection1] o.a.s.c.c.ZkStateReader path=[/collections/control_collection] [configName]=[conf1] specified config exists in ZooKeeper
   [junit4]   2> 850918 INFO  (coreLoadExecutor-2612-thread-1-processing-n:127.0.0.1:56882_) [n:127.0.0.1:56882_ c:control_collection s:shard1 r:core_node1 x:collection1] o.a.s.r.ManagedResourceStorage Setting up ZooKeeper-based storage for the RestManager with znodeBase: /configs/conf1
   [junit4]   2> 850918 INFO  (coreLoadExecutor-2612-thread-1-processing-n:127.0.0.1:56882_) [n:127.0.0.1:56882_ c:control_collection s:shard1 r:core_node1 x:collection1] o.a.s.r.ManagedResourceStorage Configured ZooKeeperStorageIO with znodeBase: /configs/conf1
   [junit4]   2> 850918 INFO  (coreLoadExecutor-2612-thread-1-processing-n:127.0.0.1:56882_) [n:127.0.0.1:56882_ c:control_collection s:shard1 r:core_node1 x:collection1] o.a.s.r.RestManager Initializing RestManager with initArgs: {}
   [junit4]   2> 850918 INFO  (coreLoadExecutor-2612-thread-1-processing-n:127.0.0.1:56882_) [n:127.0.0.1:56882_ c:control_collection s:shard1 r:core_node1 x:collection1] o.a.s.r.ManagedResourceStorage Reading _rest_managed.json using ZooKeeperStorageIO:path=/configs/conf1
   [junit4]   2> 850918 INFO  (coreLoadExecutor-2612-thread-1-processing-n:127.0.0.1:56882_) [n:127.0.0.1:56882_ c:control_collection s:shard1 r:core_node1 x:collection1] o.a.s.r.ManagedResourceStorage No data found for znode /configs/conf1/_rest_managed.json
   [junit4]   2> 850918 INFO  (coreLoadExecutor-2612-thread-1-processing-n:127.0.0.1:56882_) [n:127.0.0.1:56882_ c:control_collection s:shard1 r:core_node1 x:collection1] o.a.s.r.ManagedResourceStorage Loaded null at path _rest_managed.json using ZooKeeperStorageIO:path=/configs/conf1
   [junit4]   2> 850918 INFO  (coreLoadExecutor-2612-thread-1-processing-n:127.0.0.1:56882_) [n:127.0.0.1:56882_ c:control_collection s:shard1 r:core_node1 x:collection1] o.a.s.r.RestManager Initializing 0 registered ManagedResources
   [junit4]   2> 850919 INFO  (coreLoadExecutor-2612-thread-1-processing-n:127.0.0.1:56882_) [n:127.0.0.1:56882_ c:control_collection s:shard1 r:core_node1 x:collection1] o.a.s.h.ReplicationHandler Commits will be reserved for  10000
   [junit4]   2> 850919 INFO  (searcherExecutor-2613-thread-1-processing-r:core_node1 x:collection1 s:shard1 n:127.0.0.1:56882_ c:control_collection) [n:127.0.0.1:56882_ c:control_collection s:shard1 r:core_node1 x:collection1] o.a.s.c.SolrCore [collection1] Registered new searcher Searcher@c67382d[collection1] main{ExitableDirectoryReader(UninvertingDirectoryReader())}
   [junit4]   2> 850919 INFO  (coreLoadExecutor-2612-thread-1-processing-n:127.0.0.1:56882_) [n:127.0.0.1:56882_ c:control_collection s:shard1 r:core_node1 x:collection1] o.a.s.u.UpdateLog Looking up max value of version field to seed version buckets
   [junit4]   2> 850919 INFO  (coreLoadExecutor-2612-thread-1-processing-n:127.0.0.1:56882_) [n:127.0.0.1:56882_ c:control_collection s:shard1 r:core_node1 x:collection1] o.a.s.u.VersionInfo Refreshing highest value of _version_ for 65536 version buckets from index
   [junit4]   2> 850919 INFO  (coreLoadExecutor-2612-thread-1-processing-n:127.0.0.1:56882_) [n:127.0.0.1:56882_ c:control_collection s:shard1 r:core_node1 x:collection1] o.a.s.u.VersionInfo No terms found for _version_, cannot seed version bucket highest value from index
   [junit4]   2> 850919 INFO  (coreLoadExecutor-2612-thread-1-processing-n:127.0.0.1:56882_) [n:127.0.0.1:56882_ c:control_collection s:shard1 r:core_node1 x:collection1] o.a.s.u.UpdateLog Could not find max version in index or recent updates, using new clock 1522429137283710976
   [junit4]   2> 850921 INFO  (coreLoadExecutor-2612-thread-1-processing-n:127.0.0.1:56882_) [n:127.0.0.1:56882_ c:control_collection s:shard1 r:core_node1 x:collection1] o.a.s.u.UpdateLog Took 1.0ms to seed version buckets with highest version 1522429137283710976
   [junit4]   2> 850921 INFO  (coreLoadExecutor-2612-thread-1-processing-n:127.0.0.1:56882_) [n:127.0.0.1:56882_ c:control_collection s:shard1 r:core_node1 x:collection1] o.a.s.c.ZkController watch zkdir /configs/conf1
   [junit4]   2> 850921 INFO  (coreLoadExecutor-2612-thread-1-processing-n:127.0.0.1:56882_) [n:127.0.0.1:56882_ c:control_collection s:shard1 r:core_node1 x:collection1] o.a.s.c.CoreContainer registering core: collection1
   [junit4]   2> 850922 INFO  (coreZkRegister-2606-thread-1-processing-r:core_node1 x:collection1 s:shard1 n:127.0.0.1:56882_ c:control_collection) [n:127.0.0.1:56882_ c:control_collection s:shard1 r:core_node1 x:collection1] o.a.s.c.ZkController Register replica - core:collection1 address:http://127.0.0.1:56882 collection:control_collection shard:shard1
   [junit4]   2> 850922 INFO  (coreZkRegister-2606-thread-1-processing-r:core_node1 x:collection1 s:shard1 n:127.0.0.1:56882_ c:control_collection) [n:127.0.0.1:56882_ c:control_collection s:shard1 r:core_node1 x:collection1] o.a.s.c.c.SolrZkClient makePath: /collections/control_collection/leader_elect/shard1/election
   [junit4]   2> 850924 INFO  (coreZkRegister-2606-thread-1-processing-r:core_node1 x:collection1 s:shard1 n:127.0.0.1:56882_ c:control_collection) [n:127.0.0.1:56882_ c:control_collection s:shard1 r:core_node1 x:collection1] o.a.s.c.LeaderElector Joined leadership election with path: /collections/control_collection/leader_elect/shard1/election/95151820973801476-core_node1-n_0000000000
   [junit4]   2> 850924 INFO  (coreZkRegister-2606-thread-1-processing-r:core_node1 x:collection1 s:shard1 n:127.0.0.1:56882_ c:control_collection) [n:127.0.0.1:56882_ c:control_collection s:shard1 r:core_node1 x:collection1] o.a.s.c.ShardLeaderElectionContext Running the leader process for shard=shard1 and weAreReplacement=false and leaderVoteWait=10000
   [junit4]   2> 850924 INFO  (coreZkRegister-2606-thread-1-processing-r:core_node1 x:collection1 s:shard1 n:127.0.0.1:56882_ c:control_collection) [n:127.0.0.1:56882_ c:control_collection s:shard1 r:core_node1 x:collection1] o.a.s.c.ShardLeaderElectionContext Enough replicas found to continue.
   [junit4]   2> 850925 INFO  (coreZkRegister-2606-thread-1-processing-r:core_node1 x:collection1 s:shard1 n:127.0.0.1:56882_ c:control_collection) [n:127.0.0.1:56882_ c:control_collection s:shard1 r:core_node1 x:collection1] o.a.s.c.ShardLeaderElectionContext I may be the new leader - try and sync
   [junit4]   2> 850925 INFO  (coreZkRegister-2606-thread-1-processing-r:core_node1 x:collection1 s:shard1 n:127.0.0.1:56882_ c:control_collection) [n:127.0.0.1:56882_ c:control_collection s:shard1 r:core_node1 x:collection1] o.a.s.c.SyncStrategy Sync replicas to http://127.0.0.1:56882/collection1/
   [junit4]   2> 850925 INFO  (coreZkRegister-2606-thread-1-processing-r:core_node1 x:collection1 s:shard1 n:127.0.0.1:56882_ c:control_collection) [n:127.0.0.1:56882_ c:control_collection s:shard1 r:core_node1 x:collection1] o.a.s.c.SyncStrategy Sync Success - now sync replicas to me
   [junit4]   2> 850925 INFO  (OverseerStateUpdate-95151820973801476-127.0.0.1:56882_-n_0000000000) [n:127.0.0.1:56882_    ] o.a.s.c.Overseer processMessage: queueSize: 1, message = {
   [junit4]   2>   "operation":"leader",
   [junit4]   2>   "shard":"shard1",
   [junit4]   2>   "collection":"control_collection"} current state version: 1
   [junit4]   2> 850925 INFO  (coreZkRegister-2606-thread-1-processing-r:core_node1 x:collection1 s:shard1 n:127.0.0.1:56882_ c:control_collection) [n:127.0.0.1:56882_ c:control_collection s:shard1 r:core_node1 x:collection1] o.a.s.c.SyncStrategy http://127.0.0.1:56882/collection1/ has no replicas
   [junit4]   2> 850925 INFO  (coreZkRegister-2606-thread-1-processing-r:core_node1 x:collection1 s:shard1 n:127.0.0.1:56882_ c:control_collection) [n:127.0.0.1:56882_ c:control_collection s:shard1 r:core_node1 x:collection1] o.a.s.c.c.SolrZkClient makePath: /collections/control_collection/leaders/shard1
   [junit4]   2> 850926 INFO  (coreZkRegister-2606-thread-1-processing-r:core_node1 x:collection1 s:shard1 n:127.0.0.1:56882_ c:control_collection) [n:127.0.0.1:56882_ c:control_collection s:shard1 r:core_node1 x:collection1] o.a.s.c.ShardLeaderElectionContextBase Creating leader registration node
   [junit4]   2> 850927 INFO  (coreZkRegister-2606-thread-1-processing-r:core_node1 x:collection1 s:shard1 n:127.0.0.1:56882_ c:control_collection) [n:127.0.0.1:56882_ c:control_collection s:shard1 r:core_node1 x:collection1] o.a.s.c.ShardLeaderElectionContext I am the new leader: http://127.0.0.1:56882/collection1/ shard1
   [junit4]   2> 850928 INFO  (OverseerStateUpdate-95151820973801476-127.0.0.1:56882_-n_0000000000) [n:127.0.0.1:56882_    ] o.a.s.c.Overseer processMessage: queueSize: 1, message = {
   [junit4]   2>   "operation":"leader",
   [junit4]   2>   "shard":"shard1",
   [junit4]   2>   "collection":"control_collection",
   [junit4]   2>   "base_url":"http://127.0.0.1:56882",
   [junit4]   2>   "core":"collection1",
   [junit4]   2>   "state":"active"} current state version: 1
   [junit4]   2> 851029 INFO  (zkCallback-656-thread-2-processing-n:127.0.0.1:56882_) [n:127.0.0.1:56882_    ] o.a.s.c.c.ZkStateReader A cluster state change: [WatchedEvent state:SyncConnected type:NodeDataChanged path:/clusterstate.json], has occurred - updating... (live nodes size: [1])
   [junit4]   2> 851029 INFO  (zkCallback-656-thread-1-processing-n:127.0.0.1:56882_) [n:127.0.0.1:56882_    ] o.a.s.c.c.ZkStateReader A cluster state change: [WatchedEvent state:SyncConnected type:NodeDataChanged path:/clusterstate.json], has occurred - updating... (live nodes size: [1])
   [junit4]   2> 851075 INFO  (TEST-BasicDistributedZkTest.test-seed#[40885DE05505D283]) [    ] o.a.s.c.c.SolrZkClient Using default ZkCredentialsProvider
   [junit4]   2> 851075 INFO  (TEST-BasicDistributedZkTest.test-seed#[40885DE05505D283]) [    ] o.a.s.c.c.ConnectionManager Waiting for client to connect to ZooKeeper
   [junit4]   2> 851077 INFO  (zkCallback-658-thread-1) [    ] o.a.s.c.c.ConnectionManager Watcher org.apache.solr.common.cloud.ConnectionManager@124fe4af name:ZooKeeperConnection Watcher:127.0.0.1:41554/solr got event WatchedEvent state:SyncConnected type:None path:null path:null type:None
   [junit4]   2> 851077 INFO  (TEST-BasicDistributedZkTest.test-seed#[40885DE05505D283]) [    ] o.a.s.c.c.ConnectionManager Client is connected to ZooKeeper
   [junit4]   2> 851077 INFO  (TEST-BasicDistributedZkTest.test-seed#[40885DE05505D283]) [    ] o.a.s.c.c.SolrZkClient Using default ZkACLProvider
   [junit4]   2> 851077 INFO  (TEST-BasicDistributedZkTest.test-seed#[40885DE05505D283]) [    ] o.a.s.c.c.ZkStateReader Updating cluster state from ZooKeeper... 
   [junit4]   2> 851078 INFO  (TEST-BasicDistributedZkTest.test-seed#[40885DE05505D283]) [    ] o.a.s.c.ChaosMonkey monkey: init - expire sessions:false cause connection loss:false
   [junit4]   2> 851079 INFO  (coreZkRegister-2606-thread-1-processing-r:core_node1 x:collection1 s:shard1 n:127.0.0.1:56882_ c:control_collection) [n:127.0.0.1:56882_ c:control_collection s:shard1 r:core_node1 x:collection1] o.a.s.c.ZkController We are http://127.0.0.1:56882/collection1/ and leader is http://127.0.0.1:56882/collection1/
   [junit4]   2> 851079 INFO  (coreZkRegister-2606-thread-1-processing-r:core_node1 x:collection1 s:shard1 n:127.0.0.1:56882_ c:control_collection) [n:127.0.0.1:56882_ c:control_collection s:shard1 r:core_node1 x:collection1] o.a.s.c.ZkController No LogReplay needed for core=collection1 baseURL=http://127.0.0.1:56882
   [junit4]   2> 851079 INFO  (coreZkRegister-2606-thread-1-processing-r:core_node1 x:collection1 s:shard1 n:127.0.0.1:56882_ c:control_collection) [n:127.0.0.1:56882_ c:control_collection s:shard1 r:core_node1 x:collection1] o.a.s.c.ZkController I am the leader, no recovery necessary
   [junit4]   2> 851079 INFO  (coreZkRegister-2606-thread-1-processing-r:core_node1 x:collection1 s:shard1 n:127.0.0.1:56882_ c:control_collection) [n:127.0.0.1:56882_ c:control_collection s:shard1 r:core_node1 x:collection1] o.a.s.c.ZkController publishing state=active
   [junit4]   2> 851079 INFO  (coreZkRegister-2606-thread-1-processing-r:core_node1 x:collection1 s:shard1 n:127.0.0.1:56882_ c:control_collection) [n:127.0.0.1:56882_ c:control_collection s:shard1 r:core_node1 x:collection1] o.a.s.c.ZkController numShards not found on descriptor - reading it from system property
   [junit4]   2> 851083 INFO  (OverseerStateUpdate-95151820973801476-127.0.0.1:56882_-n_0000000000) [n:127.0.0.1:56882_    ] o.a.s.c.Overseer processMessage: queueSize: 1, message = {
   [junit4]   2>   "operation":"state",
   [junit4]   2>   "base_url":"http://127.0.0.1:56882",
   [junit4]   2>   "numShards":"2",
   [junit4]   2>   "core_node_name":"core_node1",
   [junit4]   2>   "shard":"shard1",
   [junit4]   2>   "core":"collection1",
   [junit4]   2>   "node_name":"127.0.0.1:56882_",
   [junit4]   2>   "state":"active",
   [junit4]   2>   "roles":null,
   [junit4]   2>   "collection":"control_collection"} current state version: 2
   [junit4]   2> 851083 INFO  (OverseerStateUpdate-95151820973801476-127.0.0.1:56882_-n_0000000000) [n:127.0.0.1:56882_    ] o.a.s.c.o.ReplicaMutator Update state numShards=2 message={
   [junit4]   2>   "operation":"state",
   [junit4]   2>   "base_url":"http://127.0.0.1:56882",
   [junit4]   2>   "numShards":"2",
   [junit4]   2>   "core_node_name":"core_node1",
   [junit4]   2>   "shard":"shard1",
   [junit4]   2>   "core":"collection1",
   [junit4]   2>   "node_name":"127.0.0.1:56882_",
   [junit4]   2>   "state":"active",
   [junit4]   2>   "roles":null,
   [junit4]   2>   "collection":"control_collection"}
   [junit4]   2> 851124 INFO  (TEST-BasicDistributedZkTest.test-seed#[40885DE05505D283]) [    ] o.a.s.SolrTestCaseJ4 Writing core.properties file to /home/jenkins/workspace/Lucene-Solr-5.x-Linux/solr/build/solr-core/test/J1/temp/solr.cloud.BasicDistributedZkTest_40885DE05505D283-001/shard-1-001/cores/collection1
   [junit4]   2> 851124 INFO  (TEST-BasicDistributedZkTest.test-seed#[40885DE05505D283]) [    ] o.a.s.c.AbstractFullDistribZkTestBase create jetty 1 in directory /home/jenkins/workspace/Lucene-Solr-5.x-Linux/solr/build/solr-core/test/J1/temp/solr.cloud.BasicDistributedZkTest_40885DE05505D283-001/shard-1-001
   [junit4]   2> 851125 INFO  (TEST-BasicDistributedZkTest.test-seed#[40885DE05505D283]) [    ] o.e.j.s.Server jetty-9.2.13.v20150730
   [junit4]   2> 851126 INFO  (TEST-BasicDistributedZkTest.test-seed#[40885DE05505D283]) [    ] o.e.j.s.h.ContextHandler Started o.e.j.s.ServletContextHandler@39119231{/,null,AVAILABLE}
   [junit4]   2> 851126 INFO  (TEST-BasicDistributedZkTest.test-seed#[40885DE05505D283]) [    ] o.e.j.s.ServerConnector Started ServerConnector@121700f{HTTP/1.1}{127.0.0.1:34287}
   [junit4]   2> 851126 INFO  (TEST-BasicDistributedZkTest.test-seed#[40885DE05505D283]) [    ] o.e.j.s.Server Started @852837ms
   [junit4]   2> 851126 INFO  (TEST-BasicDistributedZkTest.test-seed#[40885DE05505D283]) [    ] o.a.s.c.s.e.JettySolrRunner Jetty properties: {solr.data.dir=/home/jenkins/workspace/Lucene-Solr-5.x-Linux/solr/build/solr-core/test/J1/temp/solr.cloud.BasicDistributedZkTest_40885DE05505D283-001/tempDir-001/jetty1, hostPort=34287, solrconfig=solrconfig.xml, coreRootDirectory=/home/jenkins/workspace/Lucene-Solr-5.x-Linux/solr/build/solr-core/test/J1/../../../../../../../../../home/jenkins/workspace/Lucene-Solr-5.x-Linux/solr/build/solr-core/test/J1/temp/solr.cloud.BasicDistributedZkTest_40885DE05505D283-001/shard-1-001/cores, hostContext=/}
   [junit4]   2> 851127 INFO  (TEST-BasicDistributedZkTest.test-seed#[40885DE05505D283]) [    ] o.a.s.s.SolrDispatchFilter SolrDispatchFilter.init(): sun.misc.Launcher$AppClassLoader@43036651
   [junit4]   2> 851127 INFO  (TEST-BasicDistributedZkTest.test-seed#[40885DE05505D283]) [    ] o.a.s.c.SolrResourceLoader new SolrResourceLoader for directory: '/home/jenkins/workspace/Lucene-Solr-5.x-Linux/solr/build/solr-core/test/J1/temp/solr.cloud.BasicDistributedZkTest_40885DE05505D283-001/shard-1-001'
   [junit4]   2> 851127 INFO  (TEST-BasicDistributedZkTest.test-seed#[40885DE05505D283]) [    ] o.a.s.c.SolrResourceLoader JNDI not configured for solr (NoInitialContextEx)
   [junit4]   2> 851127 INFO  (TEST-BasicDistributedZkTest.test-seed#[40885DE05505D283]) [    ] o.a.s.c.SolrResourceLoader solr home defaulted to 'solr/' (could not find system property or JNDI)
   [junit4]   2> 851127 INFO  (TEST-BasicDistributedZkTest.test-seed#[40885DE05505D283]) [    ] o.a.s.c.c.SolrZkClient Using default ZkCredentialsProvider
   [junit4]   2> 851127 INFO  (TEST-BasicDistributedZkTest.test-seed#[40885DE05505D283]) [    ] o.a.s.c.c.ConnectionManager Waiting for client to connect to ZooKeeper
   [junit4]   2> 851128 INFO  (zkCallback-659-thread-1) [    ] o.a.s.c.c.ConnectionManager Watcher org.apache.solr.common.cloud.ConnectionManager@1cbfc3e6 name:ZooKeeperConnection Watcher:127.0.0.1:41554/solr got event WatchedEvent state:SyncConnected type:None path:null path:null type:None
   [junit4]   2> 851129 INFO  (TEST-BasicDistributedZkTest.test-seed#[40885DE05505D283]) [    ] o.a.s.c.c.ConnectionManager Client is connected to ZooKeeper
   [junit4]   2> 851129 INFO  (TEST-BasicDistributedZkTest.test-seed#[40885DE05505D283]) [    ] o.a.s.c.c.SolrZkClient Using default ZkACLProvider
   [junit4]   2> 851129 INFO  (TEST-BasicDistributedZkTest.test-seed#[40885DE05505D283]) [    ] o.a.s.s.SolrDispatchFilter Loading solr.xml from SolrHome (not found in ZooKeeper)
   [junit4]   2> 851129 INFO  (TEST-BasicDistributedZkTest.test-seed#[40885DE05505D283]) [    ] o.a.s.c.SolrXmlConfig Loading container configuration from /home/jenkins/workspace/Lucene-Solr-5.x-Linux/solr/build/solr-core/test/J1/temp/solr.cloud.BasicDistributedZkTest_40885DE05505D283-001/shard-1-001/solr.xml
   [junit4]   2> 851155 INFO  (TEST-BasicDistributedZkTest.test-seed#[40885DE05505D283]) [    ] o.a.s.c.CorePropertiesLocator Config-defined core root directory: /home/jenkins/workspace/Lucene-Solr-5.x-Linux/solr/build/solr-core/test/J1/../../../../../../../../../home/jenkins/workspace/Lucene-Solr-5.x-Linux/solr/build/solr-core/test/J1/temp/solr.cloud.BasicDistributedZkTest_40885DE05505D283-001/shard-1-001/cores
   [junit4]   2> 851155 INFO  (TEST-BasicDistributedZkTest.test-seed#[40885DE05505D283]) [    ] o.a.s.c.CoreContainer New CoreContainer 1286485726
   [junit4]   2> 851155 INFO  (TEST-BasicDistributedZkTest.test-seed#[40885DE05505D283]) [    ] o.a.s.c.CoreContainer Loading cores into CoreContainer [instanceDir=/home/jenkins/workspace/Lucene-Solr-5.x-Linux/solr/build/solr-core/test/J1/temp/solr.cloud.BasicDistributedZkTest_40885DE05505D283-001/shard-1-001]
   [junit4]   2> 851155 WARN  (TEST-BasicDistributedZkTest.test-seed#[40885DE05505D283]) [    ] o.a.s.c.CoreContainer Couldn't add files from /home/jenkins/workspace/Lucene-Solr-5.x-Linux/solr/build/solr-core/test/J1/temp/solr.cloud.BasicDistributedZkTest_40885DE05505D283-001/shard-1-001/lib to classpath: /home/jenkins/workspace/Lucene-Solr-5.x-Linux/solr/build/solr-core/test/J1/temp/solr.cloud.BasicDistributedZkTest_40885DE05505D283-001/shard-1-001/lib
   [junit4]   2> 851155 INFO  (TEST-BasicDistributedZkTest.test-seed#[40885DE05505D283]) [    ] o.a.s.h.c.HttpShardHandlerFactory created with socketTimeout : 90000,urlScheme : ,connTimeout : 15000,maxConnectionsPerHost : 20,maxConnections : 10000,corePoolSize : 0,maximumPoolSize : 2147483647,maxThreadIdleTime : 5,sizeOfQueue : -1,fairnessPolicy : false,useRetries : false,
   [junit4]   2> 851157 INFO  (TEST-BasicDistributedZkTest.test-seed#[40885DE05505D283]) [    ] o.a.s.u.UpdateShardHandler Creating UpdateShardHandler HTTP client with params: socketTimeout=340000&connTimeout=45000&retry=true
   [junit4]   2> 851157 INFO  (TEST-BasicDistributedZkTest.test-seed#[40885DE05505D283]) [    ] o.a.s.l.LogWatcher SLF4J impl is org.slf4j.impl.Log4jLoggerFactory
   [junit4]   2> 851157 INFO  (TEST-BasicDistributedZkTest.test-seed#[40885DE05505D283]) [    ] o.a.s.l.LogWatcher Registering Log Listener [Log4j (org.slf4j.impl.Log4jLoggerFactory)]
   [junit4]   2> 851157 INFO  (TEST-BasicDistributedZkTest.test-seed#[40885DE05505D283]) [    ] o.a.s.c.ZkContainer Zookeeper client=127.0.0.1:41554/solr
   [junit4]   2> 851157 INFO  (TEST-BasicDistributedZkTest.test-seed#[40885DE05505D283]) [    ] o.a.s.c.ZkController zkHost includes chroot
   [junit4]   2> 851157 INFO  (TEST-BasicDistributedZkTest.test-seed#[40885DE05505D283]) [    ] o.a.s.c.c.SolrZkClient Using default ZkCredentialsProvider
   [junit4]   2> 851158 INFO  (TEST-BasicDistributedZkTest.test-seed#[40885DE05505D283]) [    ] o.a.s.c.c.ConnectionManager Waiting for client to connect to ZooKeeper
   [junit4]   2> 851159 INFO  (zkCallback-661-thread-1) [    ] o.a.s.c.c.ConnectionManager Watcher o

[...truncated too long message...]

ception
   [junit4]   2> EndOfStreamException: Unable to read additional data from client sessionid 0x1520c1fd41e000b, likely client has closed socket
   [junit4]   2> 	at org.apache.zookeeper.server.NIOServerCnxn.doIO(NIOServerCnxn.java:228)
   [junit4]   2> 	at org.apache.zookeeper.server.NIOServerCnxnFactory.run(NIOServerCnxnFactory.java:208)
   [junit4]   2> 	at java.lang.Thread.run(Thread.java:745)
   [junit4]   2> 1650044 WARN  (zkCallback-1117-thread-1-processing-n:127.0.0.1:57467_solr) [n:127.0.0.1:57467_solr    ] o.a.s.c.c.ZkStateReader ZooKeeper watch triggered, but Solr cannot talk to ZK: [KeeperErrorCode = Session expired for /live_nodes]
   [junit4]   2> 1650044 WARN  (zkCallback-1120-thread-1-processing-n:127.0.0.1:47004_solr) [n:127.0.0.1:47004_solr    ] o.a.s.c.c.ZkStateReader ZooKeeper watch triggered, but Solr cannot talk to ZK: [KeeperErrorCode = Session expired for /live_nodes]
   [junit4]   2> 1650044 WARN  (zkCallback-1120-thread-2-processing-n:127.0.0.1:47004_solr) [n:127.0.0.1:47004_solr    ] o.a.s.c.LeaderElector 
   [junit4]   2> org.apache.zookeeper.KeeperException$SessionExpiredException: KeeperErrorCode = Session expired for /overseer_elect/election
   [junit4]   2> 	at org.apache.zookeeper.KeeperException.create(KeeperException.java:127)
   [junit4]   2> 	at org.apache.zookeeper.KeeperException.create(KeeperException.java:51)
   [junit4]   2> 	at org.apache.zookeeper.ZooKeeper.getChildren(ZooKeeper.java:1472)
   [junit4]   2> 	at org.apache.solr.common.cloud.SolrZkClient$6.execute(SolrZkClient.java:328)
   [junit4]   2> 	at org.apache.solr.common.cloud.SolrZkClient$6.execute(SolrZkClient.java:325)
   [junit4]   2> 	at org.apache.solr.common.cloud.ZkCmdExecutor.retryOperation(ZkCmdExecutor.java:61)
   [junit4]   2> 	at org.apache.solr.common.cloud.SolrZkClient.getChildren(SolrZkClient.java:325)
   [junit4]   2> 	at org.apache.solr.cloud.LeaderElector.checkIfIamLeader(LeaderElector.java:108)
   [junit4]   2> 	at org.apache.solr.cloud.LeaderElector.access$200(LeaderElector.java:59)
   [junit4]   2> 	at org.apache.solr.cloud.LeaderElector$ElectionWatcher.process(LeaderElector.java:389)
   [junit4]   2> 	at org.apache.solr.common.cloud.SolrZkClient$3$1.run(SolrZkClient.java:264)
   [junit4]   2> 	at java.util.concurrent.Executors$RunnableAdapter.call(Executors.java:471)
   [junit4]   2> 	at java.util.concurrent.FutureTask.run(FutureTask.java:262)
   [junit4]   2> 	at org.apache.solr.common.util.ExecutorUtil$MDCAwareThreadPoolExecutor$1.run(ExecutorUtil.java:232)
   [junit4]   2> 	at java.util.concurrent.ThreadPoolExecutor.runWorker(ThreadPoolExecutor.java:1145)
   [junit4]   2> 	at java.util.concurrent.ThreadPoolExecutor$Worker.run(ThreadPoolExecutor.java:615)
   [junit4]   2> 	at java.lang.Thread.run(Thread.java:745)
   [junit4]   2> 1650045 INFO  (jetty-launcher-1100-thread-5) [    ] o.e.j.s.h.ContextHandler Stopped o.e.j.s.ServletContextHandler@33a63125{/solr,null,UNAVAILABLE}
   [junit4]   2> 1650045 INFO  (jetty-launcher-1100-thread-4) [    ] o.e.j.s.h.ContextHandler Stopped o.e.j.s.ServletContextHandler@2f035516{/solr,null,UNAVAILABLE}
   [junit4]   2> 1650047 INFO  (TEST-TestAuthenticationFramework.testCollectionCreateWithoutCoresThenDelete-seed#[40885DE05505D283]) [    ] o.a.s.c.ZkTestServer connecting to 127.0.0.1:50415 50415
   [junit4]   2> 1650063 INFO  (Thread-3464) [    ] o.a.s.c.ZkTestServer connecting to 127.0.0.1:50415 50415
   [junit4]   2> 1650064 WARN  (Thread-3464) [    ] o.a.s.c.ZkTestServer Watch limit violations: 
   [junit4]   2> Maximum concurrent create/delete watches above limit:
   [junit4]   2> 
   [junit4]   2> 	7	/solr/aliases.json
   [junit4]   2> 	5	/solr/security.json
   [junit4]   2> 
   [junit4]   2> Maximum concurrent data watches above limit:
   [junit4]   2> 
   [junit4]   2> 	7	/solr/clusterstate.json
   [junit4]   2> 
   [junit4]   2> Maximum concurrent children watches above limit:
   [junit4]   2> 
   [junit4]   2> 	7	/solr/live_nodes
   [junit4]   2> 	7	/solr/collections
   [junit4]   2> 
   [junit4]   2> NOTE: leaving temporary files on disk at: /home/jenkins/workspace/Lucene-Solr-5.x-Linux/solr/build/solr-core/test/J1/temp/solr.cloud.TestAuthenticationFramework_40885DE05505D283-001
   [junit4]   2> Jan 04, 2016 10:12:45 AM com.carrotsearch.randomizedtesting.ThreadLeakControl checkThreadLeaks
   [junit4]   2> WARNING: Will linger awaiting termination of 1 leaked thread(s).
   [junit4]   2> NOTE: test params are: codec=Asserting(Lucene54): {_version_=PostingsFormat(name=LuceneVarGapDocFreqInterval), multiDefault=PostingsFormat(name=Memory doPackFST= false), id=Lucene50(blocksize=128), range_facet_i_dv=PostingsFormat(name=Memory doPackFST= false), intDefault=PostingsFormat(name=LuceneVarGapDocFreqInterval), timestamp=PostingsFormat(name=Memory doPackFST= false), range_facet_l_dv=Lucene50(blocksize=128), range_facet_l=PostingsFormat(name=Memory doPackFST= false)}, docValues:{range_facet_i_dv=DocValuesFormat(name=Direct), timestamp=DocValuesFormat(name=Direct), range_facet_l_dv=DocValuesFormat(name=Asserting)}, sim=DefaultSimilarity, locale=is_IS, timezone=Europe/Simferopol
   [junit4]   2> NOTE: Linux 3.19.0-42-generic amd64/Oracle Corporation 1.7.0_80 (64-bit)/cpus=12,threads=1,free=191019520,total=518979584
   [junit4]   2> NOTE: All tests run in this JVM: [TestLeaderElectionZkExpiry, NumericFieldsTest, AnalysisErrorHandlingTest, DistributedFacetPivotWhiteBoxTest, AddSchemaFieldsUpdateProcessorFactoryTest, TestSimpleTrackingShardHandler, SpatialRPTFieldTypeTest, TestInitParams, DistributedDebugComponentTest, SolrInfoMBeanTest, OverseerRolesTest, SchemaVersionSpecificBehaviorTest, TestSolr4Spatial2, TestQueryTypes, SpellCheckComponentTest, RecoveryAfterSoftCommitTest, TestCloudPivotFacet, TestMaxScoreQueryParser, TestFiltering, TestSystemIdResolver, SpatialFilterTest, TestWordDelimiterFilterFactory, TestOrdValues, TestExceedMaxTermLength, CSVRequestHandlerTest, AssignTest, ChaosMonkeyNothingIsSafeTest, DeleteLastCustomShardedReplicaTest, SortByFunctionTest, TestSortingResponseWriter, SolrIndexSplitterTest, PKIAuthenticationIntegrationTest, OpenExchangeRatesOrgProviderTest, DistributedFacetPivotLongTailTest, PreAnalyzedUpdateProcessorTest, MoreLikeThisHandlerTest, TestRandomForceMergePolicy, ChaosMonkeySafeLeaderTest, TermsComponentTest, TestConfigSetImmutable, TestPartialUpdateDeduplication, SolrPluginUtilsTest, TestCursorMarkWithoutUniqueKey, DistributedSuggestComponentTest, TestHashPartitioner, TermVectorComponentTest, SuggestComponentContextFilterQueryTest, TestDistribDocBasedVersion, DateRangeFieldTest, SharedFSAutoReplicaFailoverUtilsTest, DocExpirationUpdateProcessorFactoryTest, TestQueryUtils, HdfsDirectoryTest, ZkSolrClientTest, TestUpdate, LeaderInitiatedRecoveryOnShardRestartTest, TestCodecSupport, TestRestManager, TestFieldSortValues, OutOfBoxZkACLAndCredentialsProvidersTest, BitVectorTest, SpellPossibilityIteratorTest, TestManagedSynonymFilterFactory, TestFieldTypeCollectionResource, CoreAdminCreateDiscoverTest, SolrXmlInZkTest, ConnectionManagerTest, TestExactStatsCache, UniqFieldsUpdateProcessorFactoryTest, TestOverriddenPrefixQueryForCustomFieldType, ZkControllerTest, TestRestoreCore, JavabinLoaderTest, TestRawResponseWriter, SolrCmdDistributorTest, TestManagedSchema, HttpPartitionTest, TestDistributedGrouping, TestTestInjection, TestCollapseQParserPlugin, TestSolrCloudWithKerberosAlt, TestRuleBasedAuthorizationPlugin, TestConfigReload, HdfsDirectoryFactoryTest, FileUtilsTest, CollectionReloadTest, TestBinaryResponseWriter, TestDocumentBuilder, CloudMLTQParserTest, SolrIndexConfigTest, ZkStateReaderTest, TestDynamicFieldResource, BasicDistributedZkTest, BasicDistributedZk2Test, BasicZkTest, ClusterStateUpdateTest, LeaderElectionTest, AutoCommitTest, TestReload, TestRangeQuery, TestCoreContainer, SimpleFacetsTest, SolrCoreTest, QueryElevationComponentTest, ConvertedLegacyTest, BasicFunctionalityTest, TestIndexSearcher, SoftAutoCommitTest, SolrRequestParserTest, TestStressLucene, SuggesterWFSTTest, NoCacheHeaderTest, SolrCoreCheckLockOnStartupTest, StatelessScriptUpdateProcessorFactoryTest, DistanceFunctionTest, XsltUpdateRequestHandlerTest, TestSurroundQueryParser, DisMaxRequestHandlerTest, TestWriterPerf, TestOmitPositions, RequestHandlersTest, DocumentBuilderTest, TestSolrQueryParser, FastVectorHighlighterTest, IndexSchemaRuntimeFieldTest, TestJmxIntegration, UpdateRequestProcessorFactoryTest, MBeansHandlerTest, JsonLoaderTest, TestPHPSerializedResponseWriter, TestComponentsName, SearchHandlerTest, TestLFUCache, CleanupOldIndexTest, DistributedQueueTest, DistributedVersionInfoTest, TestAuthenticationFramework]
   [junit4] Completed [454/562 (5!)] on J1 in 147.88s, 7 tests, 1 failure <<< FAILURES!

[...truncated 364 lines...]
BUILD FAILED
/home/jenkins/workspace/Lucene-Solr-5.x-Linux/build.xml:794: The following error occurred while executing this line:
/home/jenkins/workspace/Lucene-Solr-5.x-Linux/build.xml:738: The following error occurred while executing this line:
/home/jenkins/workspace/Lucene-Solr-5.x-Linux/build.xml:59: The following error occurred while executing this line:
/home/jenkins/workspace/Lucene-Solr-5.x-Linux/solr/build.xml:233: The following error occurred while executing this line:
/home/jenkins/workspace/Lucene-Solr-5.x-Linux/solr/common-build.xml:526: The following error occurred while executing this line:
/home/jenkins/workspace/Lucene-Solr-5.x-Linux/lucene/common-build.xml:1444: The following error occurred while executing this line:
/home/jenkins/workspace/Lucene-Solr-5.x-Linux/lucene/common-build.xml:1000: There were test failures: 562 suites (7 ignored), 2231 tests, 1 error, 4 failures, 83 ignored (39 assumptions) [seed: 40885DE05505D283]

Total time: 53 minutes 7 seconds
Build step 'Invoke Ant' marked build as failure
Archiving artifacts
[WARNINGS] Skipping publisher since build result is FAILURE
Recording test results
Email was triggered for: Failure - Any
Sending email for trigger: Failure - Any



Mime
View raw message