lucene-dev mailing list archives

Site index · List index
Message view « Date » · « Thread »
Top « Date » · « Thread »
From Apache Jenkins Server <jenk...@builds.apache.org>
Subject [JENKINS] Lucene-Solr-NightlyTests-5.x - Build # 1071 - Still Failing
Date Sun, 10 Jan 2016 14:02:34 GMT
Build: https://builds.apache.org/job/Lucene-Solr-NightlyTests-5.x/1071/

1 tests failed.
FAILED:  org.apache.solr.cloud.CollectionsAPIDistributedZkTest.test

Error Message:
Captured an uncaught exception in thread: Thread[id=11471, name=collection1, state=RUNNABLE, group=TGRP-CollectionsAPIDistributedZkTest]

Stack Trace:
com.carrotsearch.randomizedtesting.UncaughtExceptionError: Captured an uncaught exception in thread: Thread[id=11471, name=collection1, state=RUNNABLE, group=TGRP-CollectionsAPIDistributedZkTest]
Caused by: org.apache.solr.client.solrj.impl.HttpSolrClient$RemoteSolrException: Error from server at https://127.0.0.1:44248/a: collection already exists: awholynewstresscollection_collection1_0
	at __randomizedtesting.SeedInfo.seed([6084C11E6ED1C557]:0)
	at org.apache.solr.client.solrj.impl.HttpSolrClient.executeMethod(HttpSolrClient.java:575)
	at org.apache.solr.client.solrj.impl.HttpSolrClient.request(HttpSolrClient.java:241)
	at org.apache.solr.client.solrj.impl.HttpSolrClient.request(HttpSolrClient.java:230)
	at org.apache.solr.client.solrj.impl.LBHttpSolrClient.doRequest(LBHttpSolrClient.java:372)
	at org.apache.solr.client.solrj.impl.LBHttpSolrClient.request(LBHttpSolrClient.java:325)
	at org.apache.solr.client.solrj.impl.CloudSolrClient.sendRequest(CloudSolrClient.java:1100)
	at org.apache.solr.client.solrj.impl.CloudSolrClient.requestWithRetryOnStaleState(CloudSolrClient.java:871)
	at org.apache.solr.client.solrj.impl.CloudSolrClient.request(CloudSolrClient.java:807)
	at org.apache.solr.client.solrj.SolrClient.request(SolrClient.java:1220)
	at org.apache.solr.cloud.AbstractFullDistribZkTestBase.createCollection(AbstractFullDistribZkTestBase.java:1574)
	at org.apache.solr.cloud.AbstractFullDistribZkTestBase.createCollection(AbstractFullDistribZkTestBase.java:1595)
	at org.apache.solr.cloud.CollectionsAPIDistributedZkTest$1CollectionThread.run(CollectionsAPIDistributedZkTest.java:881)




Build Log:
[...truncated 10967 lines...]
   [junit4] Suite: org.apache.solr.cloud.CollectionsAPIDistributedZkTest
   [junit4]   2> Creating dataDir: /x1/jenkins/jenkins-slave/workspace/Lucene-Solr-NightlyTests-5.x/solr/build/solr-core/test/J0/temp/solr.cloud.CollectionsAPIDistributedZkTest_6084C11E6ED1C557-001/init-core-data-001
   [junit4]   2> 1148256 INFO  (SUITE-CollectionsAPIDistributedZkTest-seed#[6084C11E6ED1C557]-worker) [    ] o.a.s.SolrTestCaseJ4 Randomized ssl (true) and clientAuth (true)
   [junit4]   2> 1148256 INFO  (SUITE-CollectionsAPIDistributedZkTest-seed#[6084C11E6ED1C557]-worker) [    ] o.a.s.BaseDistributedSearchTestCase Setting hostContext system property: /a/
   [junit4]   2> 1148260 INFO  (TEST-CollectionsAPIDistributedZkTest.test-seed#[6084C11E6ED1C557]) [    ] o.a.s.c.ZkTestServer STARTING ZK TEST SERVER
   [junit4]   2> 1148260 INFO  (Thread-6464) [    ] o.a.s.c.ZkTestServer client port:0.0.0.0/0.0.0.0:0
   [junit4]   2> 1148260 INFO  (Thread-6464) [    ] o.a.s.c.ZkTestServer Starting server
   [junit4]   2> 1148360 INFO  (TEST-CollectionsAPIDistributedZkTest.test-seed#[6084C11E6ED1C557]) [    ] o.a.s.c.ZkTestServer start zk server on port:58605
   [junit4]   2> 1148360 INFO  (TEST-CollectionsAPIDistributedZkTest.test-seed#[6084C11E6ED1C557]) [    ] o.a.s.c.c.SolrZkClient Using default ZkCredentialsProvider
   [junit4]   2> 1148361 INFO  (TEST-CollectionsAPIDistributedZkTest.test-seed#[6084C11E6ED1C557]) [    ] o.a.s.c.c.ConnectionManager Waiting for client to connect to ZooKeeper
   [junit4]   2> 1148364 INFO  (zkCallback-1014-thread-1) [    ] o.a.s.c.c.ConnectionManager Watcher org.apache.solr.common.cloud.ConnectionManager@7af29c70 name:ZooKeeperConnection Watcher:127.0.0.1:58605 got event WatchedEvent state:SyncConnected type:None path:null path:null type:None
   [junit4]   2> 1148364 INFO  (TEST-CollectionsAPIDistributedZkTest.test-seed#[6084C11E6ED1C557]) [    ] o.a.s.c.c.ConnectionManager Client is connected to ZooKeeper
   [junit4]   2> 1148364 INFO  (TEST-CollectionsAPIDistributedZkTest.test-seed#[6084C11E6ED1C557]) [    ] o.a.s.c.c.SolrZkClient Using default ZkACLProvider
   [junit4]   2> 1148364 INFO  (TEST-CollectionsAPIDistributedZkTest.test-seed#[6084C11E6ED1C557]) [    ] o.a.s.c.c.SolrZkClient makePath: /solr
   [junit4]   2> 1148367 INFO  (TEST-CollectionsAPIDistributedZkTest.test-seed#[6084C11E6ED1C557]) [    ] o.a.s.c.c.SolrZkClient Using default ZkCredentialsProvider
   [junit4]   2> 1148367 INFO  (TEST-CollectionsAPIDistributedZkTest.test-seed#[6084C11E6ED1C557]) [    ] o.a.s.c.c.ConnectionManager Waiting for client to connect to ZooKeeper
   [junit4]   2> 1148368 INFO  (zkCallback-1015-thread-1) [    ] o.a.s.c.c.ConnectionManager Watcher org.apache.solr.common.cloud.ConnectionManager@fb58e9a name:ZooKeeperConnection Watcher:127.0.0.1:58605/solr got event WatchedEvent state:SyncConnected type:None path:null path:null type:None
   [junit4]   2> 1148368 INFO  (TEST-CollectionsAPIDistributedZkTest.test-seed#[6084C11E6ED1C557]) [    ] o.a.s.c.c.ConnectionManager Client is connected to ZooKeeper
   [junit4]   2> 1148369 INFO  (TEST-CollectionsAPIDistributedZkTest.test-seed#[6084C11E6ED1C557]) [    ] o.a.s.c.c.SolrZkClient Using default ZkACLProvider
   [junit4]   2> 1148369 INFO  (TEST-CollectionsAPIDistributedZkTest.test-seed#[6084C11E6ED1C557]) [    ] o.a.s.c.c.SolrZkClient makePath: /collections/collection1
   [junit4]   2> 1148370 INFO  (TEST-CollectionsAPIDistributedZkTest.test-seed#[6084C11E6ED1C557]) [    ] o.a.s.c.c.SolrZkClient makePath: /collections/collection1/shards
   [junit4]   2> 1148372 INFO  (TEST-CollectionsAPIDistributedZkTest.test-seed#[6084C11E6ED1C557]) [    ] o.a.s.c.c.SolrZkClient makePath: /collections/control_collection
   [junit4]   2> 1148373 INFO  (TEST-CollectionsAPIDistributedZkTest.test-seed#[6084C11E6ED1C557]) [    ] o.a.s.c.c.SolrZkClient makePath: /collections/control_collection/shards
   [junit4]   2> 1148375 INFO  (TEST-CollectionsAPIDistributedZkTest.test-seed#[6084C11E6ED1C557]) [    ] o.a.s.c.AbstractZkTestCase put /x1/jenkins/jenkins-slave/workspace/Lucene-Solr-NightlyTests-5.x/solr/core/src/test-files/solr/collection1/conf/solrconfig-tlog.xml to /configs/conf1/solrconfig.xml
   [junit4]   2> 1148375 INFO  (TEST-CollectionsAPIDistributedZkTest.test-seed#[6084C11E6ED1C557]) [    ] o.a.s.c.c.SolrZkClient makePath: /configs/conf1/solrconfig.xml
   [junit4]   2> 1148377 INFO  (TEST-CollectionsAPIDistributedZkTest.test-seed#[6084C11E6ED1C557]) [    ] o.a.s.c.AbstractZkTestCase put /x1/jenkins/jenkins-slave/workspace/Lucene-Solr-NightlyTests-5.x/solr/core/src/test-files/solr/collection1/conf/schema.xml to /configs/conf1/schema.xml
   [junit4]   2> 1148377 INFO  (TEST-CollectionsAPIDistributedZkTest.test-seed#[6084C11E6ED1C557]) [    ] o.a.s.c.c.SolrZkClient makePath: /configs/conf1/schema.xml
   [junit4]   2> 1148379 INFO  (TEST-CollectionsAPIDistributedZkTest.test-seed#[6084C11E6ED1C557]) [    ] o.a.s.c.AbstractZkTestCase put /x1/jenkins/jenkins-slave/workspace/Lucene-Solr-NightlyTests-5.x/solr/core/src/test-files/solr/collection1/conf/solrconfig.snippet.randomindexconfig.xml to /configs/conf1/solrconfig.snippet.randomindexconfig.xml
   [junit4]   2> 1148379 INFO  (TEST-CollectionsAPIDistributedZkTest.test-seed#[6084C11E6ED1C557]) [    ] o.a.s.c.c.SolrZkClient makePath: /configs/conf1/solrconfig.snippet.randomindexconfig.xml
   [junit4]   2> 1148381 INFO  (TEST-CollectionsAPIDistributedZkTest.test-seed#[6084C11E6ED1C557]) [    ] o.a.s.c.AbstractZkTestCase put /x1/jenkins/jenkins-slave/workspace/Lucene-Solr-NightlyTests-5.x/solr/core/src/test-files/solr/collection1/conf/stopwords.txt to /configs/conf1/stopwords.txt
   [junit4]   2> 1148381 INFO  (TEST-CollectionsAPIDistributedZkTest.test-seed#[6084C11E6ED1C557]) [    ] o.a.s.c.c.SolrZkClient makePath: /configs/conf1/stopwords.txt
   [junit4]   2> 1148383 INFO  (TEST-CollectionsAPIDistributedZkTest.test-seed#[6084C11E6ED1C557]) [    ] o.a.s.c.AbstractZkTestCase put /x1/jenkins/jenkins-slave/workspace/Lucene-Solr-NightlyTests-5.x/solr/core/src/test-files/solr/collection1/conf/protwords.txt to /configs/conf1/protwords.txt
   [junit4]   2> 1148383 INFO  (TEST-CollectionsAPIDistributedZkTest.test-seed#[6084C11E6ED1C557]) [    ] o.a.s.c.c.SolrZkClient makePath: /configs/conf1/protwords.txt
   [junit4]   2> 1148384 INFO  (TEST-CollectionsAPIDistributedZkTest.test-seed#[6084C11E6ED1C557]) [    ] o.a.s.c.AbstractZkTestCase put /x1/jenkins/jenkins-slave/workspace/Lucene-Solr-NightlyTests-5.x/solr/core/src/test-files/solr/collection1/conf/currency.xml to /configs/conf1/currency.xml
   [junit4]   2> 1148384 INFO  (TEST-CollectionsAPIDistributedZkTest.test-seed#[6084C11E6ED1C557]) [    ] o.a.s.c.c.SolrZkClient makePath: /configs/conf1/currency.xml
   [junit4]   2> 1148386 INFO  (TEST-CollectionsAPIDistributedZkTest.test-seed#[6084C11E6ED1C557]) [    ] o.a.s.c.AbstractZkTestCase put /x1/jenkins/jenkins-slave/workspace/Lucene-Solr-NightlyTests-5.x/solr/core/src/test-files/solr/collection1/conf/enumsConfig.xml to /configs/conf1/enumsConfig.xml
   [junit4]   2> 1148386 INFO  (TEST-CollectionsAPIDistributedZkTest.test-seed#[6084C11E6ED1C557]) [    ] o.a.s.c.c.SolrZkClient makePath: /configs/conf1/enumsConfig.xml
   [junit4]   2> 1148388 INFO  (TEST-CollectionsAPIDistributedZkTest.test-seed#[6084C11E6ED1C557]) [    ] o.a.s.c.AbstractZkTestCase put /x1/jenkins/jenkins-slave/workspace/Lucene-Solr-NightlyTests-5.x/solr/core/src/test-files/solr/collection1/conf/open-exchange-rates.json to /configs/conf1/open-exchange-rates.json
   [junit4]   2> 1148388 INFO  (TEST-CollectionsAPIDistributedZkTest.test-seed#[6084C11E6ED1C557]) [    ] o.a.s.c.c.SolrZkClient makePath: /configs/conf1/open-exchange-rates.json
   [junit4]   2> 1148390 INFO  (TEST-CollectionsAPIDistributedZkTest.test-seed#[6084C11E6ED1C557]) [    ] o.a.s.c.AbstractZkTestCase put /x1/jenkins/jenkins-slave/workspace/Lucene-Solr-NightlyTests-5.x/solr/core/src/test-files/solr/collection1/conf/mapping-ISOLatin1Accent.txt to /configs/conf1/mapping-ISOLatin1Accent.txt
   [junit4]   2> 1148390 INFO  (TEST-CollectionsAPIDistributedZkTest.test-seed#[6084C11E6ED1C557]) [    ] o.a.s.c.c.SolrZkClient makePath: /configs/conf1/mapping-ISOLatin1Accent.txt
   [junit4]   2> 1148392 INFO  (TEST-CollectionsAPIDistributedZkTest.test-seed#[6084C11E6ED1C557]) [    ] o.a.s.c.AbstractZkTestCase put /x1/jenkins/jenkins-slave/workspace/Lucene-Solr-NightlyTests-5.x/solr/core/src/test-files/solr/collection1/conf/old_synonyms.txt to /configs/conf1/old_synonyms.txt
   [junit4]   2> 1148392 INFO  (TEST-CollectionsAPIDistributedZkTest.test-seed#[6084C11E6ED1C557]) [    ] o.a.s.c.c.SolrZkClient makePath: /configs/conf1/old_synonyms.txt
   [junit4]   2> 1148394 INFO  (TEST-CollectionsAPIDistributedZkTest.test-seed#[6084C11E6ED1C557]) [    ] o.a.s.c.AbstractZkTestCase put /x1/jenkins/jenkins-slave/workspace/Lucene-Solr-NightlyTests-5.x/solr/core/src/test-files/solr/collection1/conf/synonyms.txt to /configs/conf1/synonyms.txt
   [junit4]   2> 1148394 INFO  (TEST-CollectionsAPIDistributedZkTest.test-seed#[6084C11E6ED1C557]) [    ] o.a.s.c.c.SolrZkClient makePath: /configs/conf1/synonyms.txt
   [junit4]   2> 1148396 INFO  (TEST-CollectionsAPIDistributedZkTest.test-seed#[6084C11E6ED1C557]) [    ] o.a.s.c.c.SolrZkClient Using default ZkCredentialsProvider
   [junit4]   2> 1148397 INFO  (TEST-CollectionsAPIDistributedZkTest.test-seed#[6084C11E6ED1C557]) [    ] o.a.s.c.c.ConnectionManager Waiting for client to connect to ZooKeeper
   [junit4]   2> 1148398 INFO  (zkCallback-1016-thread-1) [    ] o.a.s.c.c.ConnectionManager Watcher org.apache.solr.common.cloud.ConnectionManager@7a50967f name:ZooKeeperConnection Watcher:127.0.0.1:58605/solr got event WatchedEvent state:SyncConnected type:None path:null path:null type:None
   [junit4]   2> 1148398 INFO  (TEST-CollectionsAPIDistributedZkTest.test-seed#[6084C11E6ED1C557]) [    ] o.a.s.c.c.ConnectionManager Client is connected to ZooKeeper
   [junit4]   2> 1148398 INFO  (TEST-CollectionsAPIDistributedZkTest.test-seed#[6084C11E6ED1C557]) [    ] o.a.s.c.c.SolrZkClient Using default ZkACLProvider
   [junit4]   2> 1148701 INFO  (TEST-CollectionsAPIDistributedZkTest.test-seed#[6084C11E6ED1C557]) [    ] o.a.s.SolrTestCaseJ4 Writing core.properties file to /x1/jenkins/jenkins-slave/workspace/Lucene-Solr-NightlyTests-5.x/solr/build/solr-core/test/J0/temp/solr.cloud.CollectionsAPIDistributedZkTest_6084C11E6ED1C557-001/control-001/cores/collection1
   [junit4]   2> 1148703 INFO  (TEST-CollectionsAPIDistributedZkTest.test-seed#[6084C11E6ED1C557]) [    ] o.e.j.s.Server jetty-9.2.13.v20150730
   [junit4]   2> 1148705 INFO  (TEST-CollectionsAPIDistributedZkTest.test-seed#[6084C11E6ED1C557]) [    ] o.e.j.s.h.ContextHandler Started o.e.j.s.ServletContextHandler@2d18227a{/a,null,AVAILABLE}
   [junit4]   2> 1148711 INFO  (TEST-CollectionsAPIDistributedZkTest.test-seed#[6084C11E6ED1C557]) [    ] o.e.j.s.ServerConnector Started ServerConnector@671a7f2f{SSL-http/1.1}{127.0.0.1:38201}
   [junit4]   2> 1148711 INFO  (TEST-CollectionsAPIDistributedZkTest.test-seed#[6084C11E6ED1C557]) [    ] o.e.j.s.Server Started @1151657ms
   [junit4]   2> 1148712 INFO  (TEST-CollectionsAPIDistributedZkTest.test-seed#[6084C11E6ED1C557]) [    ] o.a.s.c.s.e.JettySolrRunner Jetty properties: {solr.data.dir=/x1/jenkins/jenkins-slave/workspace/Lucene-Solr-NightlyTests-5.x/solr/build/solr-core/test/J0/temp/solr.cloud.CollectionsAPIDistributedZkTest_6084C11E6ED1C557-001/tempDir-001/control/data, hostContext=/a, coreRootDirectory=/x1/jenkins/jenkins-slave/workspace/Lucene-Solr-NightlyTests-5.x/solr/build/solr-core/test/J0/temp/solr.cloud.CollectionsAPIDistributedZkTest_6084C11E6ED1C557-001/control-001/cores, hostPort=38201}
   [junit4]   2> 1148712 INFO  (TEST-CollectionsAPIDistributedZkTest.test-seed#[6084C11E6ED1C557]) [    ] o.a.s.s.SolrDispatchFilter SolrDispatchFilter.init(): sun.misc.Launcher$AppClassLoader@7b3cb2c6
   [junit4]   2> 1148712 INFO  (TEST-CollectionsAPIDistributedZkTest.test-seed#[6084C11E6ED1C557]) [    ] o.a.s.c.SolrResourceLoader new SolrResourceLoader for directory: '/x1/jenkins/jenkins-slave/workspace/Lucene-Solr-NightlyTests-5.x/solr/build/solr-core/test/J0/temp/solr.cloud.CollectionsAPIDistributedZkTest_6084C11E6ED1C557-001/control-001'
   [junit4]   2> 1148712 INFO  (TEST-CollectionsAPIDistributedZkTest.test-seed#[6084C11E6ED1C557]) [    ] o.a.s.c.SolrResourceLoader JNDI not configured for solr (NoInitialContextEx)
   [junit4]   2> 1148712 INFO  (TEST-CollectionsAPIDistributedZkTest.test-seed#[6084C11E6ED1C557]) [    ] o.a.s.c.SolrResourceLoader solr home defaulted to 'solr/' (could not find system property or JNDI)
   [junit4]   2> 1148712 INFO  (TEST-CollectionsAPIDistributedZkTest.test-seed#[6084C11E6ED1C557]) [    ] o.a.s.c.c.SolrZkClient Using default ZkCredentialsProvider
   [junit4]   2> 1148713 INFO  (TEST-CollectionsAPIDistributedZkTest.test-seed#[6084C11E6ED1C557]) [    ] o.a.s.c.c.ConnectionManager Waiting for client to connect to ZooKeeper
   [junit4]   2> 1148714 INFO  (zkCallback-1017-thread-1) [    ] o.a.s.c.c.ConnectionManager Watcher org.apache.solr.common.cloud.ConnectionManager@1795fff0 name:ZooKeeperConnection Watcher:127.0.0.1:58605/solr got event WatchedEvent state:SyncConnected type:None path:null path:null type:None
   [junit4]   2> 1148714 INFO  (TEST-CollectionsAPIDistributedZkTest.test-seed#[6084C11E6ED1C557]) [    ] o.a.s.c.c.ConnectionManager Client is connected to ZooKeeper
   [junit4]   2> 1148715 INFO  (TEST-CollectionsAPIDistributedZkTest.test-seed#[6084C11E6ED1C557]) [    ] o.a.s.c.c.SolrZkClient Using default ZkACLProvider
   [junit4]   2> 1148715 INFO  (TEST-CollectionsAPIDistributedZkTest.test-seed#[6084C11E6ED1C557]) [    ] o.a.s.s.SolrDispatchFilter Loading solr.xml from SolrHome (not found in ZooKeeper)
   [junit4]   2> 1148716 INFO  (TEST-CollectionsAPIDistributedZkTest.test-seed#[6084C11E6ED1C557]) [    ] o.a.s.c.SolrXmlConfig Loading container configuration from /x1/jenkins/jenkins-slave/workspace/Lucene-Solr-NightlyTests-5.x/solr/build/solr-core/test/J0/temp/solr.cloud.CollectionsAPIDistributedZkTest_6084C11E6ED1C557-001/control-001/solr.xml
   [junit4]   2> 1148735 INFO  (TEST-CollectionsAPIDistributedZkTest.test-seed#[6084C11E6ED1C557]) [    ] o.a.s.c.CorePropertiesLocator Config-defined core root directory: /x1/jenkins/jenkins-slave/workspace/Lucene-Solr-NightlyTests-5.x/solr/build/solr-core/test/J0/temp/solr.cloud.CollectionsAPIDistributedZkTest_6084C11E6ED1C557-001/control-001/cores
   [junit4]   2> 1148735 INFO  (TEST-CollectionsAPIDistributedZkTest.test-seed#[6084C11E6ED1C557]) [    ] o.a.s.c.CoreContainer New CoreContainer 1632270101
   [junit4]   2> 1148735 INFO  (TEST-CollectionsAPIDistributedZkTest.test-seed#[6084C11E6ED1C557]) [    ] o.a.s.c.CoreContainer Loading cores into CoreContainer [instanceDir=/x1/jenkins/jenkins-slave/workspace/Lucene-Solr-NightlyTests-5.x/solr/build/solr-core/test/J0/temp/solr.cloud.CollectionsAPIDistributedZkTest_6084C11E6ED1C557-001/control-001]
   [junit4]   2> 1148735 WARN  (TEST-CollectionsAPIDistributedZkTest.test-seed#[6084C11E6ED1C557]) [    ] o.a.s.c.CoreContainer Couldn't add files from /x1/jenkins/jenkins-slave/workspace/Lucene-Solr-NightlyTests-5.x/solr/build/solr-core/test/J0/temp/solr.cloud.CollectionsAPIDistributedZkTest_6084C11E6ED1C557-001/control-001/lib to classpath: /x1/jenkins/jenkins-slave/workspace/Lucene-Solr-NightlyTests-5.x/solr/build/solr-core/test/J0/temp/solr.cloud.CollectionsAPIDistributedZkTest_6084C11E6ED1C557-001/control-001/lib
   [junit4]   2> 1148736 INFO  (TEST-CollectionsAPIDistributedZkTest.test-seed#[6084C11E6ED1C557]) [    ] o.a.s.h.c.HttpShardHandlerFactory created with socketTimeout : 90000,urlScheme : ,connTimeout : 15000,maxConnectionsPerHost : 20,maxConnections : 10000,corePoolSize : 0,maximumPoolSize : 2147483647,maxThreadIdleTime : 5,sizeOfQueue : -1,fairnessPolicy : false,useRetries : false,
   [junit4]   2> 1148740 INFO  (TEST-CollectionsAPIDistributedZkTest.test-seed#[6084C11E6ED1C557]) [    ] o.a.s.u.UpdateShardHandler Creating UpdateShardHandler HTTP client with params: socketTimeout=340000&connTimeout=45000&retry=true
   [junit4]   2> 1148742 INFO  (TEST-CollectionsAPIDistributedZkTest.test-seed#[6084C11E6ED1C557]) [    ] o.a.s.l.LogWatcher SLF4J impl is org.slf4j.impl.Log4jLoggerFactory
   [junit4]   2> 1148742 INFO  (TEST-CollectionsAPIDistributedZkTest.test-seed#[6084C11E6ED1C557]) [    ] o.a.s.l.LogWatcher Registering Log Listener [Log4j (org.slf4j.impl.Log4jLoggerFactory)]
   [junit4]   2> 1148742 INFO  (TEST-CollectionsAPIDistributedZkTest.test-seed#[6084C11E6ED1C557]) [    ] o.a.s.c.ZkContainer Zookeeper client=127.0.0.1:58605/solr
   [junit4]   2> 1148743 INFO  (TEST-CollectionsAPIDistributedZkTest.test-seed#[6084C11E6ED1C557]) [    ] o.a.s.c.ZkController zkHost includes chroot
   [junit4]   2> 1148743 INFO  (TEST-CollectionsAPIDistributedZkTest.test-seed#[6084C11E6ED1C557]) [    ] o.a.s.c.c.SolrZkClient Using default ZkCredentialsProvider
   [junit4]   2> 1148743 INFO  (TEST-CollectionsAPIDistributedZkTest.test-seed#[6084C11E6ED1C557]) [    ] o.a.s.c.c.ConnectionManager Waiting for client to connect to ZooKeeper
   [junit4]   2> 1148745 INFO  (zkCallback-1019-thread-1) [    ] o.a.s.c.c.ConnectionManager Watcher org.apache.solr.common.cloud.ConnectionManager@58dfbc6c name:ZooKeeperConnection Watcher:127.0.0.1:58605 got event WatchedEvent state:SyncConnected type:None path:null path:null type:None
   [junit4]   2> 1148745 INFO  (TEST-CollectionsAPIDistributedZkTest.test-seed#[6084C11E6ED1C557]) [    ] o.a.s.c.c.ConnectionManager Client is connected to ZooKeeper
   [junit4]   2> 1148746 INFO  (TEST-CollectionsAPIDistributedZkTest.test-seed#[6084C11E6ED1C557]) [    ] o.a.s.c.c.SolrZkClient Using default ZkACLProvider
   [junit4]   2> 1148747 INFO  (TEST-CollectionsAPIDistributedZkTest.test-seed#[6084C11E6ED1C557]) [n:127.0.0.1:38201_a    ] o.a.s.c.c.ConnectionManager Waiting for client to connect to ZooKeeper
   [junit4]   2> 1148749 INFO  (zkCallback-1020-thread-1-processing-n:127.0.0.1:38201_a) [n:127.0.0.1:38201_a    ] o.a.s.c.c.ConnectionManager Watcher org.apache.solr.common.cloud.ConnectionManager@c574eae name:ZooKeeperConnection Watcher:127.0.0.1:58605/solr got event WatchedEvent state:SyncConnected type:None path:null path:null type:None
   [junit4]   2> 1148749 INFO  (TEST-CollectionsAPIDistributedZkTest.test-seed#[6084C11E6ED1C557]) [n:127.0.0.1:38201_a    ] o.a.s.c.c.ConnectionManager Client is connected to ZooKeeper
   [junit4]   2> 1148750 INFO  (TEST-CollectionsAPIDistributedZkTest.test-seed#[6084C11E6ED1C557]) [n:127.0.0.1:38201_a    ] o.a.s.c.c.SolrZkClient makePath: /overseer/queue
   [junit4]   2> 1148752 INFO  (TEST-CollectionsAPIDistributedZkTest.test-seed#[6084C11E6ED1C557]) [n:127.0.0.1:38201_a    ] o.a.s.c.c.SolrZkClient makePath: /overseer/collection-queue-work
   [junit4]   2> 1148756 INFO  (TEST-CollectionsAPIDistributedZkTest.test-seed#[6084C11E6ED1C557]) [n:127.0.0.1:38201_a    ] o.a.s.c.c.SolrZkClient makePath: /overseer/collection-map-running
   [junit4]   2> 1148761 INFO  (TEST-CollectionsAPIDistributedZkTest.test-seed#[6084C11E6ED1C557]) [n:127.0.0.1:38201_a    ] o.a.s.c.c.SolrZkClient makePath: /overseer/collection-map-completed
   [junit4]   2> 1148763 INFO  (TEST-CollectionsAPIDistributedZkTest.test-seed#[6084C11E6ED1C557]) [n:127.0.0.1:38201_a    ] o.a.s.c.c.SolrZkClient makePath: /overseer/collection-map-failure
   [junit4]   2> 1148766 INFO  (TEST-CollectionsAPIDistributedZkTest.test-seed#[6084C11E6ED1C557]) [n:127.0.0.1:38201_a    ] o.a.s.c.c.SolrZkClient makePath: /live_nodes
   [junit4]   2> 1148768 INFO  (TEST-CollectionsAPIDistributedZkTest.test-seed#[6084C11E6ED1C557]) [n:127.0.0.1:38201_a    ] o.a.s.c.c.SolrZkClient makePath: /aliases.json
   [junit4]   2> 1148770 INFO  (TEST-CollectionsAPIDistributedZkTest.test-seed#[6084C11E6ED1C557]) [n:127.0.0.1:38201_a    ] o.a.s.c.c.SolrZkClient makePath: /clusterstate.json
   [junit4]   2> 1148771 INFO  (TEST-CollectionsAPIDistributedZkTest.test-seed#[6084C11E6ED1C557]) [n:127.0.0.1:38201_a    ] o.a.s.c.c.SolrZkClient makePath: /security.json
   [junit4]   2> 1148772 INFO  (TEST-CollectionsAPIDistributedZkTest.test-seed#[6084C11E6ED1C557]) [n:127.0.0.1:38201_a    ] o.a.s.c.ZkController Register node as live in ZooKeeper:/live_nodes/127.0.0.1:38201_a
   [junit4]   2> 1148781 INFO  (TEST-CollectionsAPIDistributedZkTest.test-seed#[6084C11E6ED1C557]) [n:127.0.0.1:38201_a    ] o.a.s.c.c.SolrZkClient makePath: /live_nodes/127.0.0.1:38201_a
   [junit4]   2> 1148783 INFO  (TEST-CollectionsAPIDistributedZkTest.test-seed#[6084C11E6ED1C557]) [n:127.0.0.1:38201_a    ] o.a.s.c.c.SolrZkClient makePath: /overseer_elect
   [junit4]   2> 1148784 INFO  (TEST-CollectionsAPIDistributedZkTest.test-seed#[6084C11E6ED1C557]) [n:127.0.0.1:38201_a    ] o.a.s.c.c.SolrZkClient makePath: /overseer_elect/election
   [junit4]   2> 1148785 INFO  (TEST-CollectionsAPIDistributedZkTest.test-seed#[6084C11E6ED1C557]) [n:127.0.0.1:38201_a    ] o.a.s.c.Overseer Overseer (id=null) closing
   [junit4]   2> 1148785 INFO  (TEST-CollectionsAPIDistributedZkTest.test-seed#[6084C11E6ED1C557]) [n:127.0.0.1:38201_a    ] o.a.s.c.LeaderElector Joined leadership election with path: /overseer_elect/election/95186531110289413-127.0.0.1:38201_a-n_0000000000
   [junit4]   2> 1148786 INFO  (TEST-CollectionsAPIDistributedZkTest.test-seed#[6084C11E6ED1C557]) [n:127.0.0.1:38201_a    ] o.a.s.c.OverseerElectionContext I am going to be the leader 127.0.0.1:38201_a
   [junit4]   2> 1148786 INFO  (TEST-CollectionsAPIDistributedZkTest.test-seed#[6084C11E6ED1C557]) [n:127.0.0.1:38201_a    ] o.a.s.c.c.SolrZkClient makePath: /overseer_elect/leader
   [junit4]   2> 1148787 INFO  (TEST-CollectionsAPIDistributedZkTest.test-seed#[6084C11E6ED1C557]) [n:127.0.0.1:38201_a    ] o.a.s.c.Overseer Overseer (id=95186531110289413-127.0.0.1:38201_a-n_0000000000) starting
   [junit4]   2> 1148788 INFO  (TEST-CollectionsAPIDistributedZkTest.test-seed#[6084C11E6ED1C557]) [n:127.0.0.1:38201_a    ] o.a.s.c.c.SolrZkClient makePath: /overseer/queue-work
   [junit4]   2> 1148793 INFO  (TEST-CollectionsAPIDistributedZkTest.test-seed#[6084C11E6ED1C557]) [n:127.0.0.1:38201_a    ] o.a.s.c.OverseerAutoReplicaFailoverThread Starting OverseerAutoReplicaFailoverThread autoReplicaFailoverWorkLoopDelay=10000 autoReplicaFailoverWaitAfterExpiration=10000 autoReplicaFailoverBadNodeExpiration=60000
   [junit4]   2> 1148798 INFO  (OverseerCollectionConfigSetProcessor-95186531110289413-127.0.0.1:38201_a-n_0000000000) [n:127.0.0.1:38201_a    ] o.a.s.c.OverseerTaskProcessor Process current queue of overseer operations
   [junit4]   2> 1148800 INFO  (OverseerStateUpdate-95186531110289413-127.0.0.1:38201_a-n_0000000000) [n:127.0.0.1:38201_a    ] o.a.s.c.Overseer Starting to work on the main queue
   [junit4]   2> 1148802 INFO  (OverseerStateUpdate-95186531110289413-127.0.0.1:38201_a-n_0000000000) [n:127.0.0.1:38201_a    ] o.a.s.c.c.ZkStateReader Updating cluster state from ZooKeeper... 
   [junit4]   2> 1148807 INFO  (TEST-CollectionsAPIDistributedZkTest.test-seed#[6084C11E6ED1C557]) [n:127.0.0.1:38201_a    ] o.a.s.c.c.ZkStateReader Updating cluster state from ZooKeeper... 
   [junit4]   2> 1148846 INFO  (TEST-CollectionsAPIDistributedZkTest.test-seed#[6084C11E6ED1C557]) [n:127.0.0.1:38201_a    ] o.a.s.c.CoreContainer Security conf doesn't exist. Skipping setup for authorization module.
   [junit4]   2> 1148846 INFO  (TEST-CollectionsAPIDistributedZkTest.test-seed#[6084C11E6ED1C557]) [n:127.0.0.1:38201_a    ] o.a.s.c.CoreContainer No authentication plugin used.
   [junit4]   2> 1148847 INFO  (TEST-CollectionsAPIDistributedZkTest.test-seed#[6084C11E6ED1C557]) [n:127.0.0.1:38201_a    ] o.a.s.c.CorePropertiesLocator Looking for core definitions underneath /x1/jenkins/jenkins-slave/workspace/Lucene-Solr-NightlyTests-5.x/solr/build/solr-core/test/J0/temp/solr.cloud.CollectionsAPIDistributedZkTest_6084C11E6ED1C557-001/control-001/cores
   [junit4]   2> 1148849 INFO  (TEST-CollectionsAPIDistributedZkTest.test-seed#[6084C11E6ED1C557]) [n:127.0.0.1:38201_a    ] o.a.s.c.CoreDescriptor Created CoreDescriptor: {coreNodeName=, loadOnStartup=true, collection=control_collection, schema=schema.xml, name=collection1, dataDir=data/, configSetProperties=configsetprops.json, shard=, config=solrconfig.xml, transient=false}
   [junit4]   2> 1148849 INFO  (TEST-CollectionsAPIDistributedZkTest.test-seed#[6084C11E6ED1C557]) [n:127.0.0.1:38201_a    ] o.a.s.c.CorePropertiesLocator Found core collection1 in /x1/jenkins/jenkins-slave/workspace/Lucene-Solr-NightlyTests-5.x/solr/build/solr-core/test/J0/temp/solr.cloud.CollectionsAPIDistributedZkTest_6084C11E6ED1C557-001/control-001/cores/collection1
   [junit4]   2> 1148849 INFO  (TEST-CollectionsAPIDistributedZkTest.test-seed#[6084C11E6ED1C557]) [n:127.0.0.1:38201_a    ] o.a.s.c.CorePropertiesLocator Found 1 core definitions
   [junit4]   2> 1148851 INFO  (TEST-CollectionsAPIDistributedZkTest.test-seed#[6084C11E6ED1C557]) [n:127.0.0.1:38201_a    ] o.a.s.s.SolrDispatchFilter user.dir=/x1/jenkins/jenkins-slave/workspace/Lucene-Solr-NightlyTests-5.x/solr/build/solr-core/test/J0
   [junit4]   2> 1148851 INFO  (TEST-CollectionsAPIDistributedZkTest.test-seed#[6084C11E6ED1C557]) [n:127.0.0.1:38201_a    ] o.a.s.s.SolrDispatchFilter SolrDispatchFilter.init() done
   [junit4]   2> 1148851 INFO  (coreLoadExecutor-2699-thread-1-processing-n:127.0.0.1:38201_a) [n:127.0.0.1:38201_a c:control_collection   x:collection1] o.a.s.c.ZkController publishing state=down
   [junit4]   2> 1148851 INFO  (coreLoadExecutor-2699-thread-1-processing-n:127.0.0.1:38201_a) [n:127.0.0.1:38201_a c:control_collection   x:collection1] o.a.s.c.ZkController numShards not found on descriptor - reading it from system property
   [junit4]   2> 1148854 INFO  (OverseerStateUpdate-95186531110289413-127.0.0.1:38201_a-n_0000000000) [n:127.0.0.1:38201_a    ] o.a.s.c.Overseer processMessage: queueSize: 1, message = {
   [junit4]   2>   "roles":null,
   [junit4]   2>   "state":"down",
   [junit4]   2>   "operation":"state",
   [junit4]   2>   "core":"collection1",
   [junit4]   2>   "collection":"control_collection",
   [junit4]   2>   "base_url":"https://127.0.0.1:38201/a",
   [junit4]   2>   "shard":null,
   [junit4]   2>   "numShards":"1",
   [junit4]   2>   "node_name":"127.0.0.1:38201_a"} current state version: 0
   [junit4]   2> 1148854 INFO  (coreLoadExecutor-2699-thread-1-processing-n:127.0.0.1:38201_a) [n:127.0.0.1:38201_a c:control_collection   x:collection1] o.a.s.c.ZkController look for our core node name
   [junit4]   2> 1148855 INFO  (OverseerStateUpdate-95186531110289413-127.0.0.1:38201_a-n_0000000000) [n:127.0.0.1:38201_a    ] o.a.s.c.o.ReplicaMutator Update state numShards=1 message={
   [junit4]   2>   "roles":null,
   [junit4]   2>   "state":"down",
   [junit4]   2>   "operation":"state",
   [junit4]   2>   "core":"collection1",
   [junit4]   2>   "collection":"control_collection",
   [junit4]   2>   "base_url":"https://127.0.0.1:38201/a",
   [junit4]   2>   "shard":null,
   [junit4]   2>   "numShards":"1",
   [junit4]   2>   "node_name":"127.0.0.1:38201_a"}
   [junit4]   2> 1148855 INFO  (OverseerStateUpdate-95186531110289413-127.0.0.1:38201_a-n_0000000000) [n:127.0.0.1:38201_a    ] o.a.s.c.o.ClusterStateMutator building a new cName: control_collection
   [junit4]   2> 1148856 INFO  (OverseerStateUpdate-95186531110289413-127.0.0.1:38201_a-n_0000000000) [n:127.0.0.1:38201_a    ] o.a.s.c.o.ReplicaMutator Assigning new node to shard shard=shard1
   [junit4]   2> 1148865 INFO  (zkCallback-1020-thread-1-processing-n:127.0.0.1:38201_a) [n:127.0.0.1:38201_a    ] o.a.s.c.c.ZkStateReader A cluster state change: [WatchedEvent state:SyncConnected type:NodeDataChanged path:/clusterstate.json], has occurred - updating... (live nodes size: [1])
   [junit4]   2> 1148865 INFO  (zkCallback-1020-thread-2-processing-n:127.0.0.1:38201_a) [n:127.0.0.1:38201_a    ] o.a.s.c.c.ZkStateReader A cluster state change: [WatchedEvent state:SyncConnected type:NodeDataChanged path:/clusterstate.json], has occurred - updating... (live nodes size: [1])
   [junit4]   2> 1149855 INFO  (coreLoadExecutor-2699-thread-1-processing-n:127.0.0.1:38201_a) [n:127.0.0.1:38201_a c:control_collection   x:collection1] o.a.s.c.ZkController waiting to find shard id in clusterstate for collection1
   [junit4]   2> 1149855 INFO  (coreLoadExecutor-2699-thread-1-processing-n:127.0.0.1:38201_a) [n:127.0.0.1:38201_a c:control_collection   x:collection1] o.a.s.c.ZkController Check for collection zkNode:control_collection
   [junit4]   2> 1149855 INFO  (coreLoadExecutor-2699-thread-1-processing-n:127.0.0.1:38201_a) [n:127.0.0.1:38201_a c:control_collection   x:collection1] o.a.s.c.ZkController Collection zkNode exists
   [junit4]   2> 1149855 INFO  (coreLoadExecutor-2699-thread-1-processing-n:127.0.0.1:38201_a) [n:127.0.0.1:38201_a c:control_collection   x:collection1] o.a.s.c.c.ZkStateReader Load collection config from: [/collections/control_collection]
   [junit4]   2> 1149856 INFO  (coreLoadExecutor-2699-thread-1-processing-n:127.0.0.1:38201_a) [n:127.0.0.1:38201_a c:control_collection   x:collection1] o.a.s.c.c.ZkStateReader path=[/collections/control_collection] [configName]=[conf1] specified config exists in ZooKeeper
   [junit4]   2> 1149856 INFO  (coreLoadExecutor-2699-thread-1-processing-n:127.0.0.1:38201_a) [n:127.0.0.1:38201_a c:control_collection   x:collection1] o.a.s.c.SolrResourceLoader new SolrResourceLoader for directory: '/x1/jenkins/jenkins-slave/workspace/Lucene-Solr-NightlyTests-5.x/solr/build/solr-core/test/J0/temp/solr.cloud.CollectionsAPIDistributedZkTest_6084C11E6ED1C557-001/control-001/cores/collection1'
   [junit4]   2> 1149856 INFO  (coreLoadExecutor-2699-thread-1-processing-n:127.0.0.1:38201_a) [n:127.0.0.1:38201_a c:control_collection   x:collection1] o.a.s.c.SolrResourceLoader JNDI not configured for solr (NoInitialContextEx)
   [junit4]   2> 1149856 INFO  (coreLoadExecutor-2699-thread-1-processing-n:127.0.0.1:38201_a) [n:127.0.0.1:38201_a c:control_collection   x:collection1] o.a.s.c.SolrResourceLoader solr home defaulted to 'solr/' (could not find system property or JNDI)
   [junit4]   2> 1149858 INFO  (coreLoadExecutor-2699-thread-1-processing-n:127.0.0.1:38201_a) [n:127.0.0.1:38201_a c:control_collection   x:collection1] o.a.s.c.Config loaded config solrconfig.xml with version 0 
   [junit4]   2> 1149864 INFO  (coreLoadExecutor-2699-thread-1-processing-n:127.0.0.1:38201_a) [n:127.0.0.1:38201_a c:control_collection   x:collection1] o.a.s.c.SolrConfig current version of requestparams : -1
   [junit4]   2> 1149878 INFO  (coreLoadExecutor-2699-thread-1-processing-n:127.0.0.1:38201_a) [n:127.0.0.1:38201_a c:control_collection   x:collection1] o.a.s.c.SolrConfig Using Lucene MatchVersion: 5.5.0
   [junit4]   2> 1149907 INFO  (coreLoadExecutor-2699-thread-1-processing-n:127.0.0.1:38201_a) [n:127.0.0.1:38201_a c:control_collection   x:collection1] o.a.s.c.SolrConfig Loaded SolrConfig: solrconfig.xml
   [junit4]   2> 1149915 INFO  (coreLoadExecutor-2699-thread-1-processing-n:127.0.0.1:38201_a) [n:127.0.0.1:38201_a c:control_collection   x:collection1] o.a.s.s.IndexSchema [collection1] Schema name=test
   [junit4]   2> 1150187 INFO  (coreLoadExecutor-2699-thread-1-processing-n:127.0.0.1:38201_a) [n:127.0.0.1:38201_a c:control_collection   x:collection1] o.a.s.s.OpenExchangeRatesOrgProvider Initialized with rates=open-exchange-rates.json, refreshInterval=1440.
   [junit4]   2> 1150197 INFO  (coreLoadExecutor-2699-thread-1-processing-n:127.0.0.1:38201_a) [n:127.0.0.1:38201_a c:control_collection   x:collection1] o.a.s.s.IndexSchema default search field in schema is text
   [junit4]   2> 1150199 INFO  (coreLoadExecutor-2699-thread-1-processing-n:127.0.0.1:38201_a) [n:127.0.0.1:38201_a c:control_collection   x:collection1] o.a.s.s.IndexSchema unique key field: id
   [junit4]   2> 1150211 INFO  (coreLoadExecutor-2699-thread-1-processing-n:127.0.0.1:38201_a) [n:127.0.0.1:38201_a c:control_collection   x:collection1] o.a.s.s.FileExchangeRateProvider Reloading exchange rates from file currency.xml
   [junit4]   2> 1150215 INFO  (coreLoadExecutor-2699-thread-1-processing-n:127.0.0.1:38201_a) [n:127.0.0.1:38201_a c:control_collection   x:collection1] o.a.s.s.FileExchangeRateProvider Reloading exchange rates from file currency.xml
   [junit4]   2> 1150218 INFO  (coreLoadExecutor-2699-thread-1-processing-n:127.0.0.1:38201_a) [n:127.0.0.1:38201_a c:control_collection   x:collection1] o.a.s.s.OpenExchangeRatesOrgProvider Reloading exchange rates from open-exchange-rates.json
   [junit4]   2> 1150218 INFO  (coreLoadExecutor-2699-thread-1-processing-n:127.0.0.1:38201_a) [n:127.0.0.1:38201_a c:control_collection   x:collection1] o.a.s.s.OpenExchangeRatesOrgProvider Reloading exchange rates from open-exchange-rates.json
   [junit4]   2> 1150220 INFO  (coreLoadExecutor-2699-thread-1-processing-n:127.0.0.1:38201_a) [n:127.0.0.1:38201_a c:control_collection   x:collection1] o.a.s.c.ConfigSetProperties Did not find ConfigSet properties, assuming default properties: Can't find resource 'configsetprops.json' in classpath or '/configs/conf1', cwd=/x1/jenkins/jenkins-slave/workspace/Lucene-Solr-NightlyTests-5.x/solr/build/solr-core/test/J0
   [junit4]   2> 1150220 INFO  (coreLoadExecutor-2699-thread-1-processing-n:127.0.0.1:38201_a) [n:127.0.0.1:38201_a c:control_collection   x:collection1] o.a.s.c.CoreContainer Creating SolrCore 'collection1' using configuration from collection control_collection
   [junit4]   2> 1150220 INFO  (coreLoadExecutor-2699-thread-1-processing-n:127.0.0.1:38201_a) [n:127.0.0.1:38201_a c:control_collection s:shard1 r:core_node1 x:collection1] o.a.s.c.SolrCore org.apache.solr.core.MockDirectoryFactory
   [junit4]   2> 1150221 INFO  (coreLoadExecutor-2699-thread-1-processing-n:127.0.0.1:38201_a) [n:127.0.0.1:38201_a c:control_collection s:shard1 r:core_node1 x:collection1] o.a.s.c.SolrCore [[collection1] ] Opening new SolrCore at [/x1/jenkins/jenkins-slave/workspace/Lucene-Solr-NightlyTests-5.x/solr/build/solr-core/test/J0/temp/solr.cloud.CollectionsAPIDistributedZkTest_6084C11E6ED1C557-001/control-001/cores/collection1], dataDir=[/x1/jenkins/jenkins-slave/workspace/Lucene-Solr-NightlyTests-5.x/solr/build/solr-core/test/J0/temp/solr.cloud.CollectionsAPIDistributedZkTest_6084C11E6ED1C557-001/control-001/cores/collection1/data/]
   [junit4]   2> 1150221 INFO  (coreLoadExecutor-2699-thread-1-processing-n:127.0.0.1:38201_a) [n:127.0.0.1:38201_a c:control_collection s:shard1 r:core_node1 x:collection1] o.a.s.c.JmxMonitoredMap JMX monitoring is enabled. Adding Solr mbeans to JMX Server: com.sun.jmx.mbeanserver.JmxMBeanServer@65cb8923
   [junit4]   2> 1150222 INFO  (coreLoadExecutor-2699-thread-1-processing-n:127.0.0.1:38201_a) [n:127.0.0.1:38201_a c:control_collection s:shard1 r:core_node1 x:collection1] o.a.s.c.CachingDirectoryFactory return new directory for /x1/jenkins/jenkins-slave/workspace/Lucene-Solr-NightlyTests-5.x/solr/build/solr-core/test/J0/temp/solr.cloud.CollectionsAPIDistributedZkTest_6084C11E6ED1C557-001/control-001/cores/collection1/data
   [junit4]   2> 1150222 INFO  (coreLoadExecutor-2699-thread-1-processing-n:127.0.0.1:38201_a) [n:127.0.0.1:38201_a c:control_collection s:shard1 r:core_node1 x:collection1] o.a.s.c.SolrCore New index directory detected: old=null new=/x1/jenkins/jenkins-slave/workspace/Lucene-Solr-NightlyTests-5.x/solr/build/solr-core/test/J0/temp/solr.cloud.CollectionsAPIDistributedZkTest_6084C11E6ED1C557-001/control-001/cores/collection1/data/index/
   [junit4]   2> 1150222 WARN  (coreLoadExecutor-2699-thread-1-processing-n:127.0.0.1:38201_a) [n:127.0.0.1:38201_a c:control_collection s:shard1 r:core_node1 x:collection1] o.a.s.c.SolrCore [collection1] Solr index directory '/x1/jenkins/jenkins-slave/workspace/Lucene-Solr-NightlyTests-5.x/solr/build/solr-core/test/J0/temp/solr.cloud.CollectionsAPIDistributedZkTest_6084C11E6ED1C557-001/control-001/cores/collection1/data/index' doesn't exist. Creating new index...
   [junit4]   2> 1150222 INFO  (coreLoadExecutor-2699-thread-1-processing-n:127.0.0.1:38201_a) [n:127.0.0.1:38201_a c:control_collection s:shard1 r:core_node1 x:collection1] o.a.s.c.CachingDirectoryFactory return new directory for /x1/jenkins/jenkins-slave/workspace/Lucene-Solr-NightlyTests-5.x/solr/build/solr-core/test/J0/temp/solr.cloud.CollectionsAPIDistributedZkTest_6084C11E6ED1C557-001/control-001/cores/collection1/data/index
   [junit4]   2> 1150223 INFO  (coreLoadExecutor-2699-thread-1-processing-n:127.0.0.1:38201_a) [n:127.0.0.1:38201_a c:control_collection s:shard1 r:core_node1 x:collection1] o.a.s.u.RandomMergePolicy RandomMergePolicy wrapping class org.apache.lucene.index.TieredMergePolicy: [TieredMergePolicy: maxMergeAtOnce=27, maxMergeAtOnceExplicit=16, maxMergedSegmentMB=7.609375, floorSegmentMB=0.6083984375, forceMergeDeletesPctAllowed=15.059272419023873, segmentsPerTier=40.0, maxCFSSegmentSizeMB=8.796093022207999E12, noCFSRatio=0.7281672057648912
   [junit4]   2> 1150223 INFO  (coreLoadExecutor-2699-thread-1-processing-n:127.0.0.1:38201_a) [n:127.0.0.1:38201_a c:control_collection s:shard1 r:core_node1 x:collection1] o.a.s.c.SolrDeletionPolicy SolrDeletionPolicy.onCommit: commits: num=1
   [junit4]   2> 	commit{dir=MockDirectoryWrapper(RAMDirectory@27451c71 lockFactory=org.apache.lucene.store.SingleInstanceLockFactory@2a4e52db),segFN=segments_1,generation=1}
   [junit4]   2> 1150223 INFO  (coreLoadExecutor-2699-thread-1-processing-n:127.0.0.1:38201_a) [n:127.0.0.1:38201_a c:control_collection s:shard1 r:core_node1 x:collection1] o.a.s.c.SolrDeletionPolicy newest commit generation = 1
   [junit4]   2> 1150224 INFO  (OldIndexDirectoryCleanupThreadForCore-collection1) [n:127.0.0.1:38201_a c:control_collection s:shard1 r:core_node1 x:collection1] o.a.s.c.SolrCore Looking for old index directories to cleanup for core collection1 in /x1/jenkins/jenkins-slave/workspace/Lucene-Solr-NightlyTests-5.x/solr/build/solr-core/test/J0/temp/solr.cloud.CollectionsAPIDistributedZkTest_6084C11E6ED1C557-001/control-001/cores/collection1/data/
   [junit4]   2> 1150225 WARN  (OldIndexDirectoryCleanupThreadForCore-collection1) [n:127.0.0.1:38201_a c:control_collection s:shard1 r:core_node1 x:collection1] o.a.s.c.DirectoryFactory /x1/jenkins/jenkins-slave/workspace/Lucene-Solr-NightlyTests-5.x/solr/build/solr-core/test/J0/temp/solr.cloud.CollectionsAPIDistributedZkTest_6084C11E6ED1C557-001/control-001/cores/collection1/data/ does not point to a valid data directory; skipping clean-up of old index directories.
   [junit4]   2> 1150236 INFO  (coreLoadExecutor-2699-thread-1-processing-n:127.0.0.1:38201_a) [n:127.0.0.1:38201_a c:control_collection s:shard1 r:core_node1 x:collection1] o.a.s.u.p.UpdateRequestProcessorChain creating updateRequestProcessorChain "nodistrib"
   [junit4]   2> 1150237 INFO  (coreLoadExecutor-2699-thread-1-processing-n:127.0.0.1:38201_a) [n:127.0.0.1:38201_a c:control_collection s:shard1 r:core_node1 x:collection1] o.a.s.u.p.UpdateRequestProcessorChain creating updateRequestProcessorChain "dedupe"
   [junit4]   2> 1150237 INFO  (coreLoadExecutor-2699-thread-1-processing-n:127.0.0.1:38201_a) [n:127.0.0.1:38201_a c:control_collection s:shard1 r:core_node1 x:collection1] o.a.s.u.p.UpdateRequestProcessorChain inserting DistributedUpdateProcessorFactory into updateRequestProcessorChain "dedupe"
   [junit4]   2> 1150237 INFO  (coreLoadExecutor-2699-thread-1-processing-n:127.0.0.1:38201_a) [n:127.0.0.1:38201_a c:control_collection s:shard1 r:core_node1 x:collection1] o.a.s.u.p.UpdateRequestProcessorChain creating updateRequestProcessorChain "stored_sig"
   [junit4]   2> 1150237 INFO  (coreLoadExecutor-2699-thread-1-processing-n:127.0.0.1:38201_a) [n:127.0.0.1:38201_a c:control_collection s:shard1 r:core_node1 x:collection1] o.a.s.u.p.UpdateRequestProcessorChain inserting DistributedUpdateProcessorFactory into updateRequestProcessorChain "stored_sig"
   [junit4]   2> 1150237 INFO  (coreLoadExecutor-2699-thread-1-processing-n:127.0.0.1:38201_a) [n:127.0.0.1:38201_a c:control_collection s:shard1 r:core_node1 x:collection1] o.a.s.u.p.UpdateRequestProcessorChain creating updateRequestProcessorChain "distrib-dup-test-chain-explicit"
   [junit4]   2> 1150237 INFO  (coreLoadExecutor-2699-thread-1-processing-n:127.0.0.1:38201_a) [n:127.0.0.1:38201_a c:control_collection s:shard1 r:core_node1 x:collection1] o.a.s.u.p.UpdateRequestProcessorChain creating updateRequestProcessorChain "distrib-dup-test-chain-implicit"
   [junit4]   2> 1150238 INFO  (coreLoadExecutor-2699-thread-1-processing-n:127.0.0.1:38201_a) [n:127.0.0.1:38201_a c:control_collection s:shard1 r:core_node1 x:collection1] o.a.s.u.p.UpdateRequestProcessorChain inserting DistributedUpdateProcessorFactory into updateRequestProcessorChain "distrib-dup-test-chain-implicit"
   [junit4]   2> 1150238 INFO  (coreLoadExecutor-2699-thread-1-processing-n:127.0.0.1:38201_a) [n:127.0.0.1:38201_a c:control_collection s:shard1 r:core_node1 x:collection1] o.a.s.c.SolrCore no updateRequestProcessorChain defined as default, creating implicit default
   [junit4]   2> 1150238 WARN  (coreLoadExecutor-2699-thread-1-processing-n:127.0.0.1:38201_a) [n:127.0.0.1:38201_a c:control_collection s:shard1 r:core_node1 x:collection1] o.a.s.c.RequestHandlers INVALID paramSet a in requestHandler {type = requestHandler,name = /dump,class = DumpRequestHandler,args = {defaults={a=A,b=B}}}
   [junit4]   2> 1150241 INFO  (coreLoadExecutor-2699-thread-1-processing-n:127.0.0.1:38201_a) [n:127.0.0.1:38201_a c:control_collection s:shard1 r:core_node1 x:collection1] o.a.s.h.l.XMLLoader xsltCacheLifetimeSeconds=60
   [junit4]   2> 1150243 INFO  (coreLoadExecutor-2699-thread-1-processing-n:127.0.0.1:38201_a) [n:127.0.0.1:38201_a c:control_collection s:shard1 r:core_node1 x:collection1] o.a.s.h.l.XMLLoader xsltCacheLifetimeSeconds=60
   [junit4]   2> 1150245 INFO  (coreLoadExecutor-2699-thread-1-processing-n:127.0.0.1:38201_a) [n:127.0.0.1:38201_a c:control_collection s:shard1 r:core_node1 x:collection1] o.a.s.h.l.XMLLoader xsltCacheLifetimeSeconds=60
   [junit4]   2> 1150246 INFO  (coreLoadExecutor-2699-thread-1-processing-n:127.0.0.1:38201_a) [n:127.0.0.1:38201_a c:control_collection s:shard1 r:core_node1 x:collection1] o.a.s.h.l.XMLLoader xsltCacheLifetimeSeconds=60
   [junit4]   2> 1150251 INFO  (coreLoadExecutor-2699-thread-1-processing-n:127.0.0.1:38201_a) [n:127.0.0.1:38201_a c:control_collection s:shard1 r:core_node1 x:collection1] o.a.s.c.RequestHandlers Registered paths: /admin/segments,/dump,/update/json,/replication,/admin/logging,/get,/admin/ping,/update/json/docs,standard,/config,/admin/plugins,/admin/luke,/admin/system,/admin/file,/admin/mbeans,/admin/threads,/update,/schema,/update/csv,/admin/properties
   [junit4]   2> 1150253 INFO  (coreLoadExecutor-2699-thread-1-processing-n:127.0.0.1:38201_a) [n:127.0.0.1:38201_a c:control_collection s:shard1 r:core_node1 x:collection1] o.a.s.c.SolrCore Using default statsCache cache: org.apache.solr.search.stats.LocalStatsCache
   [junit4]   2> 1150253 INFO  (coreLoadExecutor-2699-thread-1-processing-n:127.0.0.1:38201_a) [n:127.0.0.1:38201_a c:control_collection s:shard1 r:core_node1 x:collection1] o.a.s.u.UpdateHandler Using UpdateLog implementation: org.apache.solr.update.UpdateLog
   [junit4]   2> 1150253 INFO  (coreLoadExecutor-2699-thread-1-processing-n:127.0.0.1:38201_a) [n:127.0.0.1:38201_a c:control_collection s:shard1 r:core_node1 x:collection1] o.a.s.u.UpdateLog Initializing UpdateLog: dataDir= defaultSyncLevel=FLUSH numRecordsToKeep=100 maxNumLogsToKeep=10 numVersionBuckets=65536
   [junit4]   2> 1150254 INFO  (coreLoadExecutor-2699-thread-1-processing-n:127.0.0.1:38201_a) [n:127.0.0.1:38201_a c:control_collection s:shard1 r:core_node1 x:collection1] o.a.s.u.CommitTracker Hard AutoCommit: disabled
   [junit4]   2> 1150254 INFO  (coreLoadExecutor-2699-thread-1-processing-n:127.0.0.1:38201_a) [n:127.0.0.1:38201_a c:control_collection s:shard1 r:core_node1 x:collection1] o.a.s.u.CommitTracker Soft AutoCommit: disabled
   [junit4]   2> 1150255 INFO  (coreLoadExecutor-2699-thread-1-processing-n:127.0.0.1:38201_a) [n:127.0.0.1:38201_a c:control_collection s:shard1 r:core_node1 x:collection1] o.a.s.u.RandomMergePolicy RandomMergePolicy wrapping class org.apache.lucene.index.TieredMergePolicy: [TieredMergePolicy: maxMergeAtOnce=10, maxMergeAtOnceExplicit=48, maxMergedSegmentMB=0.2900390625, floorSegmentMB=2.150390625, forceMergeDeletesPctAllowed=17.50575100611905, segmentsPerTier=32.0, maxCFSSegmentSizeMB=8.796093022207999E12, noCFSRatio=0.5502066819220731
   [junit4]   2> 1150255 INFO  (coreLoadExecutor-2699-thread-1-processing-n:127.0.0.1:38201_a) [n:127.0.0.1:38201_a c:control_collection s:shard1 r:core_node1 x:collection1] o.a.s.c.SolrDeletionPolicy SolrDeletionPolicy.onInit: commits: num=1
   [junit4]   2> 	commit{dir=MockDirectoryWrapper(RAMDirectory@27451c71 lockFactory=org.apache.lucene.store.SingleInstanceLockFactory@2a4e52db),segFN=segments_1,generation=1}
   [junit4]   2> 1150255 INFO  (coreLoadExecutor-2699-thread-1-processing-n:127.0.0.1:38201_a) [n:127.0.0.1:38201_a c:control_collection s:shard1 r:core_node1 x:collection1] o.a.s.c.SolrDeletionPolicy newest commit generation = 1
   [junit4]   2> 1150256 INFO  (coreLoadExecutor-2699-thread-1-processing-n:127.0.0.1:38201_a) [n:127.0.0.1:38201_a c:control_collection s:shard1 r:core_node1 x:collection1] o.a.s.s.SolrIndexSearcher Opening Searcher@7fbe124f[collection1] main
   [junit4]   2> 1150256 INFO  (coreLoadExecutor-2699-thread-1-processing-n:127.0.0.1:38201_a) [n:127.0.0.1:38201_a c:control_collection s:shard1 r:core_node1 x:collection1] o.a.s.c.c.ZkStateReader Load collection config from: [/collections/control_collection]
   [junit4]   2> 1150257 INFO  (coreLoadExecutor-2699-thread-1-processing-n:127.0.0.1:38201_a) [n:127.0.0.1:38201_a c:control_collection s:shard1 r:core_node1 x:collection1] o.a.s.c.c.ZkStateReader path=[/collections/control_collection] [configName]=[conf1] specified config exists in ZooKeeper
   [junit4]   2> 1150257 INFO  (coreLoadExecutor-2699-thread-1-processing-n:127.0.0.1:38201_a) [n:127.0.0.1:38201_a c:control_collection s:shard1 r:core_node1 x:collection1] o.a.s.r.ManagedResourceStorage Setting up ZooKeeper-based storage for the RestManager with znodeBase: /configs/conf1
   [junit4]   2> 1150257 INFO  (coreLoadExecutor-2699-thread-1-processing-n:127.0.0.1:38201_a) [n:127.0.0.1:38201_a c:control_collection s:shard1 r:core_node1 x:collection1] o.a.s.r.ManagedResourceStorage Configured ZooKeeperStorageIO with znodeBase: /configs/conf1
   [junit4]   2> 1150257 INFO  (coreLoadExecutor-2699-thread-1-processing-n:127.0.0.1:38201_a) [n:127.0.0.1:38201_a c:control_collection s:shard1 r:core_node1 x:collection1] o.a.s.r.RestManager Initializing RestManager with initArgs: {}
   [junit4]   2> 1150257 INFO  (coreLoadExecutor-2699-thread-1-processing-n:127.0.0.1:38201_a) [n:127.0.0.1:38201_a c:control_collection s:shard1 r:core_node1 x:collection1] o.a.s.r.ManagedResourceStorage Reading _rest_managed.json using ZooKeeperStorageIO:path=/configs/conf1
   [junit4]   2> 1150258 INFO  (coreLoadExecutor-2699-thread-1-processing-n:127.0.0.1:38201_a) [n:127.0.0.1:38201_a c:control_collection s:shard1 r:core_node1 x:collection1] o.a.s.r.ManagedResourceStorage No data found for znode /configs/conf1/_rest_managed.json
   [junit4]   2> 1150258 INFO  (coreLoadExecutor-2699-thread-1-processing-n:127.0.0.1:38201_a) [n:127.0.0.1:38201_a c:control_collection s:shard1 r:core_node1 x:collection1] o.a.s.r.ManagedResourceStorage Loaded null at path _rest_managed.json using ZooKeeperStorageIO:path=/configs/conf1
   [junit4]   2> 1150258 INFO  (coreLoadExecutor-2699-thread-1-processing-n:127.0.0.1:38201_a) [n:127.0.0.1:38201_a c:control_collection s:shard1 r:core_node1 x:collection1] o.a.s.r.RestManager Initializing 0 registered ManagedResources
   [junit4]   2> 1150258 INFO  (coreLoadExecutor-2699-thread-1-processing-n:127.0.0.1:38201_a) [n:127.0.0.1:38201_a c:control_collection s:shard1 r:core_node1 x:collection1] o.a.s.h.ReplicationHandler Commits will be reserved for  10000
   [junit4]   2> 1150259 INFO  (searcherExecutor-2700-thread-1-processing-r:core_node1 x:collection1 c:control_collection s:shard1 n:127.0.0.1:38201_a) [n:127.0.0.1:38201_a c:control_collection s:shard1 r:core_node1 x:collection1] o.a.s.c.SolrCore [collection1] Registered new searcher Searcher@7fbe124f[collection1] main{ExitableDirectoryReader(UninvertingDirectoryReader())}
   [junit4]   2> 1150259 INFO  (coreLoadExecutor-2699-thread-1-processing-n:127.0.0.1:38201_a) [n:127.0.0.1:38201_a c:control_collection s:shard1 r:core_node1 x:collection1] o.a.s.u.UpdateLog Looking up max value of version field to seed version buckets
   [junit4]   2> 1150259 INFO  (coreLoadExecutor-2699-thread-1-processing-n:127.0.0.1:38201_a) [n:127.0.0.1:38201_a c:control_collection s:shard1 r:core_node1 x:collection1] o.a.s.u.VersionInfo Refreshing highest value of _version_ for 65536 version buckets from index
   [junit4]   2> 1150259 INFO  (coreLoadExecutor-2699-thread-1-processing-n:127.0.0.1:38201_a) [n:127.0.0.1:38201_a c:control_collection s:shard1 r:core_node1 x:collection1] o.a.s.u.VersionInfo No terms found for _version_, cannot seed version bucket highest value from index
   [junit4]   2> 1150259 INFO  (coreLoadExecutor-2699-thread-1-processing-n:127.0.0.1:38201_a) [n:127.0.0.1:38201_a c:control_collection s:shard1 r:core_node1 x:collection1] o.a.s.u.UpdateLog Could not find max version in index or recent updates, using new clock 1522984499858636800
   [junit4]   2> 1150261 INFO  (coreLoadExecutor-2699-thread-1-processing-n:127.0.0.1:38201_a) [n:127.0.0.1:38201_a c:control_collection s:shard1 r:core_node1 x:collection1] o.a.s.u.UpdateLog Took 2.0ms to seed version buckets with highest version 1522984499858636800
   [junit4]   2> 1150261 INFO  (coreLoadExecutor-2699-thread-1-processing-n:127.0.0.1:38201_a) [n:127.0.0.1:38201_a c:control_collection s:shard1 r:core_node1 x:collection1] o.a.s.c.ZkController watch zkdir /configs/conf1
   [junit4]   2> 1150262 INFO  (coreLoadExecutor-2699-thread-1-processing-n:127.0.0.1:38201_a) [n:127.0.0.1:38201_a c:control_collection s:shard1 r:core_node1 x:collection1] o.a.s.c.CoreContainer registering core: collection1
   [junit4]   2> 1150262 INFO  (coreZkRegister-2693-thread-1-processing-r:core_node1 x:collection1 c:control_collection s:shard1 n:127.0.0.1:38201_a) [n:127.0.0.1:38201_a c:control_collection s:shard1 r:core_node1 x:collection1] o.a.s.c.ZkController Register replica - core:collection1 address:https://127.0.0.1:38201/a collection:control_collection shard:shard1
   [junit4]   2> 1150263 INFO  (coreZkRegister-2693-thread-1-processing-r:core_node1 x:collection1 c:control_collection s:shard1 n:127.0.0.1:38201_a) [n:127.0.0.1:38201_a c:control_collection s:shard1 r:core_node1 x:collection1] o.a.s.c.c.SolrZkClient makePath: /collections/control_collection/leader_elect/shard1/election
   [junit4]   2> 1150267 INFO  (coreZkRegister-2693-thread-1-processing-r:core_node1 x:collection1 c:control_collection s:shard1 n:127.0.0.1:38201_a) [n:127.0.0.1:38201_a c:control_collection s:shard1 r:core_node1 x:collection1] o.a.s.c.LeaderElector Joined leadership election with path: /collections/control_collection/leader_elect/shard1/election/95186531110289413-core_node1-n_0000000000
   [junit4]   2> 1150267 INFO  (coreZkRegister-2693-thread-1-processing-r:core_node1 x:collection1 c:control_collection s:shard1 n:127.0.0.1:38201_a) [n:127.0.0.1:38201_a c:control_collection s:shard1 r:core_node1 x:collection1] o.a.s.c.ShardLeaderElectionContext Running the leader process for shard=shard1 and weAreReplacement=false and leaderVoteWait=180000
   [junit4]   2> 1150269 INFO  (coreZkRegister-2693-thread-1-processing-r:core_node1 x:collection1 c:control_collection s:shard1 n:127.0.0.1:38201_a) [n:127.0.0.1:38201_a c:control_collection s:shard1 r:core_node1 x:collection1] o.a.s.c.ShardLeaderElectionContext Enough replicas found to continue.
   [junit4]   2> 1150270 INFO  (OverseerStateUpdate-95186531110289413-127.0.0.1:38201_a-n_0000000000) [n:127.0.0.1:38201_a    ] o.a.s.c.Overseer processMessage: queueSize: 1, message = {
   [junit4]   2>   "operation":"leader",
   [junit4]   2>   "shard":"shard1",
   [junit4]   2>   "collection":"control_collection"} current state version: 1
   [junit4]   2> 1150270 INFO  (coreZkRegister-2693-thread-1-processing-r:core_node1 x:collection1 c:control_collection s:shard1 n:127.0.0.1:38201_a) [n:127.0.0.1:38201_a c:control_collection s:shard1 r:core_node1 x:collection1] o.a.s.c.ShardLeaderElectionContext I may be the new leader - try and sync
   [junit4]   2> 1150271 INFO  (coreZkRegister-2693-thread-1-processing-r:core_node1 x:collection1 c:control_collection s:shard1 n:127.0.0.1:38201_a) [n:127.0.0.1:38201_a c:control_collection s:shard1 r:core_node1 x:collection1] o.a.s.c.SyncStrategy Sync replicas to https://127.0.0.1:38201/a/collection1/
   [junit4]   2> 1150271 INFO  (coreZkRegister-2693-thread-1-processing-r:core_node1 x:collection1 c:control_collection s:shard1 n:127.0.0.1:38201_a) [n:127.0.0.1:38201_a c:control_collection s:shard1 r:core_node1 x:collection1] o.a.s.c.SyncStrategy Sync Success - now sync replicas to me
   [junit4]   2> 1150271 INFO  (coreZkRegister-2693-thread-1-processing-r:core_node1 x:collection1 c:control_collection s:shard1 n:127.0.0.1:38201_a) [n:127.0.0.1:38201_a c:control_collection s:shard1 r:core_node1 x:collection1] o.a.s.c.SyncStrategy https://127.0.0.1:38201/a/collection1/ has no replicas
   [junit4]   2> 1150272 INFO  (coreZkRegister-2693-thread-1-processing-r:core_node1 x:collection1 c:control_collection s:shard1 n:127.0.0.1:38201_a) [n:127.0.0.1:38201_a c:control_collection s:shard1 r:core_node1 x:collection1] o.a.s.c.c.SolrZkClient makePath: /collections/control_collection/leaders/shard1
   [junit4]   2> 1150276 INFO  (coreZkRegister-2693-thread-1-processing-r:core_node1 x:collection1 c:control_collection s:shard1 n:127.0.0.1:38201_a) [n:127.0.0.1:38201_a c:control_collection s:shard1 r:core_node1 x:collection1] o.a.s.c.ShardLeaderElectionContextBase Creating leader registration node
   [junit4]   2> 1150278 INFO  (coreZkRegister-2693-thread-1-processing-r:core_node1 x:collection1 c:control_collection s:shard1 n:127.0.0.1:38201_a) [n:127.0.0.1:38201_a c:control_collection s:shard1 r:core_node1 x:collection1] o.a.s.c.ShardLeaderElectionContext I am the new leader: https://127.0.0.1:38201/a/collection1/ shard1
   [junit4]   2> 1150279 INFO  (OverseerStateUpdate-95186531110289413-127.0.0.1:38201_a-n_0000000000) [n:127.0.0.1:38201_a    ] o.a.s.c.Overseer processMessage: queueSize: 1, message = {
   [junit4]   2>   "operation":"leader",
   [junit4]   2>   "shard":"shard1",
   [junit4]   2>   "collection":"control_collection",
   [junit4]   2>   "base_url":"https://127.0.0.1:38201/a",
   [junit4]   2>   "core":"collection1",
   [junit4]   2>   "state":"active"} current state version: 1
   [junit4]   2> 1150355 INFO  (TEST-CollectionsAPIDistributedZkTest.test-seed#[6084C11E6ED1C557]) [    ] o.a.s.c.c.SolrZkClient Using default ZkCredentialsProvider
   [junit4]   2> 1150355 INFO  (TEST-CollectionsAPIDistributedZkTest.test-seed#[6084C11E6ED1C557]) [    ] o.a.s.c.c.ConnectionManager Waiting for client to connect to ZooKeeper
   [junit4]   2> 1150356 INFO  (zkCallback-1022-thread-1) [    ] o.a.s.c.c.ConnectionManager Watcher org.apache.solr.common.cloud.ConnectionManager@17e3423c name:ZooKeeperConnection Watcher:127.0.0.1:58605/solr got event WatchedEvent state:SyncConnected type:None path:null path:null type:None
   [junit4]   2> 1150357 INFO  (TEST-CollectionsAPIDistributedZkTest.test-seed#[6084C11E6ED1C557]) [    ] o.a.s.c.c.ConnectionManager Client is connected to ZooKeeper
   [junit4]   2> 1150357 INFO  (TEST-CollectionsAPIDistributedZkTest.test-seed#[6084C11E6ED1C557]) [    ] o.a.s.c.c.SolrZkClient Using default ZkACLProvider
   [junit4]   2> 1150357 INFO  (TEST-CollectionsAPIDistributedZkTest.test-seed#[6084C11E6ED1C557]) [    ] o.a.s.c.c.ZkStateReader Updating cluster state from ZooKeeper... 
   [junit4]   2> 1150360 INFO  (TEST-CollectionsAPIDistributedZkTest.test-seed#[6084C11E6ED1C557]) [    ] o.a.s.c.ChaosMonkey monkey: init - expire sessions:false cause connection loss:false
   [junit4]   2> 1150360 INFO  (TEST-CollectionsAPIDistributedZkTest.test-seed#[6084C11E6ED1C557]) [    ] o.a.s.c.AbstractFullDistribZkTestBase Creating collection1 with stateFormat=2
   [junit4]   2> 1150360 INFO  (TEST-CollectionsAPIDistributedZkTest.test-seed#[6084C11E6ED1C557]) [    ] o.a.s.c.c.SolrZkClient Using default ZkCredentialsProvider
   [junit4]   2> 1150360 INFO  (TEST-CollectionsAPIDistributedZkTest.test-seed#[6084C11E6ED1C557]) [    ] o.a.s.c.c.ConnectionManager Waiting for client to connect to ZooKeeper
   [junit4]   2> 1150361 INFO  (zkCallback-1023-thread-1) [    ] o.a.s.c.c.ConnectionManager Watcher org.apache.solr.common.cloud.ConnectionManager@41928fef name:ZooKeeperConnection Watcher:127.0.0.1:58605/solr got event WatchedEvent state:SyncConnected type:None path:null path:null type:None
   [junit4]   2> 1150361 INFO  (TEST-CollectionsAPIDistributedZkTest.test-seed#[6084C11E6ED1C557]) [    ] o.a.s.c.c.ConnectionManager Client is connected to ZooKeeper
   [junit4]   2> 1150362 INFO  (TEST-CollectionsAPIDistributedZkTest.test-seed#[6084C11E6ED1C557]) [    ] o.a.s.c.c.SolrZkClient Using default ZkACLProvider
   [junit4]   2> 1150364 INFO  (OverseerStateUpdate-95186531110289413-127.0.0.1:38201_a-n_0000000000) [n:127.0.0.1:38201_a    ] o.a.s.c.Overseer processMessage: queueSize: 1, message = {
   [junit4]   2>   "operation":"create",
   [junit4]   2>   "name":"collection1",
   [junit4]   2>   "numShards":"2",
   [junit4]   2>   "stateFormat":"2"} current state version: 1
   [junit4]   2> 1150364 INFO  (OverseerStateUpdate-95186531110289413-127.0.0.1:38201_a-n_0000000000) [n:127.0.0.1:38201_a    ] o.a.s.c.o.ClusterStateMutator building a new cName: collection1
   [junit4]   2> 1150365 INFO  (zkCallback-1022-thread-1) [    ] o.a.s.c.c.ZkStateReader A cluster state change: [WatchedEvent state:SyncConnected type:NodeDataChanged path:/clusterstate.json], has occurred - updating... (live nodes size: [1])
   [junit4]   2> 1150365 INFO  (zkCallback-1020-thread-3-processing-n:127.0.0.1:38201_a) [n:127.0.0.1:38201_a    ] o.a.s.c.c.ZkStateReader A cluster state change: [WatchedEvent state:SyncConnected type:NodeDataChanged path:/clusterstate.json], has occurred - updating... (live nodes size: [1])
   [junit4]   2> 1150365 INFO  (zkCallback-1020-thread-2-processing-n:127.0.0.1:38201_a) [n:127.0.0.1:38201_a    ] o.a.s.c.c.ZkStateReader A cluster state change: [WatchedEvent state:SyncConnected type:NodeDataChanged path:/clusterstate.json], has occurred - updating... (live nodes size: [1])
   [junit4]   2> 1150379 INFO  (coreZkRegister-2693-thread-1-processing-r:core_node1 x:collection1 c:control_collection s:shard1 n:127.0.0.1:38201_a) [n:127.0.0.1:38201_a c:control_collection s:shard1 r:core_node1 x:collection1] o.a.s.c.ZkController We are https://127.0.0.1:38201/a/collection1/ and leader is https://127.0.0.1:38201/a/collection1/
   [junit4]   2> 1150380 INFO  (coreZkRegister-2693-thread-1-processing-r:core_node1 x:collection1 c:control_collection s:shard1 n:127.0.0.1:38201_a) [n:127.0.0.1:38201_a c:control_collection s:shard1 r:core_node1 x:collection1] o.a.s.c.ZkController No LogReplay needed for core=collection1 baseURL=https://127.0.0.1:38201/a
   [junit4]   2> 1150380 INFO  (coreZkRegister-2693-thread-1-processing-r:core_node1 x:collection1 c:control_collection s:shard1 n:127.0.0.1:38201_a) [n:127.0.0.1:38201_a c:control_collection s:shard1 r:core_node1 x:collection1] o.a.s.c.ZkController I am the leader, no recovery necessary
   [junit4]   2> 1150380 INFO  (coreZkRegister-2693-thread-1-processing-r:core_node1 x:collection1 c:control_collection s:shard1 n:127.0.0.1:38201_a) [n:127.0.0.1:38201_a c:control_collection s:shard1 r:core_node1 x:collection1] o.a.s.c.ZkController publishing state=active
   [junit4]   2> 1150380 INFO  (coreZkRegister-2693-thread-1-processing-r:core_node1 x:collection1 c:control_collection s:shard1 n:127.0.0.1:38201_a) [n:127.0.0.1:38201_a c:control_collection s:shard1 r:core_node1 x:collection1] o.a.s.c.ZkController numShards not found on descriptor - reading it from system property
   [junit4]   2> 1150381 INFO  (OverseerStateUpdate-95186531110289413-127.0.0.1:38201_a-n_0000000000) [n:127.0.0.1:38201_a    ] o.a.s.c.Overseer processMessage: queueSize: 1, message = {
   [junit4]   2>   "roles":null,
   [junit4]   2>   "state":"active",
   [junit4]   2>   "operation":"state",
   [junit4]   2>   "core":"collection1",
   [junit4]   2>   "collection":"control_collection",
   [junit4]   2>   "base_url":"https://127.0.0.1:38201/a",
   [junit4]   2>   "shard":"shard1",
   [junit4]   2>   "core_node_name":"core_node1",
   [junit4]   2>   "numShards":"2",
   [junit4]   2>   "node_name":"127.0.0.1:38201_a"} current state version: 2
   [junit4]   2> 1150382 INFO  (OverseerStateUpdate-95186531110289413-127.0.0.1:38201_a-n_0000000000) [n:127.0.0.1:38201_a    ] o.a.s.c.o.ReplicaMutator Update state numShards=2 message={
   [junit4]   2>   "roles":null,
   [junit4]   2>   "state":"active",
   [junit4]   2>   "operation":"state",
   [junit4]   2>   "core":"collection1",
   [junit4]   2>   "collection":"control_collection",
   [junit4]   2>   "base_url":"https://127.0.0.1:38201/a",
   [junit4]   2>   "shard":"shard1",
   [junit4]   2>   "core_node_name":"core_node1",
   [junit4]   2>   "numShards":"2",
   [junit4]   2>   "node_name":"127.0.0.1:38201_a"}
   [junit4]   2> 1150383 INFO  (OverseerStateUpdate-95186531110289413-127.0.0.1:38201_a-n_0000000000) [n:127.0.0.1:38201_a    ] o.a.s.c.o.ZkStateWriter going to create_collection /collections/collection1/state.json
   [junit4]   2> 1150486 INFO  (zkCallback-1022-thread-1) [    ] o.a.s.c.c.ZkStateReader A cluster state change: [WatchedEvent state:SyncConnected type:NodeDataChanged path:/clusterstate.json], has occurred - updating... (live nodes size: [1])
   [junit4]   2> 1150486 INFO  (zkCallback-1020-thread-2-processing-n:127.0.0.1:38201_a) [n:127.0.0.1:38201_a    ] o.a.s.c.c.ZkStateReader A cluster state change: [WatchedEvent state:SyncConnected type:NodeDataChanged path:/clusterstate.json], has occurred - updating... (live nodes size: [1])
   [junit4]   2> 1150486 INFO  (zkCallback-1020-thread-3-processing-n:127.0.0.1:38201_a) [n:127.0.0.1:38201_a    ] o.a.s.c.c.ZkStateReader A cluster state change: [WatchedEvent state:SyncConnected type:NodeDataChanged path:/clusterstate.json], has occurred - updating... (live nodes size: [1])
   [junit4]   2> 1150722 INFO  (TEST-CollectionsAPIDistributedZkTest.test-seed#[6084C11E6ED1C557]) [    ] o.a.s.SolrTestCaseJ4 Writing core.properties file to /x1/jenkins/jenkins-slave/workspace/Lucene-Solr-NightlyTests-5.x/solr/build/solr-core/test/J0/temp/solr.cloud.CollectionsAPIDistributedZkTest_6084C11E6ED1C557-001/shard-1-001/cores/collection1
   [junit4]   2> 1150722 INFO  (TEST-CollectionsAPIDistributedZkTest.test-seed#[6084C11E6ED1C557]) [    ] o.a.s.c.AbstractFullDistribZkTestBase create jetty 1 in directory /x1/jenkins/jenkins-slave/workspace/Lucene-Solr-NightlyTests-5.x/solr/build/solr-core/test/J0/temp/solr.cloud.CollectionsAPIDistributedZkTest_6084C11E6ED1C557-001/shard-1-001
   [junit4]   2> 1150723 INFO  (TEST-CollectionsAPIDistributedZkTest.test-seed#[6084C11E6ED1C557]) [    ] o.e.j.s.Server jetty-9.2.13.v20150730
   [junit4]   2> 1150733 INFO  (TEST-CollectionsAPIDistributedZkTest.test-seed#[6084C11E6ED1C557]) [    ] o.e.j.s.h.ContextHandler Started o.e.j.s.ServletContextHandler@2787e0b3{/a,null,AVAILABLE}
   [junit4]   2> 1150738 INFO  (TEST-CollectionsAPIDistributedZkTest.test-seed#[6084C11E6ED1C557]) [    ] o.e.j.s.ServerConnector Started ServerConnector@aa83bf9{SSL-http/1.1}{127.0.0.1:49206}
   [junit4]   2> 1150738 INFO  (TEST-CollectionsAPIDistributedZkTest.test-seed#[6084C11E6ED1C557]) [    ] o.e.j.s.Server Started @1153684ms
   [junit4]   2> 1150738 INFO  (TEST-CollectionsAPIDistributedZkTest.test-seed#[6084C11E6ED1C557]) [    ] o.a.s.c.s.e.JettySolrRunner Jetty properties: {hostContext=/a, hostPort=49206, solr.data.dir=/x1/jenkins/jenkins-slave/workspace/Lucene-Solr-NightlyTests-5.x/solr/build/solr-core/test/J0/temp/solr.cloud.CollectionsAPIDistributedZkTest_6084C11E6ED1C557-001/tempDir-001/jetty1, coreRootDirectory=/x1/jenkins/jenkins-slave/workspace/Lucene-Solr-NightlyTests-5.x/solr/build/solr-core/test/J0/temp/solr.cloud.CollectionsAPIDistributedZkTest_6084C11E6ED1C557-001/shard-1-001/cores, solrconfig=solrconfig.xml}
   [junit4]   2> 1150738 INFO  (TEST-CollectionsAPIDistributedZkTest.test-seed#[6084C11E6ED1C557]) [    ] o.a.s.s.SolrDispatchFilter SolrDispatchFilter.init(): sun.misc.Launcher$AppClassLoader@7b3cb2c6
   [junit4]   2> 1150738 INFO  (TEST-CollectionsAPIDistributedZkTest.test-seed#[6084C11E6ED1C557]) [    ] o.a.s.c.SolrResourceLoader new SolrResourceLoader for directory: '/x1/jenkins/jenkins-slave/workspace/Lucene-Solr-NightlyTests-5.x/solr/build/solr-core/test/J0/temp/solr.cloud.CollectionsAPIDistributedZkTest_6084C11E6ED1C557-001/shard-1-001'
   [junit4]   2> 1150738 INFO  (TEST-CollectionsAPIDistributedZkTest.test-seed#[6084C11E6ED1C557]) [    ] o.a.s.c.SolrResourceLoader JNDI not configured for solr (NoInitialContextEx)
   [junit4]   2> 1150739 INFO  (TEST-CollectionsAPIDistributedZkTest.test-seed#[6084C11E6ED1C557]) [    ] o.a.s.c.SolrResourceLoader solr home defaulted to 'solr/' (could not find system property or JNDI)
   [junit4]   2> 1150739 INFO  (TEST-CollectionsAPIDistributedZkTest.test-seed#[6084C11E6ED1C557]) [    ] o.a.s.c.c.SolrZkClient Using default ZkCredentialsProvider
   [junit4]   2> 1150740 INFO  (TEST-CollectionsAPIDistributedZkTest.test-seed#[6084C11E6ED1C557]) [    ] o.a.s.c.c.ConnectionManager Waiting for client to connect to ZooKeeper
   [junit4]   2> 1150741 INFO  (zkCallback-1024-thread-1) [    ] o.a.s.c.c.ConnectionManager Watcher org.apache.solr.common.cloud.ConnectionManager@53d46f3 name:ZooKeeperConnection Watcher:127.0.0.1:58605/solr got event WatchedEvent state:SyncConnected type:None path:null path:null type:None
   [junit4]   2> 1150742 INFO  (TEST-CollectionsAPIDistributedZkTest.test-seed#[6084C11E6ED1C557]) [    ] o.a.s.c.c.ConnectionManager Client is connected to ZooKeeper
   [junit4]   2> 1150742 INFO  (TEST-CollectionsAPIDistributedZkTest.test-seed#[6084C11E6ED1C557]) [    ] o.a.s.c.c.SolrZkClient Using default ZkACLProvider
   [junit4]   2> 1150743 INFO  (TEST-CollectionsAPIDistributedZkTest.test-seed#[6084C11E6ED1C557]) [    ] o.a.s.s.SolrDispatchFilter Loading solr.xml from SolrHome (not found in ZooKeeper)
   [junit4]   2> 1150743 INFO  (TEST-CollectionsAPIDistributedZkTest.test-seed#[6084C11E6ED1C557]) [    ] o.a.s.c.SolrXmlConfig Loading container configuration from /x1/jenkins/jenkins-slave/workspace/Lucene-Solr-NightlyTests-5.x/solr/build/solr-core/test/J0/temp/solr.cloud.CollectionsAPIDistributedZkTest_6084C11E6ED1C557-001/shard-1-001/solr.xml
   [junit4]   2> 1150757 INFO  (TEST-CollectionsAPIDistributedZkTest.test-seed#[6084C11E6ED1C557]) [    ] o.a.s.c.CorePropertiesLocator Config-defined core root directory: /x1/jenkins/jenkins-slave/workspace/Lucene-Solr-NightlyTests-5.x/solr/build/solr-core/test/J0/temp/solr.cloud.CollectionsAPIDistributedZkTest_6084C11E6ED1C557-001/shard-1-001/cores
   [junit4]   2> 1150757 INFO  (TEST-CollectionsAPIDistributedZkTest.test-seed#[6084C11E6ED1C557]) [    ] o.a.s.c.CoreContainer New CoreContainer 543568153
   [junit4]   2> 1150757 INFO  (TEST-CollectionsAPIDistributedZkTest.test-seed#[6084C11E6ED1C557]) [    ] o.a.s.c.CoreContainer Loading cores into CoreContainer [instanceDir=/x1/jenkins/jenkins-slave/workspace/Lucene-Solr-NightlyTests-5.x/solr/build/solr-core/test/J0/temp/solr.cloud.CollectionsAPIDistributedZkTest_6084C11E6ED1C557-001/shard-1-001]
   [junit4]   2> 1150758 WARN  (TEST-CollectionsAPIDistributedZkTest.test-seed#[6084C11E6ED1C557]) [    ] o.a.s.c.CoreContainer Couldn't add files from /x1/jenkins/jenkins-slave/workspace/Lucene-Solr-NightlyTests-5.x/solr/build/solr-core/test/J0/temp/solr.cloud.CollectionsAPIDistributedZkTest_6084C11E6ED1C557-001/shard-1-001/lib to classpath: /x1/jenkins/jenkins-slave/workspace/Lucene-Solr-NightlyTests-5.x/solr/build/solr-core/test/J0/temp/solr.cloud.CollectionsAPIDistributedZkTest_6084C11E6ED1C557-001/shard-1-001/lib
   [junit4]   2> 1150758 INFO  (TEST-CollectionsAPIDistributedZkTest.test-seed#[6084C11E6ED1C557]) [    ] o.a.s.h.c.HttpShardHandlerFactory created with socketTimeout : 90000,urlScheme : ,connTimeout : 15000,maxConnectionsPerHost : 20,maxConnections : 10000,corePoolSize : 0,maximumPoolSize : 2147483647,maxThreadIdleTime : 5,sizeOfQueue : -1,fairnessPolicy : false,useRetries : false,
   [junit4]   2> 1150760 INFO  (TEST-CollectionsAPIDistributedZkTest.test-seed#[6084C11E6ED1C557]) [    ] o.a.s.u.UpdateShardHandler Creating UpdateShardHandler HTTP client with params: socketTimeout=340000&connTimeout=45000&retry=true
   [junit4]   2> 1150762 INFO  (TEST-CollectionsAPIDistributedZkTest.test-seed#[6084C11E6ED1C557]) [    ] o.a.s.l.LogWatcher SLF4J impl is org.slf4j.impl.Log4jLoggerFactory
   [junit4]   2> 1150762 INFO  (TEST-CollectionsAPIDistributedZkTest.test-seed#[6084C11E6ED1C557]) [    ] o.a.s.l.LogWatcher Registering Log Listener [Log4j (org.slf4j.impl.Log4jLoggerFactory)]
   [junit4]   2> 1150762 INFO  (TEST-CollectionsAPIDistributedZkTest.test-seed#[6084C11E6ED1C557]) [    ] o.a.s.c.ZkContainer Zookeeper client=127.0.0.1:58605/solr
   [junit4]   2> 1150762 INFO  (TEST-CollectionsAPIDistributedZkTest.test-seed#[6084C11E6ED1C557]) [    ] o.a.s.c.ZkController zkHost includes chroot
   [junit4]   2> 1150762 INFO  (TEST-CollectionsAPIDistributedZkTest.test-seed#[6084C11E6ED1C557]) [    ] o.a.s.c.c.SolrZkClient Using default ZkCredentialsProvider
   [junit4]   2> 1150762 INFO  (TEST-CollectionsAPIDistributedZkTest.test-seed#[6084C11E6ED1C557]) [    ] o.a.s.c.c.ConnectionManager Waiting for client to connect to ZooKeeper
   [junit4]   2> 1150765 INFO  (zkCallback-1026-thread-1) [    ] o.a.s.c.c.ConnectionManager Watcher org.apache.solr.common.cloud.ConnectionManager@4b90a433 name:ZooKeeperConnection Watcher:127.0.0.1:58605 got event WatchedEvent state:SyncConnected type:None path:null path:null type:None
   [junit4]   2> 1150766 INFO  (TEST-CollectionsAPIDistributedZkTest.test-seed#[6084C11E6ED1C557]) [    ] o.a.s.c.c.ConnectionManager Client is connected to ZooKeeper
   [junit4]   2> 1150766 INFO  (TEST-CollectionsAPIDistributedZkTest.test-seed#[6084C11E6ED1C557]) [    ] o.a.s.c.c.SolrZkClient Using default ZkACLProvider
   [junit4]   2> 1150768 INFO  (TEST-CollectionsAPIDistributedZkTest.test-seed#[6084C11E6ED1C557]) [n:127.0.0.1:49206_a    ] o.a.s.c.c.ConnectionManager Waiting for client to connect to ZooKeeper
   [junit4]   2> 1150771 INFO  (zkCallback-1027-thread-1-processing-n:127.0.0.1:49206_a) [n:127.0.0.1:49206_a    ] o.a.s.c.c.ConnectionManager Watcher org.apache.solr.common.cloud.ConnectionManager@6495f01 name:ZooKeeperConnection Watcher:127.0.0.1:58605/solr got event WatchedEvent state:SyncConnected type:None path:null path:null type:None
   [junit4]   2> 1150771 INFO  (TEST-CollectionsAPIDistributedZkTest.test-seed#[6084C11E6ED1C557]) [n:127.0.0.1:49206_a    ] o.a.s.c.c.ConnectionManager Client is connected to ZooKeeper
   [junit4]   2> 1150776 INFO  (TEST-CollectionsAPIDistributedZkTest.test-seed#[6084C11E6ED1C557]) [n:127.0.0.1:49206_a    ] o.a.s.c.c.ZkStateReader Updating cluster state from ZooKeeper... 
   [junit4]   2> 1151781 INFO  (TEST-CollectionsAPIDistributedZkTest.test-seed#[6084C11E6ED1C557]) [n:127.0.0.1:49206_a    ] o.a.s.c.ZkController Register node as live in ZooKeeper:/live_nodes/127.0.0.1:49206_a
   [junit4]   2> 1151782 INFO  (TEST-CollectionsAPIDistributedZkTest.test-seed#[6084C11E6ED1C557]) [n:127.0.0.1:49206_a    ] o.a.s.c.c.SolrZkClient makePath: /live_nodes/127.0.0.1:49206_a
   [junit4]   2> 1151783 INFO  (zkCallback-1027-thread-1-processing-n:127.0.0.1:49206_a) [n:127.0.0.1:49206_a    ] o.a.s.c.c.ZkStateReader A live node change: [WatchedEvent state:SyncConnected type:NodeChildrenChanged path:/live_nodes], has occurred - updating... (live nodes size: [1])
   [junit4]   2> 1151783 INFO  (zkCallback-1022-thread-1) [    ] o.a.s.c.c.ZkStateReader A live node change: [WatchedEvent state:SyncConnected type:NodeChildrenChanged path:/live_nodes], has occurred - updating... (live nodes size: [1])
   [junit4]   2> 1151783 INFO  (zkCallback-1020-thread-2-processing-n:127.0.0.1:38201_a) [n:127.0.0.1:38201_a    ] o.a.s.c.c.ZkStateReader A live node change: [WatchedEvent state:SyncConnected type:NodeChildrenChanged path:/live_nodes], has occurred - updating... (live nodes size: [1])
   [junit4]   2> 1151783 INFO  (zkCallback-1020-thread-3-processing-n:127.0.0.1:38201_a) [n:127.0.0.1:38201_a    ] o.a.s.c.c.ZkStateReader A live node change: [WatchedEvent state:SyncConnected type:NodeChildrenChanged path:/live_nodes], has occurred - updating... (live nodes size: [1])
   [junit4]   2> 1151785 INFO  (TEST-CollectionsAPIDistributedZkTest.test-seed#[6084C11E6ED1C557]) [n:127.0.0.1:49206_a    ] o.a.s.c.Overseer Overseer (id=null) closing
   [junit4]   2> 1151786 INFO  (TEST-CollectionsAPIDistributedZkTest.test-seed#[6084C11E6ED1C557]) [n:127.0.0.1:49206_a    ] o.a.s.c.LeaderElector Joined leadership election with path: /overseer_elect/election/95186531110289418-127.0.0.1:49206_a-n_0000000001
   [junit4]   2> 1151787 INFO  (TEST-CollectionsAPIDistributedZkTest.test-seed#[6084C11E6ED1C557]) [n:127.0.0.1:49206_a    ] o.a.s.c.LeaderElector Watching path /overseer_elect/election/95186531110289413-127.0.0.1:38201_a-n_0000000000 to know if I could be the leader
   [junit4]   2> 1151810 INFO  (TEST-CollectionsAPIDistributedZkTest.test-seed#[6084C11E6ED1C557]) [n:127.0.0.1:49206_a    ] o.a.s.c.CoreContainer Security conf doesn't exist. Skipping setup for authorization module.
   [junit4]   2> 1151810 INFO  (TEST-CollectionsAPIDistributedZkTest.test-seed#[6084C11E6ED1C557]) [n:127.0.0.1:49206_a    ] o.a.s.c.CoreContainer No authentication plugin used.
   [junit4]   2> 1151811 INFO  (TEST-CollectionsAPIDistributedZkTest.test-seed#[6084C11E6ED1C557]) [n:127.0.0.1:49206_a    ] o.a.s.c.CorePropertiesLocator Looking for core definitions underneath /x1/jenkins/jenkins-slave/workspace/Lucene-Solr-NightlyTests-5.x/solr/build/solr-core/test/J0/temp/solr.cloud.CollectionsAPIDistributedZkTest_6084C11E6ED1C557-001/shard-1-001/cores
   [junit4]   2> 1151812 INFO  (TEST-CollectionsAPIDistributedZkTest.test-seed#[6084C11E6ED1C557]) [n:127.0.0.1:49206_a    ] o.a.s.c.CoreDescriptor Created CoreDescriptor: {config=solrconfig.xml, dataDir=data/, transient=false, collection=collection1, name=collection1, loadOnStartup=true, coreNodeName=, schema=schema.xml, shard=, configSetProperties=configsetprops.json}
   [junit4]   2> 1151812 INFO  (TEST-CollectionsAPIDistributedZkTest.test-seed#[6084C11E6ED1C557]) [n:127.0.0.1:49206_a    ] o.a.s.c.CorePropertiesLocator Found core collection1 in /x1/jenkins/jenkins-slave/workspace/Lucene-Solr-NightlyTests-5.x/solr/build/solr-core/test/J0/temp/solr.cloud.CollectionsAPIDistributedZkTest_6084C11E6ED1C557-001/shard-1-001/cores/collection1
   [junit4]   2> 1151812 INFO  (TEST-CollectionsAPIDistributedZkTest.test-seed#[6084C11E6ED1C557]) [n:127.0.0.1:49206_a    ] o.a.s.c.CorePropertiesLocator Found 1 core definitions
   [junit4]   2> 1151814 INFO  (TEST-CollectionsAPIDistributedZkTest.test-seed#[6084C11E6ED1C557]) [n:127.0.0.1:49206_a    ] o.a.s.s.SolrDispatchFilter user.dir=/x1/jenkins/jenkins-slave/workspace/Lucene-Solr-NightlyTests-5.x/solr/build/solr-core/test/J0
   [junit4]   2> 1151815 INFO  (TEST-CollectionsAPIDistributedZkTest.test-seed#[6084C11E6ED1C557]) [n:127.0.0.1:49206_a    ] o.a.s.s.SolrDispatchFilter SolrDispatchFilter.init() done
   [junit4]   2> 1151817 INFO  (coreLoadExecutor-2710-thread-1-processing-n:127.0.0.1:49206_a) [n:127.0.0.1:49206_a c:collection1   x:collection1] o.a.s.c.ZkController publishing state=down
   [junit4]   2> 1151817 INFO  (coreLoadExecutor-2710-thread-1-processing-n:127.0.0.1:49206_a) [n:127.0.0.1:49206_a c:collection1   x:collection1] o.a.s.c.ZkController numShards not found on descriptor - reading it from system property
   [junit4]   2> 1151819 INFO  (coreLoadExecutor-2710-thread-1-processing-n:127.0.0.1:49206_a) [n:127.0.0.1:49206_a c:collection1   x:collection1] o.a.s.c.ZkController Registering watch for collection collection1
   [junit4]   2> 1151819 INFO  (OverseerStateUpdate-95186531110289413-127.0.0.1:38201_a-n_0000000000) [n:127.0.0.1:38201_a    ] o.a.s.c.Overseer processMessage: queueSize: 1, message = {
   [junit4]   2>   "roles":null,
   [junit4]   2>   "state":"down",
   [junit4]   2>   "operation":"state",
   [junit4]   2>   "core":"collection1",
   [junit4]   2>   "collection":"collection1",
   [junit4]   2>   "base_url":"https://127.0.0.1:49206/a",
   [junit4]   2>   "shard":null,
   [junit4]   2>   "numShards":"2",
   [junit4]   2>   "node_name":"127.0.0.1:49206_a"} current state version: 3
   [junit4]   2> 1151819 INFO  (coreLoadExecutor-2710-thread-1-processing-n:127.0.0.1:49206_a) [n:127.0.0.1:49206_a c:collection1   x:collection1] o.a.s.c.c.ZkStateReader addZkWatch [collection1]
   [junit4]   2> 1151819 INFO  (coreLoadExecutor-2710-thread-1-processing-n:127.0.0.1:49206_a) [n:127.0.0.1:49206_a c:collection1   x:collection1] o.a.s.c.c.ZkStateReader Add data for [collection1] ver [0]
   [junit4]   2> 1151820 INFO  (OverseerStateUpdate-95186531110289413-127.0.0.1:38201_a-n_0000000000) [n:127.0.0.1:38201_a    ] o.a.s.c.o.ReplicaMutator Update state numShards=2 message={
   [junit4]   2>   "roles":null,
   [junit4]   2>   "state":"down",
   [junit4]   2>   "operation":"state",
   [junit4]   2>   "core":"collection1",
   [junit4]   2>   "collection":"collection1",
   [junit4]   2>   "base_url":"https://127.0.0.1:49206/a",
   [junit4]   2>   "shard":null,
   [junit4]   2>   "numShards":"2",
   [junit4]   2>   "node_name":"127.0.0.1:49206_a"}
   [junit4]   2> 1151820 INFO  (coreLoadExecutor-2710-thread-1-processing-n:127.0.0.1:49206_a) [n:127.0.0.1:49206_a c:collection1   x:collection1] o.a.s.c.ZkController look for our core node name
   [junit4]   2> 1151820 INFO  (OverseerStateUpdate-95186531110289413-127.0.0.1:38201_a-n_0000000000) [n:127.0.0.1:38201_a    ] o.a.s.c.o.ReplicaMutator Collection already exists with numShards=2
   [junit4]   2> 1151820 INFO  (OverseerStateUpdate-95186531110289413-127.0.0.1:38201_a-n_0000000000) [n:127.0.0.1:38201_a    ] o.a.s.c.o.ReplicaMutator Assigning new node to shard shard=shard2
   [junit4]   2> 1151925 INFO  (OverseerStateUpdate-95186531110289413-127.0.0.1:38201_a-n_0000000000) [n:127.0.0.1:38201_a    ] o.a.s.c.o.ZkStateWriter going to update_collection /collections/collection1/state.json version: 0
   [junit4]   2> 1151926 INFO  (zkCallback-1027-thread-1-processing-n:127.0.0.1:49206_a) [n:127.0.0.1:49206_a    ] o.a.s.c.c.ZkStateReader A cluster state change: [WatchedEvent state:SyncConnected type:NodeDataChanged path:/collections/collection1/state.json] for collection [collection1] has occurred - updating... (live nodes size: [2])
   [junit4]   2> 1151926 INFO  (zkCallback-1027-thread-1-processing-n:127.0.0.1:49206_a) [n:127.0.0.1:49206_a    ] o.a.s.c.c.ZkStateReader Updating data for [collection1] from [0] to [1]
   [junit4]   2> 1152820 INFO  (coreLoadExecutor-2710-thread-1-processing-n:127.0.0.1:49206_a) [n:127.0.0.1:49206_a c:collection1   x:collection1] o.a.s.c.ZkController waiting to find shard id in clusterstate for collection1
   [junit4]   2> 1152820 INFO  (coreLoadExecutor-2710-thread-1-processing-n:127.0.0.1:49206_a) [n:127.0.0.1:49206_a c:collection1   x:collection1] o.a.s.c.ZkController Check for collection zkNode:collection1
   [junit4]   2> 1152820 INFO  (coreLoadExecutor-2710-thread-1-processing-n:127.0.0.1:49206_a) [n:127.0.0.1:49206_a c:collection1   x:collection1] o.a.s.c.ZkController Collection zkNode exists
   [junit4]   2> 1152820 INFO  (coreLoadExecutor-2710-thread-1-processing-n:127.0.0.1:49206_a) [n:127.0.0.1:49206_a c:collection1   x:collection1] o.a.s.c.c.ZkStateReader Load collection config from: [/collections/collection1]
   [junit4]   2> 1152821 INFO  (coreLoadExecutor-2710-thread-1-processing-n:127.0.0.1:49206_a) [n:127.0.0.1:49206_a c:collection1   x:collection1] o.a.s.c.c.ZkStateReader path=[/collections/collection1] [configName]=[conf1] specified config exists in ZooKeeper
   [junit4]   2> 1152821 INFO  (coreLoadExecutor-2710-thread-1-processing-n:127.0.0.1:49206_a) [n:127.0.0.1:49206_a c:collection1   x:collection1] o.a.s.c.SolrResourceLoader new SolrResourceLoader for directory: '/x1/jenkins/jenkins-slave/workspace/Lucene-Solr-NightlyTests-5.x/solr/build/solr-core/test/J0/temp/solr.cloud.CollectionsAPIDistributedZkTest_6084C11E6ED1C557-001/shard-1-001/cores/collection1'
   [junit4]   2> 1152821 INFO  (coreLoadExecutor-2710-thread-1-processing-n:127.0.0.1:49206_a) [n:127.0.0.1:49206_a c:collection1   x:collection1] o.a.s.c.SolrResourceLoader JNDI not configured for solr (NoInitialContextEx)
   [junit4]   2> 1152821 INFO  (coreLoadExecutor-2710-thread-1-processing-n:127.0.0.1:49206_a) [n:127.0.0.1:49206_a c:collection1   x:collection1] o.a.s.c.SolrResourceLoader solr home defaulted to 'solr/' (could not find system property or JNDI)
   [junit4]   2> 1152823 INFO  (coreLoadExecutor-2710-thread-1-processing-n:127.0.0.1:49206_a) [n:127.0.0.1:49206_a c:collection1   x:collection1] o.a.s.c.Config loaded config solrconfig.xml with version 0 
   [junit4]   2> 1152829 INFO  (coreLoadExecutor-2710-thread-1-processing-n:127.0.0.1:49206_a) [n:127.0.0.1:49206_a c:collection1   x:collection1] o.a.s.c.SolrConfig current version of requestparams : -1
   [junit4]   2> 1152842 INFO  (coreLoadExecutor-2710-thread-1-processing-n:127.0.0.1:49206_a) [n:127.0.0.1:49206_a c:collection1   x:collection1] o.a.s.c.SolrConfig Using Lucene MatchVersion: 5.5.0
   [junit4]   2> 1152869 INFO  (coreLoadExecutor-2710-thread-1-processing-n:127.0.0.1:49206_a) [n:127.0.0.1:49206_a c:collection1   x:collection1] o.a.s.c.SolrConfig Loaded SolrConfig: solrconfig.xml
   [junit4]   2> 1152877 INFO  (coreLoadExecutor-2710-thread-1-processing-n:127.0.0.1:49206_a) [n:127.0.0.1:49206_a c:collection1   x:collection1] o.a.s.s.IndexSchema [collection1] Schema name=test
   [junit4]   2> 1153125 INFO  (coreLoadExecutor-2710-thread-1-processing-n:127.0.0.1:49206_a) [n:127.0.0.1:49206_a c:collection1   x:collection1] o.a.s.s.OpenExchangeRatesOrgProvider Initialized with rates=open-exchange-rates.json, refreshInterval=1440.
   [junit4]   2> 1153133 INFO  (coreLoadExecutor-2710-thread-1-processing-n:127.0.0.1:49206_a) [n:127.0.0.1:49206_a c:collection1   x:collection1] o.a.s.s.IndexSchema default search field in schema is text
   [junit4]   2> 1153135 INFO  (coreLoadExecutor-2710-thread-1-processing-n:127.0.0.1:49206_a) [n:127.0.0.1:49206_a c:collection1   x:collection1] o.a.s.s.IndexSchema unique key field: id
   [junit4]   2> 1153144 INFO  (coreLoadExecutor-2710-thread-1-processing-n:127.0.0.1:49206_a) [n:127.0.0.1:49206_a c:collection1   x:collection1] o.a.s.s.FileExchangeRateProvider Reloading exchange rates from file currency.xml
   [junit4]   2> 1153147 INFO  (coreLoadExecutor-2710-thread-1-processing-n:127.0.0.1:49206_a) [n:127.0.0.1:49206_a c:collection1   x:collection1] o.a.s.s.FileExchangeRateProvider Reloading exchange rates from file currency.xml
   [junit4]   2> 1153149 INFO  (coreLoadExecutor-2710-thread-1-processing-n:127.0.0.1:49206_a) [n:127.0.0.1:49206_a c:collection1   x:collection1] o.a.s.s.OpenExchangeRatesOrgProvider Reloading exchange rates from open-exchange-rates.json
   [junit4]   2> 1153150 INFO  (coreLoadExecutor-2710-thread-1-processing-n:127.0.0.1:49206_a) [n:127.0.0.1:49206_a c:collection1   x:collection1] o.a.s.s.OpenExchangeRatesOrgProvider Reloading exchange rates from open-exchange-rates.json
   [junit4]   2> 1153152 INFO  (coreLoadExecutor-2710-thread-1-processing-n:127.0.0.1:49206_a) [n:127.0.0.1:49206_a c:collection1   x:collection1] o.a.s.c.ConfigSetProperties Did not find ConfigSet properties, assuming default properties: Can't find resource 'configsetprops.json' in classpath or '/configs/conf1', cwd=/x1/jenkins/jenkins-slave/workspace/Lucene-Solr-NightlyTests-5.x/solr/build/solr-core/test/J0
   [junit4]   2> 1153152 INFO  (coreLoadExecutor-2710-thread-1-processing-n:127.0.0.1:49206_a) [n:127.0.0.1:49206_a c:collection1   x:collection1] o.a.s.c.CoreContainer Creating SolrCore 'collection1' using configuration from collection collection1
   [junit4]   2> 1153152 INFO  (coreLoadExecutor-2710-thread-1-processing-n:127.0.0.1:49206_a) [n:127.0.0.1:49206_a c:collection1 s:shard2 r:core_node1 x:collection1] o.a.s.c.SolrCore org.apache.solr.core.MockDirectoryFactory
   [junit4]   2> 1153152 INFO  (coreLoadExecutor-2710-thread-1-processing-n:127.0.0.1:49206_a) [n:127.0.0.1:49206_a c:collection1 s:shard2 r:core_node1 x:collection1] o.a.s.c.SolrCore [[collection1] ] Opening new SolrCore at [/x1/jenkins/jenkins-slave/workspace/Lucene-Solr-NightlyTests-5.x/solr/build/solr-core/test/J0/temp/solr.cloud.CollectionsAPIDistributedZkTest_6084C11E6ED1C557-001/shard-1-001/cores/collection1], dataDir=[/x1/jenkins/jenkins-slave/workspace/Lucene-Solr-NightlyTests-5.x/solr/build/solr-core/test/J0/temp/solr.cloud.CollectionsAPIDistributedZkTest_6084C11E6ED1C557-001/shard-1-001/cores/collection1/data/]
   [junit4]   2> 1153153 INFO  (coreLoadExecutor-2710-thread-1-processing-n:127.0.0.1:49206_a) [n:127.0.0.1:49206_a c:collection1 s:shard2 r:core_node1 x:collection1] o.a.s.c.JmxMonitoredMap JMX monitoring is enabled. Adding Solr mbeans to JMX Server: com.sun.jmx.mbeanserver.JmxMBeanServer@65cb8923
   [junit4]   2> 1153153 INFO  (coreLoadExecutor-2710-thread-1-processing-n:127.0.0.1:49206_a) [n:127.0.0.1:49206_a c:collection1 s:shard2 r:core_node1 x:collection1] o.a.s.c.CachingDirectoryFactory return new directory for /x1/jenkins/jenkins-slave/workspace/Lucene-Solr-NightlyTests-5.x/solr/build/solr-core/test/J0/temp/solr.cloud.CollectionsAPIDistributedZkTest_6084C11E6ED1C557-001/shard-1-001/cores/collection1/data
   [junit4]   2> 1153153 INFO  (coreLoadExecutor-2710-thread-1-processing-n:127.0.0.1:49206_a) [n:127.0.0.1:49206_a c:collection1 s:shard2 r:core_node1 x:collection1] o.a.s.c.SolrCore New index directory detected: old=null new=/x1/jenkins/jenkins-slave/workspace/Lucene-Solr-NightlyTests-5.x/solr/build/solr-core/test/J0/temp/solr.cloud.CollectionsAPIDistributedZkTest_6084C11E6ED1C557-001/shard-1-001/cores/collection1/data/index/
   [junit4]   2> 1153153 WARN  (coreLoadExecutor-2710-thread-1-processing-n:127.0.0.1:49206_a) [n:127.0.0.1:49206_a c:collection1 s:shard2 r:core_node1 x:collection1] o.a.s.c.SolrCore [collection1] Solr index directory '/x1/jenkins/jenkins-slave/workspace/Lucene-Solr-NightlyTests-5.x/solr/build/solr-core/test/J0/temp/solr.cloud.CollectionsAPIDistributedZkTest_6084C11E6ED1C557-001/shard-1-001/cores/collection1/data/index' doesn't exist. Creating new index...
   [junit4]   2> 1153154 INFO  (coreLoadExecutor-2710-thread-1-processing-n:127.0.0.1:49206_a) [n:127.0.0.1:49206_a c:collection1 s:shard2 r:core_node1 x:collection1] o.a.s.c.CachingDirectoryFactory return new directory for /x1/jenkins/jenkins-slave/workspace/Lucene-Solr-NightlyTests-5.x/solr/build/solr-core/test/J0/temp/solr.cloud.CollectionsAPIDistributedZkTest_6084C11E6ED1C557-001/shard-1-001/cores/collection1/data/index
   [junit4]   2> 1153154 INFO  (coreLoadExecutor-2710-thread-1-processing-n:127.0.0.1:49206_a) [n:127.0.0.1:49206_a c:collection1 s:shard2 r:core_node1 x:collection1] o.a.

[...truncated too long message...]

junit4]    > 	at org.apache.solr.cloud.AbstractFullDistribZkTestBase.createCollection(AbstractFullDistribZkTestBase.java:1574)
   [junit4]    > 	at org.apache.solr.cloud.AbstractFullDistribZkTestBase.createCollection(AbstractFullDistribZkTestBase.java:1595)
   [junit4]    > 	at org.apache.solr.cloud.CollectionsAPIDistributedZkTest$1CollectionThread.run(CollectionsAPIDistributedZkTest.java:881)Throwable #4: com.carrotsearch.randomizedtesting.UncaughtExceptionError: Captured an uncaught exception in thread: Thread[id=11474, name=collection4, state=RUNNABLE, group=TGRP-CollectionsAPIDistributedZkTest]
   [junit4]    > Caused by: org.apache.solr.client.solrj.impl.HttpSolrClient$RemoteSolrException: Error from server at https://127.0.0.1:44248/a: collection already exists: awholynewstresscollection_collection4_0
   [junit4]    > 	at __randomizedtesting.SeedInfo.seed([6084C11E6ED1C557]:0)
   [junit4]    > 	at org.apache.solr.client.solrj.impl.HttpSolrClient.executeMethod(HttpSolrClient.java:575)
   [junit4]    > 	at org.apache.solr.client.solrj.impl.HttpSolrClient.request(HttpSolrClient.java:241)
   [junit4]    > 	at org.apache.solr.client.solrj.impl.HttpSolrClient.request(HttpSolrClient.java:230)
   [junit4]    > 	at org.apache.solr.client.solrj.impl.LBHttpSolrClient.doRequest(LBHttpSolrClient.java:372)
   [junit4]    > 	at org.apache.solr.client.solrj.impl.LBHttpSolrClient.request(LBHttpSolrClient.java:325)
   [junit4]    > 	at org.apache.solr.client.solrj.impl.CloudSolrClient.sendRequest(CloudSolrClient.java:1100)
   [junit4]    > 	at org.apache.solr.client.solrj.impl.CloudSolrClient.requestWithRetryOnStaleState(CloudSolrClient.java:871)
   [junit4]    > 	at org.apache.solr.client.solrj.impl.CloudSolrClient.request(CloudSolrClient.java:807)
   [junit4]    > 	at org.apache.solr.client.solrj.SolrClient.request(SolrClient.java:1220)
   [junit4]    > 	at org.apache.solr.cloud.AbstractFullDistribZkTestBase.createCollection(AbstractFullDistribZkTestBase.java:1574)
   [junit4]    > 	at org.apache.solr.cloud.AbstractFullDistribZkTestBase.createCollection(AbstractFullDistribZkTestBase.java:1595)
   [junit4]    > 	at org.apache.solr.cloud.CollectionsAPIDistributedZkTest$1CollectionThread.run(CollectionsAPIDistributedZkTest.java:881)Throwable #5: com.carrotsearch.randomizedtesting.UncaughtExceptionError: Captured an uncaught exception in thread: Thread[id=11475, name=collection5, state=RUNNABLE, group=TGRP-CollectionsAPIDistributedZkTest]
   [junit4]    > Caused by: org.apache.solr.client.solrj.impl.HttpSolrClient$RemoteSolrException: Error from server at https://127.0.0.1:44248/a: collection already exists: awholynewstresscollection_collection5_0
   [junit4]    > 	at __randomizedtesting.SeedInfo.seed([6084C11E6ED1C557]:0)
   [junit4]    > 	at org.apache.solr.client.solrj.impl.HttpSolrClient.executeMethod(HttpSolrClient.java:575)
   [junit4]    > 	at org.apache.solr.client.solrj.impl.HttpSolrClient.request(HttpSolrClient.java:241)
   [junit4]    > 	at org.apache.solr.client.solrj.impl.HttpSolrClient.request(HttpSolrClient.java:230)
   [junit4]    > 	at org.apache.solr.client.solrj.impl.LBHttpSolrClient.doRequest(LBHttpSolrClient.java:372)
   [junit4]    > 	at org.apache.solr.client.solrj.impl.LBHttpSolrClient.request(LBHttpSolrClient.java:325)
   [junit4]    > 	at org.apache.solr.client.solrj.impl.CloudSolrClient.sendRequest(CloudSolrClient.java:1100)
   [junit4]    > 	at org.apache.solr.client.solrj.impl.CloudSolrClient.requestWithRetryOnStaleState(CloudSolrClient.java:871)
   [junit4]    > 	at org.apache.solr.client.solrj.impl.CloudSolrClient.request(CloudSolrClient.java:807)
   [junit4]    > 	at org.apache.solr.client.solrj.SolrClient.request(SolrClient.java:1220)
   [junit4]    > 	at org.apache.solr.cloud.AbstractFullDistribZkTestBase.createCollection(AbstractFullDistribZkTestBase.java:1574)
   [junit4]    > 	at org.apache.solr.cloud.AbstractFullDistribZkTestBase.createCollection(AbstractFullDistribZkTestBase.java:1595)
   [junit4]    > 	at org.apache.solr.cloud.CollectionsAPIDistributedZkTest$1CollectionThread.run(CollectionsAPIDistributedZkTest.java:881)Throwable #6: com.carrotsearch.randomizedtesting.UncaughtExceptionError: Captured an uncaught exception in thread: Thread[id=11473, name=collection3, state=RUNNABLE, group=TGRP-CollectionsAPIDistributedZkTest]
   [junit4]    > Caused by: org.apache.solr.client.solrj.impl.HttpSolrClient$RemoteSolrException: Error from server at https://127.0.0.1:33363/a: Could not find collection : awholynewstresscollection_collection3_0
   [junit4]    > 	at __randomizedtesting.SeedInfo.seed([6084C11E6ED1C557]:0)
   [junit4]    > 	at org.apache.solr.client.solrj.impl.HttpSolrClient.executeMethod(HttpSolrClient.java:575)
   [junit4]    > 	at org.apache.solr.client.solrj.impl.HttpSolrClient.request(HttpSolrClient.java:241)
   [junit4]    > 	at org.apache.solr.client.solrj.impl.HttpSolrClient.request(HttpSolrClient.java:230)
   [junit4]    > 	at org.apache.solr.client.solrj.impl.LBHttpSolrClient.doRequest(LBHttpSolrClient.java:372)
   [junit4]    > 	at org.apache.solr.client.solrj.impl.LBHttpSolrClient.request(LBHttpSolrClient.java:325)
   [junit4]    > 	at org.apache.solr.client.solrj.impl.CloudSolrClient.sendRequest(CloudSolrClient.java:1100)
   [junit4]    > 	at org.apache.solr.client.solrj.impl.CloudSolrClient.requestWithRetryOnStaleState(CloudSolrClient.java:871)
   [junit4]    > 	at org.apache.solr.client.solrj.impl.CloudSolrClient.request(CloudSolrClient.java:807)
   [junit4]    > 	at org.apache.solr.client.solrj.SolrClient.request(SolrClient.java:1220)
   [junit4]    > 	at org.apache.solr.cloud.CollectionsAPIDistributedZkTest$1CollectionThread.run(CollectionsAPIDistributedZkTest.java:888)
   [junit4]   2> 1687035 INFO  (SUITE-CollectionsAPIDistributedZkTest-seed#[6084C11E6ED1C557]-worker) [n:127.0.0.1:44248_a c:addReplicaColl s:shard2 r:core_node3 x:addReplicaColl_shard2_replica2] o.a.s.SolrTestCaseJ4 ###deleteCore
   [junit4]   2> NOTE: test params are: codec=CheapBastard, sim=RandomSimilarityProvider(queryNorm=false,coord=no): {}, locale=es_UY, timezone=Europe/Busingen
   [junit4]   2> NOTE: Linux 3.13.0-52-generic amd64/Oracle Corporation 1.7.0_80 (64-bit)/cpus=4,threads=1,free=138675704,total=508559360
   [junit4]   2> NOTE: All tests run in this JVM: [DistributedQueryComponentCustomSortTest, ExplicitHLLTest, IndexSchemaRuntimeFieldTest, TestHashQParserPlugin, TestBulkSchemaAPI, OutputWriterTest, CursorPagingTest, TestAnalyzedSuggestions, TestSimpleQParserPlugin, UUIDFieldTest, ReturnFieldsTest, CopyFieldTest, AtomicUpdatesTest, DefaultValueUpdateProcessorTest, TestHdfsUpdateLog, OverseerTaskQueueTest, SSLMigrationTest, DisMaxRequestHandlerTest, TestFieldCollectionResource, TestComponentsName, TestFastOutputStream, TestBulkSchemaConcurrent, TestScoreJoinQPScore, TestAuthorizationFramework, IndexSchemaTest, TestUniqueKeyFieldResource, TestLRUCache, TestAnalyzeInfixSuggestions, DistributedExpandComponentTest, XsltUpdateRequestHandlerTest, HdfsChaosMonkeyNothingIsSafeTest, TestDefaultSearchFieldResource, TestMiniSolrCloudClusterSSL, CollectionTooManyReplicasTest, DistribJoinFromCollectionTest, OverseerCollectionConfigSetProcessorTest, TestRangeQuery, TestStressLucene, DateFieldTest, SecurityConfHandlerTest, PeerSyncTest, TestCSVLoader, VMParamsZkACLAndCredentialsProvidersTest, FileBasedSpellCheckerTest, PingRequestHandlerTest, TestLRUStatsCache, TestConfigSetProperties, DocumentAnalysisRequestHandlerTest, SuggestComponentTest, TestFoldingMultitermQuery, TestReplicationHandlerBackup, DistributedQueryElevationComponentTest, TestSchemaManager, SolrCoreTest, StandardRequestHandlerTest, PreAnalyzedFieldTest, ResourceLoaderTest, TestBadConfig, TestChildDocTransformer, QueryResultKeyTest, HighlighterMaxOffsetTest, DocValuesMissingTest, TestManagedSchemaFieldTypeResource, TestPseudoReturnFields, TestValueSourceCache, TestRandomCollapseQParserPlugin, SignatureUpdateProcessorFactoryTest, TestAddFieldRealTimeGet, TestIBSimilarityFactory, TestMergePolicyConfig, TestLMDirichletSimilarityFactory, SimpleMLTQParserTest, HdfsNNFailoverTest, TestClusterStateMutator, URLClassifyProcessorTest, TestSerializedLuceneMatchVersion, PolyFieldTest, BigEndianAscendingWordDeserializerTest, TestCloudSchemaless, PathHierarchyTokenizerFactoryTest, TestMiniSolrCloudCluster, FacetPivotSmallTest, ForceLeaderTest, TestSchemaResource, HLLUtilTest, TestBinaryField, TestCryptoKeys, TestCrossCoreJoin, TestFieldTypeResource, TestPhraseSuggestions, BasicZkTest, TestArbitraryIndexDir, CurrencyFieldOpenExchangeTest, CollectionsAPIDistributedZkTest]
   [junit4] Completed [271/563 (1!)] on J0 in 540.43s, 1 test, 1 error <<< FAILURES!

[...truncated 967 lines...]
BUILD FAILED
/x1/jenkins/jenkins-slave/workspace/Lucene-Solr-NightlyTests-5.x/build.xml:801: The following error occurred while executing this line:
/x1/jenkins/jenkins-slave/workspace/Lucene-Solr-NightlyTests-5.x/build.xml:738: The following error occurred while executing this line:
/x1/jenkins/jenkins-slave/workspace/Lucene-Solr-NightlyTests-5.x/build.xml:59: The following error occurred while executing this line:
/x1/jenkins/jenkins-slave/workspace/Lucene-Solr-NightlyTests-5.x/solr/build.xml:233: The following error occurred while executing this line:
/x1/jenkins/jenkins-slave/workspace/Lucene-Solr-NightlyTests-5.x/solr/common-build.xml:526: The following error occurred while executing this line:
/x1/jenkins/jenkins-slave/workspace/Lucene-Solr-NightlyTests-5.x/lucene/common-build.xml:1444: The following error occurred while executing this line:
/x1/jenkins/jenkins-slave/workspace/Lucene-Solr-NightlyTests-5.x/lucene/common-build.xml:1000: There were test failures: 563 suites (7 ignored), 2236 tests, 1 error, 33 ignored (18 assumptions) [seed: 6084C11E6ED1C557]

Total time: 201 minutes 14 seconds
Build step 'Invoke Ant' marked build as failure
Archiving artifacts
Recording test results
Email was triggered for: Failure - Any
Sending email for trigger: Failure - Any



Mime
View raw message