lucene-dev mailing list archives

Site index · List index
Message view « Date » · « Thread »
Top « Date » · « Thread »
From Policeman Jenkins Server <jenk...@thetaphi.de>
Subject [JENKINS-EA] Lucene-Solr-5.x-Linux (32bit/jdk-9-ea+95) - Build # 15242 - Failure!
Date Wed, 13 Jan 2016 06:14:52 GMT
Build: http://jenkins.thetaphi.de/job/Lucene-Solr-5.x-Linux/15242/
Java: 32bit/jdk-9-ea+95 -server -XX:+UseConcMarkSweepGC -XX:-CompactStrings

1 tests failed.
FAILED:  org.apache.solr.core.TestArbitraryIndexDir.testLoadNewIndexDir

Error Message:
Exception during query

Stack Trace:
java.lang.RuntimeException: Exception during query
	at __randomizedtesting.SeedInfo.seed([D2FF81078DFC658E:3BA53A3F1365F526]:0)
	at org.apache.solr.SolrTestCaseJ4.assertQ(SolrTestCaseJ4.java:753)
	at org.apache.solr.core.TestArbitraryIndexDir.testLoadNewIndexDir(TestArbitraryIndexDir.java:107)
	at sun.reflect.NativeMethodAccessorImpl.invoke0(Native Method)
	at sun.reflect.NativeMethodAccessorImpl.invoke(NativeMethodAccessorImpl.java:62)
	at sun.reflect.DelegatingMethodAccessorImpl.invoke(DelegatingMethodAccessorImpl.java:43)
	at java.lang.reflect.Method.invoke(Method.java:520)
	at com.carrotsearch.randomizedtesting.RandomizedRunner.invoke(RandomizedRunner.java:1764)
	at com.carrotsearch.randomizedtesting.RandomizedRunner$8.evaluate(RandomizedRunner.java:871)
	at com.carrotsearch.randomizedtesting.RandomizedRunner$9.evaluate(RandomizedRunner.java:907)
	at com.carrotsearch.randomizedtesting.RandomizedRunner$10.evaluate(RandomizedRunner.java:921)
	at com.carrotsearch.randomizedtesting.rules.SystemPropertiesRestoreRule$1.evaluate(SystemPropertiesRestoreRule.java:57)
	at com.carrotsearch.randomizedtesting.rules.SystemPropertiesRestoreRule$1.evaluate(SystemPropertiesRestoreRule.java:57)
	at org.apache.lucene.util.TestRuleSetupTeardownChained$1.evaluate(TestRuleSetupTeardownChained.java:50)
	at org.apache.lucene.util.AbstractBeforeAfterRule$1.evaluate(AbstractBeforeAfterRule.java:46)
	at org.apache.lucene.util.TestRuleThreadAndTestName$1.evaluate(TestRuleThreadAndTestName.java:49)
	at org.apache.lucene.util.TestRuleIgnoreAfterMaxFailures$1.evaluate(TestRuleIgnoreAfterMaxFailures.java:65)
	at org.apache.lucene.util.TestRuleMarkFailure$1.evaluate(TestRuleMarkFailure.java:48)
	at com.carrotsearch.randomizedtesting.rules.StatementAdapter.evaluate(StatementAdapter.java:36)
	at com.carrotsearch.randomizedtesting.ThreadLeakControl$StatementRunner.run(ThreadLeakControl.java:367)
	at com.carrotsearch.randomizedtesting.ThreadLeakControl.forkTimeoutingTask(ThreadLeakControl.java:809)
	at com.carrotsearch.randomizedtesting.ThreadLeakControl$3.evaluate(ThreadLeakControl.java:460)
	at com.carrotsearch.randomizedtesting.RandomizedRunner.runSingleTest(RandomizedRunner.java:880)
	at com.carrotsearch.randomizedtesting.RandomizedRunner$5.evaluate(RandomizedRunner.java:781)
	at com.carrotsearch.randomizedtesting.RandomizedRunner$6.evaluate(RandomizedRunner.java:816)
	at com.carrotsearch.randomizedtesting.RandomizedRunner$7.evaluate(RandomizedRunner.java:827)
	at com.carrotsearch.randomizedtesting.rules.StatementAdapter.evaluate(StatementAdapter.java:36)
	at com.carrotsearch.randomizedtesting.rules.SystemPropertiesRestoreRule$1.evaluate(SystemPropertiesRestoreRule.java:57)
	at org.apache.lucene.util.AbstractBeforeAfterRule$1.evaluate(AbstractBeforeAfterRule.java:46)
	at com.carrotsearch.randomizedtesting.rules.StatementAdapter.evaluate(StatementAdapter.java:36)
	at org.apache.lucene.util.TestRuleStoreClassName$1.evaluate(TestRuleStoreClassName.java:42)
	at com.carrotsearch.randomizedtesting.rules.NoShadowingOrOverridesOnMethodsRule$1.evaluate(NoShadowingOrOverridesOnMethodsRule.java:40)
	at com.carrotsearch.randomizedtesting.rules.NoShadowingOrOverridesOnMethodsRule$1.evaluate(NoShadowingOrOverridesOnMethodsRule.java:40)
	at com.carrotsearch.randomizedtesting.rules.StatementAdapter.evaluate(StatementAdapter.java:36)
	at com.carrotsearch.randomizedtesting.rules.StatementAdapter.evaluate(StatementAdapter.java:36)
	at com.carrotsearch.randomizedtesting.rules.StatementAdapter.evaluate(StatementAdapter.java:36)
	at org.apache.lucene.util.TestRuleAssertionsRequired$1.evaluate(TestRuleAssertionsRequired.java:54)
	at org.apache.lucene.util.TestRuleMarkFailure$1.evaluate(TestRuleMarkFailure.java:48)
	at org.apache.lucene.util.TestRuleIgnoreAfterMaxFailures$1.evaluate(TestRuleIgnoreAfterMaxFailures.java:65)
	at org.apache.lucene.util.TestRuleIgnoreTestSuites$1.evaluate(TestRuleIgnoreTestSuites.java:55)
	at com.carrotsearch.randomizedtesting.rules.StatementAdapter.evaluate(StatementAdapter.java:36)
	at com.carrotsearch.randomizedtesting.ThreadLeakControl$StatementRunner.run(ThreadLeakControl.java:367)
	at java.lang.Thread.run(Thread.java:747)
Caused by: java.lang.RuntimeException: REQUEST FAILED: xpath=*[count(//doc)=1]
	xml response was: <?xml version="1.0" encoding="UTF-8"?>
<response>
<lst name="responseHeader"><int name="status">0</int><int name="QTime">0</int></lst><result name="response" numFound="0" start="0"></result>
</response>

	request was:q=id:2&qt=standard&start=0&rows=20&version=2.2
	at org.apache.solr.SolrTestCaseJ4.assertQ(SolrTestCaseJ4.java:746)
	... 41 more




Build Log:
[...truncated 10316 lines...]
   [junit4] Suite: org.apache.solr.core.TestArbitraryIndexDir
   [junit4]   2> Creating dataDir: /home/jenkins/workspace/Lucene-Solr-5.x-Linux/solr/build/solr-core/test/J0/temp/solr.core.TestArbitraryIndexDir_D2FF81078DFC658E-001/init-core-data-001
   [junit4]   2> 450456 INFO  (SUITE-TestArbitraryIndexDir-seed#[D2FF81078DFC658E]-worker) [    ] o.a.s.SolrTestCaseJ4 Randomized ssl (false) and clientAuth (false)
   [junit4]   2> 450457 INFO  (TEST-TestArbitraryIndexDir.testLoadNewIndexDir-seed#[D2FF81078DFC658E]) [    ] o.a.s.SolrTestCaseJ4 ###Starting testLoadNewIndexDir
   [junit4]   2> 450458 INFO  (TEST-TestArbitraryIndexDir.testLoadNewIndexDir-seed#[D2FF81078DFC658E]) [    ] o.a.s.SolrTestCaseJ4 ####initCore
   [junit4]   2> 450458 INFO  (TEST-TestArbitraryIndexDir.testLoadNewIndexDir-seed#[D2FF81078DFC658E]) [    ] o.a.s.c.SolrResourceLoader new SolrResourceLoader for directory: '/home/jenkins/workspace/Lucene-Solr-5.x-Linux/solr/core/src/test-files/solr/collection1'
   [junit4]   2> 450458 INFO  (TEST-TestArbitraryIndexDir.testLoadNewIndexDir-seed#[D2FF81078DFC658E]) [    ] o.a.s.c.SolrResourceLoader JNDI not configured for solr (NoInitialContextEx)
   [junit4]   2> 450458 INFO  (TEST-TestArbitraryIndexDir.testLoadNewIndexDir-seed#[D2FF81078DFC658E]) [    ] o.a.s.c.SolrResourceLoader using system property solr.solr.home: /home/jenkins/workspace/Lucene-Solr-5.x-Linux/solr/core/src/test-files/solr
   [junit4]   2> 450459 INFO  (TEST-TestArbitraryIndexDir.testLoadNewIndexDir-seed#[D2FF81078DFC658E]) [    ] o.a.s.c.SolrResourceLoader Adding 'file:/home/jenkins/workspace/Lucene-Solr-5.x-Linux/solr/core/src/test-files/solr/collection1/lib/classes/' to classloader
   [junit4]   2> 450459 INFO  (TEST-TestArbitraryIndexDir.testLoadNewIndexDir-seed#[D2FF81078DFC658E]) [    ] o.a.s.c.SolrResourceLoader Adding 'file:/home/jenkins/workspace/Lucene-Solr-5.x-Linux/solr/core/src/test-files/solr/collection1/lib/README' to classloader
   [junit4]   2> 450480 INFO  (TEST-TestArbitraryIndexDir.testLoadNewIndexDir-seed#[D2FF81078DFC658E]) [    ] o.a.s.c.SolrConfig current version of requestparams : -1
   [junit4]   2> 450489 INFO  (TEST-TestArbitraryIndexDir.testLoadNewIndexDir-seed#[D2FF81078DFC658E]) [    ] o.a.s.c.SolrConfig Using Lucene MatchVersion: 5.5.0
   [junit4]   2> 450513 INFO  (TEST-TestArbitraryIndexDir.testLoadNewIndexDir-seed#[D2FF81078DFC658E]) [    ] o.a.s.c.SolrConfig Loaded SolrConfig: solrconfig.xml
   [junit4]   2> 450517 INFO  (TEST-TestArbitraryIndexDir.testLoadNewIndexDir-seed#[D2FF81078DFC658E]) [    ] o.a.s.s.IndexSchema [null] Schema name=test
   [junit4]   2> 450604 INFO  (TEST-TestArbitraryIndexDir.testLoadNewIndexDir-seed#[D2FF81078DFC658E]) [    ] o.a.s.s.IndexSchema default search field in schema is text
   [junit4]   2> 450605 INFO  (TEST-TestArbitraryIndexDir.testLoadNewIndexDir-seed#[D2FF81078DFC658E]) [    ] o.a.s.s.IndexSchema unique key field: id
   [junit4]   2> 450605 WARN  (TEST-TestArbitraryIndexDir.testLoadNewIndexDir-seed#[D2FF81078DFC658E]) [    ] o.a.s.s.IndexSchema Field text is not multivalued and destination for multiple copyFields (2)
   [junit4]   2> 450611 INFO  (TEST-TestArbitraryIndexDir.testLoadNewIndexDir-seed#[D2FF81078DFC658E]) [    ] o.a.s.s.FileExchangeRateProvider Reloading exchange rates from file currency.xml
   [junit4]   2> 450613 INFO  (TEST-TestArbitraryIndexDir.testLoadNewIndexDir-seed#[D2FF81078DFC658E]) [    ] o.a.s.s.FileExchangeRateProvider Reloading exchange rates from file currency.xml
   [junit4]   2> 450615 INFO  (TEST-TestArbitraryIndexDir.testLoadNewIndexDir-seed#[D2FF81078DFC658E]) [    ] o.a.s.c.SolrResourceLoader JNDI not configured for solr (NoInitialContextEx)
   [junit4]   2> 450615 INFO  (TEST-TestArbitraryIndexDir.testLoadNewIndexDir-seed#[D2FF81078DFC658E]) [    ] o.a.s.c.SolrResourceLoader using system property solr.solr.home: /home/jenkins/workspace/Lucene-Solr-5.x-Linux/solr/core/src/test-files/solr
   [junit4]   2> 450615 INFO  (TEST-TestArbitraryIndexDir.testLoadNewIndexDir-seed#[D2FF81078DFC658E]) [    ] o.a.s.c.SolrResourceLoader new SolrResourceLoader for directory: '/home/jenkins/workspace/Lucene-Solr-5.x-Linux/solr/core/src/test-files/solr'
   [junit4]   2> 450615 INFO  (TEST-TestArbitraryIndexDir.testLoadNewIndexDir-seed#[D2FF81078DFC658E]) [    ] o.a.s.c.SolrResourceLoader JNDI not configured for solr (NoInitialContextEx)
   [junit4]   2> 450615 INFO  (TEST-TestArbitraryIndexDir.testLoadNewIndexDir-seed#[D2FF81078DFC658E]) [    ] o.a.s.c.SolrResourceLoader using system property solr.solr.home: /home/jenkins/workspace/Lucene-Solr-5.x-Linux/solr/core/src/test-files/solr
   [junit4]   2> 450615 INFO  (TEST-TestArbitraryIndexDir.testLoadNewIndexDir-seed#[D2FF81078DFC658E]) [    ] o.a.s.c.CoreContainer New CoreContainer 22627864
   [junit4]   2> 450615 INFO  (TEST-TestArbitraryIndexDir.testLoadNewIndexDir-seed#[D2FF81078DFC658E]) [    ] o.a.s.c.CoreContainer Loading cores into CoreContainer [instanceDir=/home/jenkins/workspace/Lucene-Solr-5.x-Linux/solr/core/src/test-files/solr]
   [junit4]   2> 450616 WARN  (TEST-TestArbitraryIndexDir.testLoadNewIndexDir-seed#[D2FF81078DFC658E]) [    ] o.a.s.c.CoreContainer Couldn't add files from /home/jenkins/workspace/Lucene-Solr-5.x-Linux/solr/core/src/test-files/solr/lib to classpath: /home/jenkins/workspace/Lucene-Solr-5.x-Linux/solr/core/src/test-files/solr/lib
   [junit4]   2> 450616 INFO  (TEST-TestArbitraryIndexDir.testLoadNewIndexDir-seed#[D2FF81078DFC658E]) [    ] o.a.s.h.c.HttpShardHandlerFactory created with socketTimeout : 600000,connTimeout : 60000,maxConnectionsPerHost : 20,maxConnections : 10000,corePoolSize : 0,maximumPoolSize : 2147483647,maxThreadIdleTime : 5,sizeOfQueue : -1,fairnessPolicy : false,useRetries : false,
   [junit4]   2> 450619 INFO  (TEST-TestArbitraryIndexDir.testLoadNewIndexDir-seed#[D2FF81078DFC658E]) [    ] o.a.s.u.UpdateShardHandler Creating UpdateShardHandler HTTP client with params: socketTimeout=30000&connTimeout=30000&retry=true
   [junit4]   2> 450620 INFO  (TEST-TestArbitraryIndexDir.testLoadNewIndexDir-seed#[D2FF81078DFC658E]) [    ] o.a.s.l.LogWatcher SLF4J impl is org.slf4j.impl.Log4jLoggerFactory
   [junit4]   2> 450620 INFO  (TEST-TestArbitraryIndexDir.testLoadNewIndexDir-seed#[D2FF81078DFC658E]) [    ] o.a.s.l.LogWatcher Registering Log Listener [Log4j (org.slf4j.impl.Log4jLoggerFactory)]
   [junit4]   2> 450620 INFO  (TEST-TestArbitraryIndexDir.testLoadNewIndexDir-seed#[D2FF81078DFC658E]) [    ] o.a.s.c.CoreContainer Security conf doesn't exist. Skipping setup for authorization module.
   [junit4]   2> 450620 INFO  (TEST-TestArbitraryIndexDir.testLoadNewIndexDir-seed#[D2FF81078DFC658E]) [    ] o.a.s.c.CoreContainer No authentication plugin used.
   [junit4]   2> 450620 INFO  (TEST-TestArbitraryIndexDir.testLoadNewIndexDir-seed#[D2FF81078DFC658E]) [    ] o.a.s.c.CoreDescriptor Created CoreDescriptor: {name=collection1, config=solrconfig.xml, transient=false, schema=schema12.xml, loadOnStartup=true, configSetProperties=configsetprops.json, collection=collection1, dataDir=/home/jenkins/workspace/Lucene-Solr-5.x-Linux/solr/build/solr-core/test/J0/temp/solr.core.TestArbitraryIndexDir_D2FF81078DFC658E-001/init-core-data-001, shard=shard1}
   [junit4]   2> 450621 INFO  (coreLoadExecutor-2241-thread-1) [    ] o.a.s.c.SolrResourceLoader new SolrResourceLoader for directory: '/home/jenkins/workspace/Lucene-Solr-5.x-Linux/solr/core/src/test-files/solr/collection1'
   [junit4]   2> 450621 INFO  (coreLoadExecutor-2241-thread-1) [    ] o.a.s.c.SolrResourceLoader JNDI not configured for solr (NoInitialContextEx)
   [junit4]   2> 450621 INFO  (coreLoadExecutor-2241-thread-1) [    ] o.a.s.c.SolrResourceLoader using system property solr.solr.home: /home/jenkins/workspace/Lucene-Solr-5.x-Linux/solr/core/src/test-files/solr
   [junit4]   2> 450621 INFO  (coreLoadExecutor-2241-thread-1) [    ] o.a.s.c.SolrResourceLoader Adding 'file:/home/jenkins/workspace/Lucene-Solr-5.x-Linux/solr/core/src/test-files/solr/collection1/lib/classes/' to classloader
   [junit4]   2> 450621 INFO  (coreLoadExecutor-2241-thread-1) [    ] o.a.s.c.SolrResourceLoader Adding 'file:/home/jenkins/workspace/Lucene-Solr-5.x-Linux/solr/core/src/test-files/solr/collection1/lib/README' to classloader
   [junit4]   2> 450643 INFO  (coreLoadExecutor-2241-thread-1) [    ] o.a.s.c.SolrConfig current version of requestparams : -1
   [junit4]   2> 450653 INFO  (coreLoadExecutor-2241-thread-1) [    ] o.a.s.c.SolrConfig Using Lucene MatchVersion: 5.5.0
   [junit4]   2> 450673 INFO  (coreLoadExecutor-2241-thread-1) [    ] o.a.s.c.SolrConfig Loaded SolrConfig: solrconfig.xml
   [junit4]   2> 450685 INFO  (coreLoadExecutor-2241-thread-1) [    ] o.a.s.s.IndexSchema [collection1] Schema name=test
   [junit4]   2> 450759 INFO  (coreLoadExecutor-2241-thread-1) [    ] o.a.s.s.IndexSchema default search field in schema is text
   [junit4]   2> 450760 INFO  (coreLoadExecutor-2241-thread-1) [    ] o.a.s.s.IndexSchema unique key field: id
   [junit4]   2> 450760 WARN  (coreLoadExecutor-2241-thread-1) [    ] o.a.s.s.IndexSchema Field text is not multivalued and destination for multiple copyFields (2)
   [junit4]   2> 450764 INFO  (coreLoadExecutor-2241-thread-1) [    ] o.a.s.s.FileExchangeRateProvider Reloading exchange rates from file currency.xml
   [junit4]   2> 450766 INFO  (coreLoadExecutor-2241-thread-1) [    ] o.a.s.s.FileExchangeRateProvider Reloading exchange rates from file currency.xml
   [junit4]   2> 450769 INFO  (coreLoadExecutor-2241-thread-1) [    ] o.a.s.c.ConfigSetProperties Did not find ConfigSet properties, assuming default properties: Can't find resource 'configsetprops.json' in classpath or '/home/jenkins/workspace/Lucene-Solr-5.x-Linux/solr/core/src/test-files/solr/collection1'
   [junit4]   2> 450769 INFO  (coreLoadExecutor-2241-thread-1) [    ] o.a.s.c.CoreContainer Creating SolrCore 'collection1' using configuration from instancedir /home/jenkins/workspace/Lucene-Solr-5.x-Linux/solr/core/src/test-files/solr/collection1
   [junit4]   2> 450769 INFO  (coreLoadExecutor-2241-thread-1) [    ] o.a.s.c.SolrCore org.apache.solr.core.MockFSDirectoryFactory
   [junit4]   2> 450770 INFO  (coreLoadExecutor-2241-thread-1) [    ] o.a.s.c.SolrCore [[collection1] ] Opening new SolrCore at [/home/jenkins/workspace/Lucene-Solr-5.x-Linux/solr/core/src/test-files/solr/collection1], dataDir=[/home/jenkins/workspace/Lucene-Solr-5.x-Linux/solr/build/solr-core/test/J0/temp/solr.core.TestArbitraryIndexDir_D2FF81078DFC658E-001/init-core-data-001/]
   [junit4]   2> 450770 INFO  (coreLoadExecutor-2241-thread-1) [    ] o.a.s.c.JmxMonitoredMap JMX monitoring is enabled. Adding Solr mbeans to JMX Server: com.sun.jmx.mbeanserver.JmxMBeanServer@1f35ca8
   [junit4]   2> 450771 INFO  (coreLoadExecutor-2241-thread-1) [    ] o.a.s.c.CachingDirectoryFactory return new directory for /home/jenkins/workspace/Lucene-Solr-5.x-Linux/solr/build/solr-core/test/J0/temp/solr.core.TestArbitraryIndexDir_D2FF81078DFC658E-001/init-core-data-001
   [junit4]   2> 450771 INFO  (coreLoadExecutor-2241-thread-1) [    ] o.a.s.c.SolrCore New index directory detected: old=null new=/home/jenkins/workspace/Lucene-Solr-5.x-Linux/solr/build/solr-core/test/J0/temp/solr.core.TestArbitraryIndexDir_D2FF81078DFC658E-001/init-core-data-001/index/
   [junit4]   2> 450771 WARN  (coreLoadExecutor-2241-thread-1) [    ] o.a.s.c.SolrCore [collection1] Solr index directory '/home/jenkins/workspace/Lucene-Solr-5.x-Linux/solr/build/solr-core/test/J0/temp/solr.core.TestArbitraryIndexDir_D2FF81078DFC658E-001/init-core-data-001/index' doesn't exist. Creating new index...
   [junit4]   2> 450772 INFO  (coreLoadExecutor-2241-thread-1) [    ] o.a.s.c.CachingDirectoryFactory return new directory for /home/jenkins/workspace/Lucene-Solr-5.x-Linux/solr/build/solr-core/test/J0/temp/solr.core.TestArbitraryIndexDir_D2FF81078DFC658E-001/init-core-data-001/index
   [junit4]   2> 450772 INFO  (coreLoadExecutor-2241-thread-1) [    ] o.a.s.u.RandomMergePolicy RandomMergePolicy wrapping class org.apache.lucene.index.TieredMergePolicy: [TieredMergePolicy: maxMergeAtOnce=37, maxMergeAtOnceExplicit=39, maxMergedSegmentMB=9.0322265625, floorSegmentMB=1.736328125, forceMergeDeletesPctAllowed=18.536693334424957, segmentsPerTier=41.0, maxCFSSegmentSizeMB=8.796093022207999E12, noCFSRatio=1.0
   [junit4]   2> 450792 INFO  (coreLoadExecutor-2241-thread-1) [    ] o.a.s.c.SolrDeletionPolicy SolrDeletionPolicy.onCommit: commits: num=1
   [junit4]   2> 	commit{dir=MockDirectoryWrapper(SimpleFSDirectory@/home/jenkins/workspace/Lucene-Solr-5.x-Linux/solr/build/solr-core/test/J0/temp/solr.core.TestArbitraryIndexDir_D2FF81078DFC658E-001/init-core-data-001/index lockFactory=org.apache.lucene.store.SingleInstanceLockFactory@19770e),segFN=segments_1,generation=1}
   [junit4]   2> 450792 INFO  (coreLoadExecutor-2241-thread-1) [    ] o.a.s.c.SolrDeletionPolicy newest commit generation = 1
   [junit4]   2> 450793 INFO  (OldIndexDirectoryCleanupThreadForCore-collection1) [    ] o.a.s.c.SolrCore Looking for old index directories to cleanup for core collection1 in /home/jenkins/workspace/Lucene-Solr-5.x-Linux/solr/build/solr-core/test/J0/temp/solr.core.TestArbitraryIndexDir_D2FF81078DFC658E-001/init-core-data-001/
   [junit4]   2> 450795 INFO  (coreLoadExecutor-2241-thread-1) [    ] o.a.s.u.p.UpdateRequestProcessorChain creating updateRequestProcessorChain "dedupe"
   [junit4]   2> 450795 INFO  (coreLoadExecutor-2241-thread-1) [    ] o.a.s.u.p.UpdateRequestProcessorChain inserting DistributedUpdateProcessorFactory into updateRequestProcessorChain "dedupe"
   [junit4]   2> 450795 INFO  (coreLoadExecutor-2241-thread-1) [    ] o.a.s.u.p.UpdateRequestProcessorChain creating updateRequestProcessorChain "dedupe-allfields"
   [junit4]   2> 450795 INFO  (coreLoadExecutor-2241-thread-1) [    ] o.a.s.u.p.UpdateRequestProcessorChain inserting DistributedUpdateProcessorFactory into updateRequestProcessorChain "dedupe-allfields"
   [junit4]   2> 450796 INFO  (coreLoadExecutor-2241-thread-1) [    ] o.a.s.u.p.UpdateRequestProcessorChain creating updateRequestProcessorChain "stored_sig"
   [junit4]   2> 450796 INFO  (coreLoadExecutor-2241-thread-1) [    ] o.a.s.u.p.UpdateRequestProcessorChain inserting DistributedUpdateProcessorFactory into updateRequestProcessorChain "stored_sig"
   [junit4]   2> 450796 INFO  (coreLoadExecutor-2241-thread-1) [    ] o.a.s.u.p.UpdateRequestProcessorChain creating updateRequestProcessorChain "uniq-fields"
   [junit4]   2> 450796 INFO  (coreLoadExecutor-2241-thread-1) [    ] o.a.s.u.p.UpdateRequestProcessorChain inserting DistributedUpdateProcessorFactory into updateRequestProcessorChain "uniq-fields"
   [junit4]   2> 450796 INFO  (coreLoadExecutor-2241-thread-1) [    ] o.a.s.u.p.UpdateRequestProcessorChain creating updateRequestProcessorChain "distrib-dup-test-chain-explicit"
   [junit4]   2> 450796 INFO  (coreLoadExecutor-2241-thread-1) [    ] o.a.s.u.p.UpdateRequestProcessorChain creating updateRequestProcessorChain "distrib-dup-test-chain-implicit"
   [junit4]   2> 450796 INFO  (coreLoadExecutor-2241-thread-1) [    ] o.a.s.u.p.UpdateRequestProcessorChain inserting DistributedUpdateProcessorFactory into updateRequestProcessorChain "distrib-dup-test-chain-implicit"
   [junit4]   2> 450796 INFO  (coreLoadExecutor-2241-thread-1) [    ] o.a.s.c.SolrCore no updateRequestProcessorChain defined as default, creating implicit default
   [junit4]   2> 450798 INFO  (coreLoadExecutor-2241-thread-1) [    ] o.a.s.h.l.XMLLoader xsltCacheLifetimeSeconds=60
   [junit4]   2> 450799 INFO  (coreLoadExecutor-2241-thread-1) [    ] o.a.s.h.l.XMLLoader xsltCacheLifetimeSeconds=60
   [junit4]   2> 450800 INFO  (coreLoadExecutor-2241-thread-1) [    ] o.a.s.h.l.XMLLoader xsltCacheLifetimeSeconds=60
   [junit4]   2> 450800 INFO  (coreLoadExecutor-2241-thread-1) [    ] o.a.s.h.l.XMLLoader xsltCacheLifetimeSeconds=60
   [junit4]   2> 450803 INFO  (coreLoadExecutor-2241-thread-1) [    ] o.a.s.c.PluginBag requestHandler : 'lazy' created with startup=lazy 
   [junit4]   2> 450804 INFO  (coreLoadExecutor-2241-thread-1) [    ] o.a.s.c.RequestHandlers Registered paths: /admin/mbeans,standard,spellCheckCompRH,lazy,/update/json/docs,/admin/luke,spellCheckWithWordbreak_Direct,tvrh,/get,/admin/properties,/update/json,mltrh,/admin/threads,/search-facet-def,/update/csv,/search-facet-invariants,/admin/segments,spellCheckCompRH1,/mlt,/admin/system,/replication,dismax,defaults,/config,/schema,/admin/plugins,/admin/logging,spellCheckWithWordbreak,mock,/admin/ping,/update,/admin/file,/terms,spellCheckCompRH_Direct,/debug/dump
   [junit4]   2> 450804 WARN  (coreLoadExecutor-2241-thread-1) [    ] o.a.s.c.SolrCore solrconfig.xml uses deprecated <admin/gettableFiles>, Please update your config to use the ShowFileRequestHandler.
   [junit4]   2> 450805 INFO  (coreLoadExecutor-2241-thread-1) [    ] o.a.s.c.SolrCore Using default statsCache cache: org.apache.solr.search.stats.LocalStatsCache
   [junit4]   2> 450805 INFO  (coreLoadExecutor-2241-thread-1) [    ] o.a.s.u.CommitTracker Hard AutoCommit: disabled
   [junit4]   2> 450805 INFO  (coreLoadExecutor-2241-thread-1) [    ] o.a.s.u.CommitTracker Soft AutoCommit: disabled
   [junit4]   2> 450805 INFO  (coreLoadExecutor-2241-thread-1) [    ] o.a.s.u.RandomMergePolicy RandomMergePolicy wrapping class org.apache.lucene.index.TieredMergePolicy: [TieredMergePolicy: maxMergeAtOnce=35, maxMergeAtOnceExplicit=12, maxMergedSegmentMB=89.796875, floorSegmentMB=1.2724609375, forceMergeDeletesPctAllowed=24.075800471761614, segmentsPerTier=33.0, maxCFSSegmentSizeMB=8.796093022207999E12, noCFSRatio=0.0
   [junit4]   2> 450806 INFO  (coreLoadExecutor-2241-thread-1) [    ] o.a.s.c.SolrDeletionPolicy SolrDeletionPolicy.onInit: commits: num=1
   [junit4]   2> 	commit{dir=MockDirectoryWrapper(SimpleFSDirectory@/home/jenkins/workspace/Lucene-Solr-5.x-Linux/solr/build/solr-core/test/J0/temp/solr.core.TestArbitraryIndexDir_D2FF81078DFC658E-001/init-core-data-001/index lockFactory=org.apache.lucene.store.SingleInstanceLockFactory@19770e),segFN=segments_1,generation=1}
   [junit4]   2> 450806 INFO  (coreLoadExecutor-2241-thread-1) [    ] o.a.s.c.SolrDeletionPolicy newest commit generation = 1
   [junit4]   2> 450806 INFO  (coreLoadExecutor-2241-thread-1) [    ] o.a.s.s.SolrIndexSearcher Opening Searcher@3b5c53[collection1] main
   [junit4]   2> 450807 INFO  (coreLoadExecutor-2241-thread-1) [    ] o.a.s.r.RestManager Initializing RestManager with initArgs: {storageIO=org.apache.solr.rest.ManagedResourceStorage$InMemoryStorageIO}
   [junit4]   2> 450807 INFO  (coreLoadExecutor-2241-thread-1) [    ] o.a.s.r.ManagedResourceStorage Reading _rest_managed.json using InMemoryStorage
   [junit4]   2> 450807 INFO  (coreLoadExecutor-2241-thread-1) [    ] o.a.s.r.RestManager Initializing 0 registered ManagedResources
   [junit4]   2> 450807 INFO  (coreLoadExecutor-2241-thread-1) [    ] o.a.s.h.c.SpellCheckComponent Initializing spell checkers
   [junit4]   2> 450831 INFO  (coreLoadExecutor-2241-thread-1) [    ] o.a.s.s.DirectSolrSpellChecker init: {name=direct,classname=DirectSolrSpellChecker,field=lowerfilt,minQueryLength=3}
   [junit4]   2> 450926 INFO  (coreLoadExecutor-2241-thread-1) [    ] o.a.s.h.ReplicationHandler Commits will be reserved for  10000
   [junit4]   2> 450926 INFO  (searcherExecutor-2242-thread-1) [    ] o.a.s.h.c.SpellCheckComponent Loading spell index for spellchecker: default
   [junit4]   2> 450927 INFO  (searcherExecutor-2242-thread-1) [    ] o.a.s.h.c.SpellCheckComponent Loading spell index for spellchecker: direct
   [junit4]   2> 450927 INFO  (searcherExecutor-2242-thread-1) [    ] o.a.s.h.c.SpellCheckComponent Loading spell index for spellchecker: wordbreak
   [junit4]   2> 450927 INFO  (searcherExecutor-2242-thread-1) [    ] o.a.s.h.c.SpellCheckComponent Loading spell index for spellchecker: multipleFields
   [junit4]   2> 450927 INFO  (searcherExecutor-2242-thread-1) [    ] o.a.s.h.c.SpellCheckComponent Loading spell index for spellchecker: jarowinkler
   [junit4]   2> 450927 INFO  (coreLoadExecutor-2241-thread-1) [    ] o.a.s.c.CoreContainer registering core: collection1
   [junit4]   2> 450927 INFO  (searcherExecutor-2242-thread-1) [    ] o.a.s.h.c.SpellCheckComponent Loading spell index for spellchecker: external
   [junit4]   2> 450927 INFO  (searcherExecutor-2242-thread-1) [    ] o.a.s.h.c.SpellCheckComponent Loading spell index for spellchecker: freq
   [junit4]   2> 450927 INFO  (searcherExecutor-2242-thread-1) [    ] o.a.s.h.c.SpellCheckComponent Loading spell index for spellchecker: fqcn
   [junit4]   2> 450928 INFO  (searcherExecutor-2242-thread-1) [    ] o.a.s.h.c.SpellCheckComponent Loading spell index for spellchecker: perDict
   [junit4]   2> 450928 INFO  (TEST-TestArbitraryIndexDir.testLoadNewIndexDir-seed#[D2FF81078DFC658E]) [    ] o.a.s.SolrTestCaseJ4 ####initCore end
   [junit4]   2> 450928 INFO  (searcherExecutor-2242-thread-1) [    ] o.a.s.c.SolrCore [collection1] Registered new searcher Searcher@3b5c53[collection1] main{ExitableDirectoryReader(UninvertingDirectoryReader())}
   [junit4]   2> 450930 INFO  (TEST-TestArbitraryIndexDir.testLoadNewIndexDir-seed#[D2FF81078DFC658E]) [    ] o.a.s.u.p.LogUpdateProcessorFactory [collection1]  webapp=null path=null params={}{add=[1]} 0 1
   [junit4]   2> 451011 INFO  (TEST-TestArbitraryIndexDir.testLoadNewIndexDir-seed#[D2FF81078DFC658E]) [    ] o.a.s.u.DirectUpdateHandler2 start commit{,optimize=false,openSearcher=true,waitSearcher=true,expungeDeletes=false,softCommit=false,prepareCommit=false}
   [junit4]   2> 451099 INFO  (TEST-TestArbitraryIndexDir.testLoadNewIndexDir-seed#[D2FF81078DFC658E]) [    ] o.a.s.c.SolrDeletionPolicy SolrDeletionPolicy.onCommit: commits: num=2
   [junit4]   2> 	commit{dir=MockDirectoryWrapper(SimpleFSDirectory@/home/jenkins/workspace/Lucene-Solr-5.x-Linux/solr/build/solr-core/test/J0/temp/solr.core.TestArbitraryIndexDir_D2FF81078DFC658E-001/init-core-data-001/index lockFactory=org.apache.lucene.store.SingleInstanceLockFactory@19770e),segFN=segments_1,generation=1}
   [junit4]   2> 	commit{dir=MockDirectoryWrapper(SimpleFSDirectory@/home/jenkins/workspace/Lucene-Solr-5.x-Linux/solr/build/solr-core/test/J0/temp/solr.core.TestArbitraryIndexDir_D2FF81078DFC658E-001/init-core-data-001/index lockFactory=org.apache.lucene.store.SingleInstanceLockFactory@19770e),segFN=segments_2,generation=2}
   [junit4]   2> 451100 INFO  (TEST-TestArbitraryIndexDir.testLoadNewIndexDir-seed#[D2FF81078DFC658E]) [    ] o.a.s.c.SolrDeletionPolicy newest commit generation = 2
   [junit4]   2> 451100 INFO  (TEST-TestArbitraryIndexDir.testLoadNewIndexDir-seed#[D2FF81078DFC658E]) [    ] o.a.s.c.SolrCore New index directory detected: old=/home/jenkins/workspace/Lucene-Solr-5.x-Linux/solr/build/solr-core/test/J0/temp/solr.core.TestArbitraryIndexDir_D2FF81078DFC658E-001/init-core-data-001/index/ new=/home/jenkins/workspace/Lucene-Solr-5.x-Linux/solr/build/solr-core/test/J0/temp/solr.core.TestArbitraryIndexDir_D2FF81078DFC658E-001/init-core-data-001/index_temp
   [junit4]   2> 451103 INFO  (TEST-TestArbitraryIndexDir.testLoadNewIndexDir-seed#[D2FF81078DFC658E]) [    ] o.a.s.s.SolrIndexSearcher Opening Searcher@13488ec[collection1] main
   [junit4]   2> 451103 INFO  (TEST-TestArbitraryIndexDir.testLoadNewIndexDir-seed#[D2FF81078DFC658E]) [    ] o.a.s.u.DirectUpdateHandler2 end_commit_flush
   [junit4]   2> 451105 INFO  (searcherExecutor-2242-thread-1) [    ] o.a.s.c.SolrCore [collection1] Registered new searcher Searcher@13488ec[collection1] main{ExitableDirectoryReader(UninvertingDirectoryReader(Uninverting(_0(5.5.0):C1)))}
   [junit4]   2> 451106 INFO  (TEST-TestArbitraryIndexDir.testLoadNewIndexDir-seed#[D2FF81078DFC658E]) [    ] o.a.s.u.p.LogUpdateProcessorFactory [collection1]  webapp=null path=null params={}{commit=} 0 94
   [junit4]   2> 451106 INFO  (TEST-TestArbitraryIndexDir.testLoadNewIndexDir-seed#[D2FF81078DFC658E]) [    ] o.a.s.c.SolrResourceLoader new SolrResourceLoader for directory: '/home/jenkins/workspace/Lucene-Solr-5.x-Linux/solr/core/src/test-files/solr/collection1'
   [junit4]   2> 451106 INFO  (TEST-TestArbitraryIndexDir.testLoadNewIndexDir-seed#[D2FF81078DFC658E]) [    ] o.a.s.c.SolrResourceLoader JNDI not configured for solr (NoInitialContextEx)
   [junit4]   2> 451106 INFO  (TEST-TestArbitraryIndexDir.testLoadNewIndexDir-seed#[D2FF81078DFC658E]) [    ] o.a.s.c.SolrResourceLoader using system property solr.solr.home: /home/jenkins/workspace/Lucene-Solr-5.x-Linux/solr/core/src/test-files/solr
   [junit4]   2> 451107 INFO  (TEST-TestArbitraryIndexDir.testLoadNewIndexDir-seed#[D2FF81078DFC658E]) [    ] o.a.s.c.SolrResourceLoader Adding 'file:/home/jenkins/workspace/Lucene-Solr-5.x-Linux/solr/core/src/test-files/solr/collection1/lib/classes/' to classloader
   [junit4]   2> 451107 INFO  (TEST-TestArbitraryIndexDir.testLoadNewIndexDir-seed#[D2FF81078DFC658E]) [    ] o.a.s.c.SolrResourceLoader Adding 'file:/home/jenkins/workspace/Lucene-Solr-5.x-Linux/solr/core/src/test-files/solr/collection1/lib/README' to classloader
   [junit4]   2> 451124 INFO  (TEST-TestArbitraryIndexDir.testLoadNewIndexDir-seed#[D2FF81078DFC658E]) [    ] o.a.s.c.SolrConfig current version of requestparams : -1
   [junit4]   2> 451130 INFO  (TEST-TestArbitraryIndexDir.testLoadNewIndexDir-seed#[D2FF81078DFC658E]) [    ] o.a.s.c.SolrConfig Using Lucene MatchVersion: 5.5.0
   [junit4]   2> 451161 INFO  (TEST-TestArbitraryIndexDir.testLoadNewIndexDir-seed#[D2FF81078DFC658E]) [    ] o.a.s.c.SolrConfig Loaded SolrConfig: solrconfig.xml
   [junit4]   2> 451166 INFO  (TEST-TestArbitraryIndexDir.testLoadNewIndexDir-seed#[D2FF81078DFC658E]) [    ] o.a.s.s.IndexSchema [collection1] Schema name=test
   [junit4]   2> 451247 INFO  (TEST-TestArbitraryIndexDir.testLoadNewIndexDir-seed#[D2FF81078DFC658E]) [    ] o.a.s.s.IndexSchema default search field in schema is text
   [junit4]   2> 451248 INFO  (TEST-TestArbitraryIndexDir.testLoadNewIndexDir-seed#[D2FF81078DFC658E]) [    ] o.a.s.s.IndexSchema unique key field: id
   [junit4]   2> 451248 WARN  (TEST-TestArbitraryIndexDir.testLoadNewIndexDir-seed#[D2FF81078DFC658E]) [    ] o.a.s.s.IndexSchema Field text is not multivalued and destination for multiple copyFields (2)
   [junit4]   2> 451252 INFO  (TEST-TestArbitraryIndexDir.testLoadNewIndexDir-seed#[D2FF81078DFC658E]) [    ] o.a.s.s.FileExchangeRateProvider Reloading exchange rates from file currency.xml
   [junit4]   2> 451253 INFO  (TEST-TestArbitraryIndexDir.testLoadNewIndexDir-seed#[D2FF81078DFC658E]) [    ] o.a.s.s.FileExchangeRateProvider Reloading exchange rates from file currency.xml
   [junit4]   2> 451256 INFO  (TEST-TestArbitraryIndexDir.testLoadNewIndexDir-seed#[D2FF81078DFC658E]) [    ] o.a.s.c.ConfigSetProperties Did not find ConfigSet properties, assuming default properties: Can't find resource 'configsetprops.json' in classpath or '/home/jenkins/workspace/Lucene-Solr-5.x-Linux/solr/core/src/test-files/solr/collection1'
   [junit4]   2> 451256 INFO  (TEST-TestArbitraryIndexDir.testLoadNewIndexDir-seed#[D2FF81078DFC658E]) [    ] o.a.s.c.CoreContainer Reloading SolrCore 'collection1' using configuration from instancedir /home/jenkins/workspace/Lucene-Solr-5.x-Linux/solr/core/src/test-files/solr/collection1
   [junit4]   2> 451257 INFO  (TEST-TestArbitraryIndexDir.testLoadNewIndexDir-seed#[D2FF81078DFC658E]) [    ] o.a.s.c.SolrCore [[collection1] ] Opening new SolrCore at [/home/jenkins/workspace/Lucene-Solr-5.x-Linux/solr/core/src/test-files/solr/collection1], dataDir=[/home/jenkins/workspace/Lucene-Solr-5.x-Linux/solr/build/solr-core/test/J0/temp/solr.core.TestArbitraryIndexDir_D2FF81078DFC658E-001/init-core-data-001/]
   [junit4]   2> 451257 INFO  (TEST-TestArbitraryIndexDir.testLoadNewIndexDir-seed#[D2FF81078DFC658E]) [    ] o.a.s.c.JmxMonitoredMap JMX monitoring is enabled. Adding Solr mbeans to JMX Server: com.sun.jmx.mbeanserver.JmxMBeanServer@1f35ca8
   [junit4]   2> 451257 INFO  (TEST-TestArbitraryIndexDir.testLoadNewIndexDir-seed#[D2FF81078DFC658E]) [    ] o.a.s.c.SolrCore New index directory detected: old=null new=/home/jenkins/workspace/Lucene-Solr-5.x-Linux/solr/build/solr-core/test/J0/temp/solr.core.TestArbitraryIndexDir_D2FF81078DFC658E-001/init-core-data-001/index_temp
   [junit4]   2> 451258 INFO  (OldIndexDirectoryCleanupThreadForCore-collection1) [    ] o.a.s.c.SolrCore Looking for old index directories to cleanup for core collection1 in /home/jenkins/workspace/Lucene-Solr-5.x-Linux/solr/build/solr-core/test/J0/temp/solr.core.TestArbitraryIndexDir_D2FF81078DFC658E-001/init-core-data-001/
   [junit4]   2> 451258 INFO  (OldIndexDirectoryCleanupThreadForCore-collection1) [    ] o.a.s.c.DirectoryFactory Found 1 old index directories to clean-up under /home/jenkins/workspace/Lucene-Solr-5.x-Linux/solr/build/solr-core/test/J0/temp/solr.core.TestArbitraryIndexDir_D2FF81078DFC658E-001/init-core-data-001/
   [junit4]   2> 451259 WARN  (OldIndexDirectoryCleanupThreadForCore-collection1) [    ] o.a.s.c.CachingDirectoryFactory Cannot delete directory /home/jenkins/workspace/Lucene-Solr-5.x-Linux/solr/build/solr-core/test/J0/temp/solr.core.TestArbitraryIndexDir_D2FF81078DFC658E-001/init-core-data-001/index as it is still being referenced in the cache!
   [junit4]   2> 451259 WARN  (OldIndexDirectoryCleanupThreadForCore-collection1) [    ] o.a.s.c.DirectoryFactory Delete old index directory /home/jenkins/workspace/Lucene-Solr-5.x-Linux/solr/build/solr-core/test/J0/temp/solr.core.TestArbitraryIndexDir_D2FF81078DFC658E-001/init-core-data-001/index failed.
   [junit4]   2> 451262 INFO  (TEST-TestArbitraryIndexDir.testLoadNewIndexDir-seed#[D2FF81078DFC658E]) [    ] o.a.s.u.p.UpdateRequestProcessorChain creating updateRequestProcessorChain "dedupe"
   [junit4]   2> 451262 INFO  (TEST-TestArbitraryIndexDir.testLoadNewIndexDir-seed#[D2FF81078DFC658E]) [    ] o.a.s.u.p.UpdateRequestProcessorChain inserting DistributedUpdateProcessorFactory into updateRequestProcessorChain "dedupe"
   [junit4]   2> 451262 INFO  (TEST-TestArbitraryIndexDir.testLoadNewIndexDir-seed#[D2FF81078DFC658E]) [    ] o.a.s.u.p.UpdateRequestProcessorChain creating updateRequestProcessorChain "dedupe-allfields"
   [junit4]   2> 451262 INFO  (TEST-TestArbitraryIndexDir.testLoadNewIndexDir-seed#[D2FF81078DFC658E]) [    ] o.a.s.u.p.UpdateRequestProcessorChain inserting DistributedUpdateProcessorFactory into updateRequestProcessorChain "dedupe-allfields"
   [junit4]   2> 451262 INFO  (TEST-TestArbitraryIndexDir.testLoadNewIndexDir-seed#[D2FF81078DFC658E]) [    ] o.a.s.u.p.UpdateRequestProcessorChain creating updateRequestProcessorChain "stored_sig"
   [junit4]   2> 451263 INFO  (TEST-TestArbitraryIndexDir.testLoadNewIndexDir-seed#[D2FF81078DFC658E]) [    ] o.a.s.u.p.UpdateRequestProcessorChain inserting DistributedUpdateProcessorFactory into updateRequestProcessorChain "stored_sig"
   [junit4]   2> 451263 INFO  (TEST-TestArbitraryIndexDir.testLoadNewIndexDir-seed#[D2FF81078DFC658E]) [    ] o.a.s.u.p.UpdateRequestProcessorChain creating updateRequestProcessorChain "uniq-fields"
   [junit4]   2> 451263 INFO  (TEST-TestArbitraryIndexDir.testLoadNewIndexDir-seed#[D2FF81078DFC658E]) [    ] o.a.s.u.p.UpdateRequestProcessorChain inserting DistributedUpdateProcessorFactory into updateRequestProcessorChain "uniq-fields"
   [junit4]   2> 451263 INFO  (TEST-TestArbitraryIndexDir.testLoadNewIndexDir-seed#[D2FF81078DFC658E]) [    ] o.a.s.u.p.UpdateRequestProcessorChain creating updateRequestProcessorChain "distrib-dup-test-chain-explicit"
   [junit4]   2> 451263 INFO  (TEST-TestArbitraryIndexDir.testLoadNewIndexDir-seed#[D2FF81078DFC658E]) [    ] o.a.s.u.p.UpdateRequestProcessorChain creating updateRequestProcessorChain "distrib-dup-test-chain-implicit"
   [junit4]   2> 451263 INFO  (TEST-TestArbitraryIndexDir.testLoadNewIndexDir-seed#[D2FF81078DFC658E]) [    ] o.a.s.u.p.UpdateRequestProcessorChain inserting DistributedUpdateProcessorFactory into updateRequestProcessorChain "distrib-dup-test-chain-implicit"
   [junit4]   2> 451263 INFO  (TEST-TestArbitraryIndexDir.testLoadNewIndexDir-seed#[D2FF81078DFC658E]) [    ] o.a.s.c.SolrCore no updateRequestProcessorChain defined as default, creating implicit default
   [junit4]   2> 451266 INFO  (TEST-TestArbitraryIndexDir.testLoadNewIndexDir-seed#[D2FF81078DFC658E]) [    ] o.a.s.h.l.XMLLoader xsltCacheLifetimeSeconds=60
   [junit4]   2> 451267 INFO  (TEST-TestArbitraryIndexDir.testLoadNewIndexDir-seed#[D2FF81078DFC658E]) [    ] o.a.s.h.l.XMLLoader xsltCacheLifetimeSeconds=60
   [junit4]   2> 451268 INFO  (TEST-TestArbitraryIndexDir.testLoadNewIndexDir-seed#[D2FF81078DFC658E]) [    ] o.a.s.h.l.XMLLoader xsltCacheLifetimeSeconds=60
   [junit4]   2> 451269 INFO  (TEST-TestArbitraryIndexDir.testLoadNewIndexDir-seed#[D2FF81078DFC658E]) [    ] o.a.s.h.l.XMLLoader xsltCacheLifetimeSeconds=60
   [junit4]   2> 451270 INFO  (TEST-TestArbitraryIndexDir.testLoadNewIndexDir-seed#[D2FF81078DFC658E]) [    ] o.a.s.c.CachingDirectoryFactory return new directory for /home/jenkins/workspace/Lucene-Solr-5.x-Linux/solr/build/solr-core/test/J0/temp/solr.core.TestArbitraryIndexDir_D2FF81078DFC658E-001/init-core-data-001/index_temp
   [junit4]   2> 451273 INFO  (TEST-TestArbitraryIndexDir.testLoadNewIndexDir-seed#[D2FF81078DFC658E]) [    ] o.a.s.c.PluginBag requestHandler : 'lazy' created with startup=lazy 
   [junit4]   2> 451275 INFO  (TEST-TestArbitraryIndexDir.testLoadNewIndexDir-seed#[D2FF81078DFC658E]) [    ] o.a.s.c.RequestHandlers Registered paths: /admin/mbeans,standard,spellCheckCompRH,lazy,/update/json/docs,/admin/luke,spellCheckWithWordbreak_Direct,tvrh,/get,/admin/properties,/update/json,mltrh,/admin/threads,/search-facet-def,/update/csv,/search-facet-invariants,/admin/segments,spellCheckCompRH1,/mlt,/admin/system,/replication,dismax,defaults,/config,/schema,/admin/plugins,/admin/logging,spellCheckWithWordbreak,mock,/admin/ping,/update,/admin/file,/terms,spellCheckCompRH_Direct,/debug/dump
   [junit4]   2> 451275 WARN  (TEST-TestArbitraryIndexDir.testLoadNewIndexDir-seed#[D2FF81078DFC658E]) [    ] o.a.s.c.SolrCore solrconfig.xml uses deprecated <admin/gettableFiles>, Please update your config to use the ShowFileRequestHandler.
   [junit4]   2> 451276 INFO  (TEST-TestArbitraryIndexDir.testLoadNewIndexDir-seed#[D2FF81078DFC658E]) [    ] o.a.s.c.SolrCore Using default statsCache cache: org.apache.solr.search.stats.LocalStatsCache
   [junit4]   2> 451276 INFO  (TEST-TestArbitraryIndexDir.testLoadNewIndexDir-seed#[D2FF81078DFC658E]) [    ] o.a.s.u.CommitTracker Hard AutoCommit: disabled
   [junit4]   2> 451276 INFO  (TEST-TestArbitraryIndexDir.testLoadNewIndexDir-seed#[D2FF81078DFC658E]) [    ] o.a.s.u.CommitTracker Soft AutoCommit: disabled
   [junit4]   2> 451283 INFO  (TEST-TestArbitraryIndexDir.testLoadNewIndexDir-seed#[D2FF81078DFC658E]) [    ] o.a.s.s.SolrIndexSearcher Opening Searcher@b174f6[collection1] main
   [junit4]   2> 451283 INFO  (TEST-TestArbitraryIndexDir.testLoadNewIndexDir-seed#[D2FF81078DFC658E]) [    ] o.a.s.r.RestManager Initializing RestManager with initArgs: {storageIO=org.apache.solr.rest.ManagedResourceStorage$InMemoryStorageIO}
   [junit4]   2> 451284 INFO  (TEST-TestArbitraryIndexDir.testLoadNewIndexDir-seed#[D2FF81078DFC658E]) [    ] o.a.s.r.ManagedResourceStorage Reading _rest_managed.json using InMemoryStorage
   [junit4]   2> 451284 INFO  (TEST-TestArbitraryIndexDir.testLoadNewIndexDir-seed#[D2FF81078DFC658E]) [    ] o.a.s.r.RestManager Initializing 0 registered ManagedResources
   [junit4]   2> 451284 INFO  (TEST-TestArbitraryIndexDir.testLoadNewIndexDir-seed#[D2FF81078DFC658E]) [    ] o.a.s.h.c.SpellCheckComponent Initializing spell checkers
   [junit4]   2> 451284 INFO  (TEST-TestArbitraryIndexDir.testLoadNewIndexDir-seed#[D2FF81078DFC658E]) [    ] o.a.s.s.DirectSolrSpellChecker init: {name=direct,classname=DirectSolrSpellChecker,field=lowerfilt,minQueryLength=3}
   [junit4]   2> 451286 INFO  (TEST-TestArbitraryIndexDir.testLoadNewIndexDir-seed#[D2FF81078DFC658E]) [    ] o.a.s.h.ReplicationHandler Commits will be reserved for  10000
   [junit4]   2> 451286 INFO  (searcherExecutor-2246-thread-1) [    ] o.a.s.h.c.SpellCheckComponent Loading spell index for spellchecker: default
   [junit4]   2> 451286 INFO  (searcherExecutor-2246-thread-1) [    ] o.a.s.h.c.SpellCheckComponent Loading spell index for spellchecker: direct
   [junit4]   2> 451286 INFO  (searcherExecutor-2246-thread-1) [    ] o.a.s.h.c.SpellCheckComponent Loading spell index for spellchecker: wordbreak
   [junit4]   2> 451286 INFO  (searcherExecutor-2246-thread-1) [    ] o.a.s.h.c.SpellCheckComponent Loading spell index for spellchecker: multipleFields
   [junit4]   2> 451286 INFO  (searcherExecutor-2246-thread-1) [    ] o.a.s.h.c.SpellCheckComponent Loading spell index for spellchecker: jarowinkler
   [junit4]   2> 451287 INFO  (searcherExecutor-2246-thread-1) [    ] o.a.s.h.c.SpellCheckComponent Loading spell index for spellchecker: external
   [junit4]   2> 451287 INFO  (searcherExecutor-2246-thread-1) [    ] o.a.s.h.c.SpellCheckComponent Loading spell index for spellchecker: freq
   [junit4]   2> 451287 INFO  (TEST-TestArbitraryIndexDir.testLoadNewIndexDir-seed#[D2FF81078DFC658E]) [    ] o.a.s.u.DefaultSolrCoreState Closing old IndexWriter... core=collection1
   [junit4]   2> 451287 INFO  (searcherExecutor-2246-thread-1) [    ] o.a.s.h.c.SpellCheckComponent Loading spell index for spellchecker: fqcn
   [junit4]   2> 451287 INFO  (searcherExecutor-2246-thread-1) [    ] o.a.s.h.c.SpellCheckComponent Loading spell index for spellchecker: perDict
   [junit4]   2> 451287 INFO  (TEST-TestArbitraryIndexDir.testLoadNewIndexDir-seed#[D2FF81078DFC658E]) [    ] o.a.s.u.RandomMergePolicy RandomMergePolicy wrapping class org.apache.lucene.index.TieredMergePolicy: [TieredMergePolicy: maxMergeAtOnce=46, maxMergeAtOnceExplicit=49, maxMergedSegmentMB=38.1806640625, floorSegmentMB=2.0283203125, forceMergeDeletesPctAllowed=1.5172289988541021, segmentsPerTier=27.0, maxCFSSegmentSizeMB=8.796093022207999E12, noCFSRatio=1.0
   [junit4]   2> 451288 INFO  (searcherExecutor-2246-thread-1) [    ] o.a.s.c.SolrCore [collection1] Registered new searcher Searcher@b174f6[collection1] main{ExitableDirectoryReader(UninvertingDirectoryReader(Uninverting(_0(5.5.0):C1)))}
   [junit4]   2> 451288 INFO  (TEST-TestArbitraryIndexDir.testLoadNewIndexDir-seed#[D2FF81078DFC658E]) [    ] o.a.s.c.SolrDeletionPolicy SolrDeletionPolicy.onInit: commits: num=1
   [junit4]   2> 	commit{dir=MockDirectoryWrapper(NIOFSDirectory@/home/jenkins/workspace/Lucene-Solr-5.x-Linux/solr/build/solr-core/test/J0/temp/solr.core.TestArbitraryIndexDir_D2FF81078DFC658E-001/init-core-data-001/index_temp lockFactory=org.apache.lucene.store.SingleInstanceLockFactory@171f330),segFN=segments_1,generation=1}
   [junit4]   2> 451288 INFO  (TEST-TestArbitraryIndexDir.testLoadNewIndexDir-seed#[D2FF81078DFC658E]) [    ] o.a.s.c.SolrDeletionPolicy newest commit generation = 1
   [junit4]   2> 451289 INFO  (TEST-TestArbitraryIndexDir.testLoadNewIndexDir-seed#[D2FF81078DFC658E]) [    ] o.a.s.u.DefaultSolrCoreState New IndexWriter is ready to be used.
   [junit4]   2> 451290 INFO  (TEST-TestArbitraryIndexDir.testLoadNewIndexDir-seed#[D2FF81078DFC658E]) [    ] o.a.s.s.SolrIndexSearcher Opening Searcher@10ade26[collection1] main
   [junit4]   2> 451290 INFO  (TEST-TestArbitraryIndexDir.testLoadNewIndexDir-seed#[D2FF81078DFC658E]) [    ] o.a.s.c.CoreContainer replacing core: collection1
   [junit4]   2> 451290 INFO  (TEST-TestArbitraryIndexDir.testLoadNewIndexDir-seed#[D2FF81078DFC658E]) [    ] o.a.s.c.SolrCore [collection1]  CLOSING SolrCore org.apache.solr.core.SolrCore@b0b3d9
   [junit4]   2> 451290 INFO  (TEST-TestArbitraryIndexDir.testLoadNewIndexDir-seed#[D2FF81078DFC658E]) [    ] o.a.s.u.DirectUpdateHandler2 closing DirectUpdateHandler2{commits=1,autocommits=0,soft autocommits=0,optimizes=0,rollbacks=0,expungeDeletes=0,docsPending=0,adds=0,deletesById=0,deletesByQuery=0,errors=0,cumulative_adds=1,cumulative_deletesById=0,cumulative_deletesByQuery=0,cumulative_errors=0}
   [junit4]   2> 451290 INFO  (TEST-TestArbitraryIndexDir.testLoadNewIndexDir-seed#[D2FF81078DFC658E]) [    ] o.a.s.c.SolrCore [collection1] Closing main searcher on request.
   [junit4]   2> 451296 INFO  (TEST-TestArbitraryIndexDir.testLoadNewIndexDir-seed#[D2FF81078DFC658E]) [    ] o.a.s.c.S.Request [collection1]  webapp=null path=null params={q=id:2&qt=standard&start=0&rows=20&version=2.2} hits=0 status=0 QTime=0
   [junit4]   2> 451297 INFO  (searcherExecutor-2246-thread-1) [    ] o.a.s.c.SolrCore [collection1] Registered new searcher Searcher@10ade26[collection1] main{ExitableDirectoryReader(UninvertingDirectoryReader(Uninverting(_0(5.5.0):c1)))}
   [junit4]   2> 451297 ERROR (TEST-TestArbitraryIndexDir.testLoadNewIndexDir-seed#[D2FF81078DFC658E]) [    ] o.a.s.SolrTestCaseJ4 REQUEST FAILED: xpath=*[count(//doc)=1]
   [junit4]   2> 	xml response was: <?xml version="1.0" encoding="UTF-8"?>
   [junit4]   2> <response>
   [junit4]   2> <lst name="responseHeader"><int name="status">0</int><int name="QTime">0</int></lst><result name="response" numFound="0" start="0"></result>
   [junit4]   2> </response>
   [junit4]   2> 
   [junit4]   2> 	request was:q=id:2&qt=standard&start=0&rows=20&version=2.2
   [junit4]   2> 451297 ERROR (TEST-TestArbitraryIndexDir.testLoadNewIndexDir-seed#[D2FF81078DFC658E]) [    ] o.a.s.SolrTestCaseJ4 REQUEST FAILED: q=id:2&qt=standard&start=0&rows=20&version=2.2:java.lang.RuntimeException: REQUEST FAILED: xpath=*[count(//doc)=1]
   [junit4]   2> 	xml response was: <?xml version="1.0" encoding="UTF-8"?>
   [junit4]   2> <response>
   [junit4]   2> <lst name="responseHeader"><int name="status">0</int><int name="QTime">0</int></lst><result name="response" numFound="0" start="0"></result>
   [junit4]   2> </response>
   [junit4]   2> 
   [junit4]   2> 	request was:q=id:2&qt=standard&start=0&rows=20&version=2.2
   [junit4]   2> 	at org.apache.solr.SolrTestCaseJ4.assertQ(SolrTestCaseJ4.java:746)
   [junit4]   2> 	at org.apache.solr.core.TestArbitraryIndexDir.testLoadNewIndexDir(TestArbitraryIndexDir.java:107)
   [junit4]   2> 	at sun.reflect.NativeMethodAccessorImpl.invoke0(Native Method)
   [junit4]   2> 	at sun.reflect.NativeMethodAccessorImpl.invoke(NativeMethodAccessorImpl.java:62)
   [junit4]   2> 	at sun.reflect.DelegatingMethodAccessorImpl.invoke(DelegatingMethodAccessorImpl.java:43)
   [junit4]   2> 	at java.lang.reflect.Method.invoke(Method.java:520)
   [junit4]   2> 	at com.carrotsearch.randomizedtesting.RandomizedRunner.invoke(RandomizedRunner.java:1764)
   [junit4]   2> 	at com.carrotsearch.randomizedtesting.RandomizedRunner$8.evaluate(RandomizedRunner.java:871)
   [junit4]   2> 	at com.carrotsearch.randomizedtesting.RandomizedRunner$9.evaluate(RandomizedRunner.java:907)
   [junit4]   2> 	at com.carrotsearch.randomizedtesting.RandomizedRunner$10.evaluate(RandomizedRunner.java:921)
   [junit4]   2> 	at com.carrotsearch.randomizedtesting.rules.SystemPropertiesRestoreRule$1.evaluate(SystemPropertiesRestoreRule.java:57)
   [junit4]   2> 	at com.carrotsearch.randomizedtesting.rules.SystemPropertiesRestoreRule$1.evaluate(SystemPropertiesRestoreRule.java:57)
   [junit4]   2> 	at org.apache.lucene.util.TestRuleSetupTeardownChained$1.evaluate(TestRuleSetupTeardownChained.java:50)
   [junit4]   2> 	at org.apache.lucene.util.AbstractBeforeAfterRule$1.evaluate(AbstractBeforeAfterRule.java:46)
   [junit4]   2> 	at org.apache.lucene.util.TestRuleThreadAndTestName$1.evaluate(TestRuleThreadAndTestName.java:49)
   [junit4]   2> 	at org.apache.lucene.util.TestRuleIgnoreAfterMaxFailures$1.evaluate(TestRuleIgnoreAfterMaxFailures.java:65)
   [junit4]   2> 	at org.apache.lucene.util.TestRuleMarkFailure$1.evaluate(TestRuleMarkFailure.java:48)
   [junit4]   2> 	at com.carrotsearch.randomizedtesting.rules.StatementAdapter.evaluate(StatementAdapter.java:36)
   [junit4]   2> 	at com.carrotsearch.randomizedtesting.ThreadLeakControl$StatementRunner.run(ThreadLeakControl.java:367)
   [junit4]   2> 	at com.carrotsearch.randomizedtesting.ThreadLeakControl.forkTimeoutingTask(ThreadLeakControl.java:809)
   [junit4]   2> 	at com.carrotsearch.randomizedtesting.ThreadLeakControl$3.evaluate(ThreadLeakControl.java:460)
   [junit4]   2> 	at com.carrotsearch.randomizedtesting.RandomizedRunner.runSingleTest(RandomizedRunner.java:880)
   [junit4]   2> 	at com.carrotsearch.randomizedtesting.RandomizedRunner$5.evaluate(RandomizedRunner.java:781)
   [junit4]   2> 	at com.carrotsearch.randomizedtesting.RandomizedRunner$6.evaluate(RandomizedRunner.java:816)
   [junit4]   2> 	at com.carrotsearch.randomizedtesting.RandomizedRunner$7.evaluate(RandomizedRunner.java:827)
   [junit4]   2> 	at com.carrotsearch.randomizedtesting.rules.StatementAdapter.evaluate(StatementAdapter.java:36)
   [junit4]   2> 	at com.carrotsearch.randomizedtesting.rules.SystemPropertiesRestoreRule$1.evaluate(SystemPropertiesRestoreRule.java:57)
   [junit4]   2> 	at org.apache.lucene.util.AbstractBeforeAfterRule$1.evaluate(AbstractBeforeAfterRule.java:46)
   [junit4]   2> 	at com.carrotsearch.randomizedtesting.rules.StatementAdapter.evaluate(StatementAdapter.java:36)
   [junit4]   2> 	at org.apache.lucene.util.TestRuleStoreClassName$1.evaluate(TestRuleStoreClassName.java:42)
   [junit4]   2> 	at com.carrotsearch.randomizedtesting.rules.NoShadowingOrOverridesOnMethodsRule$1.evaluate(NoShadowingOrOverridesOnMethodsRule.java:40)
   [junit4]   2> 	at com.carrotsearch.randomizedtesting.rules.NoShadowingOrOverridesOnMethodsRule$1.evaluate(NoShadowingOrOverridesOnMethodsRule.java:40)
   [junit4]   2> 	at com.carrotsearch.randomizedtesting.rules.StatementAdapter.evaluate(StatementAdapter.java:36)
   [junit4]   2> 	at com.carrotsearch.randomizedtesting.rules.StatementAdapter.evaluate(StatementAdapter.java:36)
   [junit4]   2> 	at com.carrotsearch.randomizedtesting.rules.StatementAdapter.evaluate(StatementAdapter.java:36)
   [junit4]   2> 	at org.apache.lucene.util.TestRuleAssertionsRequired$1.evaluate(TestRuleAssertionsRequired.java:54)
   [junit4]   2> 	at org.apache.lucene.util.TestRuleMarkFailure$1.evaluate(TestRuleMarkFailure.java:48)
   [junit4]   2> 	at org.apache.lucene.util.TestRuleIgnoreAfterMaxFailures$1.evaluate(TestRuleIgnoreAfterMaxFailures.java:65)
   [junit4]   2> 	at org.apache.lucene.util.TestRuleIgnoreTestSuites$1.evaluate(TestRuleIgnoreTestSuites.java:55)
   [junit4]   2> 	at com.carrotsearch.randomizedtesting.rules.StatementAdapter.evaluate(StatementAdapter.java:36)
   [junit4]   2> 	at com.carrotsearch.randomizedtesting.ThreadLeakControl$StatementRunner.run(ThreadLeakControl.java:367)
   [junit4]   2> 	at java.lang.Thread.run(Thread.java:747)
   [junit4]   2> 
   [junit4]   2> 451298 INFO  (TEST-TestArbitraryIndexDir.testLoadNewIndexDir-seed#[D2FF81078DFC658E]) [    ] o.a.s.SolrTestCaseJ4 ###Ending testLoadNewIndexDir
   [junit4]   2> NOTE: reproduce with: ant test  -Dtestcase=TestArbitraryIndexDir -Dtests.method=testLoadNewIndexDir -Dtests.seed=D2FF81078DFC658E -Dtests.multiplier=3 -Dtests.slow=true -Dtests.locale=lo -Dtests.timezone=Atlantic/Bermuda -Dtests.asserts=true -Dtests.file.encoding=UTF-8
   [junit4] ERROR   0.84s J0 | TestArbitraryIndexDir.testLoadNewIndexDir <<<
   [junit4]    > Throwable #1: java.lang.RuntimeException: Exception during query
   [junit4]    > 	at __randomizedtesting.SeedInfo.seed([D2FF81078DFC658E:3BA53A3F1365F526]:0)
   [junit4]    > 	at org.apache.solr.SolrTestCaseJ4.assertQ(SolrTestCaseJ4.java:753)
   [junit4]    > 	at org.apache.solr.core.TestArbitraryIndexDir.testLoadNewIndexDir(TestArbitraryIndexDir.java:107)
   [junit4]    > 	at java.lang.Thread.run(Thread.java:747)
   [junit4]    > Caused by: java.lang.RuntimeException: REQUEST FAILED: xpath=*[count(//doc)=1]
   [junit4]    > 	xml response was: <?xml version="1.0" encoding="UTF-8"?>
   [junit4]    > <response>
   [junit4]    > <lst name="responseHeader"><int name="status">0</int><int name="QTime">0</int></lst><result name="response" numFound="0" start="0"></result>
   [junit4]    > </response>
   [junit4]    > 	request was:q=id:2&qt=standard&start=0&rows=20&version=2.2
   [junit4]    > 	at org.apache.solr.SolrTestCaseJ4.assertQ(SolrTestCaseJ4.java:746)
   [junit4]    > 	... 41 more
   [junit4]   2> 451300 INFO  (SUITE-TestArbitraryIndexDir-seed#[D2FF81078DFC658E]-worker) [    ] o.a.s.SolrTestCaseJ4 ###deleteCore
   [junit4]   2> 451300 INFO  (SUITE-TestArbitraryIndexDir-seed#[D2FF81078DFC658E]-worker) [    ] o.a.s.c.CoreContainer Shutting down CoreContainer instance=22627864
   [junit4]   2> 451300 INFO  (SUITE-TestArbitraryIndexDir-seed#[D2FF81078DFC658E]-worker) [    ] o.a.s.c.SolrCore [collection1]  CLOSING SolrCore org.apache.solr.core.SolrCore@877324
   [junit4]   2> 451300 INFO  (SUITE-TestArbitraryIndexDir-seed#[D2FF81078DFC658E]-worker) [    ] o.a.s.u.DirectUpdateHandler2 closing DirectUpdateHandler2{commits=0,autocommits=0,soft autocommits=0,optimizes=0,rollbacks=0,expungeDeletes=0,docsPending=0,adds=0,deletesById=0,deletesByQuery=0,errors=0,cumulative_adds=0,cumulative_deletesById=0,cumulative_deletesByQuery=0,cumulative_errors=0}
   [junit4]   2> 451300 INFO  (SUITE-TestArbitraryIndexDir-seed#[D2FF81078DFC658E]-worker) [    ] o.a.s.u.SolrCoreState Closing SolrCoreState
   [junit4]   2> 451300 INFO  (SUITE-TestArbitraryIndexDir-seed#[D2FF81078DFC658E]-worker) [    ] o.a.s.u.DefaultSolrCoreState SolrCoreState ref count has reached 0 - closing IndexWriter
   [junit4]   2> 451300 INFO  (SUITE-TestArbitraryIndexDir-seed#[D2FF81078DFC658E]-worker) [    ] o.a.s.u.DefaultSolrCoreState closing IndexWriter with IndexWriterCloser
   [junit4]   2> 451302 INFO  (SUITE-TestArbitraryIndexDir-seed#[D2FF81078DFC658E]-worker) [    ] o.a.s.c.SolrCore [collection1] Closing main searcher on request.
   [junit4]   2> 451311 INFO  (SUITE-TestArbitraryIndexDir-seed#[D2FF81078DFC658E]-worker) [    ] o.a.s.c.CachingDirectoryFactory Closing MockFSDirectoryFactory - 3 directories currently being tracked
   [junit4]   2> 451311 INFO  (SUITE-TestArbitraryIndexDir-seed#[D2FF81078DFC658E]-worker) [    ] o.a.s.c.CachingDirectoryFactory looking to close /home/jenkins/workspace/Lucene-Solr-5.x-Linux/solr/build/solr-core/test/J0/temp/solr.core.TestArbitraryIndexDir_D2FF81078DFC658E-001/init-core-data-001/index [CachedDir<<refCount=0;path=/home/jenkins/workspace/Lucene-Solr-5.x-Linux/solr/build/solr-core/test/J0/temp/solr.core.TestArbitraryIndexDir_D2FF81078DFC658E-001/init-core-data-001/index;done=false>>]
   [junit4]   2> 451311 INFO  (SUITE-TestArbitraryIndexDir-seed#[D2FF81078DFC658E]-worker) [    ] o.a.s.c.CachingDirectoryFactory Closing directory: /home/jenkins/workspace/Lucene-Solr-5.x-Linux/solr/build/solr-core/test/J0/temp/solr.core.TestArbitraryIndexDir_D2FF81078DFC658E-001/init-core-data-001/index
   [junit4]   2> 451323 INFO  (SUITE-TestArbitraryIndexDir-seed#[D2FF81078DFC658E]-worker) [    ] o.a.s.c.CachingDirectoryFactory looking to close /home/jenkins/workspace/Lucene-Solr-5.x-Linux/solr/build/solr-core/test/J0/temp/solr.core.TestArbitraryIndexDir_D2FF81078DFC658E-001/init-core-data-001 [CachedDir<<refCount=0;path=/home/jenkins/workspace/Lucene-Solr-5.x-Linux/solr/build/solr-core/test/J0/temp/solr.core.TestArbitraryIndexDir_D2FF81078DFC658E-001/init-core-data-001;done=false>>]
   [junit4]   2> 451323 INFO  (SUITE-TestArbitraryIndexDir-seed#[D2FF81078DFC658E]-worker) [    ] o.a.s.c.CachingDirectoryFactory Closing directory: /home/jenkins/workspace/Lucene-Solr-5.x-Linux/solr/build/solr-core/test/J0/temp/solr.core.TestArbitraryIndexDir_D2FF81078DFC658E-001/init-core-data-001
   [junit4]   2> 451323 INFO  (SUITE-TestArbitraryIndexDir-seed#[D2FF81078DFC658E]-worker) [    ] o.a.s.c.CachingDirectoryFactory looking to close /home/jenkins/workspace/Lucene-Solr-5.x-Linux/solr/build/solr-core/test/J0/temp/solr.core.TestArbitraryIndexDir_D2FF81078DFC658E-001/init-core-data-001/index_temp [CachedDir<<refCount=0;path=/home/jenkins/workspace/Lucene-Solr-5.x-Linux/solr/build/solr-core/test/J0/temp/solr.core.TestArbitraryIndexDir_D2FF81078DFC658E-001/init-core-data-001/index_temp;done=false>>]
   [junit4]   2> 451323 INFO  (SUITE-TestArbitraryIndexDir-seed#[D2FF81078DFC658E]-worker) [    ] o.a.s.c.CachingDirectoryFactory Closing directory: /home/jenkins/workspace/Lucene-Solr-5.x-Linux/solr/build/solr-core/test/J0/temp/solr.core.TestArbitraryIndexDir_D2FF81078DFC658E-001/init-core-data-001/index_temp
   [junit4]   2> NOTE: leaving temporary files on disk at: /home/jenkins/workspace/Lucene-Solr-5.x-Linux/solr/build/solr-core/test/J0/temp/solr.core.TestArbitraryIndexDir_D2FF81078DFC658E-001
   [junit4]   2> NOTE: test params are: codec=Asserting(Lucene54): {name=PostingsFormat(name=LuceneVarGapDocFreqInterval), id=PostingsFormat(name=LuceneVarGapDocFreqInterval)}, docValues:{}, sim=DefaultSimilarity, locale=lo, timezone=Atlantic/Bermuda
   [junit4]   2> NOTE: Linux 3.19.0-42-generic i386/Oracle Corporation 9-ea (32-bit)/cpus=12,threads=1,free=119356280,total=236699648
   [junit4]   2> NOTE: All tests run in this JVM: [RequiredFieldsTest, LeaderElectionIntegrationTest, TestClusterStateMutator, AnalyticsMergeStrategyTest, TestSolrConfigHandler, SuggestComponentTest, RAMDirectoryFactoryTest, TestMiniSolrCloudClusterSSL, TestRawTransformer, JsonLoaderTest, TestEmbeddedSolrServerConstructors, TestRuleBasedAuthorizationPlugin, TestPivotHelperCode, BlockJoinFacetDistribTest, TestFieldTypeResource, TestSolr4Spatial, AlternateDirectoryTest, CacheHeaderTest, QueryResultKeyTest, SyncSliceTest, TestComplexPhraseQParserPlugin, SharedFSAutoReplicaFailoverTest, TestDefaultSearchFieldResource, PathHierarchyTokenizerFactoryTest, TestJoin, TestCloudSchemaless, AliasIntegrationTest, TestDefaultStatsCache, OverseerCollectionConfigSetProcessorTest, TestSolrConfigHandlerCloud, TestChildDocTransformer, DistanceUnitsTest, TestSchemaResource, TestExceedMaxTermLength, TestRandomCollapseQParserPlugin, BitVectorTest, XsltUpdateRequestHandlerTest, DocExpirationUpdateProcessorFactoryTest, CoreAdminRequestStatusTest, TestLRUCache, TestRemoteStreaming, TestBadConfig, RequestLoggingTest, TestRealTimeGet, BasicZkTest, QueryElevationComponentTest, TestStandardQParsers, PrimUtilsTest, TestSerializedLuceneMatchVersion, TestAddFieldRealTimeGet, TestMissingGroups, DistributedSpellCheckComponentTest, TestTestInjection, SynonymTokenizerTest, PeerSyncTest, LeaderInitiatedRecoveryOnCommitTest, TestHashQParserPlugin, EchoParamsTest, TestArbitraryIndexDir]
   [junit4] Completed [131/564 (1!)] on J0 in 0.89s, 1 test, 1 error <<< FAILURES!

[...truncated 1368 lines...]
BUILD FAILED
/home/jenkins/workspace/Lucene-Solr-5.x-Linux/build.xml:794: The following error occurred while executing this line:
/home/jenkins/workspace/Lucene-Solr-5.x-Linux/build.xml:738: The following error occurred while executing this line:
/home/jenkins/workspace/Lucene-Solr-5.x-Linux/build.xml:59: The following error occurred while executing this line:
/home/jenkins/workspace/Lucene-Solr-5.x-Linux/solr/build.xml:233: The following error occurred while executing this line:
/home/jenkins/workspace/Lucene-Solr-5.x-Linux/solr/common-build.xml:532: The following error occurred while executing this line:
/home/jenkins/workspace/Lucene-Solr-5.x-Linux/lucene/common-build.xml:1444: The following error occurred while executing this line:
/home/jenkins/workspace/Lucene-Solr-5.x-Linux/lucene/common-build.xml:1000: There were test failures: 564 suites (7 ignored), 2253 tests, 1 error, 84 ignored (39 assumptions) [seed: D2FF81078DFC658E]

Total time: 54 minutes 18 seconds
Build step 'Invoke Ant' marked build as failure
Archiving artifacts
[WARNINGS] Skipping publisher since build result is FAILURE
Recording test results
Email was triggered for: Failure - Any
Sending email for trigger: Failure - Any



Mime
View raw message