lucene-dev mailing list archives

Site index · List index
Message view « Date » · « Thread »
Top « Date » · « Thread »
From Apache Jenkins Server <jenk...@builds.apache.org>
Subject [JENKINS] Lucene-Solr-NightlyTests-trunk - Build # 918 - Still Failing
Date Sun, 24 Jan 2016 15:19:28 GMT
Build: https://builds.apache.org/job/Lucene-Solr-NightlyTests-trunk/918/

1 tests failed.
FAILED:  org.apache.lucene.search.TestLatLonPointQueries.testRandomBig

Error Message:
Captured an uncaught exception in thread: Thread[id=69, name=T1, state=RUNNABLE, group=TGRP-TestLatLonPointQueries]

Stack Trace:
com.carrotsearch.randomizedtesting.UncaughtExceptionError: Captured an uncaught exception
in thread: Thread[id=69, name=T1, state=RUNNABLE, group=TGRP-TestLatLonPointQueries]
Caused by: java.lang.AssertionError: some hits were wrong
	at __randomizedtesting.SeedInfo.seed([E332BA7DBDF3173D]:0)
	at org.junit.Assert.fail(Assert.java:93)
	at org.apache.lucene.util.BaseGeoPointTestCase$VerifyHits.test(BaseGeoPointTestCase.java:552)
	at org.apache.lucene.util.BaseGeoPointTestCase$2._run(BaseGeoPointTestCase.java:756)
	at org.apache.lucene.util.BaseGeoPointTestCase$2.run(BaseGeoPointTestCase.java:623)




Build Log:
[...truncated 8037 lines...]
   [junit4] Suite: org.apache.lucene.search.TestLatLonPointQueries
   [junit4]   1> T1: id=480215 should match but did not
   [junit4]   1>   small=true query=PointInRectQuery:field=point: Lower Left: [118.83159050631862,20.15449834890741]
Upper Right: [118.85143722130395,21.05741878617187] docID=621653
   [junit4]   1>   lat=20.638151623427863 lon=118.83159052767718
   [junit4]   1>   deleted?=false
   [junit4]   2> ינו 24, 2016 9:13:14 AM com.carrotsearch.randomizedtesting.RandomizedRunner$QueueUncaughtExceptionsHandler
uncaughtException
   [junit4]   2> WARNING: Uncaught exception in thread: Thread[T1,5,TGRP-TestLatLonPointQueries]
   [junit4]   2> java.lang.AssertionError: some hits were wrong
   [junit4]   2> 	at __randomizedtesting.SeedInfo.seed([E332BA7DBDF3173D]:0)
   [junit4]   2> 	at org.junit.Assert.fail(Assert.java:93)
   [junit4]   2> 	at org.apache.lucene.util.BaseGeoPointTestCase$VerifyHits.test(BaseGeoPointTestCase.java:552)
   [junit4]   2> 	at org.apache.lucene.util.BaseGeoPointTestCase$2._run(BaseGeoPointTestCase.java:756)
   [junit4]   2> 	at org.apache.lucene.util.BaseGeoPointTestCase$2.run(BaseGeoPointTestCase.java:623)
   [junit4]   2> 
   [junit4]   2> NOTE: download the large Jenkins line-docs file by running 'ant get-jenkins-line-docs'
in the lucene directory.
   [junit4]   2> NOTE: reproduce with: ant test  -Dtestcase=TestLatLonPointQueries -Dtests.method=testRandomBig
-Dtests.seed=E332BA7DBDF3173D -Dtests.multiplier=2 -Dtests.nightly=true -Dtests.slow=true
-Dtests.linedocsfile=/x1/jenkins/lucene-data/enwiki.random.lines.txt -Dtests.locale=he -Dtests.timezone=America/Guatemala
-Dtests.asserts=true -Dtests.file.encoding=UTF-8
   [junit4] ERROR   36.4s J1 | TestLatLonPointQueries.testRandomBig <<<
   [junit4]    > Throwable #1: java.lang.AssertionError
   [junit4]    > 	at org.apache.lucene.util.BaseGeoPointTestCase.verify(BaseGeoPointTestCase.java:770)
   [junit4]    > 	at org.apache.lucene.util.BaseGeoPointTestCase.doTestRandom(BaseGeoPointTestCase.java:411)
   [junit4]    > 	at org.apache.lucene.util.BaseGeoPointTestCase.testRandomBig(BaseGeoPointTestCase.java:340)
   [junit4]    > 	at java.lang.Thread.run(Thread.java:745)Throwable #2: com.carrotsearch.randomizedtesting.UncaughtExceptionError:
Captured an uncaught exception in thread: Thread[id=69, name=T1, state=RUNNABLE, group=TGRP-TestLatLonPointQueries]
   [junit4]    > Caused by: java.lang.AssertionError: some hits were wrong
   [junit4]    > 	at __randomizedtesting.SeedInfo.seed([E332BA7DBDF3173D]:0)
   [junit4]    > 	at org.apache.lucene.util.BaseGeoPointTestCase$VerifyHits.test(BaseGeoPointTestCase.java:552)
   [junit4]    > 	at org.apache.lucene.util.BaseGeoPointTestCase$2._run(BaseGeoPointTestCase.java:756)
   [junit4]    > 	at org.apache.lucene.util.BaseGeoPointTestCase$2.run(BaseGeoPointTestCase.java:623)
   [junit4]   2> NOTE: leaving temporary files on disk at: /x1/jenkins/jenkins-slave/workspace/Lucene-Solr-NightlyTests-trunk/lucene/build/sandbox/test/J1/temp/lucene.search.TestLatLonPointQueries_E332BA7DBDF3173D-001
   [junit4]   2> NOTE: test params are: codec=Asserting(Lucene60): {id=FSTOrd50}, docValues:{id=DocValuesFormat(name=Lucene54)},
sim=ClassicSimilarity, locale=he, timezone=America/Guatemala
   [junit4]   2> NOTE: Linux 3.13.0-52-generic amd64/Oracle Corporation 1.8.0_66 (64-bit)/cpus=4,threads=1,free=83251552,total=332922880
   [junit4]   2> NOTE: All tests run in this JVM: [TestDocValuesTermsQuery, TestPayloadSpanUtil,
TestLatLonPointQueries]
   [junit4] Completed [11/13 (1!)] on J1 in 88.44s, 8 tests, 1 error <<< FAILURES!

[...truncated 21 lines...]
BUILD FAILED
/x1/jenkins/jenkins-slave/workspace/Lucene-Solr-NightlyTests-trunk/build.xml:682: The following
error occurred while executing this line:
/x1/jenkins/jenkins-slave/workspace/Lucene-Solr-NightlyTests-trunk/build.xml:619: The following
error occurred while executing this line:
/x1/jenkins/jenkins-slave/workspace/Lucene-Solr-NightlyTests-trunk/build.xml:57: The following
error occurred while executing this line:
/x1/jenkins/jenkins-slave/workspace/Lucene-Solr-NightlyTests-trunk/lucene/build.xml:475: The
following error occurred while executing this line:
/x1/jenkins/jenkins-slave/workspace/Lucene-Solr-NightlyTests-trunk/lucene/common-build.xml:2154:
The following error occurred while executing this line:
/x1/jenkins/jenkins-slave/workspace/Lucene-Solr-NightlyTests-trunk/lucene/module-build.xml:58:
The following error occurred while executing this line:
/x1/jenkins/jenkins-slave/workspace/Lucene-Solr-NightlyTests-trunk/lucene/common-build.xml:1424:
The following error occurred while executing this line:
/x1/jenkins/jenkins-slave/workspace/Lucene-Solr-NightlyTests-trunk/lucene/common-build.xml:981:
There were test failures: 13 suites, 97 tests, 1 error [seed: E332BA7DBDF3173D]

Total time: 132 minutes 19 seconds
Build step 'Invoke Ant' marked build as failure
Archiving artifacts
No prior successful build to compare, so performing full copy of artifacts
Recording test results
Email was triggered for: Failure - Any
Sending email for trigger: Failure - Any



Mime
View raw message