lucene-dev mailing list archives

Site index · List index
Message view « Date » · « Thread »
Top « Date » · « Thread »
From Policeman Jenkins Server <jenk...@thetaphi.de>
Subject [JENKINS] Lucene-Solr-5.x-Linux (64bit/jdk1.8.0_66) - Build # 15184 - Failure!
Date Fri, 08 Jan 2016 11:12:11 GMT
Build: http://jenkins.thetaphi.de/job/Lucene-Solr-5.x-Linux/15184/
Java: 64bit/jdk1.8.0_66 -XX:+UseCompressedOops -XX:+UseParallelGC

1 tests failed.
FAILED:  org.apache.solr.cloud.ShardSplitTest.test

Error Message:
Error from server at http://127.0.0.1:41079/lxa/routeFieldColl: non ok status: 500, message:Server Error

Stack Trace:
org.apache.solr.client.solrj.impl.HttpSolrClient$RemoteSolrException: Error from server at http://127.0.0.1:41079/lxa/routeFieldColl: non ok status: 500, message:Server Error
	at __randomizedtesting.SeedInfo.seed([44C57313AFCAC55C:CC914CC90136A8A4]:0)
	at org.apache.solr.client.solrj.impl.HttpSolrClient.executeMethod(HttpSolrClient.java:509)
	at org.apache.solr.client.solrj.impl.HttpSolrClient.request(HttpSolrClient.java:241)
	at org.apache.solr.client.solrj.impl.HttpSolrClient.request(HttpSolrClient.java:230)
	at org.apache.solr.client.solrj.SolrRequest.process(SolrRequest.java:150)
	at org.apache.solr.client.solrj.SolrClient.add(SolrClient.java:174)
	at org.apache.solr.client.solrj.SolrClient.add(SolrClient.java:139)
	at org.apache.solr.client.solrj.SolrClient.add(SolrClient.java:153)
	at org.apache.solr.cloud.ShardSplitTest.splitByRouteFieldTest(ShardSplitTest.java:263)
	at org.apache.solr.cloud.ShardSplitTest.test(ShardSplitTest.java:83)
	at sun.reflect.NativeMethodAccessorImpl.invoke0(Native Method)
	at sun.reflect.NativeMethodAccessorImpl.invoke(NativeMethodAccessorImpl.java:62)
	at sun.reflect.DelegatingMethodAccessorImpl.invoke(DelegatingMethodAccessorImpl.java:43)
	at java.lang.reflect.Method.invoke(Method.java:497)
	at com.carrotsearch.randomizedtesting.RandomizedRunner.invoke(RandomizedRunner.java:1764)
	at com.carrotsearch.randomizedtesting.RandomizedRunner$8.evaluate(RandomizedRunner.java:871)
	at com.carrotsearch.randomizedtesting.RandomizedRunner$9.evaluate(RandomizedRunner.java:907)
	at com.carrotsearch.randomizedtesting.RandomizedRunner$10.evaluate(RandomizedRunner.java:921)
	at org.apache.solr.BaseDistributedSearchTestCase$ShardsRepeatRule$ShardsFixedStatement.callStatement(BaseDistributedSearchTestCase.java:965)
	at org.apache.solr.BaseDistributedSearchTestCase$ShardsRepeatRule$ShardsStatement.evaluate(BaseDistributedSearchTestCase.java:940)
	at com.carrotsearch.randomizedtesting.rules.SystemPropertiesRestoreRule$1.evaluate(SystemPropertiesRestoreRule.java:57)
	at org.apache.lucene.util.TestRuleSetupTeardownChained$1.evaluate(TestRuleSetupTeardownChained.java:50)
	at org.apache.lucene.util.AbstractBeforeAfterRule$1.evaluate(AbstractBeforeAfterRule.java:46)
	at org.apache.lucene.util.TestRuleThreadAndTestName$1.evaluate(TestRuleThreadAndTestName.java:49)
	at org.apache.lucene.util.TestRuleIgnoreAfterMaxFailures$1.evaluate(TestRuleIgnoreAfterMaxFailures.java:65)
	at org.apache.lucene.util.TestRuleMarkFailure$1.evaluate(TestRuleMarkFailure.java:48)
	at com.carrotsearch.randomizedtesting.rules.StatementAdapter.evaluate(StatementAdapter.java:36)
	at com.carrotsearch.randomizedtesting.ThreadLeakControl$StatementRunner.run(ThreadLeakControl.java:367)
	at com.carrotsearch.randomizedtesting.ThreadLeakControl.forkTimeoutingTask(ThreadLeakControl.java:809)
	at com.carrotsearch.randomizedtesting.ThreadLeakControl$3.evaluate(ThreadLeakControl.java:460)
	at com.carrotsearch.randomizedtesting.RandomizedRunner.runSingleTest(RandomizedRunner.java:880)
	at com.carrotsearch.randomizedtesting.RandomizedRunner$5.evaluate(RandomizedRunner.java:781)
	at com.carrotsearch.randomizedtesting.RandomizedRunner$6.evaluate(RandomizedRunner.java:816)
	at com.carrotsearch.randomizedtesting.RandomizedRunner$7.evaluate(RandomizedRunner.java:827)
	at com.carrotsearch.randomizedtesting.rules.StatementAdapter.evaluate(StatementAdapter.java:36)
	at com.carrotsearch.randomizedtesting.rules.SystemPropertiesRestoreRule$1.evaluate(SystemPropertiesRestoreRule.java:57)
	at org.apache.lucene.util.AbstractBeforeAfterRule$1.evaluate(AbstractBeforeAfterRule.java:46)
	at com.carrotsearch.randomizedtesting.rules.StatementAdapter.evaluate(StatementAdapter.java:36)
	at org.apache.lucene.util.TestRuleStoreClassName$1.evaluate(TestRuleStoreClassName.java:42)
	at com.carrotsearch.randomizedtesting.rules.NoShadowingOrOverridesOnMethodsRule$1.evaluate(NoShadowingOrOverridesOnMethodsRule.java:40)
	at com.carrotsearch.randomizedtesting.rules.NoShadowingOrOverridesOnMethodsRule$1.evaluate(NoShadowingOrOverridesOnMethodsRule.java:40)
	at com.carrotsearch.randomizedtesting.rules.StatementAdapter.evaluate(StatementAdapter.java:36)
	at com.carrotsearch.randomizedtesting.rules.StatementAdapter.evaluate(StatementAdapter.java:36)
	at com.carrotsearch.randomizedtesting.rules.StatementAdapter.evaluate(StatementAdapter.java:36)
	at org.apache.lucene.util.TestRuleAssertionsRequired$1.evaluate(TestRuleAssertionsRequired.java:54)
	at org.apache.lucene.util.TestRuleMarkFailure$1.evaluate(TestRuleMarkFailure.java:48)
	at org.apache.lucene.util.TestRuleIgnoreAfterMaxFailures$1.evaluate(TestRuleIgnoreAfterMaxFailures.java:65)
	at org.apache.lucene.util.TestRuleIgnoreTestSuites$1.evaluate(TestRuleIgnoreTestSuites.java:55)
	at com.carrotsearch.randomizedtesting.rules.StatementAdapter.evaluate(StatementAdapter.java:36)
	at com.carrotsearch.randomizedtesting.ThreadLeakControl$StatementRunner.run(ThreadLeakControl.java:367)
	at java.lang.Thread.run(Thread.java:745)




Build Log:
[...truncated 11237 lines...]
   [junit4] Suite: org.apache.solr.cloud.ShardSplitTest
   [junit4]   2> Creating dataDir: /home/jenkins/workspace/Lucene-Solr-5.x-Linux/solr/build/solr-core/test/J2/temp/solr.cloud.ShardSplitTest_44C57313AFCAC55C-001/init-core-data-001
   [junit4]   2> 1268593 INFO  (SUITE-ShardSplitTest-seed#[44C57313AFCAC55C]-worker) [    ] o.a.s.BaseDistributedSearchTestCase Setting hostContext system property: /lxa/
   [junit4]   2> 1268595 INFO  (TEST-ShardSplitTest.test-seed#[44C57313AFCAC55C]) [    ] o.a.s.c.ZkTestServer STARTING ZK TEST SERVER
   [junit4]   2> 1268595 INFO  (Thread-4311) [    ] o.a.s.c.ZkTestServer client port:0.0.0.0/0.0.0.0:0
   [junit4]   2> 1268595 INFO  (Thread-4311) [    ] o.a.s.c.ZkTestServer Starting server
   [junit4]   2> 1268695 INFO  (TEST-ShardSplitTest.test-seed#[44C57313AFCAC55C]) [    ] o.a.s.c.ZkTestServer start zk server on port:57270
   [junit4]   2> 1268695 INFO  (TEST-ShardSplitTest.test-seed#[44C57313AFCAC55C]) [    ] o.a.s.c.c.SolrZkClient Using default ZkCredentialsProvider
   [junit4]   2> 1268696 INFO  (TEST-ShardSplitTest.test-seed#[44C57313AFCAC55C]) [    ] o.a.s.c.c.ConnectionManager Waiting for client to connect to ZooKeeper
   [junit4]   2> 1268697 INFO  (zkCallback-1313-thread-1) [    ] o.a.s.c.c.ConnectionManager Watcher org.apache.solr.common.cloud.ConnectionManager@33d67097 name:ZooKeeperConnection Watcher:127.0.0.1:57270 got event WatchedEvent state:SyncConnected type:None path:null path:null type:None
   [junit4]   2> 1268697 INFO  (TEST-ShardSplitTest.test-seed#[44C57313AFCAC55C]) [    ] o.a.s.c.c.ConnectionManager Client is connected to ZooKeeper
   [junit4]   2> 1268698 INFO  (TEST-ShardSplitTest.test-seed#[44C57313AFCAC55C]) [    ] o.a.s.c.c.SolrZkClient Using default ZkACLProvider
   [junit4]   2> 1268698 INFO  (TEST-ShardSplitTest.test-seed#[44C57313AFCAC55C]) [    ] o.a.s.c.c.SolrZkClient makePath: /solr
   [junit4]   2> 1268699 INFO  (TEST-ShardSplitTest.test-seed#[44C57313AFCAC55C]) [    ] o.a.s.c.c.SolrZkClient Using default ZkCredentialsProvider
   [junit4]   2> 1268699 INFO  (TEST-ShardSplitTest.test-seed#[44C57313AFCAC55C]) [    ] o.a.s.c.c.ConnectionManager Waiting for client to connect to ZooKeeper
   [junit4]   2> 1268700 INFO  (zkCallback-1314-thread-1) [    ] o.a.s.c.c.ConnectionManager Watcher org.apache.solr.common.cloud.ConnectionManager@4fac99f9 name:ZooKeeperConnection Watcher:127.0.0.1:57270/solr got event WatchedEvent state:SyncConnected type:None path:null path:null type:None
   [junit4]   2> 1268700 INFO  (TEST-ShardSplitTest.test-seed#[44C57313AFCAC55C]) [    ] o.a.s.c.c.ConnectionManager Client is connected to ZooKeeper
   [junit4]   2> 1268700 INFO  (TEST-ShardSplitTest.test-seed#[44C57313AFCAC55C]) [    ] o.a.s.c.c.SolrZkClient Using default ZkACLProvider
   [junit4]   2> 1268700 INFO  (TEST-ShardSplitTest.test-seed#[44C57313AFCAC55C]) [    ] o.a.s.c.c.SolrZkClient makePath: /collections/collection1
   [junit4]   2> 1268701 INFO  (TEST-ShardSplitTest.test-seed#[44C57313AFCAC55C]) [    ] o.a.s.c.c.SolrZkClient makePath: /collections/collection1/shards
   [junit4]   2> 1268701 INFO  (TEST-ShardSplitTest.test-seed#[44C57313AFCAC55C]) [    ] o.a.s.c.c.SolrZkClient makePath: /collections/control_collection
   [junit4]   2> 1268702 INFO  (TEST-ShardSplitTest.test-seed#[44C57313AFCAC55C]) [    ] o.a.s.c.c.SolrZkClient makePath: /collections/control_collection/shards
   [junit4]   2> 1268702 INFO  (TEST-ShardSplitTest.test-seed#[44C57313AFCAC55C]) [    ] o.a.s.c.AbstractZkTestCase put /home/jenkins/workspace/Lucene-Solr-5.x-Linux/solr/core/src/test-files/solr/collection1/conf/solrconfig-tlog.xml to /configs/conf1/solrconfig.xml
   [junit4]   2> 1268702 INFO  (TEST-ShardSplitTest.test-seed#[44C57313AFCAC55C]) [    ] o.a.s.c.c.SolrZkClient makePath: /configs/conf1/solrconfig.xml
   [junit4]   2> 1268703 INFO  (TEST-ShardSplitTest.test-seed#[44C57313AFCAC55C]) [    ] o.a.s.c.AbstractZkTestCase put /home/jenkins/workspace/Lucene-Solr-5.x-Linux/solr/core/src/test-files/solr/collection1/conf/schema15.xml to /configs/conf1/schema.xml
   [junit4]   2> 1268703 INFO  (TEST-ShardSplitTest.test-seed#[44C57313AFCAC55C]) [    ] o.a.s.c.c.SolrZkClient makePath: /configs/conf1/schema.xml
   [junit4]   2> 1268704 INFO  (TEST-ShardSplitTest.test-seed#[44C57313AFCAC55C]) [    ] o.a.s.c.AbstractZkTestCase put /home/jenkins/workspace/Lucene-Solr-5.x-Linux/solr/core/src/test-files/solr/collection1/conf/solrconfig.snippet.randomindexconfig.xml to /configs/conf1/solrconfig.snippet.randomindexconfig.xml
   [junit4]   2> 1268704 INFO  (TEST-ShardSplitTest.test-seed#[44C57313AFCAC55C]) [    ] o.a.s.c.c.SolrZkClient makePath: /configs/conf1/solrconfig.snippet.randomindexconfig.xml
   [junit4]   2> 1268704 INFO  (TEST-ShardSplitTest.test-seed#[44C57313AFCAC55C]) [    ] o.a.s.c.AbstractZkTestCase put /home/jenkins/workspace/Lucene-Solr-5.x-Linux/solr/core/src/test-files/solr/collection1/conf/stopwords.txt to /configs/conf1/stopwords.txt
   [junit4]   2> 1268705 INFO  (TEST-ShardSplitTest.test-seed#[44C57313AFCAC55C]) [    ] o.a.s.c.c.SolrZkClient makePath: /configs/conf1/stopwords.txt
   [junit4]   2> 1268705 INFO  (TEST-ShardSplitTest.test-seed#[44C57313AFCAC55C]) [    ] o.a.s.c.AbstractZkTestCase put /home/jenkins/workspace/Lucene-Solr-5.x-Linux/solr/core/src/test-files/solr/collection1/conf/protwords.txt to /configs/conf1/protwords.txt
   [junit4]   2> 1268705 INFO  (TEST-ShardSplitTest.test-seed#[44C57313AFCAC55C]) [    ] o.a.s.c.c.SolrZkClient makePath: /configs/conf1/protwords.txt
   [junit4]   2> 1268706 INFO  (TEST-ShardSplitTest.test-seed#[44C57313AFCAC55C]) [    ] o.a.s.c.AbstractZkTestCase put /home/jenkins/workspace/Lucene-Solr-5.x-Linux/solr/core/src/test-files/solr/collection1/conf/currency.xml to /configs/conf1/currency.xml
   [junit4]   2> 1268706 INFO  (TEST-ShardSplitTest.test-seed#[44C57313AFCAC55C]) [    ] o.a.s.c.c.SolrZkClient makePath: /configs/conf1/currency.xml
   [junit4]   2> 1268715 INFO  (TEST-ShardSplitTest.test-seed#[44C57313AFCAC55C]) [    ] o.a.s.c.AbstractZkTestCase put /home/jenkins/workspace/Lucene-Solr-5.x-Linux/solr/core/src/test-files/solr/collection1/conf/enumsConfig.xml to /configs/conf1/enumsConfig.xml
   [junit4]   2> 1268716 INFO  (TEST-ShardSplitTest.test-seed#[44C57313AFCAC55C]) [    ] o.a.s.c.c.SolrZkClient makePath: /configs/conf1/enumsConfig.xml
   [junit4]   2> 1268716 INFO  (TEST-ShardSplitTest.test-seed#[44C57313AFCAC55C]) [    ] o.a.s.c.AbstractZkTestCase put /home/jenkins/workspace/Lucene-Solr-5.x-Linux/solr/core/src/test-files/solr/collection1/conf/open-exchange-rates.json to /configs/conf1/open-exchange-rates.json
   [junit4]   2> 1268716 INFO  (TEST-ShardSplitTest.test-seed#[44C57313AFCAC55C]) [    ] o.a.s.c.c.SolrZkClient makePath: /configs/conf1/open-exchange-rates.json
   [junit4]   2> 1268717 INFO  (TEST-ShardSplitTest.test-seed#[44C57313AFCAC55C]) [    ] o.a.s.c.AbstractZkTestCase put /home/jenkins/workspace/Lucene-Solr-5.x-Linux/solr/core/src/test-files/solr/collection1/conf/mapping-ISOLatin1Accent.txt to /configs/conf1/mapping-ISOLatin1Accent.txt
   [junit4]   2> 1268717 INFO  (TEST-ShardSplitTest.test-seed#[44C57313AFCAC55C]) [    ] o.a.s.c.c.SolrZkClient makePath: /configs/conf1/mapping-ISOLatin1Accent.txt
   [junit4]   2> 1268717 INFO  (TEST-ShardSplitTest.test-seed#[44C57313AFCAC55C]) [    ] o.a.s.c.AbstractZkTestCase put /home/jenkins/workspace/Lucene-Solr-5.x-Linux/solr/core/src/test-files/solr/collection1/conf/old_synonyms.txt to /configs/conf1/old_synonyms.txt
   [junit4]   2> 1268718 INFO  (TEST-ShardSplitTest.test-seed#[44C57313AFCAC55C]) [    ] o.a.s.c.c.SolrZkClient makePath: /configs/conf1/old_synonyms.txt
   [junit4]   2> 1268718 INFO  (TEST-ShardSplitTest.test-seed#[44C57313AFCAC55C]) [    ] o.a.s.c.AbstractZkTestCase put /home/jenkins/workspace/Lucene-Solr-5.x-Linux/solr/core/src/test-files/solr/collection1/conf/synonyms.txt to /configs/conf1/synonyms.txt
   [junit4]   2> 1268718 INFO  (TEST-ShardSplitTest.test-seed#[44C57313AFCAC55C]) [    ] o.a.s.c.c.SolrZkClient makePath: /configs/conf1/synonyms.txt
   [junit4]   2> 1268811 INFO  (TEST-ShardSplitTest.test-seed#[44C57313AFCAC55C]) [    ] o.a.s.SolrTestCaseJ4 Writing core.properties file to /home/jenkins/workspace/Lucene-Solr-5.x-Linux/solr/build/solr-core/test/J2/temp/solr.cloud.ShardSplitTest_44C57313AFCAC55C-001/control-001/cores/collection1
   [junit4]   2> 1268812 INFO  (TEST-ShardSplitTest.test-seed#[44C57313AFCAC55C]) [    ] o.e.j.s.Server jetty-9.2.13.v20150730
   [junit4]   2> 1268813 INFO  (TEST-ShardSplitTest.test-seed#[44C57313AFCAC55C]) [    ] o.e.j.s.h.ContextHandler Started o.e.j.s.ServletContextHandler@6fb6322f{/lxa,null,AVAILABLE}
   [junit4]   2> 1268813 INFO  (TEST-ShardSplitTest.test-seed#[44C57313AFCAC55C]) [    ] o.e.j.s.ServerConnector Started ServerConnector@7dff2b72{HTTP/1.1}{127.0.0.1:58569}
   [junit4]   2> 1268813 INFO  (TEST-ShardSplitTest.test-seed#[44C57313AFCAC55C]) [    ] o.e.j.s.Server Started @1270497ms
   [junit4]   2> 1268814 INFO  (TEST-ShardSplitTest.test-seed#[44C57313AFCAC55C]) [    ] o.a.s.c.s.e.JettySolrRunner Jetty properties: {solr.data.dir=/home/jenkins/workspace/Lucene-Solr-5.x-Linux/solr/build/solr-core/test/J2/temp/solr.cloud.ShardSplitTest_44C57313AFCAC55C-001/tempDir-001/control/data, hostContext=/lxa, hostPort=58569, coreRootDirectory=/home/jenkins/workspace/Lucene-Solr-5.x-Linux/solr/build/solr-core/test/J2/temp/solr.cloud.ShardSplitTest_44C57313AFCAC55C-001/control-001/cores}
   [junit4]   2> 1268814 INFO  (TEST-ShardSplitTest.test-seed#[44C57313AFCAC55C]) [    ] o.a.s.s.SolrDispatchFilter SolrDispatchFilter.init(): sun.misc.Launcher$AppClassLoader@4e0e2f2a
   [junit4]   2> 1268814 INFO  (TEST-ShardSplitTest.test-seed#[44C57313AFCAC55C]) [    ] o.a.s.c.SolrResourceLoader new SolrResourceLoader for directory: '/home/jenkins/workspace/Lucene-Solr-5.x-Linux/solr/build/solr-core/test/J2/temp/solr.cloud.ShardSplitTest_44C57313AFCAC55C-001/control-001'
   [junit4]   2> 1268814 INFO  (TEST-ShardSplitTest.test-seed#[44C57313AFCAC55C]) [    ] o.a.s.c.SolrResourceLoader JNDI not configured for solr (NoInitialContextEx)
   [junit4]   2> 1268814 INFO  (TEST-ShardSplitTest.test-seed#[44C57313AFCAC55C]) [    ] o.a.s.c.SolrResourceLoader solr home defaulted to 'solr/' (could not find system property or JNDI)
   [junit4]   2> 1268814 INFO  (TEST-ShardSplitTest.test-seed#[44C57313AFCAC55C]) [    ] o.a.s.c.c.SolrZkClient Using default ZkCredentialsProvider
   [junit4]   2> 1268814 INFO  (TEST-ShardSplitTest.test-seed#[44C57313AFCAC55C]) [    ] o.a.s.c.c.ConnectionManager Waiting for client to connect to ZooKeeper
   [junit4]   2> 1268815 INFO  (zkCallback-1315-thread-1) [    ] o.a.s.c.c.ConnectionManager Watcher org.apache.solr.common.cloud.ConnectionManager@14384141 name:ZooKeeperConnection Watcher:127.0.0.1:57270/solr got event WatchedEvent state:SyncConnected type:None path:null path:null type:None
   [junit4]   2> 1268815 INFO  (TEST-ShardSplitTest.test-seed#[44C57313AFCAC55C]) [    ] o.a.s.c.c.ConnectionManager Client is connected to ZooKeeper
   [junit4]   2> 1268815 INFO  (TEST-ShardSplitTest.test-seed#[44C57313AFCAC55C]) [    ] o.a.s.c.c.SolrZkClient Using default ZkACLProvider
   [junit4]   2> 1268816 INFO  (TEST-ShardSplitTest.test-seed#[44C57313AFCAC55C]) [    ] o.a.s.s.SolrDispatchFilter Loading solr.xml from SolrHome (not found in ZooKeeper)
   [junit4]   2> 1268816 INFO  (TEST-ShardSplitTest.test-seed#[44C57313AFCAC55C]) [    ] o.a.s.c.SolrXmlConfig Loading container configuration from /home/jenkins/workspace/Lucene-Solr-5.x-Linux/solr/build/solr-core/test/J2/temp/solr.cloud.ShardSplitTest_44C57313AFCAC55C-001/control-001/solr.xml
   [junit4]   2> 1268819 INFO  (TEST-ShardSplitTest.test-seed#[44C57313AFCAC55C]) [    ] o.a.s.c.CorePropertiesLocator Config-defined core root directory: /home/jenkins/workspace/Lucene-Solr-5.x-Linux/solr/build/solr-core/test/J2/temp/solr.cloud.ShardSplitTest_44C57313AFCAC55C-001/control-001/cores
   [junit4]   2> 1268819 INFO  (TEST-ShardSplitTest.test-seed#[44C57313AFCAC55C]) [    ] o.a.s.c.CoreContainer New CoreContainer 1053271435
   [junit4]   2> 1268819 INFO  (TEST-ShardSplitTest.test-seed#[44C57313AFCAC55C]) [    ] o.a.s.c.CoreContainer Loading cores into CoreContainer [instanceDir=/home/jenkins/workspace/Lucene-Solr-5.x-Linux/solr/build/solr-core/test/J2/temp/solr.cloud.ShardSplitTest_44C57313AFCAC55C-001/control-001]
   [junit4]   2> 1268819 WARN  (TEST-ShardSplitTest.test-seed#[44C57313AFCAC55C]) [    ] o.a.s.c.CoreContainer Couldn't add files from /home/jenkins/workspace/Lucene-Solr-5.x-Linux/solr/build/solr-core/test/J2/temp/solr.cloud.ShardSplitTest_44C57313AFCAC55C-001/control-001/lib to classpath: /home/jenkins/workspace/Lucene-Solr-5.x-Linux/solr/build/solr-core/test/J2/temp/solr.cloud.ShardSplitTest_44C57313AFCAC55C-001/control-001/lib
   [junit4]   2> 1268819 INFO  (TEST-ShardSplitTest.test-seed#[44C57313AFCAC55C]) [    ] o.a.s.h.c.HttpShardHandlerFactory created with socketTimeout : 90000,urlScheme : ,connTimeout : 15000,maxConnectionsPerHost : 20,maxConnections : 10000,corePoolSize : 0,maximumPoolSize : 2147483647,maxThreadIdleTime : 5,sizeOfQueue : -1,fairnessPolicy : false,useRetries : false,
   [junit4]   2> 1268820 INFO  (TEST-ShardSplitTest.test-seed#[44C57313AFCAC55C]) [    ] o.a.s.u.UpdateShardHandler Creating UpdateShardHandler HTTP client with params: socketTimeout=340000&connTimeout=45000&retry=true
   [junit4]   2> 1268820 INFO  (TEST-ShardSplitTest.test-seed#[44C57313AFCAC55C]) [    ] o.a.s.l.LogWatcher SLF4J impl is org.slf4j.impl.Log4jLoggerFactory
   [junit4]   2> 1268820 INFO  (TEST-ShardSplitTest.test-seed#[44C57313AFCAC55C]) [    ] o.a.s.l.LogWatcher Registering Log Listener [Log4j (org.slf4j.impl.Log4jLoggerFactory)]
   [junit4]   2> 1268821 INFO  (TEST-ShardSplitTest.test-seed#[44C57313AFCAC55C]) [    ] o.a.s.c.ZkContainer Zookeeper client=127.0.0.1:57270/solr
   [junit4]   2> 1268821 INFO  (TEST-ShardSplitTest.test-seed#[44C57313AFCAC55C]) [    ] o.a.s.c.ZkController zkHost includes chroot
   [junit4]   2> 1268821 INFO  (TEST-ShardSplitTest.test-seed#[44C57313AFCAC55C]) [    ] o.a.s.c.c.SolrZkClient Using default ZkCredentialsProvider
   [junit4]   2> 1268821 INFO  (TEST-ShardSplitTest.test-seed#[44C57313AFCAC55C]) [    ] o.a.s.c.c.ConnectionManager Waiting for client to connect to ZooKeeper
   [junit4]   2> 1268828 INFO  (zkCallback-1317-thread-1) [    ] o.a.s.c.c.ConnectionManager Watcher org.apache.solr.common.cloud.ConnectionManager@2fbada83 name:ZooKeeperConnection Watcher:127.0.0.1:57270 got event WatchedEvent state:SyncConnected type:None path:null path:null type:None
   [junit4]   2> 1268828 INFO  (TEST-ShardSplitTest.test-seed#[44C57313AFCAC55C]) [    ] o.a.s.c.c.ConnectionManager Client is connected to ZooKeeper
   [junit4]   2> 1268829 INFO  (TEST-ShardSplitTest.test-seed#[44C57313AFCAC55C]) [    ] o.a.s.c.c.SolrZkClient Using default ZkACLProvider
   [junit4]   2> 1268829 INFO  (TEST-ShardSplitTest.test-seed#[44C57313AFCAC55C]) [n:127.0.0.1:58569_lxa    ] o.a.s.c.c.ConnectionManager Waiting for client to connect to ZooKeeper
   [junit4]   2> 1268830 INFO  (zkCallback-1318-thread-1-processing-n:127.0.0.1:58569_lxa) [n:127.0.0.1:58569_lxa    ] o.a.s.c.c.ConnectionManager Watcher org.apache.solr.common.cloud.ConnectionManager@58a94751 name:ZooKeeperConnection Watcher:127.0.0.1:57270/solr got event WatchedEvent state:SyncConnected type:None path:null path:null type:None
   [junit4]   2> 1268830 INFO  (TEST-ShardSplitTest.test-seed#[44C57313AFCAC55C]) [n:127.0.0.1:58569_lxa    ] o.a.s.c.c.ConnectionManager Client is connected to ZooKeeper
   [junit4]   2> 1268831 INFO  (TEST-ShardSplitTest.test-seed#[44C57313AFCAC55C]) [n:127.0.0.1:58569_lxa    ] o.a.s.c.c.SolrZkClient makePath: /overseer/queue
   [junit4]   2> 1268831 INFO  (TEST-ShardSplitTest.test-seed#[44C57313AFCAC55C]) [n:127.0.0.1:58569_lxa    ] o.a.s.c.c.SolrZkClient makePath: /overseer/collection-queue-work
   [junit4]   2> 1268832 INFO  (TEST-ShardSplitTest.test-seed#[44C57313AFCAC55C]) [n:127.0.0.1:58569_lxa    ] o.a.s.c.c.SolrZkClient makePath: /overseer/collection-map-running
   [junit4]   2> 1268833 INFO  (TEST-ShardSplitTest.test-seed#[44C57313AFCAC55C]) [n:127.0.0.1:58569_lxa    ] o.a.s.c.c.SolrZkClient makePath: /overseer/collection-map-completed
   [junit4]   2> 1268833 INFO  (TEST-ShardSplitTest.test-seed#[44C57313AFCAC55C]) [n:127.0.0.1:58569_lxa    ] o.a.s.c.c.SolrZkClient makePath: /overseer/collection-map-failure
   [junit4]   2> 1268834 INFO  (TEST-ShardSplitTest.test-seed#[44C57313AFCAC55C]) [n:127.0.0.1:58569_lxa    ] o.a.s.c.c.SolrZkClient makePath: /live_nodes
   [junit4]   2> 1268834 INFO  (TEST-ShardSplitTest.test-seed#[44C57313AFCAC55C]) [n:127.0.0.1:58569_lxa    ] o.a.s.c.c.SolrZkClient makePath: /aliases.json
   [junit4]   2> 1268835 INFO  (TEST-ShardSplitTest.test-seed#[44C57313AFCAC55C]) [n:127.0.0.1:58569_lxa    ] o.a.s.c.c.SolrZkClient makePath: /clusterstate.json
   [junit4]   2> 1268835 INFO  (TEST-ShardSplitTest.test-seed#[44C57313AFCAC55C]) [n:127.0.0.1:58569_lxa    ] o.a.s.c.c.SolrZkClient makePath: /security.json
   [junit4]   2> 1268835 INFO  (TEST-ShardSplitTest.test-seed#[44C57313AFCAC55C]) [n:127.0.0.1:58569_lxa    ] o.a.s.c.ZkController Register node as live in ZooKeeper:/live_nodes/127.0.0.1:58569_lxa
   [junit4]   2> 1268836 INFO  (TEST-ShardSplitTest.test-seed#[44C57313AFCAC55C]) [n:127.0.0.1:58569_lxa    ] o.a.s.c.c.SolrZkClient makePath: /live_nodes/127.0.0.1:58569_lxa
   [junit4]   2> 1268836 INFO  (TEST-ShardSplitTest.test-seed#[44C57313AFCAC55C]) [n:127.0.0.1:58569_lxa    ] o.a.s.c.c.SolrZkClient makePath: /overseer_elect
   [junit4]   2> 1268836 INFO  (TEST-ShardSplitTest.test-seed#[44C57313AFCAC55C]) [n:127.0.0.1:58569_lxa    ] o.a.s.c.c.SolrZkClient makePath: /overseer_elect/election
   [junit4]   2> 1268837 INFO  (TEST-ShardSplitTest.test-seed#[44C57313AFCAC55C]) [n:127.0.0.1:58569_lxa    ] o.a.s.c.Overseer Overseer (id=null) closing
   [junit4]   2> 1268837 INFO  (TEST-ShardSplitTest.test-seed#[44C57313AFCAC55C]) [n:127.0.0.1:58569_lxa    ] o.a.s.c.LeaderElector Joined leadership election with path: /overseer_elect/election/95174727124975620-127.0.0.1:58569_lxa-n_0000000000
   [junit4]   2> 1268837 INFO  (TEST-ShardSplitTest.test-seed#[44C57313AFCAC55C]) [n:127.0.0.1:58569_lxa    ] o.a.s.c.OverseerElectionContext I am going to be the leader 127.0.0.1:58569_lxa
   [junit4]   2> 1268837 INFO  (TEST-ShardSplitTest.test-seed#[44C57313AFCAC55C]) [n:127.0.0.1:58569_lxa    ] o.a.s.c.c.SolrZkClient makePath: /overseer_elect/leader
   [junit4]   2> 1268837 INFO  (TEST-ShardSplitTest.test-seed#[44C57313AFCAC55C]) [n:127.0.0.1:58569_lxa    ] o.a.s.c.Overseer Overseer (id=95174727124975620-127.0.0.1:58569_lxa-n_0000000000) starting
   [junit4]   2> 1268838 INFO  (TEST-ShardSplitTest.test-seed#[44C57313AFCAC55C]) [n:127.0.0.1:58569_lxa    ] o.a.s.c.c.SolrZkClient makePath: /overseer/queue-work
   [junit4]   2> 1268840 INFO  (TEST-ShardSplitTest.test-seed#[44C57313AFCAC55C]) [n:127.0.0.1:58569_lxa    ] o.a.s.c.OverseerAutoReplicaFailoverThread Starting OverseerAutoReplicaFailoverThread autoReplicaFailoverWorkLoopDelay=10000 autoReplicaFailoverWaitAfterExpiration=30000 autoReplicaFailoverBadNodeExpiration=60000
   [junit4]   2> 1268840 INFO  (OverseerCollectionConfigSetProcessor-95174727124975620-127.0.0.1:58569_lxa-n_0000000000) [n:127.0.0.1:58569_lxa    ] o.a.s.c.OverseerTaskProcessor Process current queue of overseer operations
   [junit4]   2> 1268840 INFO  (TEST-ShardSplitTest.test-seed#[44C57313AFCAC55C]) [n:127.0.0.1:58569_lxa    ] o.a.s.c.c.ZkStateReader Updating cluster state from ZooKeeper... 
   [junit4]   2> 1268841 INFO  (OverseerStateUpdate-95174727124975620-127.0.0.1:58569_lxa-n_0000000000) [n:127.0.0.1:58569_lxa    ] o.a.s.c.Overseer Starting to work on the main queue
   [junit4]   2> 1268858 INFO  (TEST-ShardSplitTest.test-seed#[44C57313AFCAC55C]) [n:127.0.0.1:58569_lxa    ] o.a.s.c.CoreContainer Security conf doesn't exist. Skipping setup for authorization module.
   [junit4]   2> 1268858 INFO  (TEST-ShardSplitTest.test-seed#[44C57313AFCAC55C]) [n:127.0.0.1:58569_lxa    ] o.a.s.c.CoreContainer No authentication plugin used.
   [junit4]   2> 1268858 INFO  (TEST-ShardSplitTest.test-seed#[44C57313AFCAC55C]) [n:127.0.0.1:58569_lxa    ] o.a.s.c.CorePropertiesLocator Looking for core definitions underneath /home/jenkins/workspace/Lucene-Solr-5.x-Linux/solr/build/solr-core/test/J2/temp/solr.cloud.ShardSplitTest_44C57313AFCAC55C-001/control-001/cores
   [junit4]   2> 1268859 INFO  (TEST-ShardSplitTest.test-seed#[44C57313AFCAC55C]) [n:127.0.0.1:58569_lxa    ] o.a.s.c.CoreDescriptor Created CoreDescriptor: {name=collection1, config=solrconfig.xml, transient=false, schema=schema.xml, loadOnStartup=true, configSetProperties=configsetprops.json, collection=control_collection, coreNodeName=, dataDir=data/, shard=}
   [junit4]   2> 1268859 INFO  (TEST-ShardSplitTest.test-seed#[44C57313AFCAC55C]) [n:127.0.0.1:58569_lxa    ] o.a.s.c.CorePropertiesLocator Found core collection1 in /home/jenkins/workspace/Lucene-Solr-5.x-Linux/solr/build/solr-core/test/J2/temp/solr.cloud.ShardSplitTest_44C57313AFCAC55C-001/control-001/cores/collection1
   [junit4]   2> 1268859 INFO  (TEST-ShardSplitTest.test-seed#[44C57313AFCAC55C]) [n:127.0.0.1:58569_lxa    ] o.a.s.c.CorePropertiesLocator Found 1 core definitions
   [junit4]   2> 1268859 INFO  (TEST-ShardSplitTest.test-seed#[44C57313AFCAC55C]) [n:127.0.0.1:58569_lxa    ] o.a.s.s.SolrDispatchFilter user.dir=/home/jenkins/workspace/Lucene-Solr-5.x-Linux/solr/build/solr-core/test/J2
   [junit4]   2> 1268860 INFO  (TEST-ShardSplitTest.test-seed#[44C57313AFCAC55C]) [n:127.0.0.1:58569_lxa    ] o.a.s.s.SolrDispatchFilter SolrDispatchFilter.init() done
   [junit4]   2> 1268860 INFO  (coreLoadExecutor-5225-thread-1-processing-n:127.0.0.1:58569_lxa) [n:127.0.0.1:58569_lxa c:control_collection   x:collection1] o.a.s.c.ZkController publishing state=down
   [junit4]   2> 1268860 INFO  (coreLoadExecutor-5225-thread-1-processing-n:127.0.0.1:58569_lxa) [n:127.0.0.1:58569_lxa c:control_collection   x:collection1] o.a.s.c.ZkController numShards not found on descriptor - reading it from system property
   [junit4]   2> 1268860 INFO  (coreLoadExecutor-5225-thread-1-processing-n:127.0.0.1:58569_lxa) [n:127.0.0.1:58569_lxa c:control_collection   x:collection1] o.a.s.c.ZkController look for our core node name
   [junit4]   2> 1268862 INFO  (OverseerStateUpdate-95174727124975620-127.0.0.1:58569_lxa-n_0000000000) [n:127.0.0.1:58569_lxa    ] o.a.s.c.Overseer processMessage: queueSize: 1, message = {
   [junit4]   2>   "core":"collection1",
   [junit4]   2>   "roles":null,
   [junit4]   2>   "base_url":"http://127.0.0.1:58569/lxa",
   [junit4]   2>   "node_name":"127.0.0.1:58569_lxa",
   [junit4]   2>   "numShards":"1",
   [junit4]   2>   "state":"down",
   [junit4]   2>   "shard":null,
   [junit4]   2>   "collection":"control_collection",
   [junit4]   2>   "operation":"state"} current state version: 0
   [junit4]   2> 1268862 INFO  (OverseerStateUpdate-95174727124975620-127.0.0.1:58569_lxa-n_0000000000) [n:127.0.0.1:58569_lxa    ] o.a.s.c.o.ReplicaMutator Update state numShards=1 message={
   [junit4]   2>   "core":"collection1",
   [junit4]   2>   "roles":null,
   [junit4]   2>   "base_url":"http://127.0.0.1:58569/lxa",
   [junit4]   2>   "node_name":"127.0.0.1:58569_lxa",
   [junit4]   2>   "numShards":"1",
   [junit4]   2>   "state":"down",
   [junit4]   2>   "shard":null,
   [junit4]   2>   "collection":"control_collection",
   [junit4]   2>   "operation":"state"}
   [junit4]   2> 1268863 INFO  (OverseerStateUpdate-95174727124975620-127.0.0.1:58569_lxa-n_0000000000) [n:127.0.0.1:58569_lxa    ] o.a.s.c.o.ClusterStateMutator building a new cName: control_collection
   [junit4]   2> 1268863 INFO  (OverseerStateUpdate-95174727124975620-127.0.0.1:58569_lxa-n_0000000000) [n:127.0.0.1:58569_lxa    ] o.a.s.c.o.ReplicaMutator Assigning new node to shard shard=shard1
   [junit4]   2> 1268876 INFO  (zkCallback-1318-thread-1-processing-n:127.0.0.1:58569_lxa) [n:127.0.0.1:58569_lxa    ] o.a.s.c.c.ZkStateReader A cluster state change: [WatchedEvent state:SyncConnected type:NodeDataChanged path:/clusterstate.json], has occurred - updating... (live nodes size: [1])
   [junit4]   2> 1269861 INFO  (coreLoadExecutor-5225-thread-1-processing-n:127.0.0.1:58569_lxa) [n:127.0.0.1:58569_lxa c:control_collection   x:collection1] o.a.s.c.ZkController waiting to find shard id in clusterstate for collection1
   [junit4]   2> 1269861 INFO  (coreLoadExecutor-5225-thread-1-processing-n:127.0.0.1:58569_lxa) [n:127.0.0.1:58569_lxa c:control_collection   x:collection1] o.a.s.c.ZkController Check for collection zkNode:control_collection
   [junit4]   2> 1269861 INFO  (coreLoadExecutor-5225-thread-1-processing-n:127.0.0.1:58569_lxa) [n:127.0.0.1:58569_lxa c:control_collection   x:collection1] o.a.s.c.ZkController Collection zkNode exists
   [junit4]   2> 1269861 INFO  (coreLoadExecutor-5225-thread-1-processing-n:127.0.0.1:58569_lxa) [n:127.0.0.1:58569_lxa c:control_collection   x:collection1] o.a.s.c.c.ZkStateReader Load collection config from: [/collections/control_collection]
   [junit4]   2> 1269861 INFO  (coreLoadExecutor-5225-thread-1-processing-n:127.0.0.1:58569_lxa) [n:127.0.0.1:58569_lxa c:control_collection   x:collection1] o.a.s.c.c.ZkStateReader path=[/collections/control_collection] [configName]=[conf1] specified config exists in ZooKeeper
   [junit4]   2> 1269861 INFO  (coreLoadExecutor-5225-thread-1-processing-n:127.0.0.1:58569_lxa) [n:127.0.0.1:58569_lxa c:control_collection   x:collection1] o.a.s.c.SolrResourceLoader new SolrResourceLoader for directory: '/home/jenkins/workspace/Lucene-Solr-5.x-Linux/solr/build/solr-core/test/J2/temp/solr.cloud.ShardSplitTest_44C57313AFCAC55C-001/control-001/cores/collection1'
   [junit4]   2> 1269861 INFO  (coreLoadExecutor-5225-thread-1-processing-n:127.0.0.1:58569_lxa) [n:127.0.0.1:58569_lxa c:control_collection   x:collection1] o.a.s.c.SolrResourceLoader JNDI not configured for solr (NoInitialContextEx)
   [junit4]   2> 1269861 INFO  (coreLoadExecutor-5225-thread-1-processing-n:127.0.0.1:58569_lxa) [n:127.0.0.1:58569_lxa c:control_collection   x:collection1] o.a.s.c.SolrResourceLoader solr home defaulted to 'solr/' (could not find system property or JNDI)
   [junit4]   2> 1269862 INFO  (coreLoadExecutor-5225-thread-1-processing-n:127.0.0.1:58569_lxa) [n:127.0.0.1:58569_lxa c:control_collection   x:collection1] o.a.s.c.Config loaded config solrconfig.xml with version 0 
   [junit4]   2> 1269865 INFO  (coreLoadExecutor-5225-thread-1-processing-n:127.0.0.1:58569_lxa) [n:127.0.0.1:58569_lxa c:control_collection   x:collection1] o.a.s.c.SolrConfig current version of requestparams : -1
   [junit4]   2> 1269868 INFO  (coreLoadExecutor-5225-thread-1-processing-n:127.0.0.1:58569_lxa) [n:127.0.0.1:58569_lxa c:control_collection   x:collection1] o.a.s.c.SolrConfig Using Lucene MatchVersion: 5.5.0
   [junit4]   2> 1269874 INFO  (coreLoadExecutor-5225-thread-1-processing-n:127.0.0.1:58569_lxa) [n:127.0.0.1:58569_lxa c:control_collection   x:collection1] o.a.s.c.SolrConfig Loaded SolrConfig: solrconfig.xml
   [junit4]   2> 1269877 INFO  (coreLoadExecutor-5225-thread-1-processing-n:127.0.0.1:58569_lxa) [n:127.0.0.1:58569_lxa c:control_collection   x:collection1] o.a.s.s.IndexSchema [collection1] Schema name=test
   [junit4]   2> 1269938 INFO  (coreLoadExecutor-5225-thread-1-processing-n:127.0.0.1:58569_lxa) [n:127.0.0.1:58569_lxa c:control_collection   x:collection1] o.a.s.s.IndexSchema default search field in schema is text
   [junit4]   2> 1269939 INFO  (coreLoadExecutor-5225-thread-1-processing-n:127.0.0.1:58569_lxa) [n:127.0.0.1:58569_lxa c:control_collection   x:collection1] o.a.s.s.IndexSchema unique key field: id
   [junit4]   2> 1269939 INFO  (coreLoadExecutor-5225-thread-1-processing-n:127.0.0.1:58569_lxa) [n:127.0.0.1:58569_lxa c:control_collection   x:collection1] o.a.s.s.FileExchangeRateProvider Reloading exchange rates from file currency.xml
   [junit4]   2> 1269941 INFO  (coreLoadExecutor-5225-thread-1-processing-n:127.0.0.1:58569_lxa) [n:127.0.0.1:58569_lxa c:control_collection   x:collection1] o.a.s.s.FileExchangeRateProvider Reloading exchange rates from file currency.xml
   [junit4]   2> 1269946 INFO  (coreLoadExecutor-5225-thread-1-processing-n:127.0.0.1:58569_lxa) [n:127.0.0.1:58569_lxa c:control_collection   x:collection1] o.a.s.c.ConfigSetProperties Did not find ConfigSet properties, assuming default properties: Can't find resource 'configsetprops.json' in classpath or '/configs/conf1', cwd=/home/jenkins/workspace/Lucene-Solr-5.x-Linux/solr/build/solr-core/test/J2
   [junit4]   2> 1269946 INFO  (coreLoadExecutor-5225-thread-1-processing-n:127.0.0.1:58569_lxa) [n:127.0.0.1:58569_lxa c:control_collection   x:collection1] o.a.s.c.CoreContainer Creating SolrCore 'collection1' using configuration from collection control_collection
   [junit4]   2> 1269946 INFO  (coreLoadExecutor-5225-thread-1-processing-n:127.0.0.1:58569_lxa) [n:127.0.0.1:58569_lxa c:control_collection s:shard1 r:core_node1 x:collection1] o.a.s.c.SolrCore org.apache.solr.core.MockDirectoryFactory
   [junit4]   2> 1269946 INFO  (coreLoadExecutor-5225-thread-1-processing-n:127.0.0.1:58569_lxa) [n:127.0.0.1:58569_lxa c:control_collection s:shard1 r:core_node1 x:collection1] o.a.s.c.SolrCore [[collection1] ] Opening new SolrCore at [/home/jenkins/workspace/Lucene-Solr-5.x-Linux/solr/build/solr-core/test/J2/temp/solr.cloud.ShardSplitTest_44C57313AFCAC55C-001/control-001/cores/collection1], dataDir=[/home/jenkins/workspace/Lucene-Solr-5.x-Linux/solr/build/solr-core/test/J2/temp/solr.cloud.ShardSplitTest_44C57313AFCAC55C-001/control-001/cores/collection1/data/]
   [junit4]   2> 1269946 INFO  (coreLoadExecutor-5225-thread-1-processing-n:127.0.0.1:58569_lxa) [n:127.0.0.1:58569_lxa c:control_collection s:shard1 r:core_node1 x:collection1] o.a.s.c.JmxMonitoredMap JMX monitoring is enabled. Adding Solr mbeans to JMX Server: com.sun.jmx.mbeanserver.JmxMBeanServer@694fd6dc
   [junit4]   2> 1269947 INFO  (coreLoadExecutor-5225-thread-1-processing-n:127.0.0.1:58569_lxa) [n:127.0.0.1:58569_lxa c:control_collection s:shard1 r:core_node1 x:collection1] o.a.s.c.CachingDirectoryFactory return new directory for /home/jenkins/workspace/Lucene-Solr-5.x-Linux/solr/build/solr-core/test/J2/temp/solr.cloud.ShardSplitTest_44C57313AFCAC55C-001/control-001/cores/collection1/data
   [junit4]   2> 1269947 INFO  (coreLoadExecutor-5225-thread-1-processing-n:127.0.0.1:58569_lxa) [n:127.0.0.1:58569_lxa c:control_collection s:shard1 r:core_node1 x:collection1] o.a.s.c.SolrCore New index directory detected: old=null new=/home/jenkins/workspace/Lucene-Solr-5.x-Linux/solr/build/solr-core/test/J2/temp/solr.cloud.ShardSplitTest_44C57313AFCAC55C-001/control-001/cores/collection1/data/index/
   [junit4]   2> 1269947 WARN  (coreLoadExecutor-5225-thread-1-processing-n:127.0.0.1:58569_lxa) [n:127.0.0.1:58569_lxa c:control_collection s:shard1 r:core_node1 x:collection1] o.a.s.c.SolrCore [collection1] Solr index directory '/home/jenkins/workspace/Lucene-Solr-5.x-Linux/solr/build/solr-core/test/J2/temp/solr.cloud.ShardSplitTest_44C57313AFCAC55C-001/control-001/cores/collection1/data/index' doesn't exist. Creating new index...
   [junit4]   2> 1269947 INFO  (coreLoadExecutor-5225-thread-1-processing-n:127.0.0.1:58569_lxa) [n:127.0.0.1:58569_lxa c:control_collection s:shard1 r:core_node1 x:collection1] o.a.s.c.CachingDirectoryFactory return new directory for /home/jenkins/workspace/Lucene-Solr-5.x-Linux/solr/build/solr-core/test/J2/temp/solr.cloud.ShardSplitTest_44C57313AFCAC55C-001/control-001/cores/collection1/data/index
   [junit4]   2> 1269947 INFO  (coreLoadExecutor-5225-thread-1-processing-n:127.0.0.1:58569_lxa) [n:127.0.0.1:58569_lxa c:control_collection s:shard1 r:core_node1 x:collection1] o.a.s.u.RandomMergePolicy RandomMergePolicy wrapping class org.apache.lucene.index.TieredMergePolicy: [TieredMergePolicy: maxMergeAtOnce=42, maxMergeAtOnceExplicit=47, maxMergedSegmentMB=6.0498046875, floorSegmentMB=1.568359375, forceMergeDeletesPctAllowed=8.21413314615717, segmentsPerTier=26.0, maxCFSSegmentSizeMB=8.796093022207999E12, noCFSRatio=1.0
   [junit4]   2> 1269947 INFO  (coreLoadExecutor-5225-thread-1-processing-n:127.0.0.1:58569_lxa) [n:127.0.0.1:58569_lxa c:control_collection s:shard1 r:core_node1 x:collection1] o.a.s.c.SolrDeletionPolicy SolrDeletionPolicy.onCommit: commits: num=1
   [junit4]   2> 	commit{dir=MockDirectoryWrapper(RAMDirectory@28f677f8 lockFactory=org.apache.lucene.store.SingleInstanceLockFactory@51058c1a),segFN=segments_1,generation=1}
   [junit4]   2> 1269948 INFO  (coreLoadExecutor-5225-thread-1-processing-n:127.0.0.1:58569_lxa) [n:127.0.0.1:58569_lxa c:control_collection s:shard1 r:core_node1 x:collection1] o.a.s.c.SolrDeletionPolicy newest commit generation = 1
   [junit4]   2> 1269948 INFO  (OldIndexDirectoryCleanupThreadForCore-collection1) [n:127.0.0.1:58569_lxa c:control_collection s:shard1 r:core_node1 x:collection1] o.a.s.c.SolrCore Looking for old index directories to cleanup for core collection1 in /home/jenkins/workspace/Lucene-Solr-5.x-Linux/solr/build/solr-core/test/J2/temp/solr.cloud.ShardSplitTest_44C57313AFCAC55C-001/control-001/cores/collection1/data/
   [junit4]   2> 1269948 WARN  (OldIndexDirectoryCleanupThreadForCore-collection1) [n:127.0.0.1:58569_lxa c:control_collection s:shard1 r:core_node1 x:collection1] o.a.s.c.DirectoryFactory /home/jenkins/workspace/Lucene-Solr-5.x-Linux/solr/build/solr-core/test/J2/temp/solr.cloud.ShardSplitTest_44C57313AFCAC55C-001/control-001/cores/collection1/data/ does not point to a valid data directory; skipping clean-up of old index directories.
   [junit4]   2> 1269949 INFO  (coreLoadExecutor-5225-thread-1-processing-n:127.0.0.1:58569_lxa) [n:127.0.0.1:58569_lxa c:control_collection s:shard1 r:core_node1 x:collection1] o.a.s.u.p.UpdateRequestProcessorChain creating updateRequestProcessorChain "nodistrib"
   [junit4]   2> 1269949 INFO  (coreLoadExecutor-5225-thread-1-processing-n:127.0.0.1:58569_lxa) [n:127.0.0.1:58569_lxa c:control_collection s:shard1 r:core_node1 x:collection1] o.a.s.u.p.UpdateRequestProcessorChain creating updateRequestProcessorChain "dedupe"
   [junit4]   2> 1269949 INFO  (coreLoadExecutor-5225-thread-1-processing-n:127.0.0.1:58569_lxa) [n:127.0.0.1:58569_lxa c:control_collection s:shard1 r:core_node1 x:collection1] o.a.s.u.p.UpdateRequestProcessorChain inserting DistributedUpdateProcessorFactory into updateRequestProcessorChain "dedupe"
   [junit4]   2> 1269950 INFO  (coreLoadExecutor-5225-thread-1-processing-n:127.0.0.1:58569_lxa) [n:127.0.0.1:58569_lxa c:control_collection s:shard1 r:core_node1 x:collection1] o.a.s.u.p.UpdateRequestProcessorChain creating updateRequestProcessorChain "stored_sig"
   [junit4]   2> 1269950 INFO  (coreLoadExecutor-5225-thread-1-processing-n:127.0.0.1:58569_lxa) [n:127.0.0.1:58569_lxa c:control_collection s:shard1 r:core_node1 x:collection1] o.a.s.u.p.UpdateRequestProcessorChain inserting DistributedUpdateProcessorFactory into updateRequestProcessorChain "stored_sig"
   [junit4]   2> 1269950 INFO  (coreLoadExecutor-5225-thread-1-processing-n:127.0.0.1:58569_lxa) [n:127.0.0.1:58569_lxa c:control_collection s:shard1 r:core_node1 x:collection1] o.a.s.u.p.UpdateRequestProcessorChain creating updateRequestProcessorChain "distrib-dup-test-chain-explicit"
   [junit4]   2> 1269950 INFO  (coreLoadExecutor-5225-thread-1-processing-n:127.0.0.1:58569_lxa) [n:127.0.0.1:58569_lxa c:control_collection s:shard1 r:core_node1 x:collection1] o.a.s.u.p.UpdateRequestProcessorChain creating updateRequestProcessorChain "distrib-dup-test-chain-implicit"
   [junit4]   2> 1269950 INFO  (coreLoadExecutor-5225-thread-1-processing-n:127.0.0.1:58569_lxa) [n:127.0.0.1:58569_lxa c:control_collection s:shard1 r:core_node1 x:collection1] o.a.s.u.p.UpdateRequestProcessorChain inserting DistributedUpdateProcessorFactory into updateRequestProcessorChain "distrib-dup-test-chain-implicit"
   [junit4]   2> 1269950 INFO  (coreLoadExecutor-5225-thread-1-processing-n:127.0.0.1:58569_lxa) [n:127.0.0.1:58569_lxa c:control_collection s:shard1 r:core_node1 x:collection1] o.a.s.c.SolrCore no updateRequestProcessorChain defined as default, creating implicit default
   [junit4]   2> 1269950 WARN  (coreLoadExecutor-5225-thread-1-processing-n:127.0.0.1:58569_lxa) [n:127.0.0.1:58569_lxa c:control_collection s:shard1 r:core_node1 x:collection1] o.a.s.c.RequestHandlers INVALID paramSet a in requestHandler {type = requestHandler,name = /dump,class = DumpRequestHandler,args = {defaults={a=A,b=B}}}
   [junit4]   2> 1269951 INFO  (coreLoadExecutor-5225-thread-1-processing-n:127.0.0.1:58569_lxa) [n:127.0.0.1:58569_lxa c:control_collection s:shard1 r:core_node1 x:collection1] o.a.s.h.l.XMLLoader xsltCacheLifetimeSeconds=60
   [junit4]   2> 1269952 INFO  (coreLoadExecutor-5225-thread-1-processing-n:127.0.0.1:58569_lxa) [n:127.0.0.1:58569_lxa c:control_collection s:shard1 r:core_node1 x:collection1] o.a.s.h.l.XMLLoader xsltCacheLifetimeSeconds=60
   [junit4]   2> 1269952 INFO  (coreLoadExecutor-5225-thread-1-processing-n:127.0.0.1:58569_lxa) [n:127.0.0.1:58569_lxa c:control_collection s:shard1 r:core_node1 x:collection1] o.a.s.h.l.XMLLoader xsltCacheLifetimeSeconds=60
   [junit4]   2> 1269952 INFO  (coreLoadExecutor-5225-thread-1-processing-n:127.0.0.1:58569_lxa) [n:127.0.0.1:58569_lxa c:control_collection s:shard1 r:core_node1 x:collection1] o.a.s.h.l.XMLLoader xsltCacheLifetimeSeconds=60
   [junit4]   2> 1269954 INFO  (coreLoadExecutor-5225-thread-1-processing-n:127.0.0.1:58569_lxa) [n:127.0.0.1:58569_lxa c:control_collection s:shard1 r:core_node1 x:collection1] o.a.s.c.RequestHandlers Registered paths: /admin/mbeans,standard,/dump,/update/csv,/update/json/docs,/admin/luke,/admin/segments,/get,/admin/system,/replication,/admin/properties,/config,/schema,/admin/plugins,/admin/logging,/update/json,/admin/threads,/admin/ping,/update,/admin/file
   [junit4]   2> 1269954 INFO  (coreLoadExecutor-5225-thread-1-processing-n:127.0.0.1:58569_lxa) [n:127.0.0.1:58569_lxa c:control_collection s:shard1 r:core_node1 x:collection1] o.a.s.c.SolrCore Using default statsCache cache: org.apache.solr.search.stats.LocalStatsCache
   [junit4]   2> 1269955 INFO  (coreLoadExecutor-5225-thread-1-processing-n:127.0.0.1:58569_lxa) [n:127.0.0.1:58569_lxa c:control_collection s:shard1 r:core_node1 x:collection1] o.a.s.u.UpdateHandler Using UpdateLog implementation: org.apache.solr.update.UpdateLog
   [junit4]   2> 1269955 INFO  (coreLoadExecutor-5225-thread-1-processing-n:127.0.0.1:58569_lxa) [n:127.0.0.1:58569_lxa c:control_collection s:shard1 r:core_node1 x:collection1] o.a.s.u.UpdateLog Initializing UpdateLog: dataDir= defaultSyncLevel=FLUSH numRecordsToKeep=100 maxNumLogsToKeep=10 numVersionBuckets=65536
   [junit4]   2> 1269966 INFO  (coreLoadExecutor-5225-thread-1-processing-n:127.0.0.1:58569_lxa) [n:127.0.0.1:58569_lxa c:control_collection s:shard1 r:core_node1 x:collection1] o.a.s.u.CommitTracker Hard AutoCommit: disabled
   [junit4]   2> 1269966 INFO  (coreLoadExecutor-5225-thread-1-processing-n:127.0.0.1:58569_lxa) [n:127.0.0.1:58569_lxa c:control_collection s:shard1 r:core_node1 x:collection1] o.a.s.u.CommitTracker Soft AutoCommit: disabled
   [junit4]   2> 1269966 INFO  (coreLoadExecutor-5225-thread-1-processing-n:127.0.0.1:58569_lxa) [n:127.0.0.1:58569_lxa c:control_collection s:shard1 r:core_node1 x:collection1] o.a.s.u.RandomMergePolicy RandomMergePolicy wrapping class org.apache.lucene.index.TieredMergePolicy: [TieredMergePolicy: maxMergeAtOnce=23, maxMergeAtOnceExplicit=30, maxMergedSegmentMB=82.6318359375, floorSegmentMB=2.0078125, forceMergeDeletesPctAllowed=2.109460029748136, segmentsPerTier=26.0, maxCFSSegmentSizeMB=8.796093022207999E12, noCFSRatio=0.0
   [junit4]   2> 1269966 INFO  (coreLoadExecutor-5225-thread-1-processing-n:127.0.0.1:58569_lxa) [n:127.0.0.1:58569_lxa c:control_collection s:shard1 r:core_node1 x:collection1] o.a.s.c.SolrDeletionPolicy SolrDeletionPolicy.onInit: commits: num=1
   [junit4]   2> 	commit{dir=MockDirectoryWrapper(RAMDirectory@28f677f8 lockFactory=org.apache.lucene.store.SingleInstanceLockFactory@51058c1a),segFN=segments_1,generation=1}
   [junit4]   2> 1269966 INFO  (coreLoadExecutor-5225-thread-1-processing-n:127.0.0.1:58569_lxa) [n:127.0.0.1:58569_lxa c:control_collection s:shard1 r:core_node1 x:collection1] o.a.s.c.SolrDeletionPolicy newest commit generation = 1
   [junit4]   2> 1269966 INFO  (coreLoadExecutor-5225-thread-1-processing-n:127.0.0.1:58569_lxa) [n:127.0.0.1:58569_lxa c:control_collection s:shard1 r:core_node1 x:collection1] o.a.s.s.SolrIndexSearcher Opening Searcher@38f60cc[collection1] main
   [junit4]   2> 1269966 INFO  (coreLoadExecutor-5225-thread-1-processing-n:127.0.0.1:58569_lxa) [n:127.0.0.1:58569_lxa c:control_collection s:shard1 r:core_node1 x:collection1] o.a.s.c.c.ZkStateReader Load collection config from: [/collections/control_collection]
   [junit4]   2> 1269967 INFO  (coreLoadExecutor-5225-thread-1-processing-n:127.0.0.1:58569_lxa) [n:127.0.0.1:58569_lxa c:control_collection s:shard1 r:core_node1 x:collection1] o.a.s.c.c.ZkStateReader path=[/collections/control_collection] [configName]=[conf1] specified config exists in ZooKeeper
   [junit4]   2> 1269967 INFO  (coreLoadExecutor-5225-thread-1-processing-n:127.0.0.1:58569_lxa) [n:127.0.0.1:58569_lxa c:control_collection s:shard1 r:core_node1 x:collection1] o.a.s.r.ManagedResourceStorage Setting up ZooKeeper-based storage for the RestManager with znodeBase: /configs/conf1
   [junit4]   2> 1269967 INFO  (coreLoadExecutor-5225-thread-1-processing-n:127.0.0.1:58569_lxa) [n:127.0.0.1:58569_lxa c:control_collection s:shard1 r:core_node1 x:collection1] o.a.s.r.ManagedResourceStorage Configured ZooKeeperStorageIO with znodeBase: /configs/conf1
   [junit4]   2> 1269967 INFO  (coreLoadExecutor-5225-thread-1-processing-n:127.0.0.1:58569_lxa) [n:127.0.0.1:58569_lxa c:control_collection s:shard1 r:core_node1 x:collection1] o.a.s.r.RestManager Initializing RestManager with initArgs: {}
   [junit4]   2> 1269967 INFO  (coreLoadExecutor-5225-thread-1-processing-n:127.0.0.1:58569_lxa) [n:127.0.0.1:58569_lxa c:control_collection s:shard1 r:core_node1 x:collection1] o.a.s.r.ManagedResourceStorage Reading _rest_managed.json using ZooKeeperStorageIO:path=/configs/conf1
   [junit4]   2> 1269967 INFO  (coreLoadExecutor-5225-thread-1-processing-n:127.0.0.1:58569_lxa) [n:127.0.0.1:58569_lxa c:control_collection s:shard1 r:core_node1 x:collection1] o.a.s.r.ManagedResourceStorage No data found for znode /configs/conf1/_rest_managed.json
   [junit4]   2> 1269967 INFO  (coreLoadExecutor-5225-thread-1-processing-n:127.0.0.1:58569_lxa) [n:127.0.0.1:58569_lxa c:control_collection s:shard1 r:core_node1 x:collection1] o.a.s.r.ManagedResourceStorage Loaded null at path _rest_managed.json using ZooKeeperStorageIO:path=/configs/conf1
   [junit4]   2> 1269967 INFO  (coreLoadExecutor-5225-thread-1-processing-n:127.0.0.1:58569_lxa) [n:127.0.0.1:58569_lxa c:control_collection s:shard1 r:core_node1 x:collection1] o.a.s.r.RestManager Initializing 0 registered ManagedResources
   [junit4]   2> 1269967 INFO  (coreLoadExecutor-5225-thread-1-processing-n:127.0.0.1:58569_lxa) [n:127.0.0.1:58569_lxa c:control_collection s:shard1 r:core_node1 x:collection1] o.a.s.h.ReplicationHandler Commits will be reserved for  10000
   [junit4]   2> 1269968 INFO  (searcherExecutor-5226-thread-1-processing-n:127.0.0.1:58569_lxa x:collection1 s:shard1 c:control_collection r:core_node1) [n:127.0.0.1:58569_lxa c:control_collection s:shard1 r:core_node1 x:collection1] o.a.s.c.SolrCore [collection1] Registered new searcher Searcher@38f60cc[collection1] main{ExitableDirectoryReader(UninvertingDirectoryReader())}
   [junit4]   2> 1269968 INFO  (coreLoadExecutor-5225-thread-1-processing-n:127.0.0.1:58569_lxa) [n:127.0.0.1:58569_lxa c:control_collection s:shard1 r:core_node1 x:collection1] o.a.s.u.UpdateLog Looking up max value of version field to seed version buckets
   [junit4]   2> 1269968 INFO  (coreLoadExecutor-5225-thread-1-processing-n:127.0.0.1:58569_lxa) [n:127.0.0.1:58569_lxa c:control_collection s:shard1 r:core_node1 x:collection1] o.a.s.u.VersionInfo Refreshing highest value of _version_ for 65536 version buckets from index
   [junit4]   2> 1269968 INFO  (coreLoadExecutor-5225-thread-1-processing-n:127.0.0.1:58569_lxa) [n:127.0.0.1:58569_lxa c:control_collection s:shard1 r:core_node1 x:collection1] o.a.s.u.VersionInfo No terms found for _version_, cannot seed version bucket highest value from index
   [junit4]   2> 1269968 INFO  (coreLoadExecutor-5225-thread-1-processing-n:127.0.0.1:58569_lxa) [n:127.0.0.1:58569_lxa c:control_collection s:shard1 r:core_node1 x:collection1] o.a.s.u.UpdateLog Could not find max version in index or recent updates, using new clock 1522795635438256128
   [junit4]   2> 1269970 INFO  (coreLoadExecutor-5225-thread-1-processing-n:127.0.0.1:58569_lxa) [n:127.0.0.1:58569_lxa c:control_collection s:shard1 r:core_node1 x:collection1] o.a.s.u.UpdateLog Took 1.0ms to seed version buckets with highest version 1522795635438256128
   [junit4]   2> 1269970 INFO  (coreLoadExecutor-5225-thread-1-processing-n:127.0.0.1:58569_lxa) [n:127.0.0.1:58569_lxa c:control_collection s:shard1 r:core_node1 x:collection1] o.a.s.c.ZkController watch zkdir /configs/conf1
   [junit4]   2> 1269970 INFO  (coreLoadExecutor-5225-thread-1-processing-n:127.0.0.1:58569_lxa) [n:127.0.0.1:58569_lxa c:control_collection s:shard1 r:core_node1 x:collection1] o.a.s.c.CoreContainer registering core: collection1
   [junit4]   2> 1269970 INFO  (coreZkRegister-5219-thread-1-processing-n:127.0.0.1:58569_lxa x:collection1 s:shard1 c:control_collection r:core_node1) [n:127.0.0.1:58569_lxa c:control_collection s:shard1 r:core_node1 x:collection1] o.a.s.c.ZkController Register replica - core:collection1 address:http://127.0.0.1:58569/lxa collection:control_collection shard:shard1
   [junit4]   2> 1269971 INFO  (coreZkRegister-5219-thread-1-processing-n:127.0.0.1:58569_lxa x:collection1 s:shard1 c:control_collection r:core_node1) [n:127.0.0.1:58569_lxa c:control_collection s:shard1 r:core_node1 x:collection1] o.a.s.c.c.SolrZkClient makePath: /collections/control_collection/leader_elect/shard1/election
   [junit4]   2> 1269972 INFO  (coreZkRegister-5219-thread-1-processing-n:127.0.0.1:58569_lxa x:collection1 s:shard1 c:control_collection r:core_node1) [n:127.0.0.1:58569_lxa c:control_collection s:shard1 r:core_node1 x:collection1] o.a.s.c.LeaderElector Joined leadership election with path: /collections/control_collection/leader_elect/shard1/election/95174727124975620-core_node1-n_0000000000
   [junit4]   2> 1269972 INFO  (coreZkRegister-5219-thread-1-processing-n:127.0.0.1:58569_lxa x:collection1 s:shard1 c:control_collection r:core_node1) [n:127.0.0.1:58569_lxa c:control_collection s:shard1 r:core_node1 x:collection1] o.a.s.c.ShardLeaderElectionContext Running the leader process for shard=shard1 and weAreReplacement=false and leaderVoteWait=10000
   [junit4]   2> 1269973 INFO  (coreZkRegister-5219-thread-1-processing-n:127.0.0.1:58569_lxa x:collection1 s:shard1 c:control_collection r:core_node1) [n:127.0.0.1:58569_lxa c:control_collection s:shard1 r:core_node1 x:collection1] o.a.s.c.ShardLeaderElectionContext Enough replicas found to continue.
   [junit4]   2> 1269973 INFO  (coreZkRegister-5219-thread-1-processing-n:127.0.0.1:58569_lxa x:collection1 s:shard1 c:control_collection r:core_node1) [n:127.0.0.1:58569_lxa c:control_collection s:shard1 r:core_node1 x:collection1] o.a.s.c.ShardLeaderElectionContext I may be the new leader - try and sync
   [junit4]   2> 1269973 INFO  (coreZkRegister-5219-thread-1-processing-n:127.0.0.1:58569_lxa x:collection1 s:shard1 c:control_collection r:core_node1) [n:127.0.0.1:58569_lxa c:control_collection s:shard1 r:core_node1 x:collection1] o.a.s.c.SyncStrategy Sync replicas to http://127.0.0.1:58569/lxa/collection1/
   [junit4]   2> 1269973 INFO  (OverseerStateUpdate-95174727124975620-127.0.0.1:58569_lxa-n_0000000000) [n:127.0.0.1:58569_lxa    ] o.a.s.c.Overseer processMessage: queueSize: 1, message = {
   [junit4]   2>   "operation":"leader",
   [junit4]   2>   "shard":"shard1",
   [junit4]   2>   "collection":"control_collection"} current state version: 1
   [junit4]   2> 1269973 INFO  (coreZkRegister-5219-thread-1-processing-n:127.0.0.1:58569_lxa x:collection1 s:shard1 c:control_collection r:core_node1) [n:127.0.0.1:58569_lxa c:control_collection s:shard1 r:core_node1 x:collection1] o.a.s.c.SyncStrategy Sync Success - now sync replicas to me
   [junit4]   2> 1269973 INFO  (coreZkRegister-5219-thread-1-processing-n:127.0.0.1:58569_lxa x:collection1 s:shard1 c:control_collection r:core_node1) [n:127.0.0.1:58569_lxa c:control_collection s:shard1 r:core_node1 x:collection1] o.a.s.c.SyncStrategy http://127.0.0.1:58569/lxa/collection1/ has no replicas
   [junit4]   2> 1269973 INFO  (coreZkRegister-5219-thread-1-processing-n:127.0.0.1:58569_lxa x:collection1 s:shard1 c:control_collection r:core_node1) [n:127.0.0.1:58569_lxa c:control_collection s:shard1 r:core_node1 x:collection1] o.a.s.c.c.SolrZkClient makePath: /collections/control_collection/leaders/shard1
   [junit4]   2> 1269974 INFO  (coreZkRegister-5219-thread-1-processing-n:127.0.0.1:58569_lxa x:collection1 s:shard1 c:control_collection r:core_node1) [n:127.0.0.1:58569_lxa c:control_collection s:shard1 r:core_node1 x:collection1] o.a.s.c.ShardLeaderElectionContextBase Creating leader registration node
   [junit4]   2> 1269975 INFO  (coreZkRegister-5219-thread-1-processing-n:127.0.0.1:58569_lxa x:collection1 s:shard1 c:control_collection r:core_node1) [n:127.0.0.1:58569_lxa c:control_collection s:shard1 r:core_node1 x:collection1] o.a.s.c.ShardLeaderElectionContext I am the new leader: http://127.0.0.1:58569/lxa/collection1/ shard1
   [junit4]   2> 1269975 INFO  (OverseerStateUpdate-95174727124975620-127.0.0.1:58569_lxa-n_0000000000) [n:127.0.0.1:58569_lxa    ] o.a.s.c.Overseer processMessage: queueSize: 1, message = {
   [junit4]   2>   "operation":"leader",
   [junit4]   2>   "shard":"shard1",
   [junit4]   2>   "collection":"control_collection",
   [junit4]   2>   "base_url":"http://127.0.0.1:58569/lxa",
   [junit4]   2>   "core":"collection1",
   [junit4]   2>   "state":"active"} current state version: 1
   [junit4]   2> 1270076 INFO  (zkCallback-1318-thread-2-processing-n:127.0.0.1:58569_lxa) [n:127.0.0.1:58569_lxa    ] o.a.s.c.c.ZkStateReader A cluster state change: [WatchedEvent state:SyncConnected type:NodeDataChanged path:/clusterstate.json], has occurred - updating... (live nodes size: [1])
   [junit4]   2> 1270125 INFO  (coreZkRegister-5219-thread-1-processing-n:127.0.0.1:58569_lxa x:collection1 s:shard1 c:control_collection r:core_node1) [n:127.0.0.1:58569_lxa c:control_collection s:shard1 r:core_node1 x:collection1] o.a.s.c.ZkController We are http://127.0.0.1:58569/lxa/collection1/ and leader is http://127.0.0.1:58569/lxa/collection1/
   [junit4]   2> 1270125 INFO  (coreZkRegister-5219-thread-1-processing-n:127.0.0.1:58569_lxa x:collection1 s:shard1 c:control_collection r:core_node1) [n:127.0.0.1:58569_lxa c:control_collection s:shard1 r:core_node1 x:collection1] o.a.s.c.ZkController No LogReplay needed for core=collection1 baseURL=http://127.0.0.1:58569/lxa
   [junit4]   2> 1270125 INFO  (coreZkRegister-5219-thread-1-processing-n:127.0.0.1:58569_lxa x:collection1 s:shard1 c:control_collection r:core_node1) [n:127.0.0.1:58569_lxa c:control_collection s:shard1 r:core_node1 x:collection1] o.a.s.c.ZkController I am the leader, no recovery necessary
   [junit4]   2> 1270125 INFO  (coreZkRegister-5219-thread-1-processing-n:127.0.0.1:58569_lxa x:collection1 s:shard1 c:control_collection r:core_node1) [n:127.0.0.1:58569_lxa c:control_collection s:shard1 r:core_node1 x:collection1] o.a.s.c.ZkController publishing state=active
   [junit4]   2> 1270125 INFO  (coreZkRegister-5219-thread-1-processing-n:127.0.0.1:58569_lxa x:collection1 s:shard1 c:control_collection r:core_node1) [n:127.0.0.1:58569_lxa c:control_collection s:shard1 r:core_node1 x:collection1] o.a.s.c.ZkController numShards not found on descriptor - reading it from system property
   [junit4]   2> 1270127 INFO  (OverseerStateUpdate-95174727124975620-127.0.0.1:58569_lxa-n_0000000000) [n:127.0.0.1:58569_lxa    ] o.a.s.c.Overseer processMessage: queueSize: 1, message = {
   [junit4]   2>   "core":"collection1",
   [junit4]   2>   "core_node_name":"core_node1",
   [junit4]   2>   "roles":null,
   [junit4]   2>   "base_url":"http://127.0.0.1:58569/lxa",
   [junit4]   2>   "node_name":"127.0.0.1:58569_lxa",
   [junit4]   2>   "numShards":"1",
   [junit4]   2>   "state":"active",
   [junit4]   2>   "shard":"shard1",
   [junit4]   2>   "collection":"control_collection",
   [junit4]   2>   "operation":"state"} current state version: 2
   [junit4]   2> 1270127 INFO  (OverseerStateUpdate-95174727124975620-127.0.0.1:58569_lxa-n_0000000000) [n:127.0.0.1:58569_lxa    ] o.a.s.c.o.ReplicaMutator Update state numShards=1 message={
   [junit4]   2>   "core":"collection1",
   [junit4]   2>   "core_node_name":"core_node1",
   [junit4]   2>   "roles":null,
   [junit4]   2>   "base_url":"http://127.0.0.1:58569/lxa",
   [junit4]   2>   "node_name":"127.0.0.1:58569_lxa",
   [junit4]   2>   "numShards":"1",
   [junit4]   2>   "state":"active",
   [junit4]   2>   "shard":"shard1",
   [junit4]   2>   "collection":"control_collection",
   [junit4]   2>   "operation":"state"}
   [junit4]   2> 1270228 INFO  (zkCallback-1318-thread-2-processing-n:127.0.0.1:58569_lxa) [n:127.0.0.1:58569_lxa    ] o.a.s.c.c.ZkStateReader A cluster state change: [WatchedEvent state:SyncConnected type:NodeDataChanged path:/clusterstate.json], has occurred - updating... (live nodes size: [1])
   [junit4]   2> 1270361 INFO  (TEST-ShardSplitTest.test-seed#[44C57313AFCAC55C]) [    ] o.a.s.c.c.SolrZkClient Using default ZkCredentialsProvider
   [junit4]   2> 1270361 INFO  (TEST-ShardSplitTest.test-seed#[44C57313AFCAC55C]) [    ] o.a.s.c.c.ConnectionManager Waiting for client to connect to ZooKeeper
   [junit4]   2> 1270362 INFO  (zkCallback-1320-thread-1) [    ] o.a.s.c.c.ConnectionManager Watcher org.apache.solr.common.cloud.ConnectionManager@4c77513a name:ZooKeeperConnection Watcher:127.0.0.1:57270/solr got event WatchedEvent state:SyncConnected type:None path:null path:null type:None
   [junit4]   2> 1270362 INFO  (TEST-ShardSplitTest.test-seed#[44C57313AFCAC55C]) [    ] o.a.s.c.c.ConnectionManager Client is connected to ZooKeeper
   [junit4]   2> 1270363 INFO  (TEST-ShardSplitTest.test-seed#[44C57313AFCAC55C]) [    ] o.a.s.c.c.SolrZkClient Using default ZkACLProvider
   [junit4]   2> 1270363 INFO  (TEST-ShardSplitTest.test-seed#[44C57313AFCAC55C]) [    ] o.a.s.c.c.ZkStateReader Updating cluster state from ZooKeeper... 
   [junit4]   2> 1270363 INFO  (TEST-ShardSplitTest.test-seed#[44C57313AFCAC55C]) [    ] o.a.s.c.ChaosMonkey monkey: init - expire sessions:false cause connection loss:false
   [junit4]   2> 1270363 INFO  (TEST-ShardSplitTest.test-seed#[44C57313AFCAC55C]) [    ] o.a.s.c.AbstractFullDistribZkTestBase Creating collection1 with stateFormat=2
   [junit4]   2> 1270364 INFO  (TEST-ShardSplitTest.test-seed#[44C57313AFCAC55C]) [    ] o.a.s.c.c.SolrZkClient Using default ZkCredentialsProvider
   [junit4]   2> 1270364 INFO  (TEST-ShardSplitTest.test-seed#[44C57313AFCAC55C]) [    ] o.a.s.c.c.ConnectionManager Waiting for client to connect to ZooKeeper
   [junit4]   2> 1270364 INFO  (zkCallback-1321-thread-1) [    ] o.a.s.c.c.ConnectionManager Watcher org.apache.solr.common.cloud.ConnectionManager@2b6409b6 name:ZooKeeperConnection Watcher:127.0.0.1:57270/solr got event WatchedEvent state:SyncConnected type:None path:null path:null type:None
   [junit4]   2> 1270364 INFO  (TEST-ShardSplitTest.test-seed#[44C57313AFCAC55C]) [    ] o.a.s.c.c.ConnectionManager Client is connected to ZooKeeper
   [junit4]   2> 1270364 INFO  (TEST-ShardSplitTest.test-seed#[44C57313AFCAC55C]) [    ] o.a.s.c.c.SolrZkClient Using default ZkACLProvider
   [junit4]   2> 1270365 INFO  (OverseerStateUpdate-95174727124975620-127.0.0.1:58569_lxa-n_0000000000) [n:127.0.0.1:58569_lxa    ] o.a.s.c.Overseer processMessage: queueSize: 1, message = {
   [junit4]   2>   "operation":"create",
   [junit4]   2>   "name":"collection1",
   [junit4]   2>   "numShards":"2",
   [junit4]   2>   "stateFormat":"2"} current state version: 3
   [junit4]   2> 1270365 INFO  (OverseerStateUpdate-95174727124975620-127.0.0.1:58569_lxa-n_0000000000) [n:127.0.0.1:58569_lxa    ] o.a.s.c.o.ClusterStateMutator building a new cName: collection1
   [junit4]   2> 1270466 INFO  (OverseerStateUpdate-95174727124975620-127.0.0.1:58569_lxa-n_0000000000) [n:127.0.0.1:58569_lxa    ] o.a.s.c.o.ZkStateWriter going to create_collection /collections/collection1/state.json
   [junit4]   2> 1270482 INFO  (TEST-ShardSplitTest.test-seed#[44C57313AFCAC55C]) [    ] o.a.s.SolrTestCaseJ4 Writing core.properties file to /home/jenkins/workspace/Lucene-Solr-5.x-Linux/solr/build/solr-core/test/J2/temp/solr.cloud.ShardSplitTest_44C57313AFCAC55C-001/shard-1-001/cores/collection1
   [junit4]   2> 1270483 INFO  (TEST-ShardSplitTest.test-seed#[44C57313AFCAC55C]) [    ] o.a.s.c.AbstractFullDistribZkTestBase create jetty 1 in directory /home/jenkins/workspace/Lucene-Solr-5.x-Linux/solr/build/solr-core/test/J2/temp/solr.cloud.ShardSplitTest_44C57313AFCAC55C-001/shard-1-001
   [junit4]   2> 1270483 INFO  (TEST-ShardSplitTest.test-seed#[44C57313AFCAC55C]) [    ] o.e.j.s.Server jetty-9.2.13.v20150730
   [junit4]   2> 1270484 INFO  (TEST-ShardSplitTest.test-seed#[44C57313AFCAC55C]) [    ] o.e.j.s.h.ContextHandler Started o.e.j.s.ServletContextHandler@36e2fb1e{/lxa,null,AVAILABLE}
   [junit4]   2> 1270484 INFO  (TEST-ShardSplitTest.test-seed#[44C57313AFCAC55C]) [    ] o.e.j.s.ServerConnector Started ServerConnector@365860e3{HTTP/1.1}{127.0.0.1:38505}
   [junit4]   2> 1270484 INFO  (TEST-ShardSplitTest.test-seed#[44C57313AFCAC55C]) [    ] o.e.j.s.Server Started @1272168ms
   [junit4]   2> 1270484 INFO  (TEST-ShardSplitTest.test-seed#[44C57313AFCAC55C]) [    ] o.a.s.c.s.e.JettySolrRunner Jetty properties: {solr.data.dir=/home/jenkins/workspace/Lucene-Solr-5.x-Linux/solr/build/solr-core/test/J2/temp/solr.cloud.ShardSplitTest_44C57313AFCAC55C-001/tempDir-001/jetty1, solrconfig=solrconfig.xml, hostContext=/lxa, hostPort=38505, coreRootDirectory=/home/jenkins/workspace/Lucene-Solr-5.x-Linux/solr/build/solr-core/test/J2/../../../../../../../../../home/jenkins/workspace/Lucene-Solr-5.x-Linux/solr/build/solr-core/test/J2/temp/solr.cloud.ShardSplitTest_44C57313AFCAC55C-001/shard-1-001/cores}
   [junit4]   2> 1270484 INFO  (TEST-ShardSplitTest.test-seed#[44C57313AFCAC55C]) [    ] o.a.s.s.SolrDispatchFilter SolrDispatchFilter.init(): sun.misc.Launcher$AppClassLoader@4e0e2f2a
   [junit4]   2> 1270485 INFO  (TEST-ShardSplitTest.test-seed#[44C57313AFCAC55C]) [    ] o.a.s.c.SolrResourceLoader new SolrResourceLoader for directory: '/home/jenkins/workspace/Lucene-Solr-5.x-Linux/solr/build/solr-core/test/J2/temp/solr.cloud.ShardSplitTest_44C57313AFCAC55C-001/shard-1-001'
   [junit4]   2> 1270485 INFO  (TEST-ShardSplitTest.test-seed#[44C57313AFCAC55C]) [    ] o.a.s.c.SolrResourceLoader JNDI not configured for solr (NoInitialContextEx)
   [junit4]   2> 1270485 INFO  (TEST-ShardSplitTest.test-seed#[44C57313AFCAC55C]) [    ] o.a.s.c.SolrResourceLoader solr home defaulted to 'solr/' (could not find system property or JNDI)
   [junit4]   2> 1270485 INFO  (TEST-ShardSplitTest.test-seed#[44C57313AFCAC55C]) [    ] o.a.s.c.c.SolrZkClient Using default ZkCredentialsProvider
   [junit4]   2> 1270485 INFO  (TEST-ShardSplitTest.test-seed#[44C57313AFCAC55C]) [    ] o.a.s.c.c.ConnectionManager Waiting for client to connect to ZooKeeper
   [junit4]   2> 1270486 INFO  (zkCallback-1322-thread-1) [    ] o.a.s.c.c.ConnectionManager Watcher org.apache.solr.common.cloud.ConnectionManager@18f7ccb4 name:ZooKeeperConnection Watcher:127.0.0.1:57270/solr got event WatchedEvent state:SyncConnected type:None path:null path:null type:None
   [junit4]   2> 1270486 INFO  (TEST-ShardSplitTest.test-seed#[44C57313AFCAC55C]) [    ] o.a.s.c.c.ConnectionManager Client is connected to ZooKeeper
   [junit4]   2> 1270486 INFO  (TEST-ShardSplitTest.test-seed#[44C57313AFCAC55C]) [    ] o.a.s.c.c.SolrZkClient Using default ZkACLProvider
   [junit4]   2> 1270504 INFO  (TEST-ShardSplitTest.test-seed#[44C57313AFCAC55C]) [    ] o.a.s.s.SolrDispatchFilter Loading solr.xml from SolrHome (not found in ZooKeeper)
   [junit4]   2> 1270504 INFO  (TEST-ShardSplitTest.test-seed#[44C57313AFCAC55C]) [    ] o.a.s.c.SolrXmlConfig Loading container configuration from /home/jenkins/workspace/Lucene-Solr-5.x-Linux/solr/build/solr-core/test/J2/temp/solr.cloud.ShardSplitTest_44C57313AFCAC55C-001/shard-1-001/solr.xml
   [junit4]   2> 1270507 INFO  (TEST-ShardSplitTest.test-seed#[44C57313AFCAC55C]) [    ] o.a.s.c.CorePropertiesLocator Config-defined core root directory: /home/jenkins/workspace/Lucene-Solr-5.x-Linux/solr/build/solr-core/test/J2/../../../../../../../../../home/jenkins/workspace/Lucene-Solr-5.x-Linux/solr/build/solr-core/test/J2/temp/solr.cloud.ShardSplitTest_44C57313AFCAC55C-001/shard-1-001/cores
   [junit4]   2> 1270507 INFO  (TEST-ShardSplitTest.test-seed#[44C57313AFCAC55C]) [    ] o.a.s.c.CoreContainer New CoreContainer 450285139
   [junit4]   2> 1270507 INFO  (TEST-ShardSplitTest.test-seed#[44C57313AFCAC55C]) [    ] o.a.s.c.CoreContainer Loading cores into CoreContainer [instanceDir=/home/jenkins/workspace/Lucene-Solr-5.x-Linux/solr/build/solr-core/test/J2/temp/solr.cloud.ShardSplitTest_44C57313AFCAC55C-001/shard-1-001]
   [junit4]   2> 1270507 WARN  (TEST-ShardSplitTest.test-seed#[44C57313AFCAC55C]) [    ] o.a.s.c.CoreContainer Couldn't add files from /home/jenkins/workspace/Lucene-Solr-5.x-Linux/solr/build/solr-core/test/J2/temp/solr.cloud.ShardSplitTest_44C57313AFCAC55C-001/shard-1-001/lib to classpath: /home/jenkins/workspace/Lucene-Solr-5.x-Linux/solr/build/solr-core/test/J2/temp/solr.cloud.ShardSplitTest_44C57313AFCAC55C-001/shard-1-001/lib
   [junit4]   2> 1270508 INFO  (TEST-ShardSplitTest.test-seed#[44C57313AFCAC55C]) [    ] o.a.s.h.c.HttpShardHandlerFactory created with socketTimeout : 90000,urlScheme : ,connTimeout : 15000,maxConnectionsPerHost : 20,maxConnections : 10000,corePoolSize : 0,maximumPoolSize : 2147483647,maxThreadIdleTime : 5,sizeOfQueue : -1,fairnessPolicy : false,useRetries : false,
   [junit4]   2> 1270508 INFO  (TEST-ShardSplitTest.test-seed#[44C57313AFCAC55C]) [    ] o.a.s.u.UpdateShardHandler Creating UpdateShardHandler HTTP client with params: socketTimeout=340000&connTimeout=45000&retry=true
   [junit4]   2> 1270509 INFO  (TEST-ShardSplitTest.test-seed#[44C57313AFCAC55C]) [    ] o.a.s.l.LogWatcher SLF4J impl is org.slf4j.impl.Log4jLoggerFactory
   [junit4]   2> 1270509 INFO  (TEST-ShardSplitTest.test-seed#[44C57313AFCAC55C]) [    ] o.a.s.l.LogWatcher Registering Log Listener [Log4j (org.slf4j.impl.Log4jLoggerFactory)]
   [junit4]   2> 1270509 INFO  (TEST-ShardSplitTest.test-seed#[44C57313AFCAC55C]) [    ] o.a.s.c.ZkContainer Zookeeper client=127.0.0.1:57270/solr
   [junit4]   2> 1270509 INFO  (TEST-ShardSplitTest.test-seed#[44C57313AFCAC55C]) [    ] o.a.s.c.ZkController zkHost includes chroot
   [junit4]   2> 1270509 INFO  (TEST-ShardSplitTest.test-seed#[44C57313AFCAC55C]) [    ] o.a.s.c.c.SolrZkClient Using default ZkCredentialsProvider
   [junit4]   2> 1270509 INFO  (TEST-ShardSplitTest.test-seed#[44C57313AFCAC55C]) [    ] o.a.s.c.c.ConnectionManager Waiting for client to connect to ZooKeeper
   [junit4]   2> 1270510 INFO  (zkCallback-1324-thread-1) [    ] o.a.s.c.c.ConnectionManager Watcher org.apache.solr.common.cloud.ConnectionManager@7b995d35 name:ZooKeeperConnection Watcher:127.0.0.1:57270 got event WatchedEvent state:SyncConnected type:None path:null path:null type:None
   [junit4]   2> 1270511 INFO  (TEST-ShardSplitTest.test-seed#[44C57313AFCAC55C]) [    ] o.a.s.c.c.ConnectionManager Client is connected to ZooKeeper
   [junit4]   2> 1270511 INFO  (TEST-ShardSplitTest.test-seed#[44C57313AFCAC55C]) [    ] o.a.s.c.c.SolrZkClient Using default ZkACLProvider
   [junit4]   2> 1270511 INFO  (TEST-ShardSplitTest.test-seed#[44C57313AFCAC55C]) [n:127.0.0.1:38505_lxa    ] o.a.s.c.c.ConnectionManager Waiting for client to connect to ZooKeeper
   [junit4]   2> 1270512 INFO  (zkCallback-1325-thread-1-processing-n:127.0.0.1:38505_lxa) [n:127.0.0.1:38505_lxa    ] o.a.s.c.c.ConnectionManager Watcher org.apache.solr.common.cloud.ConnectionManager@79d45228 name:ZooKeeperConnection Watcher:127.0.0.1:57270/solr got event WatchedEvent state:SyncConnected type:None path:null path:null type:None
   [junit4]   2> 1270512 INFO  (TEST-ShardSplitTest.test-seed#[44C57313AFCAC55C]) [n:127.0.0.1:38505_lxa    ] o.a.s.c.c.ConnectionManager Client is connected to ZooKeeper
   [junit4]   2> 1270513 INFO  (TEST-ShardSplitTest.test-seed#[44C57313AFCAC55C]) [n:127.0.0.1:38505_lxa    ] o.a.s.c.c.ZkStateReader Updating cluster state from ZooKeeper... 
   [junit4]   2> 1271515 INFO  (TEST-ShardSplitTest.test-seed#[44C57313AFCAC55C]) [n:127.0.0.1:38505_lxa    ] o.a.s.c.ZkController Register node as live in ZooKeeper:/live_nodes/127.0.0.1:38505_lxa
   [junit4]   2> 1271516 INFO  (TEST-ShardSplitTest.test-seed#[44C57313AFCAC55C]) [n:127.0.0.1:38505_lxa    ] o.a.s.c.c.SolrZkClient makePath: /live_nodes/127.0.0.1:38505_lxa
   [junit4]   2> 1271516 INFO  (zkCallback-1318-thread-2-processing-n:127.0.0.1:58569_lxa) [n:127.0.0.1:58569_lxa    ] o.a.s.c.c.ZkStateReader A live node change: [WatchedEvent state:SyncConnected type:NodeChildrenChanged path:/live_nodes], has occurred - updating... (live nodes size: [1])
   [junit4]   2> 1271516 INFO  (zkCallback-1320-thread-1) [    ] o.a.s.c.c.ZkStateReader A live node change: [WatchedEvent state:SyncConnected type:NodeChildrenChanged path:/live_nodes], has occurred - updating... (live nodes size: [1])
   [junit4]   2> 1271516 INFO  (zkCallback-1325-thread-1-processing-n:127.0.0.1:38505_lxa) [n:127.0.0.1:38505_lxa    ] o.a.s.c.c.ZkStateReader A live node change: [WatchedEvent state:SyncConnected type:NodeChildrenChanged path:/live_nodes], has occurred - updating... (live nodes size: [1])
   [junit4]   2> 1271516 INFO  (TEST-ShardSplitTest.test-seed#[44C57313AFCAC55C]) [n:127.0.0.1:38505_lxa    ] o.a.s.c.Overseer Overseer (id=null) closing
   [junit4]   2> 1271516 INFO  (TEST-ShardSplitTest.test-seed#[44C57313AFCAC55C]) [n:127.0.0.1:38505_lxa    ] o.a.s.c.LeaderElector Joined leadership election with path: /overseer_elect/election/95174727124975625-127.0.0.1:38505_lxa-n_0000000001
   [junit4]   2> 1271517 INFO  (TEST-ShardSplitTest.test-seed#[44C57313AFCAC55C]) [n:127.0.0.1:38505_lxa    ] o.a.s.c.LeaderElector Watching path /overseer_elect/election/95174727124975620-127.0.0.1:58569_lxa-n_0000000000 to know if I could be the leader
   [junit4]   2> 1271525 INFO  (TEST-ShardSplitTest.test-seed#[44C57313AFCAC55C]) [n:127.0.0.1:38505_lxa    ] o.a.s.c.CoreContainer Security conf doesn't exist. Skipping setup for authorization module.
   [junit4]   2> 1271525 INFO  (TEST-ShardSplitTest.test-seed#[44C57313AFCAC55C]) [n:127.0.0.1:38505_lxa    ] o.a.s.c.CoreContainer No authentication plugin used.
   [junit4]   2> 1271525 INFO  (TEST-ShardSplitTest.test-seed#[44C57313AFCAC55C]) [n:127.0.0.1:38505_lxa    ] o.a.s.c.CorePropertiesLocator Looking for core definitions underneath /home/jenkins/workspace/Lucene-Solr-5.x-Linux/solr/build/solr-core/test/J2/../../../../../../../../../home/jenkins/workspace/Lucene-Solr-5.x-Linux/solr/build/solr-core/test/J2/temp/solr.cloud.ShardSplitTest_44C57313AFCAC55C-001/shard-1-001/cores
   [junit4]   2> 1271526 INFO  (TEST-ShardSplitTest.test-seed#[44C57313AFCAC55C]) [n:127.0.0.1:38505_lxa    ] o.a.s.c.CoreDescriptor Created CoreDescriptor: {name=collection1, config=solrconfig.xml, transient=false, schema=schema.xml, loadOnStartup=true, configSetProperties=configsetprops.json, collection=collection1, coreNodeName=, dataDir=data/, shard=}
   [junit4]   2> 1271526 INFO  (TEST-ShardSplitTest.test-seed#[44C57313AFCAC55C]) [n:127.0.0.1:38505_lxa    ] o.a.s.c.CorePropertiesLocator Found core collection1 in /home/jenkins/workspace/Lucene-Solr-5.x-Linux/solr/build/solr-core/test/J2/../../../../../../../../../home/jenkins/workspace/Lucene-Solr-5.x-Linux/solr/build/solr-core/test/J2/temp/solr.cloud.ShardSplitTest_44C57313AFCAC55C-001/shard-1-001/cores/collection1
   [junit4]   2> 1271526 INFO  (TEST-ShardSplitTest.test-seed#[44C57313AFCAC55C]) [n:127.0.0.1:38505_lxa    ] o.a.s.c.CorePropertiesLocator Found 1 core definitions
   [junit4]   2> 1271527 INFO  (TEST-ShardSplitTest.test-seed#[44C57313AFCAC55C]) [n:127.0.0.1:38505_lxa    ] o.a.s.s.SolrDispatchFilter user.dir=/home/jenkins/workspace/Lucene-Solr-5.x-Linux/solr/build/solr-core/test/J2
   [junit4]   2> 1271527 INFO  (TEST-ShardSplitTest.test-seed#[44C57313AFCAC55C]) [n:127.0.0.1:38505_lxa    ] o.a.s.s.SolrDispatchFilter SolrDispatchFilter.init() done
   [junit4]   2> 1271527 INFO  (coreLoadExecutor-5236-thread-1-processing-n:127.0.0.1:38505_lxa) [n:127.0.0.1:38505_lxa c:collection1   x:collection1] o.a.s.c.ZkController publishing state=down
   [junit4]   2> 1271527 INFO  (coreLoadExecutor-5236-thread-1-processing-n:127.0.0.1:38505_lxa) [n:127.0.0.1:38505_lxa c:collection1   x:collection1] o.a.s.c.ZkController numShards not found on descriptor - reading it from system property
   [junit4]   2> 1271527 INFO  (coreLoadExecutor-5236-thread-1-processing-n:127.0.0.1:38505_lxa) [n:127.0.0.1:38505_lxa c:collection1   x:collection1] o.a.s.c.ZkController Registering watch for collection collection1
   [junit4]   2> 1271527 INFO  (coreLoadExecutor-5236-thread-1-processing-n:127.0.0.1:38505_lxa) [n:127.0.0.1:38505_lxa c:collection1   x:collection1] o.a.s.c.c.ZkStateReader addZkWatch [collection1]
   [junit4]   2> 1271527 INFO  (OverseerStateUpdate-95174727124975620-127.0.0.1:58569_lxa-n_0000000000) [n:127.0.0.1:58569_lxa    ] o.a.s.c.Overseer processMessage: queueSize: 1, message = {
   [junit4]   2>   "core":"collection1",
   [junit4]   2>   "roles":null,
   [junit4]   2>   "base_url":"http://127.0.0.1:38505/lxa",
   [junit4]   2>   "node_name":"127.0.0.1:38505_lxa",
   [junit4]   2>   "numShards":"2",
   [junit4]   2>   "state":"down",
   [junit4]   2>   "shard":null,
   [junit4]   2>   "collection":"collection1",
   [junit4]   2>   "operation":"state"} current state version: 3
   [junit4]   2> 1271527 INFO  (coreLoadExecutor-5236-thread-1-processing-n:127.0.0.1:38505_lxa) [n:127.0.0.1:38505_lxa c:collection1   x:collection1] o.a.s.c.c.ZkStateReader Add data for [collection1] ver [0]
   [junit4]   2> 1271528 INFO  (coreLoadExecutor-5236-thread-1-processing-n:127.0.0.1:38505_lxa) [n:127.0.0.1:38505_lxa c:collection1   x:collection1] o.a.s.c.ZkController look for our core node name
   [junit4]   2> 1271528 INFO  (OverseerStateUpdate-95174727124975620-127.0.0.1:58569_lxa-n_0000000000) [n:127.0.0.1:58569_lxa    ] o.a.s.c.o.ReplicaMutator Update state numShards=2 message={
   [junit4]   2>   "core":"collection1",
   [junit4]   2>   "roles":null,
   [junit4]   2>   "base_url":"http://127.0.0.1:38505/lxa",
   [junit4]   2>   "node_name":"127.0.0.1:38505_lxa",
   [junit4]   2>   "numShards":"2",
   [junit4]   2>   "state":"down",
   [junit4]   2>   "shard":null,
   [junit4]   2>   "collection":"collection1",
   [junit4]   2>   "operation":"state"}
   [junit4]   2> 1271528 INFO  (OverseerStateUpdate-95174727124975620-127.0.0.1:58569_lxa-n_0000000000) [n:127.0.0.1:58569_lxa    ] o.a.s.c.o.ReplicaMutator Collection already exists with numShards=2
   [junit4]   2> 1271528 INFO  (OverseerStateUpdate-95174727124975620-127.0.0.1:58569_lxa-n_0000000000) [n:127.0.0.1:58569_lxa    ] o.a.s.c.o.ReplicaMutator Assigning new node to shard shard=shard2
   [junit4]   2> 1271629 INFO  (OverseerStateUpdate-95174727124975620-127.0.0.1:58569_lxa-n_0000000000) [n:127.0.0.1:58569_lxa    ] o.a.s.c.o.ZkStateWriter going to update_collection /collections/collection1/state.json version: 0
   [junit4]   2> 1271629 INFO  (zkCallback-1325-thread-1-processing-n:127.0.0.1:38505_lxa) [n:127.0.0.1:38505_lxa    ] o.a.s.c.c.ZkStateReader A cluster state change: [WatchedEvent state:SyncConnected type:NodeDataChanged path:/collections/collection1/state.json] for collection [collection1] has occurred - updating... (live nodes size: [2])
   [junit4]   2> 1271629 INFO  (zkCallback-1325-thread-1-processing-n:127.0.0.1:38505_lxa) [n:127.0.0.1:38505_lxa    ] o.a.s.c.c.ZkStateReader Updating data for [collection1] from [0] to [1]
   [junit4]   2> 1272528 INFO  (coreLoadExecutor-5236-thread-1-processing-n:127.0.0.1:38505_lxa) [n:127.0.0.1:38505_lxa c:collection1   x:collection1] o.a.s.c.ZkController waiting to find shard id in clusterstate for collection1
   [junit4]   2> 1272528 INFO  (coreLoadExecutor-5236-thread-1-processing-n:127.0.0.1:38505_lxa) [n:127.0.0.1:38505_lxa c:collection1   x:collection1] o.a.s.c.ZkController Check for collection zkNode:collection1
   [junit4]   2> 1272528 INFO  (coreLoadExecutor-5236-thread-1-processing-n:127.0.0.1:38505_lxa) [n:127.0.0.1:38505_lxa c:collection1   x:collection1] o.a.s.c.ZkController Collection zkNode exists
   [junit4]   2> 1272528 INFO  (coreLoadExecutor-5236-thread-1-processing-n:127.0.0.1:38505_lxa) [n:127.0.0.1:38505_lxa c:collection1   x:collection1] o.a.s.c.c.ZkStateReader Load collection config from: [/collections/collection1]
   [junit4]   2> 1272528 INFO  (coreLoadExecutor-5236-thread-1-processing-n:127.0.0.1:38505_lxa) [n:127.0.0.1:38505_lxa c:collection1   x:collection1] o.a.s.c.c.ZkStateReader path=[/collections/collection1] [configName]=[conf1] specified config exists in ZooKeeper
   [junit4]   2> 1272528 INFO  (coreLoadExecutor-5236-thread-1-processing-n:127.0.0.1:38505_lxa) [n:127.0.0.1:38505_lxa c:collection1   x:collection1] o.a.s.c.SolrResourceLoader new SolrResourceLoader for directory: '/home/jenkins/workspace/Lucene-Solr-5.x-Linux/solr/build/solr-core/test/J2/temp/solr.cloud.ShardSplitTest_44C57313AFCAC55C-001/shard-1-001/cores/collection1'
   [junit4]   2> 1272528 INFO  (coreLoadExecutor-5236-thread-1-processing-n:127.0.0.1:38505_lxa) [n:127.0.0.1:38505_lxa c:collection1   x:collection1] o.a.s.c.SolrResourceLoader JNDI not configured for solr (NoInitialContextEx)
   [junit4]   2> 1272529 INFO  (coreLoadExecutor-5236-thread-1-processing-n:127.0.0.1:38505_lxa) [n:127.0.0.1:38505_lxa c:collection1   x:collection1] o.a.s.c.SolrResourceLoader solr home defaulted to 'solr/' (could not find system property or JNDI)
   [junit4]   2> 1272529 INFO  (coreLoadExecutor-5236-thread-1-processing-n:127.0.0.1:38505_lxa) [n:127.0.0.1:38505_lxa c:collection1   x:collection1] o.a.s.c.Config loaded config solrconfig.xml with version 0 
   [junit4]   2> 1272532 INFO  (coreLoadExecutor-5236-thread-1-processing-n:127.0.0.1:38505_lxa) [n:127.0.0.1:38505_lxa c:collection1   x:collection1] o.a.s.c.SolrConfig current version of requestparams : -1
   [junit4]   2> 1272534 INFO  (coreLoadExecutor-5236-thread-1-processing-n:127.0.0.1:38505_lxa) [n:127.0.0.1:38505_lxa c:collection1   x:collection1] o.a.s.c.SolrConfig Using Lucene MatchVersion: 5.5.0
   [junit4]   2> 1272551 INFO  (coreLoadExecutor-5236-thread-1-processing-n:127.0.0.1:38505_lxa) [n:127.0.0.1:38505_lxa c:collection1   x:collection1] o.a.s.c.SolrConfig Loaded SolrConfig: solrconfig.xml
   [junit4]   2> 1272556 INFO  (coreLoadExecutor-5236-thread-1-processing-n:127.0.0.1:38505_lxa) [n:127.0.0.1:38505_lxa c:collection1   x:collection1] o.a.s.s.IndexSchema [collection1] Schema name=test
   [junit4]   2> 1272639 INFO  (coreLoadExecutor-5236-thread-1-processing-n:127.0.0.1:38505_lxa) [n:127.0.0.1:38505_lxa c:collection1   x:collection1] o.a.s.s.IndexSchema default search field in schema is text
   [junit4]   2> 1272640 INFO  (coreLoadExecutor-5236-thread-1-processing-n:127.0.0.1:38505_lxa) [n:127.0.0.1:38505_lxa c:collection1   x:collection1] o.a.s.s.IndexSchema unique key field: id
   [junit4]   2> 1272641 INFO  (coreLoadExecutor-5236-thread-1-processing-n:127.0.0.1:38505_lxa) [n:127.0.0.1:38505_lxa c:collection1   x:collection1] o.a.s.s.FileExchangeRateProvider Reloading exchange rates from file currency.xml
   [junit4]   2> 1272643 INFO  (coreLoadExecutor-5236-thread-1-processing-n:127.0.0.1:38505_lxa) [n:127.0.0.1:38505_lxa c:collection1   x:collection1] o.a.s.s.FileExchangeRateProvider Reloading exchange rates from file currency.xml
   [junit4]   2> 1272651 INFO  (coreLoadExecutor-5236-thread-1-processing-n:127.0.0.1:38505_lxa) [n:127.0.0.1:38505_lxa c:collection1   x:collection1] o.a.s.c.ConfigSetProperties Did not find ConfigSet properties, assuming default properties: Can't find resource 'configsetprops.json' in classpath or '/configs/conf1', cwd=/home/jenkins/workspace/Lucene-Solr-5.x-Linux/solr/build/solr-core/test/J2
   [junit4]   2> 1272651 INFO  (coreLoadExecutor-5236-thread-1-processing-n:127.0.0.1:38505_lxa) [n:127.0.0.1:38505_lxa c:collection1   x:collection1] o.a.s.c.CoreContainer Creating SolrCore 'collection1' using configuration from collection collection1
   [junit4]   2> 1272651 INFO  (coreLoadExecutor-5236-thread-1-processing-n:127.0.0.1:38505_lxa) [n:127.0.0.1:38505_lxa c:collection1 s:shard2 r:core_node1 x:collection1] o.a.s.c.SolrCore org.apache.solr.core.MockDirectoryFactory
   [junit4]   2> 1272651 INFO  (coreLoadExecutor-5236-thread-1-processing-n:127.0.0.1:38505_lxa) [n:127.0.0.1:38505_lxa c:collection1 s:shard2 r:core_node1 x:collection1] o.a.s.c.SolrCore [[collection1] ] Opening new SolrCore at [/home/jenkins/workspace/Lucene-Solr-5.x-Linux/solr/build/solr-core/test/J2/temp/solr.cloud.ShardSplitTest_44C57313AFCAC55C-001/shard-1-001/cores/collection1], dataDir=[/home/jenkins/workspace/Lucene-Solr-5.x-Linux/solr/build/solr-core/test/J2/../../../../../../../../../home/jenkins/workspace/Lucene-Solr-5.x-Linux/solr/build/solr-core/test/J2/temp/solr.cloud.ShardSplitTest_44C57313AFCAC55C-001/shard-1-001/cores/collection1/data/]
   [junit4]   2> 1272652 INFO  (coreLoadExecutor-5236-thread-1-processing-n:127.0.0.1:38505_lxa) [n:127.0.0.1:38505_lxa c:collection1 s:shard2 r:core_node1 x:collection1] o.a.s.c.JmxMonitoredMap JMX monitoring is enabled. Adding Solr mbeans to JMX Server: com.sun.jmx.mbeanserver.JmxMBeanServer@694fd6dc
   [junit4]   2> 1272652 INFO  (coreLoadExecutor-5236-thread-1-processing-n:127.0.0.1:38505_lxa) [n:127.0.0.1:38505_lxa c:collection1 s:shard2 r:core_node1 x:collection1] o.a.s.c.CachingDirectoryFactory return new directory for /home/jenkins/workspace/Lucene-Solr-5.x-Linux/solr/build/solr-core/test/J2/../../../../../../../../../home/jenkins/workspace/Lucene-Solr-5.x-Linux/solr/build/solr-core/test/J2/temp/solr.cloud.ShardSplitTest_44C57313AFCAC55C-001/shard-1-001/cores/collection1/data
   [junit4]   2> 1272652 INFO  (coreLoadExecutor-5236-thread-1-processing-n:127.0.0.1:38505_lxa) [n:127.0.0.1:38505_lxa c:collection1 s:shard2 r:core_node1 x:collection1] o.a.s.c.SolrCore New index directory detected: old=null new=/home/jenkins/workspace/Lucene-Solr-5.x-Linux/solr/build/solr-core/test/J2/../../../../../../../../../home/jenkins/workspace/Lucene-Solr-5.x-Linux/solr/build/solr-core/test/J2/temp/solr.cloud.ShardSplitTest_44C57313AFCAC55C-001/shard-1-001/cores/collection1/data/index/
   [junit4]   2> 1272652 WARN  (coreLoadExecutor-5236-thread-1-processing-n:127.0.0.1:38505_lxa) [n:127.0.0.1:38505_lxa c:collection1 s:shard2 r:core_node1 x:collection1] o.a.s.c.SolrCore [collection1] Solr index directory '/home/jenkins/workspace/Lucene-Solr-5.x-Linux/solr/build/solr-core/test/J2/../../../../../../../../../home/jenkins/workspace/Lucene-Solr-5.x-Linux/solr/build/solr-core/test/J2/temp/solr.cloud.ShardSplitTest_44C57313AFCAC55C-001/shard-1-001/cores/collection1/data/index' doesn't exist. Creating new index...
   [junit4]   2> 1272652 INFO  (coreLoadExecutor-5236-thread-1-processing-n:127.0.0.1:38505_lxa) [n:127.0.0.1:38505_lxa c:collection1 s:shard2 r:core_node1 x:collection1] o.a.s.c.CachingDirectoryFactory return new directory for /home/jenkins/workspace/Lucene-Solr-5.x-Linux/solr/build/solr-core/test/J2/../../../../../../../../../home/jenkins/workspace/Lucene-Solr-5.x-Linux/solr/build/solr-core/test/J2/temp/solr.cloud.ShardSplitTest_44C57313AFCAC55C-001/shard-1-001/cores/collection1/data/index
   [junit4]   2> 1272653 INFO  (coreLoadExecutor-5236-thread-1-processing-n:127.0.0.1:38505_lxa) [n:127.0.0.1:38505_lxa c:collection1 s:shard2 r:core_node1 x:collection1] o.a.s.u.RandomMergePolicy RandomMergePolicy wrapping class org.apache.lucene.index.TieredMergePolicy: [TieredMergePolicy: maxMergeAtOnce=42, maxMergeAtOnceExplicit=47, maxMergedSegmentMB=6.0498046875, floorSegmentMB=1.568359375, forceMergeDeletesPctAllowed=8.21413314615717, segmentsPerTier=26.0, maxCFSSegmentSizeMB=8.796093022207999E12, noCFSRatio=1.0
   [junit4]   2> 1272653 INFO  (coreLoadExecutor-5236-thread-1-processing-n:127.0.0.1:38505_lxa) [n:127.0.0.1:38505_lxa c:collection1 s:shard2 r:core_node1 x:collection1] o.a.s.c.SolrDeletionPolicy SolrDeletionPolicy.onCommit: commits: num=1
   [junit4]   2> 	commit{dir=MockDirectoryWrapper(RAMDirectory@59ad314 lockFactory=org.apache.lucene.store.SingleInstanceLockFactory@6d1b79fc),segFN=segments_1,generation=1}
   [junit4]   2> 1272653 INFO  (coreLoadExecutor-5236-thread-1-processing-n:127.0.0.1:38505_lxa) [n:127.0.0.1:38505_lxa c:collection1 s:shard2 r:core_node1 x:collection1] o.a.s.c.SolrDeletionPolicy newest commit generation = 1
   [junit4]   2> 1272653 INFO  (OldIndexDirectoryCleanupThreadForCore-collection1) [n:127.0.0.1:38505_lxa c:collection1 s:shard2 r:core_node1 x:collection1] o.a.s.c.SolrCore Looking for old index directories to cleanup for core collection1 in /home/jenkins/workspace/Lucene-Solr-5.x-Linux/solr/build/solr-core/test/J2/../../../../../../../../../home/jenkins/workspace/Lucene-Solr-5.x-Linux/solr/build/solr-core/test/J2/temp/solr.cloud.ShardSplitTest_44C57313AFCAC55C-001/shard-1-001/cores/collection1/data/
   [junit4]   2> 1272654 WARN  (OldIndexDirectoryCleanupThreadForCore-collection1) [n:127.0.0.1:38505_lxa c:collection1 s:shard2 r:core_node1 x:collection1] o.a.s.c.DirectoryFactory /home/jenkins/workspace/Lucene-Solr-5.x-Linux/solr/build/solr-core/test/J2/../../../../../../../../../home/jenkins/workspace/Lucene-Solr-5.x-Linux/solr/build/solr-core/test/J2/temp/solr.cloud.ShardSplitTest_44C57313AFCAC55C-001/shard-1-001/cores/collection1/data/ does not point to a valid data directory; skipping clean-up of old index directories.
   [junit4]   2> 1272656 INFO  (coreLoadExecutor-5236-thread-1-processing-n:127.0.0.1:38505_lxa) [n:127.0.0.1:38505_lxa c:collection1 s:shard2 r:core_node1 x:collection1] o.a.s.u.p.UpdateRequestProcessorChain creating updateRequestProcessorChain "nodistrib"
   [junit4]   2> 1272656 INFO  (coreLoadExecutor-5236-thread-1-processing-n:127.0.0.1:38505_lxa) [n:127.0.0.1:38505_lxa c:collection1 s:shard2 r:core_node1 x:collection1] o.a.s.u.p.UpdateRequestProcessorChain creating updateRequestProcessorChain "dedupe"
   [junit4]   2> 1272656 INFO  (coreLoadExecutor-5236-thread-1-processing-n:127.0.0.1:38505_lxa) [n:127.0.0.1:38505_lxa c:collection1 s:shard2 r:core_node1 x:collection1] o.a.s.u.p.UpdateRequestProcessorChain inserting DistributedUpdateProcessorFactory into updateRequestProcessorChain "dedupe"
   [junit4]   2> 1272656 INFO  (coreLoadExecutor-5236-thread-1-processing-n:127.0.0.1:38505_lxa) [n:127.0.0.1:38505_lxa c:collection1 s:shard2 r:core_node1 x:collection1] o.a.s.u.p.UpdateRequestProcessorChain creating updateRequestProcessorChain "stored_sig"
   [junit4]   2> 1272657 INFO  (coreLoadExecutor-5236-thread-1-processing-n:127.0.0.1:38505_lxa) [n:127.0.0.1:38505_lxa c:collection1 s:shard2 r:core_node1 x:collection1] o.a.s.u.p.UpdateRequestProcessorChain inserting DistributedUpdateProcessorFactory into updateRequestProcessorChain "stored_sig"
   [junit4]   2> 1272657 INFO  (coreLoadExecutor-5236-thread-1-processing-n:127.0.0.1:38505_lxa) [n:127.0.0.1:38505_lxa c:collection1 s:shard2 r:core_node1 x:collection1] o.a.s.u.p.UpdateRequestProcessorChain creating updateRequestProcessorChain "distrib-dup-test-chain-explicit"
   [junit4]   2> 1272657 INFO  (coreLoadExecutor-5236-thread-1-processing-n:127.0.0.1:38505_lxa) [n:127.0.0.1:38505_lxa c:collection1 s:shard2 r:core_node1 x:collection1] o

[...truncated too long message...]

ion.onFillable(HttpConnection.java:257)
   [junit4]   2> 	at org.eclipse.jetty.io.AbstractConnection$2.run(AbstractConnection.java:540)
   [junit4]   2> 	at org.eclipse.jetty.util.thread.QueuedThreadPool.runJob(QueuedThreadPool.java:635)
   [junit4]   2> 	at org.eclipse.jetty.util.thread.QueuedThreadPool$3.run(QueuedThreadPool.java:555)
   [junit4]   2> 	at java.lang.Thread.run(Thread.java:745)
   [junit4]   2> 
   [junit4]   2> 1475713 INFO  (qtp2096979134-10929) [n:127.0.0.1:54998_lxa    ] o.a.s.s.HttpSolrCall [admin] webapp=null path=/admin/cores params={nodeName=127.0.0.1:58569_lxa&onlyIfLeaderActive=true&core=routeFieldColl_shard3_replica1&coreNodeName=core_node3&action=PREPRECOVERY&checkLive=true&state=recovering&onlyIfLeader=true&wt=javabin&version=2} status=400 QTime=21015
   [junit4]   2> 1475715 INFO  (TEST-ShardSplitTest.test-seed#[44C57313AFCAC55C]) [n:127.0.0.1:54998_lxa c:routeFieldColl s:shard3 r:core_node8 x:routeFieldColl_shard3_replica1] o.a.s.c.ZkTestServer connecting to 127.0.0.1:57270 57270
   [junit4]   2> 1475736 INFO  (Thread-4311) [    ] o.a.s.c.ZkTestServer connecting to 127.0.0.1:57270 57270
   [junit4]   2> 1475736 WARN  (Thread-4311) [    ] o.a.s.c.ZkTestServer Watch limit violations: 
   [junit4]   2> Maximum concurrent create/delete watches above limit:
   [junit4]   2> 
   [junit4]   2> 	8	/solr/aliases.json
   [junit4]   2> 	5	/solr/security.json
   [junit4]   2> 	5	/solr/configs/conf1
   [junit4]   2> 
   [junit4]   2> Maximum concurrent data watches above limit:
   [junit4]   2> 
   [junit4]   2> 	8	/solr/clusterstate.json
   [junit4]   2> 	5	/solr/collections/routeFieldColl/state.json
   [junit4]   2> 	4	/solr/collections/collection1/state.json
   [junit4]   2> 
   [junit4]   2> Maximum concurrent children watches above limit:
   [junit4]   2> 
   [junit4]   2> 	8	/solr/live_nodes
   [junit4]   2> 	8	/solr/collections
   [junit4]   2> 	5	/solr/overseer/queue
   [junit4]   2> 	5	/solr/overseer/collection-queue-work
   [junit4]   2> 
   [junit4]   2> NOTE: reproduce with: ant test  -Dtestcase=ShardSplitTest -Dtests.method=test -Dtests.seed=44C57313AFCAC55C -Dtests.multiplier=3 -Dtests.slow=true -Dtests.locale=no -Dtests.timezone=Europe/Amsterdam -Dtests.asserts=true -Dtests.file.encoding=UTF-8
   [junit4] ERROR    207s J2 | ShardSplitTest.test <<<
   [junit4]    > Throwable #1: org.apache.solr.client.solrj.impl.HttpSolrClient$RemoteSolrException: Error from server at http://127.0.0.1:41079/lxa/routeFieldColl: non ok status: 500, message:Server Error
   [junit4]    > 	at __randomizedtesting.SeedInfo.seed([44C57313AFCAC55C:CC914CC90136A8A4]:0)
   [junit4]    > 	at org.apache.solr.client.solrj.impl.HttpSolrClient.executeMethod(HttpSolrClient.java:509)
   [junit4]    > 	at org.apache.solr.client.solrj.impl.HttpSolrClient.request(HttpSolrClient.java:241)
   [junit4]    > 	at org.apache.solr.client.solrj.impl.HttpSolrClient.request(HttpSolrClient.java:230)
   [junit4]    > 	at org.apache.solr.client.solrj.SolrRequest.process(SolrRequest.java:150)
   [junit4]    > 	at org.apache.solr.client.solrj.SolrClient.add(SolrClient.java:174)
   [junit4]    > 	at org.apache.solr.client.solrj.SolrClient.add(SolrClient.java:139)
   [junit4]    > 	at org.apache.solr.client.solrj.SolrClient.add(SolrClient.java:153)
   [junit4]    > 	at org.apache.solr.cloud.ShardSplitTest.splitByRouteFieldTest(ShardSplitTest.java:263)
   [junit4]    > 	at org.apache.solr.cloud.ShardSplitTest.test(ShardSplitTest.java:83)
   [junit4]    > 	at org.apache.solr.BaseDistributedSearchTestCase$ShardsRepeatRule$ShardsFixedStatement.callStatement(BaseDistributedSearchTestCase.java:965)
   [junit4]    > 	at org.apache.solr.BaseDistributedSearchTestCase$ShardsRepeatRule$ShardsStatement.evaluate(BaseDistributedSearchTestCase.java:940)
   [junit4]    > 	at java.lang.Thread.run(Thread.java:745)
   [junit4]   2> 1475740 INFO  (SUITE-ShardSplitTest-seed#[44C57313AFCAC55C]-worker) [n:127.0.0.1:54998_lxa c:routeFieldColl s:shard3 r:core_node8 x:routeFieldColl_shard3_replica1] o.a.s.SolrTestCaseJ4 ###deleteCore
   [junit4]   2> NOTE: leaving temporary files on disk at: /home/jenkins/workspace/Lucene-Solr-5.x-Linux/solr/build/solr-core/test/J2/temp/solr.cloud.ShardSplitTest_44C57313AFCAC55C-001
   [junit4]   2> Jan 08, 2016 11:08:12 AM com.carrotsearch.randomizedtesting.ThreadLeakControl checkThreadLeaks
   [junit4]   2> WARNING: Will linger awaiting termination of 1 leaked thread(s).
   [junit4]   2> NOTE: test params are: codec=Asserting(Lucene54): {shard_s=PostingsFormat(name=LuceneVarGapFixedInterval), _version_=Lucene50(blocksize=128), n_ti=PostingsFormat(name=LuceneVarGapFixedInterval), id=PostingsFormat(name=MockRandom)}, docValues:{}, sim=DefaultSimilarity, locale=no, timezone=Europe/Amsterdam
   [junit4]   2> NOTE: Linux 3.19.0-42-generic amd64/Oracle Corporation 1.8.0_66 (64-bit)/cpus=12,threads=1,free=287040656,total=515375104
   [junit4]   2> NOTE: All tests run in this JVM: [DistributedSuggestComponentTest, HLLSerializationTest, TestCollationField, TestRestManager, SimpleFacetsTest, InfoHandlerTest, DistributedVersionInfoTest, TestReversedWildcardFilterFactory, SpatialRPTFieldTypeTest, TestSolrIndexConfig, TestSweetSpotSimilarityFactory, TestInitParams, TestRandomForceMergePolicy, TestPHPSerializedResponseWriter, StressHdfsTest, TestNonDefinedSimilarityFactory, BasicDistributedZk2Test, CloudMLTQParserTest, TestExceedMaxTermLength, TestPostingsSolrHighlighter, TestZkChroot, TestExpandComponent, TestShardHandlerFactory, TestConfigSetImmutable, SuggesterWFSTTest, SuggesterTest, TestSortingResponseWriter, TermVectorComponentDistributedTest, TestCollectionAPI, TestFastWriter, NoCacheHeaderTest, FieldAnalysisRequestHandlerTest, TestCharFilters, TestConfigSetsAPIZkFailure, TestElisionMultitermQuery, TestExactStatsCache, AutoCommitTest, CustomCollectionTest, ActionThrottleTest, TestScoreJoinQPNoScore, CoreAdminHandlerTest, DocValuesMultiTest, TestRestoreCore, TestSearcherReuse, LeaderElectionTest, PreAnalyzedUpdateProcessorTest, TestMaxScoreQueryParser, TestFieldTypeCollectionResource, DistribDocExpirationUpdateProcessorTest, TestTolerantSearch, TestSearchPerf, DirectUpdateHandlerTest, TestDistributedMissingSort, DistributedFacetPivotWhiteBoxTest, BitVectorTest, TestStressRecovery, TestSolrQueryParserResource, LukeRequestHandlerTest, HdfsCollectionsAPIDistributedZkTest, ConjunctionSolrSpellCheckerTest, BadIndexSchemaTest, TestDynamicLoading, TestIndexingPerformance, HdfsRecoveryZkTest, DistanceUnitsTest, CursorMarkTest, TestDefaultStatsCache, SuggestComponentContextFilterQueryTest, TestSolrDeletionPolicy1, HighlighterConfigTest, TestOrdValues, QueryParsingTest, OverseerTest, TestReload, TestExtendedDismaxParser, PKIAuthenticationIntegrationTest, TestCopyFieldCollectionResource, TestRuleBasedAuthorizationPlugin, SolrTestCaseJ4Test, RequestHandlersTest, TestSchemaVersionResource, DirectSolrConnectionTest, CleanupOldIndexTest, SimpleCollectionCreateDeleteTest, TestIndexSearcher, TestStressReorder, RollingRestartTest, HdfsDirectoryTest, TestXIncludeConfig, UnloadDistributedZkTest, ShardRoutingTest, BasicZkTest, RecoveryZkTest, TestReplicationHandler, TestRecovery, DistributedSpellCheckComponentTest, HardAutoCommitTest, TestRangeQuery, StatsComponentTest, TestBadConfig, SoftAutoCommitTest, TestTrie, TestCSVLoader, TestUpdate, FieldMutatingUpdateProcessorTest, TestAtomicUpdateErrorCases, TestWordDelimiterFilterFactory, StatelessScriptUpdateProcessorFactoryTest, XsltUpdateRequestHandlerTest, IndexBasedSpellCheckerTest, DirectSolrSpellCheckerTest, TestQueryTypes, TestOmitPositions, TermsComponentTest, PathHierarchyTokenizerFactoryTest, LoggingHandlerTest, SolrPluginUtilsTest, ReturnFieldsTest, TestCSVResponseWriter, BinaryUpdateRequestHandlerTest, CSVRequestHandlerTest, TestBinaryResponseWriter, UpdateParamsTest, AlternateDirectoryTest, BadComponentTest, MultiTermTest, SampleTest, TestBinaryField, NumericFieldsTest, MinimalSchemaTest, TestConfig, TestFuzzyAnalyzedSuggestions, ExternalFileFieldSortTest, TestSolrCoreProperties, NotRequiredUniqueKeyTest, TestPhraseSuggestions, TestCodecSupport, SynonymTokenizerTest, EchoParamsTest, TestPerFieldSimilarity, TestJmxMonitoredMap, TestFastOutputStream, ScriptEngineTest, URLClassifyProcessorTest, PluginInfoTest, TestFastLRUCache, DateMathParserTest, ChaosMonkeyNothingIsSafeTest, AsyncCallRequestStatusResponseTest, ConcurrentDeleteAndCreateCollectionTest, ConfigSetsAPITest, DeleteReplicaTest, LeaderInitiatedRecoveryOnShardRestartTest, MigrateRouteKeyTest, OutOfBoxZkACLAndCredentialsProvidersTest, OverriddenZkACLAndCredentialsProvidersTest, OverseerStatusTest, RemoteQueryErrorTest, ShardSplitTest]
   [junit4] Completed [447/563 (1!)] on J2 in 207.92s, 1 test, 1 error <<< FAILURES!

[...truncated 371 lines...]
BUILD FAILED
/home/jenkins/workspace/Lucene-Solr-5.x-Linux/build.xml:794: The following error occurred while executing this line:
/home/jenkins/workspace/Lucene-Solr-5.x-Linux/build.xml:738: The following error occurred while executing this line:
/home/jenkins/workspace/Lucene-Solr-5.x-Linux/build.xml:59: The following error occurred while executing this line:
/home/jenkins/workspace/Lucene-Solr-5.x-Linux/solr/build.xml:233: The following error occurred while executing this line:
/home/jenkins/workspace/Lucene-Solr-5.x-Linux/solr/common-build.xml:526: The following error occurred while executing this line:
/home/jenkins/workspace/Lucene-Solr-5.x-Linux/lucene/common-build.xml:1444: The following error occurred while executing this line:
/home/jenkins/workspace/Lucene-Solr-5.x-Linux/lucene/common-build.xml:1000: There were test failures: 563 suites (7 ignored), 2236 tests, 1 error, 83 ignored (39 assumptions) [seed: 44C57313AFCAC55C]

Total time: 50 minutes 7 seconds
Build step 'Invoke Ant' marked build as failure
Archiving artifacts
[WARNINGS] Skipping publisher since build result is FAILURE
Recording test results
Email was triggered for: Failure - Any
Sending email for trigger: Failure - Any



Mime
View raw message