lucene-dev mailing list archives

Site index · List index
Message view « Date » · « Thread »
Top « Date » · « Thread »
From Apache Jenkins Server <jenk...@builds.apache.org>
Subject [JENKINS] Lucene-Solr-NightlyTests-trunk - Build # 910 - Still Failing
Date Wed, 13 Jan 2016 03:33:50 GMT
Build: https://builds.apache.org/job/Lucene-Solr-NightlyTests-trunk/910/

1 tests failed.
FAILED:  org.apache.solr.core.TestDynamicLoading.testDynamicLoading

Error Message:
Could not get expected value  'X val changed' for path 'x' full output: {   "responseHeader":{     "status":0,     "QTime":0},   "params":{"wt":"json"},   "context":{     "webapp":"/kyvy/kk",     "path":"/test1",     "httpMethod":"GET"},   "class":"org.apache.solr.core.BlobStoreTestRequestHandler",   "x":"X val"}

Stack Trace:
java.lang.AssertionError: Could not get expected value  'X val changed' for path 'x' full output: {
  "responseHeader":{
    "status":0,
    "QTime":0},
  "params":{"wt":"json"},
  "context":{
    "webapp":"/kyvy/kk",
    "path":"/test1",
    "httpMethod":"GET"},
  "class":"org.apache.solr.core.BlobStoreTestRequestHandler",
  "x":"X val"}
	at __randomizedtesting.SeedInfo.seed([1AB3E18A9263A2E2:C2FECCDD65BE0742]:0)
	at org.junit.Assert.fail(Assert.java:93)
	at org.junit.Assert.assertTrue(Assert.java:43)
	at org.apache.solr.core.TestSolrConfigHandler.testForResponseElement(TestSolrConfigHandler.java:458)
	at org.apache.solr.core.TestDynamicLoading.testDynamicLoading(TestDynamicLoading.java:257)
	at sun.reflect.NativeMethodAccessorImpl.invoke0(Native Method)
	at sun.reflect.NativeMethodAccessorImpl.invoke(NativeMethodAccessorImpl.java:62)
	at sun.reflect.DelegatingMethodAccessorImpl.invoke(DelegatingMethodAccessorImpl.java:43)
	at java.lang.reflect.Method.invoke(Method.java:497)
	at com.carrotsearch.randomizedtesting.RandomizedRunner.invoke(RandomizedRunner.java:1764)
	at com.carrotsearch.randomizedtesting.RandomizedRunner$8.evaluate(RandomizedRunner.java:871)
	at com.carrotsearch.randomizedtesting.RandomizedRunner$9.evaluate(RandomizedRunner.java:907)
	at com.carrotsearch.randomizedtesting.RandomizedRunner$10.evaluate(RandomizedRunner.java:921)
	at org.apache.solr.BaseDistributedSearchTestCase$ShardsRepeatRule$ShardsFixedStatement.callStatement(BaseDistributedSearchTestCase.java:965)
	at org.apache.solr.BaseDistributedSearchTestCase$ShardsRepeatRule$ShardsStatement.evaluate(BaseDistributedSearchTestCase.java:940)
	at com.carrotsearch.randomizedtesting.rules.SystemPropertiesRestoreRule$1.evaluate(SystemPropertiesRestoreRule.java:57)
	at org.apache.lucene.util.TestRuleSetupTeardownChained$1.evaluate(TestRuleSetupTeardownChained.java:50)
	at org.apache.lucene.util.AbstractBeforeAfterRule$1.evaluate(AbstractBeforeAfterRule.java:46)
	at org.apache.lucene.util.TestRuleThreadAndTestName$1.evaluate(TestRuleThreadAndTestName.java:49)
	at org.apache.lucene.util.TestRuleIgnoreAfterMaxFailures$1.evaluate(TestRuleIgnoreAfterMaxFailures.java:65)
	at org.apache.lucene.util.TestRuleMarkFailure$1.evaluate(TestRuleMarkFailure.java:48)
	at com.carrotsearch.randomizedtesting.rules.StatementAdapter.evaluate(StatementAdapter.java:36)
	at com.carrotsearch.randomizedtesting.ThreadLeakControl$StatementRunner.run(ThreadLeakControl.java:367)
	at com.carrotsearch.randomizedtesting.ThreadLeakControl.forkTimeoutingTask(ThreadLeakControl.java:809)
	at com.carrotsearch.randomizedtesting.ThreadLeakControl$3.evaluate(ThreadLeakControl.java:460)
	at com.carrotsearch.randomizedtesting.RandomizedRunner.runSingleTest(RandomizedRunner.java:880)
	at com.carrotsearch.randomizedtesting.RandomizedRunner$5.evaluate(RandomizedRunner.java:781)
	at com.carrotsearch.randomizedtesting.RandomizedRunner$6.evaluate(RandomizedRunner.java:816)
	at com.carrotsearch.randomizedtesting.RandomizedRunner$7.evaluate(RandomizedRunner.java:827)
	at com.carrotsearch.randomizedtesting.rules.StatementAdapter.evaluate(StatementAdapter.java:36)
	at com.carrotsearch.randomizedtesting.rules.SystemPropertiesRestoreRule$1.evaluate(SystemPropertiesRestoreRule.java:57)
	at org.apache.lucene.util.AbstractBeforeAfterRule$1.evaluate(AbstractBeforeAfterRule.java:46)
	at com.carrotsearch.randomizedtesting.rules.StatementAdapter.evaluate(StatementAdapter.java:36)
	at org.apache.lucene.util.TestRuleStoreClassName$1.evaluate(TestRuleStoreClassName.java:42)
	at com.carrotsearch.randomizedtesting.rules.NoShadowingOrOverridesOnMethodsRule$1.evaluate(NoShadowingOrOverridesOnMethodsRule.java:40)
	at com.carrotsearch.randomizedtesting.rules.NoShadowingOrOverridesOnMethodsRule$1.evaluate(NoShadowingOrOverridesOnMethodsRule.java:40)
	at com.carrotsearch.randomizedtesting.rules.StatementAdapter.evaluate(StatementAdapter.java:36)
	at com.carrotsearch.randomizedtesting.rules.StatementAdapter.evaluate(StatementAdapter.java:36)
	at com.carrotsearch.randomizedtesting.rules.StatementAdapter.evaluate(StatementAdapter.java:36)
	at org.apache.lucene.util.TestRuleAssertionsRequired$1.evaluate(TestRuleAssertionsRequired.java:54)
	at org.apache.lucene.util.TestRuleMarkFailure$1.evaluate(TestRuleMarkFailure.java:48)
	at org.apache.lucene.util.TestRuleIgnoreAfterMaxFailures$1.evaluate(TestRuleIgnoreAfterMaxFailures.java:65)
	at org.apache.lucene.util.TestRuleIgnoreTestSuites$1.evaluate(TestRuleIgnoreTestSuites.java:55)
	at com.carrotsearch.randomizedtesting.rules.StatementAdapter.evaluate(StatementAdapter.java:36)
	at com.carrotsearch.randomizedtesting.ThreadLeakControl$StatementRunner.run(ThreadLeakControl.java:367)
	at java.lang.Thread.run(Thread.java:745)




Build Log:
[...truncated 10654 lines...]
   [junit4] Suite: org.apache.solr.core.TestDynamicLoading
   [junit4]   2> Creating dataDir: /x1/jenkins/jenkins-slave/workspace/Lucene-Solr-NightlyTests-trunk/solr/build/solr-core/test/J2/temp/solr.core.TestDynamicLoading_1AB3E18A9263A2E2-001/init-core-data-001
   [junit4]   2> 2103628 INFO  (SUITE-TestDynamicLoading-seed#[1AB3E18A9263A2E2]-worker) [    ] o.a.s.SolrTestCaseJ4 Randomized ssl (false) and clientAuth (false)
   [junit4]   2> 2103628 INFO  (SUITE-TestDynamicLoading-seed#[1AB3E18A9263A2E2]-worker) [    ] o.a.s.BaseDistributedSearchTestCase Setting hostContext system property: /kyvy/kk
   [junit4]   2> 2103630 INFO  (TEST-TestDynamicLoading.testDynamicLoading-seed#[1AB3E18A9263A2E2]) [    ] o.a.s.c.ZkTestServer STARTING ZK TEST SERVER
   [junit4]   2> 2103631 INFO  (Thread-123210) [    ] o.a.s.c.ZkTestServer client port:0.0.0.0/0.0.0.0:0
   [junit4]   2> 2103631 INFO  (Thread-123210) [    ] o.a.s.c.ZkTestServer Starting server
   [junit4]   2> 2103731 INFO  (TEST-TestDynamicLoading.testDynamicLoading-seed#[1AB3E18A9263A2E2]) [    ] o.a.s.c.ZkTestServer start zk server on port:53911
   [junit4]   2> 2103731 INFO  (TEST-TestDynamicLoading.testDynamicLoading-seed#[1AB3E18A9263A2E2]) [    ] o.a.s.c.c.SolrZkClient Using default ZkCredentialsProvider
   [junit4]   2> 2103731 INFO  (TEST-TestDynamicLoading.testDynamicLoading-seed#[1AB3E18A9263A2E2]) [    ] o.a.s.c.c.ConnectionManager Waiting for client to connect to ZooKeeper
   [junit4]   2> 2103734 INFO  (zkCallback-1091-thread-1) [    ] o.a.s.c.c.ConnectionManager Watcher org.apache.solr.common.cloud.ConnectionManager@7500ffd5 name:ZooKeeperConnection Watcher:127.0.0.1:53911 got event WatchedEvent state:SyncConnected type:None path:null path:null type:None
   [junit4]   2> 2103734 INFO  (TEST-TestDynamicLoading.testDynamicLoading-seed#[1AB3E18A9263A2E2]) [    ] o.a.s.c.c.ConnectionManager Client is connected to ZooKeeper
   [junit4]   2> 2103735 INFO  (TEST-TestDynamicLoading.testDynamicLoading-seed#[1AB3E18A9263A2E2]) [    ] o.a.s.c.c.SolrZkClient Using default ZkACLProvider
   [junit4]   2> 2103735 INFO  (TEST-TestDynamicLoading.testDynamicLoading-seed#[1AB3E18A9263A2E2]) [    ] o.a.s.c.c.SolrZkClient makePath: /solr
   [junit4]   2> 2103738 INFO  (TEST-TestDynamicLoading.testDynamicLoading-seed#[1AB3E18A9263A2E2]) [    ] o.a.s.c.c.SolrZkClient Using default ZkCredentialsProvider
   [junit4]   2> 2103738 INFO  (TEST-TestDynamicLoading.testDynamicLoading-seed#[1AB3E18A9263A2E2]) [    ] o.a.s.c.c.ConnectionManager Waiting for client to connect to ZooKeeper
   [junit4]   2> 2103739 INFO  (zkCallback-1092-thread-1) [    ] o.a.s.c.c.ConnectionManager Watcher org.apache.solr.common.cloud.ConnectionManager@2627cd6c name:ZooKeeperConnection Watcher:127.0.0.1:53911/solr got event WatchedEvent state:SyncConnected type:None path:null path:null type:None
   [junit4]   2> 2103739 INFO  (TEST-TestDynamicLoading.testDynamicLoading-seed#[1AB3E18A9263A2E2]) [    ] o.a.s.c.c.ConnectionManager Client is connected to ZooKeeper
   [junit4]   2> 2103740 INFO  (TEST-TestDynamicLoading.testDynamicLoading-seed#[1AB3E18A9263A2E2]) [    ] o.a.s.c.c.SolrZkClient Using default ZkACLProvider
   [junit4]   2> 2103740 INFO  (TEST-TestDynamicLoading.testDynamicLoading-seed#[1AB3E18A9263A2E2]) [    ] o.a.s.c.c.SolrZkClient makePath: /collections/collection1
   [junit4]   2> 2103741 INFO  (TEST-TestDynamicLoading.testDynamicLoading-seed#[1AB3E18A9263A2E2]) [    ] o.a.s.c.c.SolrZkClient makePath: /collections/collection1/shards
   [junit4]   2> 2103743 INFO  (TEST-TestDynamicLoading.testDynamicLoading-seed#[1AB3E18A9263A2E2]) [    ] o.a.s.c.c.SolrZkClient makePath: /collections/control_collection
   [junit4]   2> 2103744 INFO  (TEST-TestDynamicLoading.testDynamicLoading-seed#[1AB3E18A9263A2E2]) [    ] o.a.s.c.c.SolrZkClient makePath: /collections/control_collection/shards
   [junit4]   2> 2103746 INFO  (TEST-TestDynamicLoading.testDynamicLoading-seed#[1AB3E18A9263A2E2]) [    ] o.a.s.c.AbstractZkTestCase put /x1/jenkins/jenkins-slave/workspace/Lucene-Solr-NightlyTests-trunk/solr/core/src/test-files/solr/collection1/conf/solrconfig-tlog.xml to /configs/conf1/solrconfig.xml
   [junit4]   2> 2103746 INFO  (TEST-TestDynamicLoading.testDynamicLoading-seed#[1AB3E18A9263A2E2]) [    ] o.a.s.c.c.SolrZkClient makePath: /configs/conf1/solrconfig.xml
   [junit4]   2> 2103748 INFO  (TEST-TestDynamicLoading.testDynamicLoading-seed#[1AB3E18A9263A2E2]) [    ] o.a.s.c.AbstractZkTestCase put /x1/jenkins/jenkins-slave/workspace/Lucene-Solr-NightlyTests-trunk/solr/core/src/test-files/solr/collection1/conf/schema.xml to /configs/conf1/schema.xml
   [junit4]   2> 2103748 INFO  (TEST-TestDynamicLoading.testDynamicLoading-seed#[1AB3E18A9263A2E2]) [    ] o.a.s.c.c.SolrZkClient makePath: /configs/conf1/schema.xml
   [junit4]   2> 2103750 INFO  (TEST-TestDynamicLoading.testDynamicLoading-seed#[1AB3E18A9263A2E2]) [    ] o.a.s.c.AbstractZkTestCase put /x1/jenkins/jenkins-slave/workspace/Lucene-Solr-NightlyTests-trunk/solr/core/src/test-files/solr/collection1/conf/solrconfig.snippet.randomindexconfig.xml to /configs/conf1/solrconfig.snippet.randomindexconfig.xml
   [junit4]   2> 2103750 INFO  (TEST-TestDynamicLoading.testDynamicLoading-seed#[1AB3E18A9263A2E2]) [    ] o.a.s.c.c.SolrZkClient makePath: /configs/conf1/solrconfig.snippet.randomindexconfig.xml
   [junit4]   2> 2103754 INFO  (TEST-TestDynamicLoading.testDynamicLoading-seed#[1AB3E18A9263A2E2]) [    ] o.a.s.c.AbstractZkTestCase put /x1/jenkins/jenkins-slave/workspace/Lucene-Solr-NightlyTests-trunk/solr/core/src/test-files/solr/collection1/conf/stopwords.txt to /configs/conf1/stopwords.txt
   [junit4]   2> 2103754 INFO  (TEST-TestDynamicLoading.testDynamicLoading-seed#[1AB3E18A9263A2E2]) [    ] o.a.s.c.c.SolrZkClient makePath: /configs/conf1/stopwords.txt
   [junit4]   2> 2103755 INFO  (TEST-TestDynamicLoading.testDynamicLoading-seed#[1AB3E18A9263A2E2]) [    ] o.a.s.c.AbstractZkTestCase put /x1/jenkins/jenkins-slave/workspace/Lucene-Solr-NightlyTests-trunk/solr/core/src/test-files/solr/collection1/conf/protwords.txt to /configs/conf1/protwords.txt
   [junit4]   2> 2103755 INFO  (TEST-TestDynamicLoading.testDynamicLoading-seed#[1AB3E18A9263A2E2]) [    ] o.a.s.c.c.SolrZkClient makePath: /configs/conf1/protwords.txt
   [junit4]   2> 2103757 INFO  (TEST-TestDynamicLoading.testDynamicLoading-seed#[1AB3E18A9263A2E2]) [    ] o.a.s.c.AbstractZkTestCase put /x1/jenkins/jenkins-slave/workspace/Lucene-Solr-NightlyTests-trunk/solr/core/src/test-files/solr/collection1/conf/currency.xml to /configs/conf1/currency.xml
   [junit4]   2> 2103757 INFO  (TEST-TestDynamicLoading.testDynamicLoading-seed#[1AB3E18A9263A2E2]) [    ] o.a.s.c.c.SolrZkClient makePath: /configs/conf1/currency.xml
   [junit4]   2> 2103758 INFO  (TEST-TestDynamicLoading.testDynamicLoading-seed#[1AB3E18A9263A2E2]) [    ] o.a.s.c.AbstractZkTestCase put /x1/jenkins/jenkins-slave/workspace/Lucene-Solr-NightlyTests-trunk/solr/core/src/test-files/solr/collection1/conf/enumsConfig.xml to /configs/conf1/enumsConfig.xml
   [junit4]   2> 2103758 INFO  (TEST-TestDynamicLoading.testDynamicLoading-seed#[1AB3E18A9263A2E2]) [    ] o.a.s.c.c.SolrZkClient makePath: /configs/conf1/enumsConfig.xml
   [junit4]   2> 2103760 INFO  (TEST-TestDynamicLoading.testDynamicLoading-seed#[1AB3E18A9263A2E2]) [    ] o.a.s.c.AbstractZkTestCase put /x1/jenkins/jenkins-slave/workspace/Lucene-Solr-NightlyTests-trunk/solr/core/src/test-files/solr/collection1/conf/open-exchange-rates.json to /configs/conf1/open-exchange-rates.json
   [junit4]   2> 2103760 INFO  (TEST-TestDynamicLoading.testDynamicLoading-seed#[1AB3E18A9263A2E2]) [    ] o.a.s.c.c.SolrZkClient makePath: /configs/conf1/open-exchange-rates.json
   [junit4]   2> 2103761 INFO  (TEST-TestDynamicLoading.testDynamicLoading-seed#[1AB3E18A9263A2E2]) [    ] o.a.s.c.AbstractZkTestCase put /x1/jenkins/jenkins-slave/workspace/Lucene-Solr-NightlyTests-trunk/solr/core/src/test-files/solr/collection1/conf/mapping-ISOLatin1Accent.txt to /configs/conf1/mapping-ISOLatin1Accent.txt
   [junit4]   2> 2103762 INFO  (TEST-TestDynamicLoading.testDynamicLoading-seed#[1AB3E18A9263A2E2]) [    ] o.a.s.c.c.SolrZkClient makePath: /configs/conf1/mapping-ISOLatin1Accent.txt
   [junit4]   2> 2103763 INFO  (TEST-TestDynamicLoading.testDynamicLoading-seed#[1AB3E18A9263A2E2]) [    ] o.a.s.c.AbstractZkTestCase put /x1/jenkins/jenkins-slave/workspace/Lucene-Solr-NightlyTests-trunk/solr/core/src/test-files/solr/collection1/conf/old_synonyms.txt to /configs/conf1/old_synonyms.txt
   [junit4]   2> 2103763 INFO  (TEST-TestDynamicLoading.testDynamicLoading-seed#[1AB3E18A9263A2E2]) [    ] o.a.s.c.c.SolrZkClient makePath: /configs/conf1/old_synonyms.txt
   [junit4]   2> 2103764 INFO  (TEST-TestDynamicLoading.testDynamicLoading-seed#[1AB3E18A9263A2E2]) [    ] o.a.s.c.AbstractZkTestCase put /x1/jenkins/jenkins-slave/workspace/Lucene-Solr-NightlyTests-trunk/solr/core/src/test-files/solr/collection1/conf/synonyms.txt to /configs/conf1/synonyms.txt
   [junit4]   2> 2103765 INFO  (TEST-TestDynamicLoading.testDynamicLoading-seed#[1AB3E18A9263A2E2]) [    ] o.a.s.c.c.SolrZkClient makePath: /configs/conf1/synonyms.txt
   [junit4]   2> 2104083 INFO  (TEST-TestDynamicLoading.testDynamicLoading-seed#[1AB3E18A9263A2E2]) [    ] o.a.s.SolrTestCaseJ4 Writing core.properties file to /x1/jenkins/jenkins-slave/workspace/Lucene-Solr-NightlyTests-trunk/solr/build/solr-core/test/J2/temp/solr.core.TestDynamicLoading_1AB3E18A9263A2E2-001/control-001/cores/collection1
   [junit4]   2> 2104088 INFO  (TEST-TestDynamicLoading.testDynamicLoading-seed#[1AB3E18A9263A2E2]) [    ] o.e.j.s.Server jetty-9.2.13.v20150730
   [junit4]   2> 2104090 INFO  (TEST-TestDynamicLoading.testDynamicLoading-seed#[1AB3E18A9263A2E2]) [    ] o.e.j.s.h.ContextHandler Started o.e.j.s.ServletContextHandler@2c7d4708{/kyvy/kk,null,AVAILABLE}
   [junit4]   2> 2104100 INFO  (TEST-TestDynamicLoading.testDynamicLoading-seed#[1AB3E18A9263A2E2]) [    ] o.e.j.s.ServerConnector Started ServerConnector@4605aada{HTTP/1.1}{127.0.0.1:53338}
   [junit4]   2> 2104100 INFO  (TEST-TestDynamicLoading.testDynamicLoading-seed#[1AB3E18A9263A2E2]) [    ] o.e.j.s.Server Started @2107179ms
   [junit4]   2> 2104100 INFO  (TEST-TestDynamicLoading.testDynamicLoading-seed#[1AB3E18A9263A2E2]) [    ] o.a.s.c.s.e.JettySolrRunner Jetty properties: {solr.data.dir=/x1/jenkins/jenkins-slave/workspace/Lucene-Solr-NightlyTests-trunk/solr/build/solr-core/test/J2/temp/solr.core.TestDynamicLoading_1AB3E18A9263A2E2-001/tempDir-001/control/data, hostContext=/kyvy/kk, hostPort=53338, coreRootDirectory=/x1/jenkins/jenkins-slave/workspace/Lucene-Solr-NightlyTests-trunk/solr/build/solr-core/test/J2/../../../../../../../../../../x1/jenkins/jenkins-slave/workspace/Lucene-Solr-NightlyTests-trunk/solr/build/solr-core/test/J2/temp/solr.core.TestDynamicLoading_1AB3E18A9263A2E2-001/control-001/cores}
   [junit4]   2> 2104100 INFO  (TEST-TestDynamicLoading.testDynamicLoading-seed#[1AB3E18A9263A2E2]) [    ] o.a.s.s.SolrDispatchFilter SolrDispatchFilter.init(): sun.misc.Launcher$AppClassLoader@4e0e2f2a
   [junit4]   2> 2104100 INFO  (TEST-TestDynamicLoading.testDynamicLoading-seed#[1AB3E18A9263A2E2]) [    ] o.a.s.c.SolrResourceLoader new SolrResourceLoader for directory: '/x1/jenkins/jenkins-slave/workspace/Lucene-Solr-NightlyTests-trunk/solr/build/solr-core/test/J2/temp/solr.core.TestDynamicLoading_1AB3E18A9263A2E2-001/control-001'
   [junit4]   2> 2104100 INFO  (TEST-TestDynamicLoading.testDynamicLoading-seed#[1AB3E18A9263A2E2]) [    ] o.a.s.c.SolrResourceLoader JNDI not configured for solr (NoInitialContextEx)
   [junit4]   2> 2104100 INFO  (TEST-TestDynamicLoading.testDynamicLoading-seed#[1AB3E18A9263A2E2]) [    ] o.a.s.c.SolrResourceLoader solr home defaulted to 'solr/' (could not find system property or JNDI)
   [junit4]   2> 2104101 INFO  (TEST-TestDynamicLoading.testDynamicLoading-seed#[1AB3E18A9263A2E2]) [    ] o.a.s.c.c.SolrZkClient Using default ZkCredentialsProvider
   [junit4]   2> 2104102 INFO  (TEST-TestDynamicLoading.testDynamicLoading-seed#[1AB3E18A9263A2E2]) [    ] o.a.s.c.c.ConnectionManager Waiting for client to connect to ZooKeeper
   [junit4]   2> 2104103 INFO  (zkCallback-1093-thread-1) [    ] o.a.s.c.c.ConnectionManager Watcher org.apache.solr.common.cloud.ConnectionManager@86b8170 name:ZooKeeperConnection Watcher:127.0.0.1:53911/solr got event WatchedEvent state:SyncConnected type:None path:null path:null type:None
   [junit4]   2> 2104103 INFO  (TEST-TestDynamicLoading.testDynamicLoading-seed#[1AB3E18A9263A2E2]) [    ] o.a.s.c.c.ConnectionManager Client is connected to ZooKeeper
   [junit4]   2> 2104103 INFO  (TEST-TestDynamicLoading.testDynamicLoading-seed#[1AB3E18A9263A2E2]) [    ] o.a.s.c.c.SolrZkClient Using default ZkACLProvider
   [junit4]   2> 2104104 INFO  (TEST-TestDynamicLoading.testDynamicLoading-seed#[1AB3E18A9263A2E2]) [    ] o.a.s.s.SolrDispatchFilter Loading solr.xml from SolrHome (not found in ZooKeeper)
   [junit4]   2> 2104104 INFO  (TEST-TestDynamicLoading.testDynamicLoading-seed#[1AB3E18A9263A2E2]) [    ] o.a.s.c.SolrXmlConfig Loading container configuration from /x1/jenkins/jenkins-slave/workspace/Lucene-Solr-NightlyTests-trunk/solr/build/solr-core/test/J2/temp/solr.core.TestDynamicLoading_1AB3E18A9263A2E2-001/control-001/solr.xml
   [junit4]   2> 2104109 INFO  (TEST-TestDynamicLoading.testDynamicLoading-seed#[1AB3E18A9263A2E2]) [    ] o.a.s.c.CorePropertiesLocator Config-defined core root directory: /x1/jenkins/jenkins-slave/workspace/Lucene-Solr-NightlyTests-trunk/solr/build/solr-core/test/J2/../../../../../../../../../../x1/jenkins/jenkins-slave/workspace/Lucene-Solr-NightlyTests-trunk/solr/build/solr-core/test/J2/temp/solr.core.TestDynamicLoading_1AB3E18A9263A2E2-001/control-001/cores
   [junit4]   2> 2104109 INFO  (TEST-TestDynamicLoading.testDynamicLoading-seed#[1AB3E18A9263A2E2]) [    ] o.a.s.c.CoreContainer New CoreContainer 1457586994
   [junit4]   2> 2104109 INFO  (TEST-TestDynamicLoading.testDynamicLoading-seed#[1AB3E18A9263A2E2]) [    ] o.a.s.c.CoreContainer Loading cores into CoreContainer [instanceDir=/x1/jenkins/jenkins-slave/workspace/Lucene-Solr-NightlyTests-trunk/solr/build/solr-core/test/J2/temp/solr.core.TestDynamicLoading_1AB3E18A9263A2E2-001/control-001]
   [junit4]   2> 2104109 WARN  (TEST-TestDynamicLoading.testDynamicLoading-seed#[1AB3E18A9263A2E2]) [    ] o.a.s.c.CoreContainer Couldn't add files from /x1/jenkins/jenkins-slave/workspace/Lucene-Solr-NightlyTests-trunk/solr/build/solr-core/test/J2/temp/solr.core.TestDynamicLoading_1AB3E18A9263A2E2-001/control-001/lib to classpath: /x1/jenkins/jenkins-slave/workspace/Lucene-Solr-NightlyTests-trunk/solr/build/solr-core/test/J2/temp/solr.core.TestDynamicLoading_1AB3E18A9263A2E2-001/control-001/lib
   [junit4]   2> 2104109 INFO  (TEST-TestDynamicLoading.testDynamicLoading-seed#[1AB3E18A9263A2E2]) [    ] o.a.s.h.c.HttpShardHandlerFactory created with socketTimeout : 90000,urlScheme : ,connTimeout : 15000,maxConnectionsPerHost : 20,maxConnections : 10000,corePoolSize : 0,maximumPoolSize : 2147483647,maxThreadIdleTime : 5,sizeOfQueue : -1,fairnessPolicy : false,useRetries : false,
   [junit4]   2> 2104111 INFO  (TEST-TestDynamicLoading.testDynamicLoading-seed#[1AB3E18A9263A2E2]) [    ] o.a.s.u.UpdateShardHandler Creating UpdateShardHandler HTTP client with params: socketTimeout=340000&connTimeout=45000&retry=true
   [junit4]   2> 2104111 INFO  (TEST-TestDynamicLoading.testDynamicLoading-seed#[1AB3E18A9263A2E2]) [    ] o.a.s.l.LogWatcher SLF4J impl is org.slf4j.impl.Log4jLoggerFactory
   [junit4]   2> 2104111 INFO  (TEST-TestDynamicLoading.testDynamicLoading-seed#[1AB3E18A9263A2E2]) [    ] o.a.s.l.LogWatcher Registering Log Listener [Log4j (org.slf4j.impl.Log4jLoggerFactory)]
   [junit4]   2> 2104111 INFO  (TEST-TestDynamicLoading.testDynamicLoading-seed#[1AB3E18A9263A2E2]) [    ] o.a.s.c.ZkContainer Zookeeper client=127.0.0.1:53911/solr
   [junit4]   2> 2104111 INFO  (TEST-TestDynamicLoading.testDynamicLoading-seed#[1AB3E18A9263A2E2]) [    ] o.a.s.c.ZkController zkHost includes chroot
   [junit4]   2> 2104111 INFO  (TEST-TestDynamicLoading.testDynamicLoading-seed#[1AB3E18A9263A2E2]) [    ] o.a.s.c.c.SolrZkClient Using default ZkCredentialsProvider
   [junit4]   2> 2104116 INFO  (TEST-TestDynamicLoading.testDynamicLoading-seed#[1AB3E18A9263A2E2]) [    ] o.a.s.c.c.ConnectionManager Waiting for client to connect to ZooKeeper
   [junit4]   2> 2104116 INFO  (zkCallback-1096-thread-1) [    ] o.a.s.c.c.ConnectionManager Watcher org.apache.solr.common.cloud.ConnectionManager@1b6273cc name:ZooKeeperConnection Watcher:127.0.0.1:53911 got event WatchedEvent state:SyncConnected type:None path:null path:null type:None
   [junit4]   2> 2104116 INFO  (TEST-TestDynamicLoading.testDynamicLoading-seed#[1AB3E18A9263A2E2]) [    ] o.a.s.c.c.ConnectionManager Client is connected to ZooKeeper
   [junit4]   2> 2104116 INFO  (TEST-TestDynamicLoading.testDynamicLoading-seed#[1AB3E18A9263A2E2]) [    ] o.a.s.c.c.SolrZkClient Using default ZkACLProvider
   [junit4]   2> 2104118 INFO  (TEST-TestDynamicLoading.testDynamicLoading-seed#[1AB3E18A9263A2E2]) [n:127.0.0.1:53338_kyvy%2Fkk    ] o.a.s.c.c.ConnectionManager Waiting for client to connect to ZooKeeper
   [junit4]   2> 2104119 INFO  (zkCallback-1097-thread-1-processing-n:127.0.0.1:53338_kyvy%2Fkk) [n:127.0.0.1:53338_kyvy%2Fkk    ] o.a.s.c.c.ConnectionManager Watcher org.apache.solr.common.cloud.ConnectionManager@11605787 name:ZooKeeperConnection Watcher:127.0.0.1:53911/solr got event WatchedEvent state:SyncConnected type:None path:null path:null type:None
   [junit4]   2> 2104119 INFO  (TEST-TestDynamicLoading.testDynamicLoading-seed#[1AB3E18A9263A2E2]) [n:127.0.0.1:53338_kyvy%2Fkk    ] o.a.s.c.c.ConnectionManager Client is connected to ZooKeeper
   [junit4]   2> 2104120 INFO  (TEST-TestDynamicLoading.testDynamicLoading-seed#[1AB3E18A9263A2E2]) [n:127.0.0.1:53338_kyvy%2Fkk    ] o.a.s.c.c.SolrZkClient makePath: /overseer/queue
   [junit4]   2> 2104121 INFO  (TEST-TestDynamicLoading.testDynamicLoading-seed#[1AB3E18A9263A2E2]) [n:127.0.0.1:53338_kyvy%2Fkk    ] o.a.s.c.c.SolrZkClient makePath: /overseer/collection-queue-work
   [junit4]   2> 2104124 INFO  (TEST-TestDynamicLoading.testDynamicLoading-seed#[1AB3E18A9263A2E2]) [n:127.0.0.1:53338_kyvy%2Fkk    ] o.a.s.c.c.SolrZkClient makePath: /overseer/collection-map-running
   [junit4]   2> 2104126 INFO  (TEST-TestDynamicLoading.testDynamicLoading-seed#[1AB3E18A9263A2E2]) [n:127.0.0.1:53338_kyvy%2Fkk    ] o.a.s.c.c.SolrZkClient makePath: /overseer/collection-map-completed
   [junit4]   2> 2104128 INFO  (TEST-TestDynamicLoading.testDynamicLoading-seed#[1AB3E18A9263A2E2]) [n:127.0.0.1:53338_kyvy%2Fkk    ] o.a.s.c.c.SolrZkClient makePath: /overseer/collection-map-failure
   [junit4]   2> 2104131 INFO  (TEST-TestDynamicLoading.testDynamicLoading-seed#[1AB3E18A9263A2E2]) [n:127.0.0.1:53338_kyvy%2Fkk    ] o.a.s.c.c.SolrZkClient makePath: /live_nodes
   [junit4]   2> 2104132 INFO  (TEST-TestDynamicLoading.testDynamicLoading-seed#[1AB3E18A9263A2E2]) [n:127.0.0.1:53338_kyvy%2Fkk    ] o.a.s.c.c.SolrZkClient makePath: /aliases.json
   [junit4]   2> 2104133 INFO  (TEST-TestDynamicLoading.testDynamicLoading-seed#[1AB3E18A9263A2E2]) [n:127.0.0.1:53338_kyvy%2Fkk    ] o.a.s.c.c.SolrZkClient makePath: /clusterstate.json
   [junit4]   2> 2104134 INFO  (TEST-TestDynamicLoading.testDynamicLoading-seed#[1AB3E18A9263A2E2]) [n:127.0.0.1:53338_kyvy%2Fkk    ] o.a.s.c.c.SolrZkClient makePath: /security.json
   [junit4]   2> 2104135 INFO  (TEST-TestDynamicLoading.testDynamicLoading-seed#[1AB3E18A9263A2E2]) [n:127.0.0.1:53338_kyvy%2Fkk    ] o.a.s.c.ZkController Register node as live in ZooKeeper:/live_nodes/127.0.0.1:53338_kyvy%2Fkk
   [junit4]   2> 2104135 INFO  (TEST-TestDynamicLoading.testDynamicLoading-seed#[1AB3E18A9263A2E2]) [n:127.0.0.1:53338_kyvy%2Fkk    ] o.a.s.c.c.SolrZkClient makePath: /live_nodes/127.0.0.1:53338_kyvy%2Fkk
   [junit4]   2> 2104137 INFO  (TEST-TestDynamicLoading.testDynamicLoading-seed#[1AB3E18A9263A2E2]) [n:127.0.0.1:53338_kyvy%2Fkk    ] o.a.s.c.c.SolrZkClient makePath: /overseer_elect
   [junit4]   2> 2104138 INFO  (TEST-TestDynamicLoading.testDynamicLoading-seed#[1AB3E18A9263A2E2]) [n:127.0.0.1:53338_kyvy%2Fkk    ] o.a.s.c.c.SolrZkClient makePath: /overseer_elect/election
   [junit4]   2> 2104145 INFO  (TEST-TestDynamicLoading.testDynamicLoading-seed#[1AB3E18A9263A2E2]) [n:127.0.0.1:53338_kyvy%2Fkk    ] o.a.s.c.Overseer Overseer (id=null) closing
   [junit4]   2> 2104145 INFO  (TEST-TestDynamicLoading.testDynamicLoading-seed#[1AB3E18A9263A2E2]) [n:127.0.0.1:53338_kyvy%2Fkk    ] o.a.s.c.LeaderElector Joined leadership election with path: /overseer_elect/election/95201109831188484-127.0.0.1:53338_kyvy%2Fkk-n_0000000000
   [junit4]   2> 2104145 INFO  (TEST-TestDynamicLoading.testDynamicLoading-seed#[1AB3E18A9263A2E2]) [n:127.0.0.1:53338_kyvy%2Fkk    ] o.a.s.c.OverseerElectionContext I am going to be the leader 127.0.0.1:53338_kyvy%2Fkk
   [junit4]   2> 2104145 INFO  (TEST-TestDynamicLoading.testDynamicLoading-seed#[1AB3E18A9263A2E2]) [n:127.0.0.1:53338_kyvy%2Fkk    ] o.a.s.c.c.SolrZkClient makePath: /overseer_elect/leader
   [junit4]   2> 2104147 INFO  (TEST-TestDynamicLoading.testDynamicLoading-seed#[1AB3E18A9263A2E2]) [n:127.0.0.1:53338_kyvy%2Fkk    ] o.a.s.c.Overseer Overseer (id=95201109831188484-127.0.0.1:53338_kyvy%2Fkk-n_0000000000) starting
   [junit4]   2> 2104148 INFO  (TEST-TestDynamicLoading.testDynamicLoading-seed#[1AB3E18A9263A2E2]) [n:127.0.0.1:53338_kyvy%2Fkk    ] o.a.s.c.c.SolrZkClient makePath: /overseer/queue-work
   [junit4]   2> 2104155 INFO  (TEST-TestDynamicLoading.testDynamicLoading-seed#[1AB3E18A9263A2E2]) [n:127.0.0.1:53338_kyvy%2Fkk    ] o.a.s.c.OverseerAutoReplicaFailoverThread Starting OverseerAutoReplicaFailoverThread autoReplicaFailoverWorkLoopDelay=10000 autoReplicaFailoverWaitAfterExpiration=30000 autoReplicaFailoverBadNodeExpiration=60000
   [junit4]   2> 2104160 INFO  (OverseerCollectionConfigSetProcessor-95201109831188484-127.0.0.1:53338_kyvy%2Fkk-n_0000000000) [n:127.0.0.1:53338_kyvy%2Fkk    ] o.a.s.c.OverseerTaskProcessor Process current queue of overseer operations
   [junit4]   2> 2104160 INFO  (OverseerStateUpdate-95201109831188484-127.0.0.1:53338_kyvy%2Fkk-n_0000000000) [n:127.0.0.1:53338_kyvy%2Fkk    ] o.a.s.c.Overseer Starting to work on the main queue
   [junit4]   2> 2104160 INFO  (TEST-TestDynamicLoading.testDynamicLoading-seed#[1AB3E18A9263A2E2]) [n:127.0.0.1:53338_kyvy%2Fkk    ] o.a.s.c.c.ZkStateReader Updating cluster state from ZooKeeper... 
   [junit4]   2> 2104176 INFO  (TEST-TestDynamicLoading.testDynamicLoading-seed#[1AB3E18A9263A2E2]) [n:127.0.0.1:53338_kyvy%2Fkk    ] o.a.s.c.CoreContainer Security conf doesn't exist. Skipping setup for authorization module.
   [junit4]   2> 2104176 INFO  (TEST-TestDynamicLoading.testDynamicLoading-seed#[1AB3E18A9263A2E2]) [n:127.0.0.1:53338_kyvy%2Fkk    ] o.a.s.c.CoreContainer No authentication plugin used.
   [junit4]   2> 2104177 INFO  (TEST-TestDynamicLoading.testDynamicLoading-seed#[1AB3E18A9263A2E2]) [n:127.0.0.1:53338_kyvy%2Fkk    ] o.a.s.c.CorePropertiesLocator Looking for core definitions underneath /x1/jenkins/jenkins-slave/workspace/Lucene-Solr-NightlyTests-trunk/solr/build/solr-core/test/J2/../../../../../../../../../../x1/jenkins/jenkins-slave/workspace/Lucene-Solr-NightlyTests-trunk/solr/build/solr-core/test/J2/temp/solr.core.TestDynamicLoading_1AB3E18A9263A2E2-001/control-001/cores
   [junit4]   2> 2104178 INFO  (TEST-TestDynamicLoading.testDynamicLoading-seed#[1AB3E18A9263A2E2]) [n:127.0.0.1:53338_kyvy%2Fkk    ] o.a.s.c.CoreDescriptor Created CoreDescriptor: {name=collection1, config=solrconfig.xml, transient=false, schema=schema.xml, loadOnStartup=true, configSetProperties=configsetprops.json, collection=control_collection, coreNodeName=, dataDir=data/, shard=}
   [junit4]   2> 2104178 INFO  (TEST-TestDynamicLoading.testDynamicLoading-seed#[1AB3E18A9263A2E2]) [n:127.0.0.1:53338_kyvy%2Fkk    ] o.a.s.c.CorePropertiesLocator Found core collection1 in /x1/jenkins/jenkins-slave/workspace/Lucene-Solr-NightlyTests-trunk/solr/build/solr-core/test/J2/../../../../../../../../../../x1/jenkins/jenkins-slave/workspace/Lucene-Solr-NightlyTests-trunk/solr/build/solr-core/test/J2/temp/solr.core.TestDynamicLoading_1AB3E18A9263A2E2-001/control-001/cores/collection1
   [junit4]   2> 2104178 INFO  (TEST-TestDynamicLoading.testDynamicLoading-seed#[1AB3E18A9263A2E2]) [n:127.0.0.1:53338_kyvy%2Fkk    ] o.a.s.c.CorePropertiesLocator Found 1 core definitions
   [junit4]   2> 2104179 INFO  (TEST-TestDynamicLoading.testDynamicLoading-seed#[1AB3E18A9263A2E2]) [n:127.0.0.1:53338_kyvy%2Fkk    ] o.a.s.s.SolrDispatchFilter user.dir=/x1/jenkins/jenkins-slave/workspace/Lucene-Solr-NightlyTests-trunk/solr/build/solr-core/test/J2
   [junit4]   2> 2104179 INFO  (TEST-TestDynamicLoading.testDynamicLoading-seed#[1AB3E18A9263A2E2]) [n:127.0.0.1:53338_kyvy%2Fkk    ] o.a.s.s.SolrDispatchFilter SolrDispatchFilter.init() done
   [junit4]   2> 2104179 INFO  (coreLoadExecutor-2997-thread-1-processing-n:127.0.0.1:53338_kyvy%2Fkk) [n:127.0.0.1:53338_kyvy%2Fkk c:control_collection   x:collection1] o.a.s.c.ZkController publishing state=down
   [junit4]   2> 2104179 INFO  (coreLoadExecutor-2997-thread-1-processing-n:127.0.0.1:53338_kyvy%2Fkk) [n:127.0.0.1:53338_kyvy%2Fkk c:control_collection   x:collection1] o.a.s.c.ZkController numShards not found on descriptor - reading it from system property
   [junit4]   2> 2104180 INFO  (OverseerStateUpdate-95201109831188484-127.0.0.1:53338_kyvy%2Fkk-n_0000000000) [n:127.0.0.1:53338_kyvy%2Fkk    ] o.a.s.c.Overseer processMessage: queueSize: 1, message = {
   [junit4]   2>   "core":"collection1",
   [junit4]   2>   "roles":null,
   [junit4]   2>   "base_url":"http://127.0.0.1:53338/kyvy/kk",
   [junit4]   2>   "node_name":"127.0.0.1:53338_kyvy%2Fkk",
   [junit4]   2>   "numShards":"1",
   [junit4]   2>   "state":"down",
   [junit4]   2>   "shard":null,
   [junit4]   2>   "collection":"control_collection",
   [junit4]   2>   "operation":"state"} current state version: 0
   [junit4]   2> 2104181 INFO  (coreLoadExecutor-2997-thread-1-processing-n:127.0.0.1:53338_kyvy%2Fkk) [n:127.0.0.1:53338_kyvy%2Fkk c:control_collection   x:collection1] o.a.s.c.ZkController look for our core node name
   [junit4]   2> 2104181 INFO  (OverseerStateUpdate-95201109831188484-127.0.0.1:53338_kyvy%2Fkk-n_0000000000) [n:127.0.0.1:53338_kyvy%2Fkk    ] o.a.s.c.o.ReplicaMutator Update state numShards=1 message={
   [junit4]   2>   "core":"collection1",
   [junit4]   2>   "roles":null,
   [junit4]   2>   "base_url":"http://127.0.0.1:53338/kyvy/kk",
   [junit4]   2>   "node_name":"127.0.0.1:53338_kyvy%2Fkk",
   [junit4]   2>   "numShards":"1",
   [junit4]   2>   "state":"down",
   [junit4]   2>   "shard":null,
   [junit4]   2>   "collection":"control_collection",
   [junit4]   2>   "operation":"state"}
   [junit4]   2> 2104184 INFO  (OverseerStateUpdate-95201109831188484-127.0.0.1:53338_kyvy%2Fkk-n_0000000000) [n:127.0.0.1:53338_kyvy%2Fkk    ] o.a.s.c.o.ClusterStateMutator building a new cName: control_collection
   [junit4]   2> 2104184 INFO  (OverseerStateUpdate-95201109831188484-127.0.0.1:53338_kyvy%2Fkk-n_0000000000) [n:127.0.0.1:53338_kyvy%2Fkk    ] o.a.s.c.o.ReplicaMutator Assigning new node to shard shard=shard1
   [junit4]   2> 2104185 INFO  (zkCallback-1097-thread-1-processing-n:127.0.0.1:53338_kyvy%2Fkk) [n:127.0.0.1:53338_kyvy%2Fkk    ] o.a.s.c.c.ZkStateReader A cluster state change: [WatchedEvent state:SyncConnected type:NodeDataChanged path:/clusterstate.json], has occurred - updating... (live nodes size: [1])
   [junit4]   2> 2105181 INFO  (coreLoadExecutor-2997-thread-1-processing-n:127.0.0.1:53338_kyvy%2Fkk) [n:127.0.0.1:53338_kyvy%2Fkk c:control_collection   x:collection1] o.a.s.c.ZkController waiting to find shard id in clusterstate for collection1
   [junit4]   2> 2105181 INFO  (coreLoadExecutor-2997-thread-1-processing-n:127.0.0.1:53338_kyvy%2Fkk) [n:127.0.0.1:53338_kyvy%2Fkk c:control_collection   x:collection1] o.a.s.c.ZkController Check for collection zkNode:control_collection
   [junit4]   2> 2105182 INFO  (coreLoadExecutor-2997-thread-1-processing-n:127.0.0.1:53338_kyvy%2Fkk) [n:127.0.0.1:53338_kyvy%2Fkk c:control_collection   x:collection1] o.a.s.c.ZkController Collection zkNode exists
   [junit4]   2> 2105182 INFO  (coreLoadExecutor-2997-thread-1-processing-n:127.0.0.1:53338_kyvy%2Fkk) [n:127.0.0.1:53338_kyvy%2Fkk c:control_collection   x:collection1] o.a.s.c.c.ZkStateReader Load collection config from: [/collections/control_collection]
   [junit4]   2> 2105182 INFO  (coreLoadExecutor-2997-thread-1-processing-n:127.0.0.1:53338_kyvy%2Fkk) [n:127.0.0.1:53338_kyvy%2Fkk c:control_collection   x:collection1] o.a.s.c.c.ZkStateReader path=[/collections/control_collection] [configName]=[conf1] specified config exists in ZooKeeper
   [junit4]   2> 2105182 INFO  (coreLoadExecutor-2997-thread-1-processing-n:127.0.0.1:53338_kyvy%2Fkk) [n:127.0.0.1:53338_kyvy%2Fkk c:control_collection   x:collection1] o.a.s.c.SolrResourceLoader new SolrResourceLoader for directory: '/x1/jenkins/jenkins-slave/workspace/Lucene-Solr-NightlyTests-trunk/solr/build/solr-core/test/J2/temp/solr.core.TestDynamicLoading_1AB3E18A9263A2E2-001/control-001/cores/collection1'
   [junit4]   2> 2105183 INFO  (coreLoadExecutor-2997-thread-1-processing-n:127.0.0.1:53338_kyvy%2Fkk) [n:127.0.0.1:53338_kyvy%2Fkk c:control_collection   x:collection1] o.a.s.c.SolrResourceLoader JNDI not configured for solr (NoInitialContextEx)
   [junit4]   2> 2105183 INFO  (coreLoadExecutor-2997-thread-1-processing-n:127.0.0.1:53338_kyvy%2Fkk) [n:127.0.0.1:53338_kyvy%2Fkk c:control_collection   x:collection1] o.a.s.c.SolrResourceLoader solr home defaulted to 'solr/' (could not find system property or JNDI)
   [junit4]   2> 2105186 INFO  (coreLoadExecutor-2997-thread-1-processing-n:127.0.0.1:53338_kyvy%2Fkk) [n:127.0.0.1:53338_kyvy%2Fkk c:control_collection   x:collection1] o.a.s.c.Config loaded config solrconfig.xml with version 0 
   [junit4]   2> 2105191 INFO  (coreLoadExecutor-2997-thread-1-processing-n:127.0.0.1:53338_kyvy%2Fkk) [n:127.0.0.1:53338_kyvy%2Fkk c:control_collection   x:collection1] o.a.s.c.SolrConfig current version of requestparams : -1
   [junit4]   2> 2105195 INFO  (coreLoadExecutor-2997-thread-1-processing-n:127.0.0.1:53338_kyvy%2Fkk) [n:127.0.0.1:53338_kyvy%2Fkk c:control_collection   x:collection1] o.a.s.c.SolrConfig Using Lucene MatchVersion: 6.0.0
   [junit4]   2> 2105204 INFO  (coreLoadExecutor-2997-thread-1-processing-n:127.0.0.1:53338_kyvy%2Fkk) [n:127.0.0.1:53338_kyvy%2Fkk c:control_collection   x:collection1] o.a.s.c.SolrConfig Loaded SolrConfig: solrconfig.xml
   [junit4]   2> 2105209 INFO  (coreLoadExecutor-2997-thread-1-processing-n:127.0.0.1:53338_kyvy%2Fkk) [n:127.0.0.1:53338_kyvy%2Fkk c:control_collection   x:collection1] o.a.s.s.IndexSchema [collection1] Schema name=test
   [junit4]   2> 2105311 INFO  (coreLoadExecutor-2997-thread-1-processing-n:127.0.0.1:53338_kyvy%2Fkk) [n:127.0.0.1:53338_kyvy%2Fkk c:control_collection   x:collection1] o.a.s.s.OpenExchangeRatesOrgProvider Initialized with rates=open-exchange-rates.json, refreshInterval=1440.
   [junit4]   2> 2105317 INFO  (coreLoadExecutor-2997-thread-1-processing-n:127.0.0.1:53338_kyvy%2Fkk) [n:127.0.0.1:53338_kyvy%2Fkk c:control_collection   x:collection1] o.a.s.s.IndexSchema default search field in schema is text
   [junit4]   2> 2105318 INFO  (coreLoadExecutor-2997-thread-1-processing-n:127.0.0.1:53338_kyvy%2Fkk) [n:127.0.0.1:53338_kyvy%2Fkk c:control_collection   x:collection1] o.a.s.s.IndexSchema unique key field: id
   [junit4]   2> 2105326 INFO  (coreLoadExecutor-2997-thread-1-processing-n:127.0.0.1:53338_kyvy%2Fkk) [n:127.0.0.1:53338_kyvy%2Fkk c:control_collection   x:collection1] o.a.s.s.FileExchangeRateProvider Reloading exchange rates from file currency.xml
   [junit4]   2> 2105329 INFO  (coreLoadExecutor-2997-thread-1-processing-n:127.0.0.1:53338_kyvy%2Fkk) [n:127.0.0.1:53338_kyvy%2Fkk c:control_collection   x:collection1] o.a.s.s.FileExchangeRateProvider Reloading exchange rates from file currency.xml
   [junit4]   2> 2105331 INFO  (coreLoadExecutor-2997-thread-1-processing-n:127.0.0.1:53338_kyvy%2Fkk) [n:127.0.0.1:53338_kyvy%2Fkk c:control_collection   x:collection1] o.a.s.s.OpenExchangeRatesOrgProvider Reloading exchange rates from open-exchange-rates.json
   [junit4]   2> 2105331 INFO  (coreLoadExecutor-2997-thread-1-processing-n:127.0.0.1:53338_kyvy%2Fkk) [n:127.0.0.1:53338_kyvy%2Fkk c:control_collection   x:collection1] o.a.s.s.OpenExchangeRatesOrgProvider Reloading exchange rates from open-exchange-rates.json
   [junit4]   2> 2105333 INFO  (coreLoadExecutor-2997-thread-1-processing-n:127.0.0.1:53338_kyvy%2Fkk) [n:127.0.0.1:53338_kyvy%2Fkk c:control_collection   x:collection1] o.a.s.c.ConfigSetProperties Did not find ConfigSet properties, assuming default properties: Can't find resource 'configsetprops.json' in classpath or '/configs/conf1', cwd=/x1/jenkins/jenkins-slave/workspace/Lucene-Solr-NightlyTests-trunk/solr/build/solr-core/test/J2
   [junit4]   2> 2105333 INFO  (coreLoadExecutor-2997-thread-1-processing-n:127.0.0.1:53338_kyvy%2Fkk) [n:127.0.0.1:53338_kyvy%2Fkk c:control_collection   x:collection1] o.a.s.c.CoreContainer Creating SolrCore 'collection1' using configuration from collection control_collection
   [junit4]   2> 2105333 INFO  (coreLoadExecutor-2997-thread-1-processing-n:127.0.0.1:53338_kyvy%2Fkk) [n:127.0.0.1:53338_kyvy%2Fkk c:control_collection s:shard1 r:core_node1 x:collection1] o.a.s.c.SolrCore org.apache.solr.core.MockDirectoryFactory
   [junit4]   2> 2105334 INFO  (coreLoadExecutor-2997-thread-1-processing-n:127.0.0.1:53338_kyvy%2Fkk) [n:127.0.0.1:53338_kyvy%2Fkk c:control_collection s:shard1 r:core_node1 x:collection1] o.a.s.c.SolrCore [[collection1] ] Opening new SolrCore at [/x1/jenkins/jenkins-slave/workspace/Lucene-Solr-NightlyTests-trunk/solr/build/solr-core/test/J2/temp/solr.core.TestDynamicLoading_1AB3E18A9263A2E2-001/control-001/cores/collection1], dataDir=[/x1/jenkins/jenkins-slave/workspace/Lucene-Solr-NightlyTests-trunk/solr/build/solr-core/test/J2/../../../../../../../../../../x1/jenkins/jenkins-slave/workspace/Lucene-Solr-NightlyTests-trunk/solr/build/solr-core/test/J2/temp/solr.core.TestDynamicLoading_1AB3E18A9263A2E2-001/control-001/cores/collection1/data/]
   [junit4]   2> 2105334 INFO  (coreLoadExecutor-2997-thread-1-processing-n:127.0.0.1:53338_kyvy%2Fkk) [n:127.0.0.1:53338_kyvy%2Fkk c:control_collection s:shard1 r:core_node1 x:collection1] o.a.s.c.JmxMonitoredMap JMX monitoring is enabled. Adding Solr mbeans to JMX Server: com.sun.jmx.mbeanserver.JmxMBeanServer@3da91be9
   [junit4]   2> 2105334 INFO  (coreLoadExecutor-2997-thread-1-processing-n:127.0.0.1:53338_kyvy%2Fkk) [n:127.0.0.1:53338_kyvy%2Fkk c:control_collection s:shard1 r:core_node1 x:collection1] o.a.s.c.CachingDirectoryFactory return new directory for /x1/jenkins/jenkins-slave/workspace/Lucene-Solr-NightlyTests-trunk/solr/build/solr-core/test/J2/../../../../../../../../../../x1/jenkins/jenkins-slave/workspace/Lucene-Solr-NightlyTests-trunk/solr/build/solr-core/test/J2/temp/solr.core.TestDynamicLoading_1AB3E18A9263A2E2-001/control-001/cores/collection1/data
   [junit4]   2> 2105334 INFO  (coreLoadExecutor-2997-thread-1-processing-n:127.0.0.1:53338_kyvy%2Fkk) [n:127.0.0.1:53338_kyvy%2Fkk c:control_collection s:shard1 r:core_node1 x:collection1] o.a.s.c.SolrCore New index directory detected: old=null new=/x1/jenkins/jenkins-slave/workspace/Lucene-Solr-NightlyTests-trunk/solr/build/solr-core/test/J2/../../../../../../../../../../x1/jenkins/jenkins-slave/workspace/Lucene-Solr-NightlyTests-trunk/solr/build/solr-core/test/J2/temp/solr.core.TestDynamicLoading_1AB3E18A9263A2E2-001/control-001/cores/collection1/data/index/
   [junit4]   2> 2105334 WARN  (coreLoadExecutor-2997-thread-1-processing-n:127.0.0.1:53338_kyvy%2Fkk) [n:127.0.0.1:53338_kyvy%2Fkk c:control_collection s:shard1 r:core_node1 x:collection1] o.a.s.c.SolrCore [collection1] Solr index directory '/x1/jenkins/jenkins-slave/workspace/Lucene-Solr-NightlyTests-trunk/solr/build/solr-core/test/J2/../../../../../../../../../../x1/jenkins/jenkins-slave/workspace/Lucene-Solr-NightlyTests-trunk/solr/build/solr-core/test/J2/temp/solr.core.TestDynamicLoading_1AB3E18A9263A2E2-001/control-001/cores/collection1/data/index' doesn't exist. Creating new index...
   [junit4]   2> 2105335 INFO  (coreLoadExecutor-2997-thread-1-processing-n:127.0.0.1:53338_kyvy%2Fkk) [n:127.0.0.1:53338_kyvy%2Fkk c:control_collection s:shard1 r:core_node1 x:collection1] o.a.s.c.CachingDirectoryFactory return new directory for /x1/jenkins/jenkins-slave/workspace/Lucene-Solr-NightlyTests-trunk/solr/build/solr-core/test/J2/../../../../../../../../../../x1/jenkins/jenkins-slave/workspace/Lucene-Solr-NightlyTests-trunk/solr/build/solr-core/test/J2/temp/solr.core.TestDynamicLoading_1AB3E18A9263A2E2-001/control-001/cores/collection1/data/index
   [junit4]   2> 2105335 INFO  (coreLoadExecutor-2997-thread-1-processing-n:127.0.0.1:53338_kyvy%2Fkk) [n:127.0.0.1:53338_kyvy%2Fkk c:control_collection s:shard1 r:core_node1 x:collection1] o.a.s.u.RandomMergePolicy RandomMergePolicy wrapping class org.apache.lucene.index.TieredMergePolicy: [TieredMergePolicy: maxMergeAtOnce=26, maxMergeAtOnceExplicit=17, maxMergedSegmentMB=20.7958984375, floorSegmentMB=1.0419921875, forceMergeDeletesPctAllowed=19.22508172262372, segmentsPerTier=26.0, maxCFSSegmentSizeMB=8.796093022207999E12, noCFSRatio=0.7866353431685463
   [junit4]   2> 2105335 INFO  (coreLoadExecutor-2997-thread-1-processing-n:127.0.0.1:53338_kyvy%2Fkk) [n:127.0.0.1:53338_kyvy%2Fkk c:control_collection s:shard1 r:core_node1 x:collection1] o.a.s.c.SolrDeletionPolicy SolrDeletionPolicy.onCommit: commits: num=1
   [junit4]   2> 	commit{dir=MockDirectoryWrapper(RAMDirectory@6488d906 lockFactory=org.apache.lucene.store.SingleInstanceLockFactory@60238a80),segFN=segments_1,generation=1}
   [junit4]   2> 2105335 INFO  (coreLoadExecutor-2997-thread-1-processing-n:127.0.0.1:53338_kyvy%2Fkk) [n:127.0.0.1:53338_kyvy%2Fkk c:control_collection s:shard1 r:core_node1 x:collection1] o.a.s.c.SolrDeletionPolicy newest commit generation = 1
   [junit4]   2> 2105336 INFO  (OldIndexDirectoryCleanupThreadForCore-collection1) [n:127.0.0.1:53338_kyvy%2Fkk c:control_collection s:shard1 r:core_node1 x:collection1] o.a.s.c.SolrCore Looking for old index directories to cleanup for core collection1 in /x1/jenkins/jenkins-slave/workspace/Lucene-Solr-NightlyTests-trunk/solr/build/solr-core/test/J2/../../../../../../../../../../x1/jenkins/jenkins-slave/workspace/Lucene-Solr-NightlyTests-trunk/solr/build/solr-core/test/J2/temp/solr.core.TestDynamicLoading_1AB3E18A9263A2E2-001/control-001/cores/collection1/data/
   [junit4]   2> 2105336 WARN  (OldIndexDirectoryCleanupThreadForCore-collection1) [n:127.0.0.1:53338_kyvy%2Fkk c:control_collection s:shard1 r:core_node1 x:collection1] o.a.s.c.DirectoryFactory /x1/jenkins/jenkins-slave/workspace/Lucene-Solr-NightlyTests-trunk/solr/build/solr-core/test/J2/../../../../../../../../../../x1/jenkins/jenkins-slave/workspace/Lucene-Solr-NightlyTests-trunk/solr/build/solr-core/test/J2/temp/solr.core.TestDynamicLoading_1AB3E18A9263A2E2-001/control-001/cores/collection1/data/ does not point to a valid data directory; skipping clean-up of old index directories.
   [junit4]   2> 2105339 INFO  (coreLoadExecutor-2997-thread-1-processing-n:127.0.0.1:53338_kyvy%2Fkk) [n:127.0.0.1:53338_kyvy%2Fkk c:control_collection s:shard1 r:core_node1 x:collection1] o.a.s.u.p.UpdateRequestProcessorChain creating updateRequestProcessorChain "nodistrib"
   [junit4]   2> 2105339 INFO  (coreLoadExecutor-2997-thread-1-processing-n:127.0.0.1:53338_kyvy%2Fkk) [n:127.0.0.1:53338_kyvy%2Fkk c:control_collection s:shard1 r:core_node1 x:collection1] o.a.s.u.p.UpdateRequestProcessorChain creating updateRequestProcessorChain "dedupe"
   [junit4]   2> 2105339 INFO  (coreLoadExecutor-2997-thread-1-processing-n:127.0.0.1:53338_kyvy%2Fkk) [n:127.0.0.1:53338_kyvy%2Fkk c:control_collection s:shard1 r:core_node1 x:collection1] o.a.s.u.p.UpdateRequestProcessorChain inserting DistributedUpdateProcessorFactory into updateRequestProcessorChain "dedupe"
   [junit4]   2> 2105339 INFO  (coreLoadExecutor-2997-thread-1-processing-n:127.0.0.1:53338_kyvy%2Fkk) [n:127.0.0.1:53338_kyvy%2Fkk c:control_collection s:shard1 r:core_node1 x:collection1] o.a.s.u.p.UpdateRequestProcessorChain creating updateRequestProcessorChain "stored_sig"
   [junit4]   2> 2105339 INFO  (coreLoadExecutor-2997-thread-1-processing-n:127.0.0.1:53338_kyvy%2Fkk) [n:127.0.0.1:53338_kyvy%2Fkk c:control_collection s:shard1 r:core_node1 x:collection1] o.a.s.u.p.UpdateRequestProcessorChain inserting DistributedUpdateProcessorFactory into updateRequestProcessorChain "stored_sig"
   [junit4]   2> 2105339 INFO  (coreLoadExecutor-2997-thread-1-processing-n:127.0.0.1:53338_kyvy%2Fkk) [n:127.0.0.1:53338_kyvy%2Fkk c:control_collection s:shard1 r:core_node1 x:collection1] o.a.s.u.p.UpdateRequestProcessorChain creating updateRequestProcessorChain "distrib-dup-test-chain-explicit"
   [junit4]   2> 2105339 INFO  (coreLoadExecutor-2997-thread-1-processing-n:127.0.0.1:53338_kyvy%2Fkk) [n:127.0.0.1:53338_kyvy%2Fkk c:control_collection s:shard1 r:core_node1 x:collection1] o.a.s.u.p.UpdateRequestProcessorChain creating updateRequestProcessorChain "distrib-dup-test-chain-implicit"
   [junit4]   2> 2105340 INFO  (coreLoadExecutor-2997-thread-1-processing-n:127.0.0.1:53338_kyvy%2Fkk) [n:127.0.0.1:53338_kyvy%2Fkk c:control_collection s:shard1 r:core_node1 x:collection1] o.a.s.u.p.UpdateRequestProcessorChain inserting DistributedUpdateProcessorFactory into updateRequestProcessorChain "distrib-dup-test-chain-implicit"
   [junit4]   2> 2105340 INFO  (coreLoadExecutor-2997-thread-1-processing-n:127.0.0.1:53338_kyvy%2Fkk) [n:127.0.0.1:53338_kyvy%2Fkk c:control_collection s:shard1 r:core_node1 x:collection1] o.a.s.c.SolrCore no updateRequestProcessorChain defined as default, creating implicit default
   [junit4]   2> 2105340 WARN  (coreLoadExecutor-2997-thread-1-processing-n:127.0.0.1:53338_kyvy%2Fkk) [n:127.0.0.1:53338_kyvy%2Fkk c:control_collection s:shard1 r:core_node1 x:collection1] o.a.s.c.RequestHandlers INVALID paramSet a in requestHandler {type = requestHandler,name = /dump,class = DumpRequestHandler,args = {defaults={a=A,b=B}}}
   [junit4]   2> 2105342 INFO  (coreLoadExecutor-2997-thread-1-processing-n:127.0.0.1:53338_kyvy%2Fkk) [n:127.0.0.1:53338_kyvy%2Fkk c:control_collection s:shard1 r:core_node1 x:collection1] o.a.s.h.l.XMLLoader xsltCacheLifetimeSeconds=60
   [junit4]   2> 2105343 INFO  (coreLoadExecutor-2997-thread-1-processing-n:127.0.0.1:53338_kyvy%2Fkk) [n:127.0.0.1:53338_kyvy%2Fkk c:control_collection s:shard1 r:core_node1 x:collection1] o.a.s.h.l.XMLLoader xsltCacheLifetimeSeconds=60
   [junit4]   2> 2105343 INFO  (coreLoadExecutor-2997-thread-1-processing-n:127.0.0.1:53338_kyvy%2Fkk) [n:127.0.0.1:53338_kyvy%2Fkk c:control_collection s:shard1 r:core_node1 x:collection1] o.a.s.h.l.XMLLoader xsltCacheLifetimeSeconds=60
   [junit4]   2> 2105345 INFO  (coreLoadExecutor-2997-thread-1-processing-n:127.0.0.1:53338_kyvy%2Fkk) [n:127.0.0.1:53338_kyvy%2Fkk c:control_collection s:shard1 r:core_node1 x:collection1] o.a.s.h.l.XMLLoader xsltCacheLifetimeSeconds=60
   [junit4]   2> 2105350 INFO  (coreLoadExecutor-2997-thread-1-processing-n:127.0.0.1:53338_kyvy%2Fkk) [n:127.0.0.1:53338_kyvy%2Fkk c:control_collection s:shard1 r:core_node1 x:collection1] o.a.s.c.RequestHandlers Registered paths: /admin/mbeans,standard,/dump,/update/csv,/sql,/update/json/docs,/admin/luke,/export,/admin/segments,/get,/admin/system,/replication,/admin/properties,/config,/stream,/schema,/admin/plugins,/admin/logging,/update/json,/admin/threads,/admin/ping,/update,/admin/file
   [junit4]   2> 2105351 INFO  (coreLoadExecutor-2997-thread-1-processing-n:127.0.0.1:53338_kyvy%2Fkk) [n:127.0.0.1:53338_kyvy%2Fkk c:control_collection s:shard1 r:core_node1 x:collection1] o.a.s.c.SolrCore Using default statsCache cache: org.apache.solr.search.stats.LocalStatsCache
   [junit4]   2> 2105351 INFO  (coreLoadExecutor-2997-thread-1-processing-n:127.0.0.1:53338_kyvy%2Fkk) [n:127.0.0.1:53338_kyvy%2Fkk c:control_collection s:shard1 r:core_node1 x:collection1] o.a.s.u.UpdateHandler Using UpdateLog implementation: org.apache.solr.update.UpdateLog
   [junit4]   2> 2105351 INFO  (coreLoadExecutor-2997-thread-1-processing-n:127.0.0.1:53338_kyvy%2Fkk) [n:127.0.0.1:53338_kyvy%2Fkk c:control_collection s:shard1 r:core_node1 x:collection1] o.a.s.u.UpdateLog Initializing UpdateLog: dataDir= defaultSyncLevel=FLUSH numRecordsToKeep=100 maxNumLogsToKeep=10 numVersionBuckets=65536
   [junit4]   2> 2105352 INFO  (coreLoadExecutor-2997-thread-1-processing-n:127.0.0.1:53338_kyvy%2Fkk) [n:127.0.0.1:53338_kyvy%2Fkk c:control_collection s:shard1 r:core_node1 x:collection1] o.a.s.u.CommitTracker Hard AutoCommit: disabled
   [junit4]   2> 2105352 INFO  (coreLoadExecutor-2997-thread-1-processing-n:127.0.0.1:53338_kyvy%2Fkk) [n:127.0.0.1:53338_kyvy%2Fkk c:control_collection s:shard1 r:core_node1 x:collection1] o.a.s.u.CommitTracker Soft AutoCommit: disabled
   [junit4]   2> 2105353 INFO  (coreLoadExecutor-2997-thread-1-processing-n:127.0.0.1:53338_kyvy%2Fkk) [n:127.0.0.1:53338_kyvy%2Fkk c:control_collection s:shard1 r:core_node1 x:collection1] o.a.s.u.RandomMergePolicy RandomMergePolicy wrapping class org.apache.lucene.index.MockRandomMergePolicy: org.apache.lucene.index.MockRandomMergePolicy@4d11d1d9
   [junit4]   2> 2105353 INFO  (coreLoadExecutor-2997-thread-1-processing-n:127.0.0.1:53338_kyvy%2Fkk) [n:127.0.0.1:53338_kyvy%2Fkk c:control_collection s:shard1 r:core_node1 x:collection1] o.a.s.c.SolrDeletionPolicy SolrDeletionPolicy.onInit: commits: num=1
   [junit4]   2> 	commit{dir=MockDirectoryWrapper(RAMDirectory@6488d906 lockFactory=org.apache.lucene.store.SingleInstanceLockFactory@60238a80),segFN=segments_1,generation=1}
   [junit4]   2> 2105353 INFO  (coreLoadExecutor-2997-thread-1-processing-n:127.0.0.1:53338_kyvy%2Fkk) [n:127.0.0.1:53338_kyvy%2Fkk c:control_collection s:shard1 r:core_node1 x:collection1] o.a.s.c.SolrDeletionPolicy newest commit generation = 1
   [junit4]   2> 2105353 INFO  (coreLoadExecutor-2997-thread-1-processing-n:127.0.0.1:53338_kyvy%2Fkk) [n:127.0.0.1:53338_kyvy%2Fkk c:control_collection s:shard1 r:core_node1 x:collection1] o.a.s.s.SolrIndexSearcher Opening [Searcher@126a2fbe[collection1] main]
   [junit4]   2> 2105353 INFO  (coreLoadExecutor-2997-thread-1-processing-n:127.0.0.1:53338_kyvy%2Fkk) [n:127.0.0.1:53338_kyvy%2Fkk c:control_collection s:shard1 r:core_node1 x:collection1] o.a.s.c.c.ZkStateReader Load collection config from: [/collections/control_collection]
   [junit4]   2> 2105354 INFO  (coreLoadExecutor-2997-thread-1-processing-n:127.0.0.1:53338_kyvy%2Fkk) [n:127.0.0.1:53338_kyvy%2Fkk c:control_collection s:shard1 r:core_node1 x:collection1] o.a.s.c.c.ZkStateReader path=[/collections/control_collection] [configName]=[conf1] specified config exists in ZooKeeper
   [junit4]   2> 2105354 INFO  (coreLoadExecutor-2997-thread-1-processing-n:127.0.0.1:53338_kyvy%2Fkk) [n:127.0.0.1:53338_kyvy%2Fkk c:control_collection s:shard1 r:core_node1 x:collection1] o.a.s.r.ManagedResourceStorage Setting up ZooKeeper-based storage for the RestManager with znodeBase: /configs/conf1
   [junit4]   2> 2105354 INFO  (coreLoadExecutor-2997-thread-1-processing-n:127.0.0.1:53338_kyvy%2Fkk) [n:127.0.0.1:53338_kyvy%2Fkk c:control_collection s:shard1 r:core_node1 x:collection1] o.a.s.r.ManagedResourceStorage Configured ZooKeeperStorageIO with znodeBase: /configs/conf1
   [junit4]   2> 2105354 INFO  (coreLoadExecutor-2997-thread-1-processing-n:127.0.0.1:53338_kyvy%2Fkk) [n:127.0.0.1:53338_kyvy%2Fkk c:control_collection s:shard1 r:core_node1 x:collection1] o.a.s.r.RestManager Initializing RestManager with initArgs: {}
   [junit4]   2> 2105354 INFO  (coreLoadExecutor-2997-thread-1-processing-n:127.0.0.1:53338_kyvy%2Fkk) [n:127.0.0.1:53338_kyvy%2Fkk c:control_collection s:shard1 r:core_node1 x:collection1] o.a.s.r.ManagedResourceStorage Reading _rest_managed.json using ZooKeeperStorageIO:path=/configs/conf1
   [junit4]   2> 2105355 INFO  (coreLoadExecutor-2997-thread-1-processing-n:127.0.0.1:53338_kyvy%2Fkk) [n:127.0.0.1:53338_kyvy%2Fkk c:control_collection s:shard1 r:core_node1 x:collection1] o.a.s.r.ManagedResourceStorage No data found for znode /configs/conf1/_rest_managed.json
   [junit4]   2> 2105355 INFO  (coreLoadExecutor-2997-thread-1-processing-n:127.0.0.1:53338_kyvy%2Fkk) [n:127.0.0.1:53338_kyvy%2Fkk c:control_collection s:shard1 r:core_node1 x:collection1] o.a.s.r.ManagedResourceStorage Loaded null at path _rest_managed.json using ZooKeeperStorageIO:path=/configs/conf1
   [junit4]   2> 2105355 INFO  (coreLoadExecutor-2997-thread-1-processing-n:127.0.0.1:53338_kyvy%2Fkk) [n:127.0.0.1:53338_kyvy%2Fkk c:control_collection s:shard1 r:core_node1 x:collection1] o.a.s.r.RestManager Initializing 0 registered ManagedResources
   [junit4]   2> 2105355 INFO  (coreLoadExecutor-2997-thread-1-processing-n:127.0.0.1:53338_kyvy%2Fkk) [n:127.0.0.1:53338_kyvy%2Fkk c:control_collection s:shard1 r:core_node1 x:collection1] o.a.s.h.ReplicationHandler Commits will be reserved for  10000
   [junit4]   2> 2105356 INFO  (coreLoadExecutor-2997-thread-1-processing-n:127.0.0.1:53338_kyvy%2Fkk) [n:127.0.0.1:53338_kyvy%2Fkk c:control_collection s:shard1 r:core_node1 x:collection1] o.a.s.u.UpdateLog Looking up max value of version field to seed version buckets
   [junit4]   2> 2105356 INFO  (coreLoadExecutor-2997-thread-1-processing-n:127.0.0.1:53338_kyvy%2Fkk) [n:127.0.0.1:53338_kyvy%2Fkk c:control_collection s:shard1 r:core_node1 x:collection1] o.a.s.u.VersionInfo Refreshing highest value of _version_ for 65536 version buckets from index
   [junit4]   2> 2105356 INFO  (coreLoadExecutor-2997-thread-1-processing-n:127.0.0.1:53338_kyvy%2Fkk) [n:127.0.0.1:53338_kyvy%2Fkk c:control_collection s:shard1 r:core_node1 x:collection1] o.a.s.u.VersionInfo No terms found for _version_, cannot seed version bucket highest value from index
   [junit4]   2> 2105356 INFO  (coreLoadExecutor-2997-thread-1-processing-n:127.0.0.1:53338_kyvy%2Fkk) [n:127.0.0.1:53338_kyvy%2Fkk c:control_collection s:shard1 r:core_node1 x:collection1] o.a.s.u.UpdateLog Could not find max version in index or recent updates, using new clock 1523217759106760704
   [junit4]   2> 2105358 INFO  (coreLoadExecutor-2997-thread-1-processing-n:127.0.0.1:53338_kyvy%2Fkk) [n:127.0.0.1:53338_kyvy%2Fkk c:control_collection s:shard1 r:core_node1 x:collection1] o.a.s.u.UpdateLog Took 2.0ms to seed version buckets with highest version 1523217759106760704
   [junit4]   2> 2105358 INFO  (coreLoadExecutor-2997-thread-1-processing-n:127.0.0.1:53338_kyvy%2Fkk) [n:127.0.0.1:53338_kyvy%2Fkk c:control_collection s:shard1 r:core_node1 x:collection1] o.a.s.c.ZkController watch zkdir /configs/conf1
   [junit4]   2> 2105358 INFO  (searcherExecutor-2998-thread-1-processing-n:127.0.0.1:53338_kyvy%2Fkk x:collection1 s:shard1 c:control_collection r:core_node1) [n:127.0.0.1:53338_kyvy%2Fkk c:control_collection s:shard1 r:core_node1 x:collection1] o.a.s.c.SolrCore [collection1] Registered new searcher Searcher@126a2fbe[collection1] main{ExitableDirectoryReader(UninvertingDirectoryReader())}
   [junit4]   2> 2105359 INFO  (coreLoadExecutor-2997-thread-1-processing-n:127.0.0.1:53338_kyvy%2Fkk) [n:127.0.0.1:53338_kyvy%2Fkk c:control_collection s:shard1 r:core_node1 x:collection1] o.a.s.c.CoreContainer registering core: collection1
   [junit4]   2> 2105359 INFO  (coreZkRegister-2991-thread-1-processing-n:127.0.0.1:53338_kyvy%2Fkk x:collection1 s:shard1 c:control_collection r:core_node1) [n:127.0.0.1:53338_kyvy%2Fkk c:control_collection s:shard1 r:core_node1 x:collection1] o.a.s.c.ZkController Register replica - core:collection1 address:http://127.0.0.1:53338/kyvy/kk collection:control_collection shard:shard1
   [junit4]   2> 2105360 INFO  (coreZkRegister-2991-thread-1-processing-n:127.0.0.1:53338_kyvy%2Fkk x:collection1 s:shard1 c:control_collection r:core_node1) [n:127.0.0.1:53338_kyvy%2Fkk c:control_collection s:shard1 r:core_node1 x:collection1] o.a.s.c.c.SolrZkClient makePath: /collections/control_collection/leader_elect/shard1/election
   [junit4]   2> 2105363 INFO  (coreZkRegister-2991-thread-1-processing-n:127.0.0.1:53338_kyvy%2Fkk x:collection1 s:shard1 c:control_collection r:core_node1) [n:127.0.0.1:53338_kyvy%2Fkk c:control_collection s:shard1 r:core_node1 x:collection1] o.a.s.c.LeaderElector Joined leadership election with path: /collections/control_collection/leader_elect/shard1/election/95201109831188484-core_node1-n_0000000000
   [junit4]   2> 2105363 INFO  (coreZkRegister-2991-thread-1-processing-n:127.0.0.1:53338_kyvy%2Fkk x:collection1 s:shard1 c:control_collection r:core_node1) [n:127.0.0.1:53338_kyvy%2Fkk c:control_collection s:shard1 r:core_node1 x:collection1] o.a.s.c.ShardLeaderElectionContext Running the leader process for shard=shard1 and weAreReplacement=false and leaderVoteWait=10000
   [junit4]   2> 2105365 INFO  (coreZkRegister-2991-thread-1-processing-n:127.0.0.1:53338_kyvy%2Fkk x:collection1 s:shard1 c:control_collection r:core_node1) [n:127.0.0.1:53338_kyvy%2Fkk c:control_collection s:shard1 r:core_node1 x:collection1] o.a.s.c.ShardLeaderElectionContext Enough replicas found to continue.
   [junit4]   2> 2105365 INFO  (coreZkRegister-2991-thread-1-processing-n:127.0.0.1:53338_kyvy%2Fkk x:collection1 s:shard1 c:control_collection r:core_node1) [n:127.0.0.1:53338_kyvy%2Fkk c:control_collection s:shard1 r:core_node1 x:collection1] o.a.s.c.ShardLeaderElectionContext I may be the new leader - try and sync
   [junit4]   2> 2105365 INFO  (coreZkRegister-2991-thread-1-processing-n:127.0.0.1:53338_kyvy%2Fkk x:collection1 s:shard1 c:control_collection r:core_node1) [n:127.0.0.1:53338_kyvy%2Fkk c:control_collection s:shard1 r:core_node1 x:collection1] o.a.s.c.SyncStrategy Sync replicas to http://127.0.0.1:53338/kyvy/kk/collection1/
   [junit4]   2> 2105365 INFO  (coreZkRegister-2991-thread-1-processing-n:127.0.0.1:53338_kyvy%2Fkk x:collection1 s:shard1 c:control_collection r:core_node1) [n:127.0.0.1:53338_kyvy%2Fkk c:control_collection s:shard1 r:core_node1 x:collection1] o.a.s.c.SyncStrategy Sync Success - now sync replicas to me
   [junit4]   2> 2105365 INFO  (coreZkRegister-2991-thread-1-processing-n:127.0.0.1:53338_kyvy%2Fkk x:collection1 s:shard1 c:control_collection r:core_node1) [n:127.0.0.1:53338_kyvy%2Fkk c:control_collection s:shard1 r:core_node1 x:collection1] o.a.s.c.SyncStrategy http://127.0.0.1:53338/kyvy/kk/collection1/ has no replicas
   [junit4]   2> 2105366 INFO  (coreZkRegister-2991-thread-1-processing-n:127.0.0.1:53338_kyvy%2Fkk x:collection1 s:shard1 c:control_collection r:core_node1) [n:127.0.0.1:53338_kyvy%2Fkk c:control_collection s:shard1 r:core_node1 x:collection1] o.a.s.c.c.SolrZkClient makePath: /collections/control_collection/leaders/shard1
   [junit4]   2> 2105366 INFO  (OverseerStateUpdate-95201109831188484-127.0.0.1:53338_kyvy%2Fkk-n_0000000000) [n:127.0.0.1:53338_kyvy%2Fkk    ] o.a.s.c.Overseer processMessage: queueSize: 1, message = {
   [junit4]   2>   "operation":"leader",
   [junit4]   2>   "shard":"shard1",
   [junit4]   2>   "collection":"control_collection"} current state version: 1
   [junit4]   2> 2105369 INFO  (coreZkRegister-2991-thread-1-processing-n:127.0.0.1:53338_kyvy%2Fkk x:collection1 s:shard1 c:control_collection r:core_node1) [n:127.0.0.1:53338_kyvy%2Fkk c:control_collection s:shard1 r:core_node1 x:collection1] o.a.s.c.ShardLeaderElectionContextBase Creating leader registration node
   [junit4]   2> 2105371 INFO  (coreZkRegister-2991-thread-1-processing-n:127.0.0.1:53338_kyvy%2Fkk x:collection1 s:shard1 c:control_collection r:core_node1) [n:127.0.0.1:53338_kyvy%2Fkk c:control_collection s:shard1 r:core_node1 x:collection1] o.a.s.c.ShardLeaderElectionContext I am the new leader: http://127.0.0.1:53338/kyvy/kk/collection1/ shard1
   [junit4]   2> 2105371 INFO  (OverseerStateUpdate-95201109831188484-127.0.0.1:53338_kyvy%2Fkk-n_0000000000) [n:127.0.0.1:53338_kyvy%2Fkk    ] o.a.s.c.Overseer processMessage: queueSize: 1, message = {
   [junit4]   2>   "operation":"leader",
   [junit4]   2>   "shard":"shard1",
   [junit4]   2>   "collection":"control_collection",
   [junit4]   2>   "base_url":"http://127.0.0.1:53338/kyvy/kk",
   [junit4]   2>   "core":"collection1",
   [junit4]   2>   "state":"active"} current state version: 1
   [junit4]   2> 2105474 INFO  (zkCallback-1097-thread-1-processing-n:127.0.0.1:53338_kyvy%2Fkk) [n:127.0.0.1:53338_kyvy%2Fkk    ] o.a.s.c.c.ZkStateReader A cluster state change: [WatchedEvent state:SyncConnected type:NodeDataChanged path:/clusterstate.json], has occurred - updating... (live nodes size: [1])
   [junit4]   2> 2105522 INFO  (coreZkRegister-2991-thread-1-processing-n:127.0.0.1:53338_kyvy%2Fkk x:collection1 s:shard1 c:control_collection r:core_node1) [n:127.0.0.1:53338_kyvy%2Fkk c:control_collection s:shard1 r:core_node1 x:collection1] o.a.s.c.ZkController We are http://127.0.0.1:53338/kyvy/kk/collection1/ and leader is http://127.0.0.1:53338/kyvy/kk/collection1/
   [junit4]   2> 2105522 INFO  (coreZkRegister-2991-thread-1-processing-n:127.0.0.1:53338_kyvy%2Fkk x:collection1 s:shard1 c:control_collection r:core_node1) [n:127.0.0.1:53338_kyvy%2Fkk c:control_collection s:shard1 r:core_node1 x:collection1] o.a.s.c.ZkController No LogReplay needed for core=collection1 baseURL=http://127.0.0.1:53338/kyvy/kk
   [junit4]   2> 2105522 INFO  (coreZkRegister-2991-thread-1-processing-n:127.0.0.1:53338_kyvy%2Fkk x:collection1 s:shard1 c:control_collection r:core_node1) [n:127.0.0.1:53338_kyvy%2Fkk c:control_collection s:shard1 r:core_node1 x:collection1] o.a.s.c.ZkController I am the leader, no recovery necessary
   [junit4]   2> 2105522 INFO  (coreZkRegister-2991-thread-1-processing-n:127.0.0.1:53338_kyvy%2Fkk x:collection1 s:shard1 c:control_collection r:core_node1) [n:127.0.0.1:53338_kyvy%2Fkk c:control_collection s:shard1 r:core_node1 x:collection1] o.a.s.c.ZkController publishing state=active
   [junit4]   2> 2105522 INFO  (coreZkRegister-2991-thread-1-processing-n:127.0.0.1:53338_kyvy%2Fkk x:collection1 s:shard1 c:control_collection r:core_node1) [n:127.0.0.1:53338_kyvy%2Fkk c:control_collection s:shard1 r:core_node1 x:collection1] o.a.s.c.ZkController numShards not found on descriptor - reading it from system property
   [junit4]   2> 2105524 INFO  (OverseerStateUpdate-95201109831188484-127.0.0.1:53338_kyvy%2Fkk-n_0000000000) [n:127.0.0.1:53338_kyvy%2Fkk    ] o.a.s.c.Overseer processMessage: queueSize: 1, message = {
   [junit4]   2>   "core":"collection1",
   [junit4]   2>   "core_node_name":"core_node1",
   [junit4]   2>   "roles":null,
   [junit4]   2>   "base_url":"http://127.0.0.1:53338/kyvy/kk",
   [junit4]   2>   "node_name":"127.0.0.1:53338_kyvy%2Fkk",
   [junit4]   2>   "numShards":"1",
   [junit4]   2>   "state":"active",
   [junit4]   2>   "shard":"shard1",
   [junit4]   2>   "collection":"control_collection",
   [junit4]   2>   "operation":"state"} current state version: 2
   [junit4]   2> 2105524 INFO  (OverseerStateUpdate-95201109831188484-127.0.0.1:53338_kyvy%2Fkk-n_0000000000) [n:127.0.0.1:53338_kyvy%2Fkk    ] o.a.s.c.o.ReplicaMutator Update state numShards=1 message={
   [junit4]   2>   "core":"collection1",
   [junit4]   2>   "core_node_name":"core_node1",
   [junit4]   2>   "roles":null,
   [junit4]   2>   "base_url":"http://127.0.0.1:53338/kyvy/kk",
   [junit4]   2>   "node_name":"127.0.0.1:53338_kyvy%2Fkk",
   [junit4]   2>   "numShards":"1",
   [junit4]   2>   "state":"active",
   [junit4]   2>   "shard":"shard1",
   [junit4]   2>   "collection":"control_collection",
   [junit4]   2>   "operation":"state"}
   [junit4]   2> 2105627 INFO  (zkCallback-1097-thread-1-processing-n:127.0.0.1:53338_kyvy%2Fkk) [n:127.0.0.1:53338_kyvy%2Fkk    ] o.a.s.c.c.ZkStateReader A cluster state change: [WatchedEvent state:SyncConnected type:NodeDataChanged path:/clusterstate.json], has occurred - updating... (live nodes size: [1])
   [junit4]   2> 2105681 INFO  (TEST-TestDynamicLoading.testDynamicLoading-seed#[1AB3E18A9263A2E2]) [    ] o.a.s.c.c.SolrZkClient Using default ZkCredentialsProvider
   [junit4]   2> 2105681 INFO  (TEST-TestDynamicLoading.testDynamicLoading-seed#[1AB3E18A9263A2E2]) [    ] o.a.s.c.c.ConnectionManager Waiting for client to connect to ZooKeeper
   [junit4]   2> 2105682 INFO  (zkCallback-1099-thread-1) [    ] o.a.s.c.c.ConnectionManager Watcher org.apache.solr.common.cloud.ConnectionManager@792a02f3 name:ZooKeeperConnection Watcher:127.0.0.1:53911/solr got event WatchedEvent state:SyncConnected type:None path:null path:null type:None
   [junit4]   2> 2105683 INFO  (TEST-TestDynamicLoading.testDynamicLoading-seed#[1AB3E18A9263A2E2]) [    ] o.a.s.c.c.ConnectionManager Client is connected to ZooKeeper
   [junit4]   2> 2105683 INFO  (TEST-TestDynamicLoading.testDynamicLoading-seed#[1AB3E18A9263A2E2]) [    ] o.a.s.c.c.SolrZkClient Using default ZkACLProvider
   [junit4]   2> 2105683 INFO  (TEST-TestDynamicLoading.testDynamicLoading-seed#[1AB3E18A9263A2E2]) [    ] o.a.s.c.c.ZkStateReader Updating cluster state from ZooKeeper... 
   [junit4]   2> 2105685 INFO  (TEST-TestDynamicLoading.testDynamicLoading-seed#[1AB3E18A9263A2E2]) [    ] o.a.s.c.ChaosMonkey monkey: init - expire sessions:false cause connection loss:false
   [junit4]   2> 2105685 INFO  (TEST-TestDynamicLoading.testDynamicLoading-seed#[1AB3E18A9263A2E2]) [    ] o.a.s.c.AbstractFullDistribZkTestBase Creating collection1 with stateFormat=2
   [junit4]   2> 2105685 INFO  (TEST-TestDynamicLoading.testDynamicLoading-seed#[1AB3E18A9263A2E2]) [    ] o.a.s.c.c.SolrZkClient Using default ZkCredentialsProvider
   [junit4]   2> 2105686 INFO  (TEST-TestDynamicLoading.testDynamicLoading-seed#[1AB3E18A9263A2E2]) [    ] o.a.s.c.c.ConnectionManager Waiting for client to connect to ZooKeeper
   [junit4]   2> 2105687 INFO  (zkCallback-1100-thread-1) [    ] o.a.s.c.c.ConnectionManager Watcher org.apache.solr.common.cloud.ConnectionManager@4f2075d3 name:ZooKeeperConnection Watcher:127.0.0.1:53911/solr got event WatchedEvent state:SyncConnected type:None path:null path:null type:None
   [junit4]   2> 2105687 INFO  (TEST-TestDynamicLoading.testDynamicLoading-seed#[1AB3E18A9263A2E2]) [    ] o.a.s.c.c.ConnectionManager Client is connected to ZooKeeper
   [junit4]   2> 2105687 INFO  (TEST-TestDynamicLoading.testDynamicLoading-seed#[1AB3E18A9263A2E2]) [    ] o.a.s.c.c.SolrZkClient Using default ZkACLProvider
   [junit4]   2> 2105689 INFO  (OverseerStateUpdate-95201109831188484-127.0.0.1:53338_kyvy%2Fkk-n_0000000000) [n:127.0.0.1:53338_kyvy%2Fkk    ] o.a.s.c.Overseer processMessage: queueSize: 1, message = {
   [junit4]   2>   "operation":"create",
   [junit4]   2>   "name":"collection1",
   [junit4]   2>   "numShards":"2",
   [junit4]   2>   "stateFormat":"2"} current state version: 3
   [junit4]   2> 2105689 INFO  (OverseerStateUpdate-95201109831188484-127.0.0.1:53338_kyvy%2Fkk-n_0000000000) [n:127.0.0.1:53338_kyvy%2Fkk    ] o.a.s.c.o.ClusterStateMutator building a new cName: collection1
   [junit4]   2> 2105792 INFO  (OverseerStateUpdate-95201109831188484-127.0.0.1:53338_kyvy%2Fkk-n_0000000000) [n:127.0.0.1:53338_kyvy%2Fkk    ] o.a.s.c.o.ZkStateWriter going to create_collection /collections/collection1/state.json
   [junit4]   2> 2106013 INFO  (TEST-TestDynamicLoading.testDynamicLoading-seed#[1AB3E18A9263A2E2]) [    ] o.a.s.SolrTestCaseJ4 Writing core.properties file to /x1/jenkins/jenkins-slave/workspace/Lucene-Solr-NightlyTests-trunk/solr/build/solr-core/test/J2/temp/solr.core.TestDynamicLoading_1AB3E18A9263A2E2-001/shard-1-001/cores/collection1
   [junit4]   2> 2106014 INFO  (TEST-TestDynamicLoading.testDynamicLoading-seed#[1AB3E18A9263A2E2]) [    ] o.a.s.c.AbstractFullDistribZkTestBase create jetty 1 in directory /x1/jenkins/jenkins-slave/workspace/Lucene-Solr-NightlyTests-trunk/solr/build/solr-core/test/J2/temp/solr.core.TestDynamicLoading_1AB3E18A9263A2E2-001/shard-1-001
   [junit4]   2> 2106015 INFO  (TEST-TestDynamicLoading.testDynamicLoading-seed#[1AB3E18A9263A2E2]) [    ] o.e.j.s.Server jetty-9.2.13.v20150730
   [junit4]   2> 2106016 INFO  (TEST-TestDynamicLoading.testDynamicLoading-seed#[1AB3E18A9263A2E2]) [    ] o.e.j.s.h.ContextHandler Started o.e.j.s.ServletContextHandler@43e4c1df{/kyvy/kk,null,AVAILABLE}
   [junit4]   2> 2106017 INFO  (TEST-TestDynamicLoading.testDynamicLoading-seed#[1AB3E18A9263A2E2]) [    ] o.e.j.s.ServerConnector Started ServerConnector@79f09368{HTTP/1.1}{127.0.0.1:56579}
   [junit4]   2> 2106017 INFO  (TEST-TestDynamicLoading.testDynamicLoading-seed#[1AB3E18A9263A2E2]) [    ] o.e.j.s.Server Started @2109096ms
   [junit4]   2> 2106017 INFO  (TEST-TestDynamicLoading.testDynamicLoading-seed#[1AB3E18A9263A2E2]) [    ] o.a.s.c.s.e.JettySolrRunner Jetty properties: {solr.data.dir=/x1/jenkins/jenkins-slave/workspace/Lucene-Solr-NightlyTests-trunk/solr/build/solr-core/test/J2/temp/solr.core.TestDynamicLoading_1AB3E18A9263A2E2-001/tempDir-001/jetty1, solrconfig=solrconfig.xml, hostContext=/kyvy/kk, hostPort=56579, coreRootDirectory=/x1/jenkins/jenkins-slave/workspace/Lucene-Solr-NightlyTests-trunk/solr/build/solr-core/test/J2/../../../../../../../../../../x1/jenkins/jenkins-slave/workspace/Lucene-Solr-NightlyTests-trunk/solr/build/solr-core/test/J2/temp/solr.core.TestDynamicLoading_1AB3E18A9263A2E2-001/shard-1-001/cores}
   [junit4]   2> 2106017 INFO  (TEST-TestDynamicLoading.testDynamicLoading-seed#[1AB3E18A9263A2E2]) [    ] o.a.s.s.SolrDispatchFilter SolrDispatchFilter.init(): sun.misc.Launcher$AppClassLoader@4e0e2f2a
   [junit4]   2> 2106017 INFO  (TEST-TestDynamicLoading.testDynamicLoading-seed#[1AB3E18A9263A2E2]) [    ] o.a.s.c.SolrResourceLoader new SolrResourceLoader for directory: '/x1/jenkins/jenkins-slave/workspace/Lucene-Solr-NightlyTests-trunk/solr/build/solr-core/test/J2/temp/solr.core.TestDynamicLoading_1AB3E18A9263A2E2-001/shard-1-001'
   [junit4]   2> 2106017 INFO  (TEST-TestDynamicLoading.testDynamicLoading-seed#[1AB3E18A9263A2E2]) [    ] o.a.s.c.SolrResourceLoader JNDI not configured for solr (NoInitialContextEx)
   [junit4]   2> 2106018 INFO  (TEST-TestDynamicLoading.testDynamicLoading-seed#[1AB3E18A9263A2E2]) [    ] o.a.s.c.SolrResourceLoader solr home defaulted to 'solr/' (could not find system property or JNDI)
   [junit4]   2> 2106018 INFO  (TEST-TestDynamicLoading.testDynamicLoading-seed#[1AB3E18A9263A2E2]) [    ] o.a.s.c.c.SolrZkClient Using default ZkCredentialsProvider
   [junit4]   2> 2106024 INFO  (TEST-TestDynamicLoading.testDynamicLoading-seed#[1AB3E18A9263A2E2]) [    ] o.a.s.c.c.ConnectionManager Waiting for client to connect to ZooKeeper
   [junit4]   2> 2106024 INFO  (zkCallback-1101-thread-1) [    ] o.a.s.c.c.ConnectionManager Watcher org.apache.solr.common.cloud.ConnectionManager@1a4751be name:ZooKeeperConnection Watcher:127.0.0.1:53911/solr got event WatchedEvent state:SyncConnected type:None path:null path:null type:None
   [junit4]   2> 2106024 INFO  (TEST-TestDynamicLoading.testDynamicLoading-seed#[1AB3E18A9263A2E2]) [    ] o.a.s.c.c.ConnectionManager Client is connected to ZooKeeper
   [junit4]   2> 2106025 INFO  (TEST-TestDynamicLoading.testDynamicLoading-seed#[1AB3E18A9263A2E2]) [    ] o.a.s.c.c.SolrZkClient Using default ZkACLProvider
   [junit4]   2> 2106026 INFO  (TEST-TestDynamicLoading.testDynamicLoading-seed#[1AB3E18A9263A2E2]) [    ] o.a.s.s.SolrDispatchFilter Loading solr.xml from SolrHome (not found in ZooKeeper)
   [junit4]   2> 2106026 INFO  (TEST-TestDynamicLoading.testDynamicLoading-seed#[1AB3E18A9263A2E2]) [    ] o.a.s.c.SolrXmlConfig Loading container configuration from /x1/jenkins/jenkins-slave/workspace/Lucene-Solr-NightlyTests-trunk/solr/build/solr-core/test/J2/temp/solr.core.TestDynamicLoading_1AB3E18A9263A2E2-001/shard-1-001/solr.xml
   [junit4]   2> 2106031 INFO  (TEST-TestDynamicLoading.testDynamicLoading-seed#[1AB3E18A9263A2E2]) [    ] o.a.s.c.CorePropertiesLocator Config-defined core root directory: /x1/jenkins/jenkins-slave/workspace/Lucene-Solr-NightlyTests-trunk/solr/build/solr-core/test/J2/../../../../../../../../../../x1/jenkins/jenkins-slave/workspace/Lucene-Solr-NightlyTests-trunk/solr/build/solr-core/test/J2/temp/solr.core.TestDynamicLoading_1AB3E18A9263A2E2-001/shard-1-001/cores
   [junit4]   2> 2106031 INFO  (TEST-TestDynamicLoading.testDynamicLoading-seed#[1AB3E18A9263A2E2]) [    ] o.a.s.c.CoreContainer New CoreContainer 2127162311
   [junit4]   2> 2106031 INFO  (TEST-TestDynamicLoading.testDynamicLoading-seed#[1AB3E18A9263A2E2]) [    ] o.a.s.c.CoreContainer Loading cores into CoreContainer [instanceDir=/x1/jenkins/jenkins-slave/workspace/Lucene-Solr-NightlyTests-trunk/solr/build/solr-core/test/J2/temp/solr.core.TestDynamicLoading_1AB3E18A9263A2E2-001/shard-1-001]
   [junit4]   2> 2106031 WARN  (TEST-TestDynamicLoading.testDynamicLoading-seed#[1AB3E18A9263A2E2]) [    ] o.a.s.c.CoreContainer Couldn't add files from /x1/jenkins/jenkins-slave/workspace/Lucene-Solr-NightlyTests-trunk/solr/build/solr-core/test/J2/temp/solr.core.TestDynamicLoading_1AB3E18A9263A2E2-001/shard-1-001/lib to classpath: /x1/jenkins/jenkins-slave/workspace/Lucene-Solr-NightlyTests-trunk/solr/build/solr-core/test/J2/temp/solr.core.TestDynamicLoading_1AB3E18A9263A2E2-001/shard-1-001/lib
   [junit4]   2> 2106032 INFO  (TEST-TestDynamicLoading.testDynamicLoading-seed#[1AB3E18A9263A2E2]) [    ] o.a.s.h.c.HttpShardHandlerFactory created with socketTimeout : 90000,urlScheme : ,connTimeout : 15000,maxConnectionsPerHost : 20,maxConnections : 10000,corePoolSize : 0,maximumPoolSize : 2147483647,maxThreadIdleTime : 5,sizeOfQueue : -1,fairnessPolicy : false,useRetries : false,
   [junit4]   2> 2106033 INFO  (TEST-TestDynamicLoading.testDynamicLoading-seed#[1AB3E18A9263A2E2]) [    ] o.a.s.u.UpdateShardHandler Creating UpdateShardHandler HTTP client with params: socketTimeout=340000&connTimeout=45000&retry=true
   [junit4]   2> 2106033 INFO  (TEST-TestDynamicLoading.testDynamicLoading-seed#[1AB3E18A9263A2E2]) [    ] o.a.s.l.LogWatcher SLF4J impl is org.slf4j.impl.Log4jLoggerFactory
   [junit4]   2> 2106033 INFO  (TEST-TestDynamicLoading.testDynamicLoading-seed#[1AB3E18A9263A2E2]) [    ] o.a.s.l.LogWatcher Registering Log Listener [Log4j (org.slf4j.impl.Log4jLoggerFactory)]
   [junit4]   2> 2106033 INFO  (TEST-TestDynamicLoading.testDynamicLoading-seed#[1AB3E18A9263A2E2]) [    ] o.a.s.c.ZkContainer Zookeeper client=127.0.0.1:53911/solr
   [junit4]   2> 2106033 INFO  (TEST-TestDynamicLoading.testDynamicLoading-seed#[1AB3E18A9263A2E2]) [    ] o.a.s.c.ZkController zkHost includes chroot
   [junit4]   2> 2106034 INFO  (TEST-TestDynamicLoading.testDynamicLoading-seed#[1AB3E18A9263A2E2]) [    ] o.a.s.c.c.SolrZkClient Using default ZkCredentialsProvider
   [junit4]   2> 2106035 INFO  (TEST-TestDynamicLoading.testDynamicLoading-seed#[1AB3E18A9263A2E2]) [    ] o.a.s.c.c.ConnectionManager Waiting for client to connect to ZooKeeper
   [junit4]   2> 2106035 INFO  (zkCallback-1104-thread-1) [    ] o.a.s.c.c.ConnectionManager Watcher org.apache.solr.common.cloud.ConnectionManager@3174d52a name:ZooKeeperConnection Watcher:127.0.0.1:53911 got event WatchedEvent state:SyncConnected type:None path:null path:null type:None
   [junit4]   2> 2106035 INFO  (TEST-TestDynamicLoading.testDynamicLoading-seed#[1AB3E18A9263A2E2]) [    ] o.a.s.c.c.ConnectionManager Client is connected to ZooKeeper
   [junit4]   2> 2106036 INFO  (TEST-TestDynamicLoading.testDynamicLoading-seed#[1AB3E18A9263A2E2]) [    ] o.a.s.c.c.SolrZkClient Using default ZkACLProvider
   [junit4]   2> 2106037 INFO  (TEST-TestDynamicLoading.testDynamicLoading-seed#[1AB3E18A9263A2E2]) [n:127.0.0.1:56579_kyvy%2Fkk    ] o.a.s.c.c.ConnectionManager Waiting for client to connect to ZooKeeper
   [junit4]   2> 2106038 INFO  (zkCallback-1105-thread-1-processing-n:127.0.0.1:56579_kyvy%2Fkk) [n:127.0.0.1:56579_kyvy%2Fkk    ] o.a.s.c.c.ConnectionManager Watcher org.apache.solr.common.cloud.ConnectionManager@48162509 name:ZooKeeperConnection Watcher:127.0.0.1:53911/solr got event WatchedEvent state:SyncConnected type:None path:null path:null type:None
   [junit4]   2> 2106038 INFO  (TEST-TestDynamicLoading.testDynamicLoading-seed#[1AB3E18A9263A2E2]) [n:127.0.0.1:56579_kyvy%2Fkk    ] o.a.s.c.c.ConnectionManager Client is connected to ZooKeeper
   [junit4]   2> 2106043 INFO  (TEST-TestDynamicLoading.testDynamicLoading-seed#[1AB3E18A9263A2E2]) [n:127.0.0.1:56579_kyvy%2Fkk    ] o.a.s.c.c.ZkStateReader Updating cluster state from ZooKeeper... 
   [junit4]   2> 2107048 INFO  (TEST-TestDynamicLoading.testDynamicLoading-seed#[1AB3E18A9263A2E2]) [n:127.0.0.1:56579_kyvy%2Fkk    ] o.a.s.c.ZkController Register node as live in ZooKeeper:/live_nodes/127.0.0.1:56579_kyvy%2Fkk
   [junit4]   2> 2107049 INFO  (TEST-TestDynamicLoading.testDynamicLoading-seed#[1AB3E18A9263A2E2]) [n:127.0.0.1:56579_kyvy%2Fkk    ] o.a.s.c.c.SolrZkClient makePath: /live_nodes/127.0.0.1:56579_kyvy%2Fkk
   [junit4]   2> 2107050 INFO  (zkCallback-1099-thread-1) [    ] o.a.s.c.c.ZkStateReader A live node change: [WatchedEvent state:SyncConnected type:NodeChildrenChanged path:/live_nodes], has occurred - updating... (live nodes size: [1])
   [junit4]   2> 2107050 INFO  (zkCallback-1097-thread-1-processing-n:127.0.0.1:53338_kyvy%2Fkk) [n:127.0.0.1:53338_kyvy%2Fkk    ] o.a.s.c.c.ZkStateReader A live node change: [WatchedEvent state:SyncConnected type:NodeChildrenChanged path:/live_nodes], has occurred - updating... (live nodes size: [1])
   [junit4]   2> 2107050 INFO  (zkCallback-1105-thread-1-processing-n:127.0.0.1:56579_kyvy%2Fkk) [n:127.0.0.1:56579_kyvy%2Fkk    ] o.a.s.c.c.ZkStateReader A live node change: [WatchedEvent state:SyncConnected type:NodeChildrenChanged path:/live_nodes], has occurred - updating... (live nodes size: [1])
   [junit4]   2> 2107051 INFO  (TEST-TestDynamicLoading.testDynamicLoading-seed#[1AB3E18A9263A2E2]) [n:127.0.0.1:56579_kyvy%2Fkk    ] o.a.s.c.Overseer Overseer (id=null) closing
   [junit4]   2> 2107051 INFO  (TEST-TestDynamicLoading.testDynamicLoading-seed#[1AB3E18A9263A2E2]) [n:127.0.0.1:56579_kyvy%2Fkk    ] o.a.s.c.LeaderElector Joined leadership election with path: /overseer_elect/election/95201109831188489-127.0.0.1:56579_kyvy%2Fkk-n_0000000001
   [junit4]   2> 2107052 INFO  (TEST-TestDynamicLoading.testDynamicLoading-seed#[1AB3E18A9263A2E2]) [n:127.0.0.1:56579_kyvy%2Fkk    ] o.a.s.c.LeaderElector Watching path /overseer_elect/election/95201109831188484-127.0.0.1:53338_kyvy%2Fkk-n_0000000000 to know if I could be the leader
   [junit4]   2> 2107062 INFO  (TEST-TestDynamicLoading.testDynamicLoading-seed#[1AB3E18A9263A2E2]) [n:127.0.0.1:56579_kyvy%2Fkk    ] o.a.s.c.CoreContainer Security conf doesn't exist. Skipping setup for authorization module.
   [junit4]   2> 2107063 INFO  (TEST-TestDynamicLoading.testDynamicLoading-seed#[1AB3E18A9263A2E2]) [n:127.0.0.1:56579_kyvy%2Fkk    ] o.a.s.c.CoreContainer No authentication plugin used.
   [junit4]   2> 2107063 INFO  (TEST-TestDynamicLoading.testDynamicLoading-seed#[1AB3E18A9263A2E2]) [n:127.0.0.1:56579_kyvy%2Fkk    ] o.a.s.c.CorePropertiesLocator Looking for core definitions underneath /x1/jenkins/jenkins-slave/workspace/Lucene-Solr-NightlyTests-trunk/solr/build/solr-core/test/J2/../../../../../../../../../../x1/jenkins/jenkins-slave/workspace/Lucene-Solr-NightlyTests-trunk/solr/build/solr-core/test/J2/temp/solr.core.TestDynamicLoading_1AB3E18A9263A2E2-001/shard-1-001/cores
   [junit4]   2> 2107064 INFO  (TEST-TestDynamicLoading.testDynamicLoading-seed#[1AB3E18A9263A2E2]) [n:127.0.0.1:56579_kyvy%2Fkk    ] o.a.s.c.CoreDescriptor Created CoreDescriptor: {name=collection1, config=solrconfig.xml, transient=false, schema=schema.xml, loadOnStartup=true, configSetProperties=configsetprops.json, collection=collection1, coreNodeName=, dataDir=data/, shard=}
   [junit4]   2> 2107064 INFO  (TEST-TestDynamicLoading.testDynamicLoading-seed#[1AB3E18A9263A2E2]) [n:127.0.0.1:56579_kyvy%2Fkk    ] o.a.s.c.CorePropertiesLocator Found core collection1 in /x1/jenkins/jenkins-slave/workspace/Lucene-Solr-NightlyTests-trunk/solr/build/solr-core/test/J2/../../../../../../../../../../x1/jenkins/jenkins-slave/workspace/Lucene-Solr-NightlyTests-trunk/solr/build/solr-core/test/J2/temp/solr.core.TestDynamicLoading_1AB3E18A9263A2E2-001/shard-1-001/cores/collection1
   [junit4]   2> 2107065 INFO  (TEST-TestDynamicLoading.testDynamicLoading-seed#[1AB3E18A9263A2E2]) [n:127.0.0.1:56579_kyvy%2Fkk    ] o.a.s.c.CorePropertiesLocator Found 1 core definitions
   [junit4]   2> 2107067 INFO  (coreLoadExecutor-3008-thread-1-processing-n:127.0.0.1:56579_kyvy%2Fkk) [n:127.0.0.1:56579_kyvy%2Fkk c:collection1   x:collection1] o.a.s.c.ZkController publishing state=down
   [junit4]   2> 2107067 INFO  (coreLoadExecutor-3008-thread-1-processing-n:127.0.0.1:56579_kyvy%2Fkk) [n:127.0.0.1:56579_kyvy%2Fkk c:collection1   x:collection1] o.a.s.c.ZkController numShards not found on descriptor - reading it from system property
   [junit4]   2> 2107068 INFO  (OverseerStateUpdate-95201109831188484-127.0.0.1:53338_kyvy%2Fkk-n_0000000000) [n:127.0.0.1:53338_kyvy%2Fkk    ] o.a.s.c.Overseer processMessage: queueSize: 1, message = {
   [junit4]   2>   "core":"collection1",
   [junit4]   2>   "roles":null,
   [junit4]   2>   "base_url":"http://127.0.0.1:56579/kyvy/kk",
   [junit4]   2>   "node_name":"127.0.0.1:56579_kyvy%2Fkk",
   [junit4]   2>   "numShards":"2",
   [junit4]   2>   "state":"down",
   [junit4]   2>   "shard":null,
   [junit4]   2>   "collection":"collection1",
   [junit4]   2>   "operation":"state"} current state version: 3
   [junit4]   2> 2107069 INFO  (coreLoadExecutor-3008-thread-1-processing-n:127.0.0.1:56579_kyvy%2Fkk) [n:127.0.0.1:56579_kyvy%2Fkk c:collection1   x:collection1] o.a.s.c.ZkController Registering watch for collection collection1
   [junit4]   2> 2107069 INFO  (OverseerStateUpdate-95201109831188484-127.0.0.1:53338_kyvy%2Fkk-n_0000000000) [n:127.0.0.1:53338_kyvy%2Fkk    ] o.a.s.c.o.ReplicaMutator Update state numShards=2 message={
   [junit4]   2>   "core":"collection1",
   [junit4]   2>   "roles":null,
   [junit4]   2>   "base_url":"http://127.0.0.1:56579/kyvy/kk",
   [junit4]   2>   "node_name":"127.0.0.1:56579_kyvy%2Fkk",
   [junit4]   2>   "numShards":"2",
   [junit4]   2>   "state":"down",
   [junit4]   2>   "shard":null,
   [junit4]   2>   "collection":"collection1",
   [junit4]   2>   "operation":"state"}
   [junit4]   2> 2107069 INFO  (OverseerStateUpdate-95201109831188484-127.0.0.1:53338_kyvy%2Fkk-n_0000000000) [n:127.0.0.1:53338_kyvy%2Fkk    ] o.a.s.c.o.ReplicaMutator Collection already exists with numShards=2
   [junit4]   2> 2107069 INFO  (OverseerStateUpdate-95201109831188484-127.0.0.1:53338_kyvy%2Fkk-n_0000000000) [n:127.0.0.1:53338_kyvy%2Fkk    ] o.a.s.c.o.ReplicaMutator Assigning new node to shard shard=shard2
   [junit4]   2> 2107069 INFO  (coreLoadExecutor-3008-thread-1-processing-n:127.0.0.1:56579_kyvy%2Fkk) [n:127.0.0.1:56579_kyvy%2Fkk c:collection1   x:collection1] o.a.s.c.c.ZkStateReader addZkWatch [collection1]
   [junit4]   2> 2107071 INFO  (coreLoadExecutor-3008-thread-1-processing-n:127.0.0.1:56579_kyvy%2Fkk) [n:127.0.0.1:56579_kyvy%2Fkk c:collection1   x:collection1] o.a.s.c.c.ZkStateReader Add data for [collection1] ver [0]
   [junit4]   2> 2107071 INFO  (coreLoadExecutor-3008-thread-1-processing-n:127.0.0.1:56579_kyvy%2Fkk) [n:127.0.0.1:56579_kyvy%2Fkk c:collection1   x:collection1] o.a.s.c.ZkController look for our core node name
   [junit4]   2> 2107076 INFO  (TEST-TestDynamicLoading.testDynamicLoading-seed#[1AB3E18A9263A2E2]) [n:127.0.0.1:56579_kyvy%2Fkk    ] o.a.s.s.SolrDispatchFilter user.dir=/x1/jenkins/jenkins-slave/workspace/Lucene-Solr-NightlyTests-trunk/solr/build/solr-core/test/J2
   [junit4]   2> 2107076 INFO  (TEST-TestDynamicLoading.testDynamicLoading-seed#[1AB3E18A9263A2E2]) [n:127.0.0.1:56579_kyvy%2Fkk    ] o.a.s.s.SolrDispatchFilter SolrDispatchFilter.init() done
   [junit4]   2> 2107171 INFO  (OverseerStateUpdate-95201109831188484-127.0.0.1:53338_kyvy%2Fkk-n_0000000000) [n:127.0.0.1:53338_kyvy%2Fkk    ] o.a.s.c.o.ZkStateWriter going to update_collection /collections/collection1/state.json version: 0
   [junit4]   2> 2107172 INFO  (zkCallback-1105-thread-1-processing-n:127.0.0.1:56579_kyvy%2Fkk) [n:127.0.0.1:56579_kyvy%2Fkk    ] o.a.s.c.c.ZkStateReader A cluster state change: [WatchedEvent state:SyncConnected type:NodeDataChanged path:/collections/collection1/state.json] for collection [collection1] has occurred - updating... (live nodes size: [2])
   [junit4]   2> 2107172 INFO  (zkCallback-1105-thread-1-processing-n:127.0.0.1:56579_kyvy%2Fkk) [n:127.0.0.1:56579_kyvy%2Fkk    ] o.a.s.c.c.ZkStateReader Updating data for [collection1] from [0] to [1]
   [junit4]   2> 2108071 INFO  (coreLoadExecutor-3008-thread-1-processing-n:127.0.0.1:56579_kyvy%2Fkk) [n:127.0.0.1:56579_kyvy%2Fkk c:collection1   x:collection1] o.a.s.c.ZkController waiting to find shard id in clusterstate for collection1
   [junit4]   2> 2108072 INFO  (coreLoadExecutor-3008-thread-1-processing-n:127.0.0.1:56579_kyvy%2Fkk) [n:127.0.0.1:56579_kyvy%2Fkk c:collection1   x:collection1] o.a.s.c.ZkController Check for collection zkNode:collection1
   [junit4]   2> 2108072 INFO  (coreLoadExecutor-3008-thread-1-processing-n:127.0.0.1:56579_kyvy%2Fkk) [n:127.0.0.1:56579_kyvy%2Fkk c:collection1   x:collection1] o.a.s.c.ZkController Collection zkNode exists
   [junit4]   2> 2108072 INFO  (coreLoadExecutor-3008-thread-1-processing-n:127.0.0.1:56579_kyvy%2Fkk) [n:127.0.0.1:56579_kyvy%2Fkk c:collection1   x:collection1] o.a.s.c.c.ZkStateReader Load collection config from: [/collections/collection1]
   [junit4]   2> 2108073 INFO  (coreLoadExecutor-3008-thread-1-processing-n:127.0.0.1:56579_kyvy%2Fkk) [n:127.0.0.1:56579_kyvy%2Fkk c:collection1   x:collection1] o.a.s.c.c.ZkStateReader path=[/collections/collection1] [configName]=[conf1] specified config exists in ZooKeeper
   [junit4]   2> 2108073 INFO  (coreLoadExecutor-3008-thread-1-processing-n:127.0.0.1:56579_kyvy%2Fkk) [n:127.0.0.1:56579_kyvy%2Fkk c:collection1   x:collection1] o.a.s.c.SolrResourceLoader new SolrResourceLoader for directory: '/x1/jenkins/jenkins-slave/workspace/Lucene-Solr-NightlyTests-trunk/solr/build/solr-core/test/J2/temp/solr.core.TestDynamicLoading_1AB3E18A9263A2E2-001/shard-1-001/cores/collection1'
   [junit4]   2> 2108073 INFO  (coreLoadExecutor-3008-thread-1-processing-n:127.0.0.1:56579_kyvy%2Fkk) [n:127.0.0.1:56579_kyvy%2Fkk c:collection1   x:collection1] o.a.s.c.SolrResourceLoader JNDI not configured for solr (NoInitialContextEx)
   [junit4]   2> 2108073 INFO  (coreLoadExecutor-3008-thread-1-processing-n:127.0.0.1:56579_kyvy%2Fkk) [n:127.0.0.1:56579_kyvy%2Fkk c:collection1   x:collection1] o.a.s.c.SolrResourceLoader solr home defaulted to 'solr/' (could not find system property or JNDI)
   [junit4]   2> 2108075 INFO  (coreLoadExecutor-3008-thread-1-processing-n:127.0.0.1:56579_kyvy%2Fkk) [n:127.0.0.1:56579_kyvy%2Fkk c:collection1   x:collection1] o.a.s.c.Config loaded config solrconfig.xml with version 0 
   [junit4]   2> 2108080 INFO  (coreLoadExecutor-3008-thread-1-processing-n:127.0.0.1:56579_kyvy%2Fkk) [n:127.0.0.1:56579_kyvy%2Fkk c:collection1   x:collection1] o.a.s.c.SolrConfig current version of requestparams : -1
   [junit4]   2> 2108084 INFO  (coreLoadExecutor-3008-thread-1-processing-n:127.0.0.1:56579_kyvy%2Fkk) [n:127.0.0.1:56579_kyvy%2Fkk c:collection1   x:collection1] o.a.s.c.SolrConfig Using Lucene MatchVersion: 6.0.0
   [junit4]   2> 2108109 INFO  (coreLoadExecutor-3008-thread-1-processing-n:127.0.0.1:56579_kyvy%2Fkk) [n:127.0.0.1:56579_kyvy%2Fkk c:collection1   x:collection1] o.a.s.c.SolrConfig Loaded SolrConfig: solrconfig.xml
   [junit4]   2> 2108116 INFO  (coreLoadExecutor-3008-thread-1-processing-n:127.0.0.1:56579_kyvy%2Fkk) [n:127.0.0.1:56579_kyvy%2Fkk c:collection1   x:collection1] o.a.s.s.IndexSchema [collection1] Schema name=test
   [junit4]   2> 2108233 INFO  (coreLoadExecutor-3008-thread-1-processing-n:127.0.0.1:56579_kyvy%2Fkk) [n:127.0.0.1:56579_kyvy%2Fkk c:collection1   x:collection1] o.a.s.s.OpenExchangeRatesOrgProvider Initialized with rates=open-exchange-rates.json, refreshInterval=1440.
   [junit4]   2> 2108240 INFO  (coreLoadExecutor-3008-thread-1-processing-n:127.0.0.1:56579_kyvy%2Fkk) [n:127.0.0.1:56579_kyvy%2Fkk c:collection1   x:collection1] o.a.s.s.IndexSchema default search field in schema is text
   [junit4]   2> 2108241 INFO  (coreLoadExe

[...truncated too long message...]

unit4]   2> 	at org.apache.zookeeper.KeeperException.create(KeeperException.java:51)
   [junit4]   2> 	at org.apache.zookeeper.ZooKeeper.delete(ZooKeeper.java:873)
   [junit4]   2> 	at org.apache.solr.common.cloud.SolrZkClient$2.execute(SolrZkClient.java:244)
   [junit4]   2> 	at org.apache.solr.common.cloud.SolrZkClient$2.execute(SolrZkClient.java:241)
   [junit4]   2> 	at org.apache.solr.common.cloud.ZkCmdExecutor.retryOperation(ZkCmdExecutor.java:61)
   [junit4]   2> 	at org.apache.solr.common.cloud.SolrZkClient.delete(SolrZkClient.java:241)
   [junit4]   2> 	at org.apache.solr.cloud.ElectionContext.cancelElection(ElectionContext.java:87)
   [junit4]   2> 	at org.apache.solr.cloud.ShardLeaderElectionContextBase.cancelElection(ElectionContext.java:167)
   [junit4]   2> 	at org.apache.solr.cloud.ShardLeaderElectionContext.cancelElection(ElectionContext.java:268)
   [junit4]   2> 	at org.apache.solr.cloud.ShardLeaderElectionContext.runLeaderProcess(ElectionContext.java:444)
   [junit4]   2> 	at org.apache.solr.cloud.LeaderElector.runIamLeaderProcess(LeaderElector.java:198)
   [junit4]   2> 	at org.apache.solr.cloud.LeaderElector.checkIfIamLeader(LeaderElector.java:158)
   [junit4]   2> 	at org.apache.solr.cloud.LeaderElector.access$200(LeaderElector.java:59)
   [junit4]   2> 	at org.apache.solr.cloud.LeaderElector$ElectionWatcher.process(LeaderElector.java:389)
   [junit4]   2> 	at org.apache.solr.common.cloud.SolrZkClient$3$1.run(SolrZkClient.java:269)
   [junit4]   2> 	at java.util.concurrent.Executors$RunnableAdapter.call(Executors.java:511)
   [junit4]   2> 	at java.util.concurrent.FutureTask.run(FutureTask.java:266)
   [junit4]   2> 	at org.apache.solr.common.util.ExecutorUtil$MDCAwareThreadPoolExecutor$1.run(ExecutorUtil.java:232)
   [junit4]   2> 	at java.util.concurrent.ThreadPoolExecutor.runWorker(ThreadPoolExecutor.java:1142)
   [junit4]   2> 	at java.util.concurrent.ThreadPoolExecutor$Worker.run(ThreadPoolExecutor.java:617)
   [junit4]   2> 	at java.lang.Thread.run(Thread.java:745)
   [junit4]   2> 2160085 WARN  (zkCallback-1121-thread-3-processing-n:127.0.0.1:54108_kyvy%2Fkk) [n:127.0.0.1:54108_kyvy%2Fkk    ] o.a.s.c.c.ZkStateReader ZooKeeper watch triggered, but Solr cannot talk to ZK: [KeeperErrorCode = Session expired for /live_nodes]
   [junit4]   2> 2160092 INFO  (TEST-TestDynamicLoading.testDynamicLoading-seed#[1AB3E18A9263A2E2]) [    ] o.e.j.s.ServerConnector Stopped ServerConnector@1bda4259{HTTP/1.1}{127.0.0.1:0}
   [junit4]   2> 2160092 INFO  (TEST-TestDynamicLoading.testDynamicLoading-seed#[1AB3E18A9263A2E2]) [    ] o.e.j.s.h.ContextHandler Stopped o.e.j.s.ServletContextHandler@70ba9e1a{/kyvy/kk,null,UNAVAILABLE}
   [junit4]   2> 2160096 INFO  (TEST-TestDynamicLoading.testDynamicLoading-seed#[1AB3E18A9263A2E2]) [n:127.0.0.1:54108_kyvy%2Fkk c:collection1 s:shard1 r:core_node4 x:collection1] o.a.s.c.ZkTestServer connecting to 127.0.0.1:53911 53911
   [junit4]   2> 2160252 INFO  (Thread-123210) [    ] o.a.s.c.ZkTestServer connecting to 127.0.0.1:53911 53911
   [junit4]   2> 2160253 WARN  (Thread-123210) [    ] o.a.s.c.ZkTestServer Watch limit violations: 
   [junit4]   2> Maximum concurrent create/delete watches above limit:
   [junit4]   2> 
   [junit4]   2> 	40	/solr/configs/conf1
   [junit4]   2> 	6	/solr/aliases.json
   [junit4]   2> 	5	/solr/security.json
   [junit4]   2> 	2	/solr/configs/.system
   [junit4]   2> 	2	/solr/configs/.system/managed-schema
   [junit4]   2> 
   [junit4]   2> Maximum concurrent data watches above limit:
   [junit4]   2> 
   [junit4]   2> 	6	/solr/clusterstate.json
   [junit4]   2> 	4	/solr/collections/collection1/state.json
   [junit4]   2> 	2	/solr/collections/.system/state.json
   [junit4]   2> 
   [junit4]   2> Maximum concurrent children watches above limit:
   [junit4]   2> 
   [junit4]   2> 	6	/solr/live_nodes
   [junit4]   2> 	6	/solr/collections
   [junit4]   2> 	4	/solr/overseer/queue
   [junit4]   2> 	4	/solr/overseer/collection-queue-work
   [junit4]   2> 
   [junit4]   2> NOTE: download the large Jenkins line-docs file by running 'ant get-jenkins-line-docs' in the lucene directory.
   [junit4]   2> NOTE: reproduce with: ant test  -Dtestcase=TestDynamicLoading -Dtests.method=testDynamicLoading -Dtests.seed=1AB3E18A9263A2E2 -Dtests.multiplier=2 -Dtests.nightly=true -Dtests.slow=true -Dtests.linedocsfile=/x1/jenkins/lucene-data/enwiki.random.lines.txt -Dtests.locale=sr_CS -Dtests.timezone=Africa/Maseru -Dtests.asserts=true -Dtests.file.encoding=ISO-8859-1
   [junit4] FAILURE 56.6s J2 | TestDynamicLoading.testDynamicLoading <<<
   [junit4]    > Throwable #1: java.lang.AssertionError: Could not get expected value  'X val changed' for path 'x' full output: {
   [junit4]    >   "responseHeader":{
   [junit4]    >     "status":0,
   [junit4]    >     "QTime":0},
   [junit4]    >   "params":{"wt":"json"},
   [junit4]    >   "context":{
   [junit4]    >     "webapp":"/kyvy/kk",
   [junit4]    >     "path":"/test1",
   [junit4]    >     "httpMethod":"GET"},
   [junit4]    >   "class":"org.apache.solr.core.BlobStoreTestRequestHandler",
   [junit4]    >   "x":"X val"}
   [junit4]    > 	at __randomizedtesting.SeedInfo.seed([1AB3E18A9263A2E2:C2FECCDD65BE0742]:0)
   [junit4]    > 	at org.apache.solr.core.TestSolrConfigHandler.testForResponseElement(TestSolrConfigHandler.java:458)
   [junit4]    > 	at org.apache.solr.core.TestDynamicLoading.testDynamicLoading(TestDynamicLoading.java:257)
   [junit4]    > 	at org.apache.solr.BaseDistributedSearchTestCase$ShardsRepeatRule$ShardsFixedStatement.callStatement(BaseDistributedSearchTestCase.java:965)
   [junit4]    > 	at org.apache.solr.BaseDistributedSearchTestCase$ShardsRepeatRule$ShardsStatement.evaluate(BaseDistributedSearchTestCase.java:940)
   [junit4]    > 	at java.lang.Thread.run(Thread.java:745)
   [junit4]   2> 2160263 INFO  (SUITE-TestDynamicLoading-seed#[1AB3E18A9263A2E2]-worker) [n:127.0.0.1:54108_kyvy%2Fkk c:collection1 s:shard1 r:core_node4 x:collection1] o.a.s.SolrTestCaseJ4 ###deleteCore
   [junit4]   2> NOTE: leaving temporary files on disk at: /x1/jenkins/jenkins-slave/workspace/Lucene-Solr-NightlyTests-trunk/solr/build/solr-core/test/J2/temp/solr.core.TestDynamicLoading_1AB3E18A9263A2E2-001
   [junit4]   2> NOTE: test params are: codec=Lucene60, sim=ClassicSimilarity, locale=sr_CS, timezone=Africa/Maseru
   [junit4]   2> NOTE: Linux 3.13.0-52-generic amd64/Oracle Corporation 1.8.0_66 (64-bit)/cpus=4,threads=1,free=113267248,total=533725184
   [junit4]   2> NOTE: All tests run in this JVM: [TestSolrDeletionPolicy1, TestSolrIndexConfig, TestIndexingPerformance, TestDistributedStatsComponentCardinality, TestManagedStopFilterFactory, AutoCommitTest, SuggesterWFSTTest, TestRestoreCore, TestPHPSerializedResponseWriter, TestTrackingShardHandlerFactory, TestSchemaSimilarityResource, SearchHandlerTest, CleanupOldIndexTest, RankQueryTest, AssignTest, TestCharFilters, HdfsRecoveryZkTest, MigrateRouteKeyTest, HdfsBasicDistributedZkTest, TestSolrQueryParser, BaseCdcrDistributedZkTest, TestConfigSetsAPIZkFailure, DirectUpdateHandlerOptimizeTest, CachingDirectoryFactoryTest, FieldAnalysisRequestHandlerTest, TestDownShardTolerantSearch, TestExtendedDismaxParser, TestClassNameShortening, TestDefaultStatsCache, TestReload, SegmentsInfoRequestHandlerTest, TestDynamicFieldCollectionResource, SparseHLLTest, TestMissingGroups, SampleTest, SuggesterTest, CircularListTest, TestQueryWrapperFilter, TestHashQParserPlugin, BasicDistributedZk2Test, TestUseDocValuesAsStored, ParsingFieldUpdateProcessorsTest, TestXIncludeConfig, BlockCacheTest, SpatialHeatmapFacetsTest, DistribDocExpirationUpdateProcessorTest, BadIndexSchemaTest, TestCustomSort, CurrencyFieldXmlFileTest, BJQParserTest, TestSweetSpotSimilarityFactory, HardAutoCommitTest, SimpleCollectionCreateDeleteTest, TestTolerantSearch, PKIAuthenticationIntegrationTest, AnalyticsQueryTest, TestInitParams, DistributedQueryComponentOptimizationTest, TestSuggestSpellingConverter, TestReRankQParserPlugin, BinaryUpdateRequestHandlerTest, DateMathParserTest, TestDistributedMissingSort, DebugComponentTest, TermVectorComponentDistributedTest, StressHdfsTest, TestRTimerTree, ZkStateWriterTest, CoreMergeIndexesAdminHandlerTest, TestCustomDocTransformer, PluginInfoTest, TestFuzzyAnalyzedSuggestions, TestIntervalFaceting, BadComponentTest, TestSolrCLIRunExample, OverseerTest, TestRebalanceLeaders, SimpleMLTQParserTest, TestCollationFieldDocValues, TestReversedWildcardFilterFactory, UnloadDistributedZkTest, TestDynamicLoading]
   [junit4] Completed [249/576 (1!)] on J2 in 56.66s, 1 test, 1 failure <<< FAILURES!

[...truncated 1054 lines...]
BUILD FAILED
/x1/jenkins/jenkins-slave/workspace/Lucene-Solr-NightlyTests-trunk/build.xml:791: The following error occurred while executing this line:
/x1/jenkins/jenkins-slave/workspace/Lucene-Solr-NightlyTests-trunk/build.xml:728: The following error occurred while executing this line:
/x1/jenkins/jenkins-slave/workspace/Lucene-Solr-NightlyTests-trunk/build.xml:59: The following error occurred while executing this line:
/x1/jenkins/jenkins-slave/workspace/Lucene-Solr-NightlyTests-trunk/solr/build.xml:233: The following error occurred while executing this line:
/x1/jenkins/jenkins-slave/workspace/Lucene-Solr-NightlyTests-trunk/solr/common-build.xml:522: The following error occurred while executing this line:
/x1/jenkins/jenkins-slave/workspace/Lucene-Solr-NightlyTests-trunk/lucene/common-build.xml:1424: The following error occurred while executing this line:
/x1/jenkins/jenkins-slave/workspace/Lucene-Solr-NightlyTests-trunk/lucene/common-build.xml:981: There were test failures: 576 suites (8 ignored), 2305 tests, 1 failure, 33 ignored (18 assumptions) [seed: 1AB3E18A9263A2E2]

Total time: 228 minutes 5 seconds
Build step 'Invoke Ant' marked build as failure
Archiving artifacts
No prior successful build to compare, so performing full copy of artifacts
Recording test results
Email was triggered for: Failure - Any
Sending email for trigger: Failure - Any



Mime
View raw message