lucene-dev mailing list archives

Site index · List index
Message view « Date » · « Thread »
Top « Date » · « Thread »
From Policeman Jenkins Server <jenk...@thetaphi.de>
Subject [JENKINS] Lucene-Solr-5.x-Linux (64bit/jdk1.8.0_66) - Build # 15244 - Failure!
Date Wed, 13 Jan 2016 10:26:23 GMT
Build: http://jenkins.thetaphi.de/job/Lucene-Solr-5.x-Linux/15244/
Java: 64bit/jdk1.8.0_66 -XX:-UseCompressedOops -XX:+UseConcMarkSweepGC

3 tests failed.
FAILED:  org.apache.solr.cloud.BasicDistributedZkTest.test

Error Message:
.response.numFound:1!=0

Stack Trace:
junit.framework.AssertionFailedError: .response.numFound:1!=0
	at __randomizedtesting.SeedInfo.seed([ED47A51AB42FE55C:65139AC01AD388A4]:0)
	at junit.framework.Assert.fail(Assert.java:50)
	at org.apache.solr.BaseDistributedSearchTestCase.compareSolrResponses(BaseDistributedSearchTestCase.java:893)
	at org.apache.solr.BaseDistributedSearchTestCase.compareResponses(BaseDistributedSearchTestCase.java:912)
	at org.apache.solr.BaseDistributedSearchTestCase.queryAndCompare(BaseDistributedSearchTestCase.java:655)
	at org.apache.solr.cloud.AbstractFullDistribZkTestBase.queryAndCompareReplicas(AbstractFullDistribZkTestBase.java:1042)
	at org.apache.solr.cloud.AbstractFullDistribZkTestBase.queryAndCompareShards(AbstractFullDistribZkTestBase.java:1059)
	at org.apache.solr.cloud.BasicDistributedZkTest.test(BasicDistributedZkTest.java:165)
	at sun.reflect.NativeMethodAccessorImpl.invoke0(Native Method)
	at sun.reflect.NativeMethodAccessorImpl.invoke(NativeMethodAccessorImpl.java:62)
	at sun.reflect.DelegatingMethodAccessorImpl.invoke(DelegatingMethodAccessorImpl.java:43)
	at java.lang.reflect.Method.invoke(Method.java:497)
	at com.carrotsearch.randomizedtesting.RandomizedRunner.invoke(RandomizedRunner.java:1764)
	at com.carrotsearch.randomizedtesting.RandomizedRunner$8.evaluate(RandomizedRunner.java:871)
	at com.carrotsearch.randomizedtesting.RandomizedRunner$9.evaluate(RandomizedRunner.java:907)
	at com.carrotsearch.randomizedtesting.RandomizedRunner$10.evaluate(RandomizedRunner.java:921)
	at org.apache.solr.BaseDistributedSearchTestCase$ShardsRepeatRule$ShardsFixedStatement.callStatement(BaseDistributedSearchTestCase.java:965)
	at org.apache.solr.BaseDistributedSearchTestCase$ShardsRepeatRule$ShardsStatement.evaluate(BaseDistributedSearchTestCase.java:940)
	at com.carrotsearch.randomizedtesting.rules.SystemPropertiesRestoreRule$1.evaluate(SystemPropertiesRestoreRule.java:57)
	at org.apache.lucene.util.TestRuleSetupTeardownChained$1.evaluate(TestRuleSetupTeardownChained.java:50)
	at org.apache.lucene.util.AbstractBeforeAfterRule$1.evaluate(AbstractBeforeAfterRule.java:46)
	at org.apache.lucene.util.TestRuleThreadAndTestName$1.evaluate(TestRuleThreadAndTestName.java:49)
	at org.apache.lucene.util.TestRuleIgnoreAfterMaxFailures$1.evaluate(TestRuleIgnoreAfterMaxFailures.java:65)
	at org.apache.lucene.util.TestRuleMarkFailure$1.evaluate(TestRuleMarkFailure.java:48)
	at com.carrotsearch.randomizedtesting.rules.StatementAdapter.evaluate(StatementAdapter.java:36)
	at com.carrotsearch.randomizedtesting.ThreadLeakControl$StatementRunner.run(ThreadLeakControl.java:367)
	at com.carrotsearch.randomizedtesting.ThreadLeakControl.forkTimeoutingTask(ThreadLeakControl.java:809)
	at com.carrotsearch.randomizedtesting.ThreadLeakControl$3.evaluate(ThreadLeakControl.java:460)
	at com.carrotsearch.randomizedtesting.RandomizedRunner.runSingleTest(RandomizedRunner.java:880)
	at com.carrotsearch.randomizedtesting.RandomizedRunner$5.evaluate(RandomizedRunner.java:781)
	at com.carrotsearch.randomizedtesting.RandomizedRunner$6.evaluate(RandomizedRunner.java:816)
	at com.carrotsearch.randomizedtesting.RandomizedRunner$7.evaluate(RandomizedRunner.java:827)
	at com.carrotsearch.randomizedtesting.rules.StatementAdapter.evaluate(StatementAdapter.java:36)
	at com.carrotsearch.randomizedtesting.rules.SystemPropertiesRestoreRule$1.evaluate(SystemPropertiesRestoreRule.java:57)
	at org.apache.lucene.util.AbstractBeforeAfterRule$1.evaluate(AbstractBeforeAfterRule.java:46)
	at com.carrotsearch.randomizedtesting.rules.StatementAdapter.evaluate(StatementAdapter.java:36)
	at org.apache.lucene.util.TestRuleStoreClassName$1.evaluate(TestRuleStoreClassName.java:42)
	at com.carrotsearch.randomizedtesting.rules.NoShadowingOrOverridesOnMethodsRule$1.evaluate(NoShadowingOrOverridesOnMethodsRule.java:40)
	at com.carrotsearch.randomizedtesting.rules.NoShadowingOrOverridesOnMethodsRule$1.evaluate(NoShadowingOrOverridesOnMethodsRule.java:40)
	at com.carrotsearch.randomizedtesting.rules.StatementAdapter.evaluate(StatementAdapter.java:36)
	at com.carrotsearch.randomizedtesting.rules.StatementAdapter.evaluate(StatementAdapter.java:36)
	at com.carrotsearch.randomizedtesting.rules.StatementAdapter.evaluate(StatementAdapter.java:36)
	at org.apache.lucene.util.TestRuleAssertionsRequired$1.evaluate(TestRuleAssertionsRequired.java:54)
	at org.apache.lucene.util.TestRuleMarkFailure$1.evaluate(TestRuleMarkFailure.java:48)
	at org.apache.lucene.util.TestRuleIgnoreAfterMaxFailures$1.evaluate(TestRuleIgnoreAfterMaxFailures.java:65)
	at org.apache.lucene.util.TestRuleIgnoreTestSuites$1.evaluate(TestRuleIgnoreTestSuites.java:55)
	at com.carrotsearch.randomizedtesting.rules.StatementAdapter.evaluate(StatementAdapter.java:36)
	at com.carrotsearch.randomizedtesting.ThreadLeakControl$StatementRunner.run(ThreadLeakControl.java:367)
	at java.lang.Thread.run(Thread.java:745)


FAILED:  org.apache.solr.cloud.DistribJoinFromCollectionTest.test

Error Message:
Error from server at http://127.0.0.1:58617/p_w/az/to_2x2_shard2_replica1: Error from server at http://127.0.0.1:39792/p_w/az/to_2x2_shard1_replica1: SolrCloud join: from_1x2 has a local replica (from_1x2_shard1_replica4) on 127.0.0.1:39792_p_w%2Faz, but it is down

Stack Trace:
org.apache.solr.client.solrj.impl.HttpSolrClient$RemoteSolrException: Error from server at http://127.0.0.1:58617/p_w/az/to_2x2_shard2_replica1: Error from server at http://127.0.0.1:39792/p_w/az/to_2x2_shard1_replica1: SolrCloud join: from_1x2 has a local replica (from_1x2_shard1_replica4) on 127.0.0.1:39792_p_w%2Faz, but it is down
	at __randomizedtesting.SeedInfo.seed([ED47A51AB42FE55C:65139AC01AD388A4]:0)
	at org.apache.solr.client.solrj.impl.HttpSolrClient.executeMethod(HttpSolrClient.java:575)
	at org.apache.solr.client.solrj.impl.HttpSolrClient.request(HttpSolrClient.java:241)
	at org.apache.solr.client.solrj.impl.HttpSolrClient.request(HttpSolrClient.java:230)
	at org.apache.solr.client.solrj.impl.LBHttpSolrClient.doRequest(LBHttpSolrClient.java:372)
	at org.apache.solr.client.solrj.impl.LBHttpSolrClient.request(LBHttpSolrClient.java:325)
	at org.apache.solr.client.solrj.impl.CloudSolrClient.sendRequest(CloudSolrClient.java:1100)
	at org.apache.solr.client.solrj.impl.CloudSolrClient.requestWithRetryOnStaleState(CloudSolrClient.java:871)
	at org.apache.solr.client.solrj.impl.CloudSolrClient.request(CloudSolrClient.java:807)
	at org.apache.solr.client.solrj.SolrClient.request(SolrClient.java:1220)
	at org.apache.solr.cloud.DistribJoinFromCollectionTest.testJoins(DistribJoinFromCollectionTest.java:132)
	at org.apache.solr.cloud.DistribJoinFromCollectionTest.test(DistribJoinFromCollectionTest.java:103)
	at sun.reflect.NativeMethodAccessorImpl.invoke0(Native Method)
	at sun.reflect.NativeMethodAccessorImpl.invoke(NativeMethodAccessorImpl.java:62)
	at sun.reflect.DelegatingMethodAccessorImpl.invoke(DelegatingMethodAccessorImpl.java:43)
	at java.lang.reflect.Method.invoke(Method.java:497)
	at com.carrotsearch.randomizedtesting.RandomizedRunner.invoke(RandomizedRunner.java:1764)
	at com.carrotsearch.randomizedtesting.RandomizedRunner$8.evaluate(RandomizedRunner.java:871)
	at com.carrotsearch.randomizedtesting.RandomizedRunner$9.evaluate(RandomizedRunner.java:907)
	at com.carrotsearch.randomizedtesting.RandomizedRunner$10.evaluate(RandomizedRunner.java:921)
	at org.apache.solr.BaseDistributedSearchTestCase$ShardsRepeatRule$ShardsFixedStatement.callStatement(BaseDistributedSearchTestCase.java:965)
	at org.apache.solr.BaseDistributedSearchTestCase$ShardsRepeatRule$ShardsStatement.evaluate(BaseDistributedSearchTestCase.java:940)
	at com.carrotsearch.randomizedtesting.rules.SystemPropertiesRestoreRule$1.evaluate(SystemPropertiesRestoreRule.java:57)
	at org.apache.lucene.util.TestRuleSetupTeardownChained$1.evaluate(TestRuleSetupTeardownChained.java:50)
	at org.apache.lucene.util.AbstractBeforeAfterRule$1.evaluate(AbstractBeforeAfterRule.java:46)
	at org.apache.lucene.util.TestRuleThreadAndTestName$1.evaluate(TestRuleThreadAndTestName.java:49)
	at org.apache.lucene.util.TestRuleIgnoreAfterMaxFailures$1.evaluate(TestRuleIgnoreAfterMaxFailures.java:65)
	at org.apache.lucene.util.TestRuleMarkFailure$1.evaluate(TestRuleMarkFailure.java:48)
	at com.carrotsearch.randomizedtesting.rules.StatementAdapter.evaluate(StatementAdapter.java:36)
	at com.carrotsearch.randomizedtesting.ThreadLeakControl$StatementRunner.run(ThreadLeakControl.java:367)
	at com.carrotsearch.randomizedtesting.ThreadLeakControl.forkTimeoutingTask(ThreadLeakControl.java:809)
	at com.carrotsearch.randomizedtesting.ThreadLeakControl$3.evaluate(ThreadLeakControl.java:460)
	at com.carrotsearch.randomizedtesting.RandomizedRunner.runSingleTest(RandomizedRunner.java:880)
	at com.carrotsearch.randomizedtesting.RandomizedRunner$5.evaluate(RandomizedRunner.java:781)
	at com.carrotsearch.randomizedtesting.RandomizedRunner$6.evaluate(RandomizedRunner.java:816)
	at com.carrotsearch.randomizedtesting.RandomizedRunner$7.evaluate(RandomizedRunner.java:827)
	at com.carrotsearch.randomizedtesting.rules.StatementAdapter.evaluate(StatementAdapter.java:36)
	at com.carrotsearch.randomizedtesting.rules.SystemPropertiesRestoreRule$1.evaluate(SystemPropertiesRestoreRule.java:57)
	at org.apache.lucene.util.AbstractBeforeAfterRule$1.evaluate(AbstractBeforeAfterRule.java:46)
	at com.carrotsearch.randomizedtesting.rules.StatementAdapter.evaluate(StatementAdapter.java:36)
	at org.apache.lucene.util.TestRuleStoreClassName$1.evaluate(TestRuleStoreClassName.java:42)
	at com.carrotsearch.randomizedtesting.rules.NoShadowingOrOverridesOnMethodsRule$1.evaluate(NoShadowingOrOverridesOnMethodsRule.java:40)
	at com.carrotsearch.randomizedtesting.rules.NoShadowingOrOverridesOnMethodsRule$1.evaluate(NoShadowingOrOverridesOnMethodsRule.java:40)
	at com.carrotsearch.randomizedtesting.rules.StatementAdapter.evaluate(StatementAdapter.java:36)
	at com.carrotsearch.randomizedtesting.rules.StatementAdapter.evaluate(StatementAdapter.java:36)
	at com.carrotsearch.randomizedtesting.rules.StatementAdapter.evaluate(StatementAdapter.java:36)
	at org.apache.lucene.util.TestRuleAssertionsRequired$1.evaluate(TestRuleAssertionsRequired.java:54)
	at org.apache.lucene.util.TestRuleMarkFailure$1.evaluate(TestRuleMarkFailure.java:48)
	at org.apache.lucene.util.TestRuleIgnoreAfterMaxFailures$1.evaluate(TestRuleIgnoreAfterMaxFailures.java:65)
	at org.apache.lucene.util.TestRuleIgnoreTestSuites$1.evaluate(TestRuleIgnoreTestSuites.java:55)
	at com.carrotsearch.randomizedtesting.rules.StatementAdapter.evaluate(StatementAdapter.java:36)
	at com.carrotsearch.randomizedtesting.ThreadLeakControl$StatementRunner.run(ThreadLeakControl.java:367)
	at java.lang.Thread.run(Thread.java:745)


FAILED:  org.apache.solr.cloud.ShardSplitTest.test

Error Message:
There are still nodes recoverying - waited for 330 seconds

Stack Trace:
java.lang.AssertionError: There are still nodes recoverying - waited for 330 seconds
	at __randomizedtesting.SeedInfo.seed([ED47A51AB42FE55C:65139AC01AD388A4]:0)
	at org.junit.Assert.fail(Assert.java:93)
	at org.apache.solr.cloud.AbstractDistribZkTestBase.waitForRecoveriesToFinish(AbstractDistribZkTestBase.java:175)
	at org.apache.solr.cloud.AbstractDistribZkTestBase.waitForRecoveriesToFinish(AbstractDistribZkTestBase.java:136)
	at org.apache.solr.cloud.AbstractDistribZkTestBase.waitForRecoveriesToFinish(AbstractDistribZkTestBase.java:131)
	at org.apache.solr.cloud.AbstractFullDistribZkTestBase.waitForRecoveriesToFinish(AbstractFullDistribZkTestBase.java:825)
	at org.apache.solr.cloud.ShardSplitTest.splitByUniqueKeyTest(ShardSplitTest.java:219)
	at org.apache.solr.cloud.ShardSplitTest.test(ShardSplitTest.java:82)
	at sun.reflect.NativeMethodAccessorImpl.invoke0(Native Method)
	at sun.reflect.NativeMethodAccessorImpl.invoke(NativeMethodAccessorImpl.java:62)
	at sun.reflect.DelegatingMethodAccessorImpl.invoke(DelegatingMethodAccessorImpl.java:43)
	at java.lang.reflect.Method.invoke(Method.java:497)
	at com.carrotsearch.randomizedtesting.RandomizedRunner.invoke(RandomizedRunner.java:1764)
	at com.carrotsearch.randomizedtesting.RandomizedRunner$8.evaluate(RandomizedRunner.java:871)
	at com.carrotsearch.randomizedtesting.RandomizedRunner$9.evaluate(RandomizedRunner.java:907)
	at com.carrotsearch.randomizedtesting.RandomizedRunner$10.evaluate(RandomizedRunner.java:921)
	at org.apache.solr.BaseDistributedSearchTestCase$ShardsRepeatRule$ShardsFixedStatement.callStatement(BaseDistributedSearchTestCase.java:965)
	at org.apache.solr.BaseDistributedSearchTestCase$ShardsRepeatRule$ShardsStatement.evaluate(BaseDistributedSearchTestCase.java:940)
	at com.carrotsearch.randomizedtesting.rules.SystemPropertiesRestoreRule$1.evaluate(SystemPropertiesRestoreRule.java:57)
	at org.apache.lucene.util.TestRuleSetupTeardownChained$1.evaluate(TestRuleSetupTeardownChained.java:50)
	at org.apache.lucene.util.AbstractBeforeAfterRule$1.evaluate(AbstractBeforeAfterRule.java:46)
	at org.apache.lucene.util.TestRuleThreadAndTestName$1.evaluate(TestRuleThreadAndTestName.java:49)
	at org.apache.lucene.util.TestRuleIgnoreAfterMaxFailures$1.evaluate(TestRuleIgnoreAfterMaxFailures.java:65)
	at org.apache.lucene.util.TestRuleMarkFailure$1.evaluate(TestRuleMarkFailure.java:48)
	at com.carrotsearch.randomizedtesting.rules.StatementAdapter.evaluate(StatementAdapter.java:36)
	at com.carrotsearch.randomizedtesting.ThreadLeakControl$StatementRunner.run(ThreadLeakControl.java:367)
	at com.carrotsearch.randomizedtesting.ThreadLeakControl.forkTimeoutingTask(ThreadLeakControl.java:809)
	at com.carrotsearch.randomizedtesting.ThreadLeakControl$3.evaluate(ThreadLeakControl.java:460)
	at com.carrotsearch.randomizedtesting.RandomizedRunner.runSingleTest(RandomizedRunner.java:880)
	at com.carrotsearch.randomizedtesting.RandomizedRunner$5.evaluate(RandomizedRunner.java:781)
	at com.carrotsearch.randomizedtesting.RandomizedRunner$6.evaluate(RandomizedRunner.java:816)
	at com.carrotsearch.randomizedtesting.RandomizedRunner$7.evaluate(RandomizedRunner.java:827)
	at com.carrotsearch.randomizedtesting.rules.StatementAdapter.evaluate(StatementAdapter.java:36)
	at com.carrotsearch.randomizedtesting.rules.SystemPropertiesRestoreRule$1.evaluate(SystemPropertiesRestoreRule.java:57)
	at org.apache.lucene.util.AbstractBeforeAfterRule$1.evaluate(AbstractBeforeAfterRule.java:46)
	at com.carrotsearch.randomizedtesting.rules.StatementAdapter.evaluate(StatementAdapter.java:36)
	at org.apache.lucene.util.TestRuleStoreClassName$1.evaluate(TestRuleStoreClassName.java:42)
	at com.carrotsearch.randomizedtesting.rules.NoShadowingOrOverridesOnMethodsRule$1.evaluate(NoShadowingOrOverridesOnMethodsRule.java:40)
	at com.carrotsearch.randomizedtesting.rules.NoShadowingOrOverridesOnMethodsRule$1.evaluate(NoShadowingOrOverridesOnMethodsRule.java:40)
	at com.carrotsearch.randomizedtesting.rules.StatementAdapter.evaluate(StatementAdapter.java:36)
	at com.carrotsearch.randomizedtesting.rules.StatementAdapter.evaluate(StatementAdapter.java:36)
	at com.carrotsearch.randomizedtesting.rules.StatementAdapter.evaluate(StatementAdapter.java:36)
	at org.apache.lucene.util.TestRuleAssertionsRequired$1.evaluate(TestRuleAssertionsRequired.java:54)
	at org.apache.lucene.util.TestRuleMarkFailure$1.evaluate(TestRuleMarkFailure.java:48)
	at org.apache.lucene.util.TestRuleIgnoreAfterMaxFailures$1.evaluate(TestRuleIgnoreAfterMaxFailures.java:65)
	at org.apache.lucene.util.TestRuleIgnoreTestSuites$1.evaluate(TestRuleIgnoreTestSuites.java:55)
	at com.carrotsearch.randomizedtesting.rules.StatementAdapter.evaluate(StatementAdapter.java:36)
	at com.carrotsearch.randomizedtesting.ThreadLeakControl$StatementRunner.run(ThreadLeakControl.java:367)
	at java.lang.Thread.run(Thread.java:745)




Build Log:
[...truncated 10588 lines...]
   [junit4] Suite: org.apache.solr.cloud.BasicDistributedZkTest
   [junit4]   2> Creating dataDir: /home/jenkins/workspace/Lucene-Solr-5.x-Linux/solr/build/solr-core/test/J0/temp/solr.cloud.BasicDistributedZkTest_ED47A51AB42FE55C-001/init-core-data-001
   [junit4]   2> 689092 INFO  (SUITE-BasicDistributedZkTest-seed#[ED47A51AB42FE55C]-worker) [    ] o.a.s.BaseDistributedSearchTestCase Setting hostContext system property: /
   [junit4]   2> 689093 INFO  (TEST-BasicDistributedZkTest.test-seed#[ED47A51AB42FE55C]) [    ] o.a.s.c.ZkTestServer STARTING ZK TEST SERVER
   [junit4]   2> 689094 INFO  (Thread-1733) [    ] o.a.s.c.ZkTestServer client port:0.0.0.0/0.0.0.0:0
   [junit4]   2> 689094 INFO  (Thread-1733) [    ] o.a.s.c.ZkTestServer Starting server
   [junit4]   2> 689194 INFO  (TEST-BasicDistributedZkTest.test-seed#[ED47A51AB42FE55C]) [    ] o.a.s.c.ZkTestServer start zk server on port:48011
   [junit4]   2> 689194 INFO  (TEST-BasicDistributedZkTest.test-seed#[ED47A51AB42FE55C]) [    ] o.a.s.c.c.SolrZkClient Using default ZkCredentialsProvider
   [junit4]   2> 689194 INFO  (TEST-BasicDistributedZkTest.test-seed#[ED47A51AB42FE55C]) [    ] o.a.s.c.c.ConnectionManager Waiting for client to connect to ZooKeeper
   [junit4]   2> 689196 INFO  (zkCallback-595-thread-1) [    ] o.a.s.c.c.ConnectionManager Watcher org.apache.solr.common.cloud.ConnectionManager@502be571 name:ZooKeeperConnection Watcher:127.0.0.1:48011 got event WatchedEvent state:SyncConnected type:None path:null path:null type:None
   [junit4]   2> 689196 INFO  (TEST-BasicDistributedZkTest.test-seed#[ED47A51AB42FE55C]) [    ] o.a.s.c.c.ConnectionManager Client is connected to ZooKeeper
   [junit4]   2> 689196 INFO  (TEST-BasicDistributedZkTest.test-seed#[ED47A51AB42FE55C]) [    ] o.a.s.c.c.SolrZkClient Using default ZkACLProvider
   [junit4]   2> 689196 INFO  (TEST-BasicDistributedZkTest.test-seed#[ED47A51AB42FE55C]) [    ] o.a.s.c.c.SolrZkClient makePath: /solr
   [junit4]   2> 689198 INFO  (TEST-BasicDistributedZkTest.test-seed#[ED47A51AB42FE55C]) [    ] o.a.s.c.c.SolrZkClient Using default ZkCredentialsProvider
   [junit4]   2> 689198 INFO  (TEST-BasicDistributedZkTest.test-seed#[ED47A51AB42FE55C]) [    ] o.a.s.c.c.ConnectionManager Waiting for client to connect to ZooKeeper
   [junit4]   2> 689198 INFO  (zkCallback-596-thread-1) [    ] o.a.s.c.c.ConnectionManager Watcher org.apache.solr.common.cloud.ConnectionManager@2d3cc798 name:ZooKeeperConnection Watcher:127.0.0.1:48011/solr got event WatchedEvent state:SyncConnected type:None path:null path:null type:None
   [junit4]   2> 689198 INFO  (TEST-BasicDistributedZkTest.test-seed#[ED47A51AB42FE55C]) [    ] o.a.s.c.c.ConnectionManager Client is connected to ZooKeeper
   [junit4]   2> 689199 INFO  (TEST-BasicDistributedZkTest.test-seed#[ED47A51AB42FE55C]) [    ] o.a.s.c.c.SolrZkClient Using default ZkACLProvider
   [junit4]   2> 689199 INFO  (TEST-BasicDistributedZkTest.test-seed#[ED47A51AB42FE55C]) [    ] o.a.s.c.c.SolrZkClient makePath: /collections/collection1
   [junit4]   2> 689200 INFO  (TEST-BasicDistributedZkTest.test-seed#[ED47A51AB42FE55C]) [    ] o.a.s.c.c.SolrZkClient makePath: /collections/collection1/shards
   [junit4]   2> 689200 INFO  (TEST-BasicDistributedZkTest.test-seed#[ED47A51AB42FE55C]) [    ] o.a.s.c.c.SolrZkClient makePath: /collections/control_collection
   [junit4]   2> 689201 INFO  (TEST-BasicDistributedZkTest.test-seed#[ED47A51AB42FE55C]) [    ] o.a.s.c.c.SolrZkClient makePath: /collections/control_collection/shards
   [junit4]   2> 689201 INFO  (TEST-BasicDistributedZkTest.test-seed#[ED47A51AB42FE55C]) [    ] o.a.s.c.AbstractZkTestCase put /home/jenkins/workspace/Lucene-Solr-5.x-Linux/solr/core/src/test-files/solr/collection1/conf/solrconfig-tlog.xml to /configs/conf1/solrconfig.xml
   [junit4]   2> 689201 INFO  (TEST-BasicDistributedZkTest.test-seed#[ED47A51AB42FE55C]) [    ] o.a.s.c.c.SolrZkClient makePath: /configs/conf1/solrconfig.xml
   [junit4]   2> 689202 INFO  (TEST-BasicDistributedZkTest.test-seed#[ED47A51AB42FE55C]) [    ] o.a.s.c.AbstractZkTestCase put /home/jenkins/workspace/Lucene-Solr-5.x-Linux/solr/core/src/test-files/solr/collection1/conf/schema.xml to /configs/conf1/schema.xml
   [junit4]   2> 689202 INFO  (TEST-BasicDistributedZkTest.test-seed#[ED47A51AB42FE55C]) [    ] o.a.s.c.c.SolrZkClient makePath: /configs/conf1/schema.xml
   [junit4]   2> 689203 INFO  (TEST-BasicDistributedZkTest.test-seed#[ED47A51AB42FE55C]) [    ] o.a.s.c.AbstractZkTestCase put /home/jenkins/workspace/Lucene-Solr-5.x-Linux/solr/core/src/test-files/solr/collection1/conf/solrconfig.snippet.randomindexconfig.xml to /configs/conf1/solrconfig.snippet.randomindexconfig.xml
   [junit4]   2> 689203 INFO  (TEST-BasicDistributedZkTest.test-seed#[ED47A51AB42FE55C]) [    ] o.a.s.c.c.SolrZkClient makePath: /configs/conf1/solrconfig.snippet.randomindexconfig.xml
   [junit4]   2> 689203 INFO  (TEST-BasicDistributedZkTest.test-seed#[ED47A51AB42FE55C]) [    ] o.a.s.c.AbstractZkTestCase put /home/jenkins/workspace/Lucene-Solr-5.x-Linux/solr/core/src/test-files/solr/collection1/conf/stopwords.txt to /configs/conf1/stopwords.txt
   [junit4]   2> 689204 INFO  (TEST-BasicDistributedZkTest.test-seed#[ED47A51AB42FE55C]) [    ] o.a.s.c.c.SolrZkClient makePath: /configs/conf1/stopwords.txt
   [junit4]   2> 689204 INFO  (TEST-BasicDistributedZkTest.test-seed#[ED47A51AB42FE55C]) [    ] o.a.s.c.AbstractZkTestCase put /home/jenkins/workspace/Lucene-Solr-5.x-Linux/solr/core/src/test-files/solr/collection1/conf/protwords.txt to /configs/conf1/protwords.txt
   [junit4]   2> 689204 INFO  (TEST-BasicDistributedZkTest.test-seed#[ED47A51AB42FE55C]) [    ] o.a.s.c.c.SolrZkClient makePath: /configs/conf1/protwords.txt
   [junit4]   2> 689205 INFO  (TEST-BasicDistributedZkTest.test-seed#[ED47A51AB42FE55C]) [    ] o.a.s.c.AbstractZkTestCase put /home/jenkins/workspace/Lucene-Solr-5.x-Linux/solr/core/src/test-files/solr/collection1/conf/currency.xml to /configs/conf1/currency.xml
   [junit4]   2> 689205 INFO  (TEST-BasicDistributedZkTest.test-seed#[ED47A51AB42FE55C]) [    ] o.a.s.c.c.SolrZkClient makePath: /configs/conf1/currency.xml
   [junit4]   2> 689205 INFO  (TEST-BasicDistributedZkTest.test-seed#[ED47A51AB42FE55C]) [    ] o.a.s.c.AbstractZkTestCase put /home/jenkins/workspace/Lucene-Solr-5.x-Linux/solr/core/src/test-files/solr/collection1/conf/enumsConfig.xml to /configs/conf1/enumsConfig.xml
   [junit4]   2> 689205 INFO  (TEST-BasicDistributedZkTest.test-seed#[ED47A51AB42FE55C]) [    ] o.a.s.c.c.SolrZkClient makePath: /configs/conf1/enumsConfig.xml
   [junit4]   2> 689206 INFO  (TEST-BasicDistributedZkTest.test-seed#[ED47A51AB42FE55C]) [    ] o.a.s.c.AbstractZkTestCase put /home/jenkins/workspace/Lucene-Solr-5.x-Linux/solr/core/src/test-files/solr/collection1/conf/open-exchange-rates.json to /configs/conf1/open-exchange-rates.json
   [junit4]   2> 689206 INFO  (TEST-BasicDistributedZkTest.test-seed#[ED47A51AB42FE55C]) [    ] o.a.s.c.c.SolrZkClient makePath: /configs/conf1/open-exchange-rates.json
   [junit4]   2> 689206 INFO  (TEST-BasicDistributedZkTest.test-seed#[ED47A51AB42FE55C]) [    ] o.a.s.c.AbstractZkTestCase put /home/jenkins/workspace/Lucene-Solr-5.x-Linux/solr/core/src/test-files/solr/collection1/conf/mapping-ISOLatin1Accent.txt to /configs/conf1/mapping-ISOLatin1Accent.txt
   [junit4]   2> 689206 INFO  (TEST-BasicDistributedZkTest.test-seed#[ED47A51AB42FE55C]) [    ] o.a.s.c.c.SolrZkClient makePath: /configs/conf1/mapping-ISOLatin1Accent.txt
   [junit4]   2> 689207 INFO  (TEST-BasicDistributedZkTest.test-seed#[ED47A51AB42FE55C]) [    ] o.a.s.c.AbstractZkTestCase put /home/jenkins/workspace/Lucene-Solr-5.x-Linux/solr/core/src/test-files/solr/collection1/conf/old_synonyms.txt to /configs/conf1/old_synonyms.txt
   [junit4]   2> 689207 INFO  (TEST-BasicDistributedZkTest.test-seed#[ED47A51AB42FE55C]) [    ] o.a.s.c.c.SolrZkClient makePath: /configs/conf1/old_synonyms.txt
   [junit4]   2> 689208 INFO  (TEST-BasicDistributedZkTest.test-seed#[ED47A51AB42FE55C]) [    ] o.a.s.c.AbstractZkTestCase put /home/jenkins/workspace/Lucene-Solr-5.x-Linux/solr/core/src/test-files/solr/collection1/conf/synonyms.txt to /configs/conf1/synonyms.txt
   [junit4]   2> 689208 INFO  (TEST-BasicDistributedZkTest.test-seed#[ED47A51AB42FE55C]) [    ] o.a.s.c.c.SolrZkClient makePath: /configs/conf1/synonyms.txt
   [junit4]   2> 689265 INFO  (TEST-BasicDistributedZkTest.test-seed#[ED47A51AB42FE55C]) [    ] o.a.s.SolrTestCaseJ4 Writing core.properties file to /home/jenkins/workspace/Lucene-Solr-5.x-Linux/solr/build/solr-core/test/J0/temp/solr.cloud.BasicDistributedZkTest_ED47A51AB42FE55C-001/control-001/cores/collection1
   [junit4]   2> 689266 INFO  (TEST-BasicDistributedZkTest.test-seed#[ED47A51AB42FE55C]) [    ] o.e.j.s.Server jetty-9.2.13.v20150730
   [junit4]   2> 689278 INFO  (TEST-BasicDistributedZkTest.test-seed#[ED47A51AB42FE55C]) [    ] o.e.j.s.h.ContextHandler Started o.e.j.s.ServletContextHandler@2169cc0f{/,null,AVAILABLE}
   [junit4]   2> 689281 INFO  (TEST-BasicDistributedZkTest.test-seed#[ED47A51AB42FE55C]) [    ] o.e.j.s.ServerConnector Started ServerConnector@1ebc5aa5{HTTP/1.1}{127.0.0.1:34475}
   [junit4]   2> 689281 INFO  (TEST-BasicDistributedZkTest.test-seed#[ED47A51AB42FE55C]) [    ] o.e.j.s.Server Started @691254ms
   [junit4]   2> 689281 INFO  (TEST-BasicDistributedZkTest.test-seed#[ED47A51AB42FE55C]) [    ] o.a.s.c.s.e.JettySolrRunner Jetty properties: {solr.data.dir=/home/jenkins/workspace/Lucene-Solr-5.x-Linux/solr/build/solr-core/test/J0/temp/solr.cloud.BasicDistributedZkTest_ED47A51AB42FE55C-001/tempDir-001/control/data, hostContext=/, hostPort=34475, coreRootDirectory=/home/jenkins/workspace/Lucene-Solr-5.x-Linux/solr/build/solr-core/test/J0/../../../../../../../../../home/jenkins/workspace/Lucene-Solr-5.x-Linux/solr/build/solr-core/test/J0/temp/solr.cloud.BasicDistributedZkTest_ED47A51AB42FE55C-001/control-001/cores}
   [junit4]   2> 689281 INFO  (TEST-BasicDistributedZkTest.test-seed#[ED47A51AB42FE55C]) [    ] o.a.s.s.SolrDispatchFilter SolrDispatchFilter.init(): sun.misc.Launcher$AppClassLoader@4e0e2f2a
   [junit4]   2> 689281 INFO  (TEST-BasicDistributedZkTest.test-seed#[ED47A51AB42FE55C]) [    ] o.a.s.c.SolrResourceLoader new SolrResourceLoader for directory: '/home/jenkins/workspace/Lucene-Solr-5.x-Linux/solr/build/solr-core/test/J0/temp/solr.cloud.BasicDistributedZkTest_ED47A51AB42FE55C-001/control-001'
   [junit4]   2> 689282 INFO  (TEST-BasicDistributedZkTest.test-seed#[ED47A51AB42FE55C]) [    ] o.a.s.c.SolrResourceLoader JNDI not configured for solr (NoInitialContextEx)
   [junit4]   2> 689282 INFO  (TEST-BasicDistributedZkTest.test-seed#[ED47A51AB42FE55C]) [    ] o.a.s.c.SolrResourceLoader solr home defaulted to 'solr/' (could not find system property or JNDI)
   [junit4]   2> 689282 INFO  (TEST-BasicDistributedZkTest.test-seed#[ED47A51AB42FE55C]) [    ] o.a.s.c.c.SolrZkClient Using default ZkCredentialsProvider
   [junit4]   2> 689282 INFO  (TEST-BasicDistributedZkTest.test-seed#[ED47A51AB42FE55C]) [    ] o.a.s.c.c.ConnectionManager Waiting for client to connect to ZooKeeper
   [junit4]   2> 689283 INFO  (zkCallback-597-thread-1) [    ] o.a.s.c.c.ConnectionManager Watcher org.apache.solr.common.cloud.ConnectionManager@3bcbc2a9 name:ZooKeeperConnection Watcher:127.0.0.1:48011/solr got event WatchedEvent state:SyncConnected type:None path:null path:null type:None
   [junit4]   2> 689283 INFO  (TEST-BasicDistributedZkTest.test-seed#[ED47A51AB42FE55C]) [    ] o.a.s.c.c.ConnectionManager Client is connected to ZooKeeper
   [junit4]   2> 689284 INFO  (TEST-BasicDistributedZkTest.test-seed#[ED47A51AB42FE55C]) [    ] o.a.s.c.c.SolrZkClient Using default ZkACLProvider
   [junit4]   2> 689284 INFO  (TEST-BasicDistributedZkTest.test-seed#[ED47A51AB42FE55C]) [    ] o.a.s.s.SolrDispatchFilter Loading solr.xml from SolrHome (not found in ZooKeeper)
   [junit4]   2> 689284 INFO  (TEST-BasicDistributedZkTest.test-seed#[ED47A51AB42FE55C]) [    ] o.a.s.c.SolrXmlConfig Loading container configuration from /home/jenkins/workspace/Lucene-Solr-5.x-Linux/solr/build/solr-core/test/J0/temp/solr.cloud.BasicDistributedZkTest_ED47A51AB42FE55C-001/control-001/solr.xml
   [junit4]   2> 689288 INFO  (TEST-BasicDistributedZkTest.test-seed#[ED47A51AB42FE55C]) [    ] o.a.s.c.CorePropertiesLocator Config-defined core root directory: /home/jenkins/workspace/Lucene-Solr-5.x-Linux/solr/build/solr-core/test/J0/../../../../../../../../../home/jenkins/workspace/Lucene-Solr-5.x-Linux/solr/build/solr-core/test/J0/temp/solr.cloud.BasicDistributedZkTest_ED47A51AB42FE55C-001/control-001/cores
   [junit4]   2> 689288 INFO  (TEST-BasicDistributedZkTest.test-seed#[ED47A51AB42FE55C]) [    ] o.a.s.c.CoreContainer New CoreContainer 583410488
   [junit4]   2> 689288 INFO  (TEST-BasicDistributedZkTest.test-seed#[ED47A51AB42FE55C]) [    ] o.a.s.c.CoreContainer Loading cores into CoreContainer [instanceDir=/home/jenkins/workspace/Lucene-Solr-5.x-Linux/solr/build/solr-core/test/J0/temp/solr.cloud.BasicDistributedZkTest_ED47A51AB42FE55C-001/control-001]
   [junit4]   2> 689288 WARN  (TEST-BasicDistributedZkTest.test-seed#[ED47A51AB42FE55C]) [    ] o.a.s.c.CoreContainer Couldn't add files from /home/jenkins/workspace/Lucene-Solr-5.x-Linux/solr/build/solr-core/test/J0/temp/solr.cloud.BasicDistributedZkTest_ED47A51AB42FE55C-001/control-001/lib to classpath: /home/jenkins/workspace/Lucene-Solr-5.x-Linux/solr/build/solr-core/test/J0/temp/solr.cloud.BasicDistributedZkTest_ED47A51AB42FE55C-001/control-001/lib
   [junit4]   2> 689288 INFO  (TEST-BasicDistributedZkTest.test-seed#[ED47A51AB42FE55C]) [    ] o.a.s.h.c.HttpShardHandlerFactory created with socketTimeout : 90000,urlScheme : ,connTimeout : 15000,maxConnectionsPerHost : 20,maxConnections : 10000,corePoolSize : 0,maximumPoolSize : 2147483647,maxThreadIdleTime : 5,sizeOfQueue : -1,fairnessPolicy : false,useRetries : false,
   [junit4]   2> 689289 INFO  (TEST-BasicDistributedZkTest.test-seed#[ED47A51AB42FE55C]) [    ] o.a.s.u.UpdateShardHandler Creating UpdateShardHandler HTTP client with params: socketTimeout=340000&connTimeout=45000&retry=true
   [junit4]   2> 689289 INFO  (TEST-BasicDistributedZkTest.test-seed#[ED47A51AB42FE55C]) [    ] o.a.s.l.LogWatcher SLF4J impl is org.slf4j.impl.Log4jLoggerFactory
   [junit4]   2> 689289 INFO  (TEST-BasicDistributedZkTest.test-seed#[ED47A51AB42FE55C]) [    ] o.a.s.l.LogWatcher Registering Log Listener [Log4j (org.slf4j.impl.Log4jLoggerFactory)]
   [junit4]   2> 689289 INFO  (TEST-BasicDistributedZkTest.test-seed#[ED47A51AB42FE55C]) [    ] o.a.s.c.ZkContainer Zookeeper client=127.0.0.1:48011/solr
   [junit4]   2> 689289 INFO  (TEST-BasicDistributedZkTest.test-seed#[ED47A51AB42FE55C]) [    ] o.a.s.c.ZkController zkHost includes chroot
   [junit4]   2> 689289 INFO  (TEST-BasicDistributedZkTest.test-seed#[ED47A51AB42FE55C]) [    ] o.a.s.c.c.SolrZkClient Using default ZkCredentialsProvider
   [junit4]   2> 689289 INFO  (TEST-BasicDistributedZkTest.test-seed#[ED47A51AB42FE55C]) [    ] o.a.s.c.c.ConnectionManager Waiting for client to connect to ZooKeeper
   [junit4]   2> 689290 INFO  (zkCallback-599-thread-1) [    ] o.a.s.c.c.ConnectionManager Watcher org.apache.solr.common.cloud.ConnectionManager@7d718df name:ZooKeeperConnection Watcher:127.0.0.1:48011 got event WatchedEvent state:SyncConnected type:None path:null path:null type:None
   [junit4]   2> 689291 INFO  (TEST-BasicDistributedZkTest.test-seed#[ED47A51AB42FE55C]) [    ] o.a.s.c.c.ConnectionManager Client is connected to ZooKeeper
   [junit4]   2> 689291 INFO  (TEST-BasicDistributedZkTest.test-seed#[ED47A51AB42FE55C]) [    ] o.a.s.c.c.SolrZkClient Using default ZkACLProvider
   [junit4]   2> 689292 INFO  (TEST-BasicDistributedZkTest.test-seed#[ED47A51AB42FE55C]) [n:127.0.0.1:34475_    ] o.a.s.c.c.ConnectionManager Waiting for client to connect to ZooKeeper
   [junit4]   2> 689292 INFO  (zkCallback-600-thread-1-processing-n:127.0.0.1:34475_) [n:127.0.0.1:34475_    ] o.a.s.c.c.ConnectionManager Watcher org.apache.solr.common.cloud.ConnectionManager@bbcd176 name:ZooKeeperConnection Watcher:127.0.0.1:48011/solr got event WatchedEvent state:SyncConnected type:None path:null path:null type:None
   [junit4]   2> 689292 INFO  (TEST-BasicDistributedZkTest.test-seed#[ED47A51AB42FE55C]) [n:127.0.0.1:34475_    ] o.a.s.c.c.ConnectionManager Client is connected to ZooKeeper
   [junit4]   2> 689293 INFO  (TEST-BasicDistributedZkTest.test-seed#[ED47A51AB42FE55C]) [n:127.0.0.1:34475_    ] o.a.s.c.c.SolrZkClient makePath: /overseer/queue
   [junit4]   2> 689294 INFO  (TEST-BasicDistributedZkTest.test-seed#[ED47A51AB42FE55C]) [n:127.0.0.1:34475_    ] o.a.s.c.c.SolrZkClient makePath: /overseer/collection-queue-work
   [junit4]   2> 689295 INFO  (TEST-BasicDistributedZkTest.test-seed#[ED47A51AB42FE55C]) [n:127.0.0.1:34475_    ] o.a.s.c.c.SolrZkClient makePath: /overseer/collection-map-running
   [junit4]   2> 689295 INFO  (TEST-BasicDistributedZkTest.test-seed#[ED47A51AB42FE55C]) [n:127.0.0.1:34475_    ] o.a.s.c.c.SolrZkClient makePath: /overseer/collection-map-completed
   [junit4]   2> 689296 INFO  (TEST-BasicDistributedZkTest.test-seed#[ED47A51AB42FE55C]) [n:127.0.0.1:34475_    ] o.a.s.c.c.SolrZkClient makePath: /overseer/collection-map-failure
   [junit4]   2> 689297 INFO  (TEST-BasicDistributedZkTest.test-seed#[ED47A51AB42FE55C]) [n:127.0.0.1:34475_    ] o.a.s.c.c.SolrZkClient makePath: /live_nodes
   [junit4]   2> 689297 INFO  (TEST-BasicDistributedZkTest.test-seed#[ED47A51AB42FE55C]) [n:127.0.0.1:34475_    ] o.a.s.c.c.SolrZkClient makePath: /aliases.json
   [junit4]   2> 689297 INFO  (TEST-BasicDistributedZkTest.test-seed#[ED47A51AB42FE55C]) [n:127.0.0.1:34475_    ] o.a.s.c.c.SolrZkClient makePath: /clusterstate.json
   [junit4]   2> 689298 INFO  (TEST-BasicDistributedZkTest.test-seed#[ED47A51AB42FE55C]) [n:127.0.0.1:34475_    ] o.a.s.c.c.SolrZkClient makePath: /security.json
   [junit4]   2> 689298 INFO  (TEST-BasicDistributedZkTest.test-seed#[ED47A51AB42FE55C]) [n:127.0.0.1:34475_    ] o.a.s.c.ZkController Register node as live in ZooKeeper:/live_nodes/127.0.0.1:34475_
   [junit4]   2> 689298 INFO  (TEST-BasicDistributedZkTest.test-seed#[ED47A51AB42FE55C]) [n:127.0.0.1:34475_    ] o.a.s.c.c.SolrZkClient makePath: /live_nodes/127.0.0.1:34475_
   [junit4]   2> 689299 INFO  (TEST-BasicDistributedZkTest.test-seed#[ED47A51AB42FE55C]) [n:127.0.0.1:34475_    ] o.a.s.c.c.SolrZkClient makePath: /overseer_elect
   [junit4]   2> 689299 INFO  (TEST-BasicDistributedZkTest.test-seed#[ED47A51AB42FE55C]) [n:127.0.0.1:34475_    ] o.a.s.c.c.SolrZkClient makePath: /overseer_elect/election
   [junit4]   2> 689300 INFO  (TEST-BasicDistributedZkTest.test-seed#[ED47A51AB42FE55C]) [n:127.0.0.1:34475_    ] o.a.s.c.Overseer Overseer (id=null) closing
   [junit4]   2> 689300 INFO  (TEST-BasicDistributedZkTest.test-seed#[ED47A51AB42FE55C]) [n:127.0.0.1:34475_    ] o.a.s.c.LeaderElector Joined leadership election with path: /overseer_elect/election/95202812514729988-127.0.0.1:34475_-n_0000000000
   [junit4]   2> 689300 INFO  (TEST-BasicDistributedZkTest.test-seed#[ED47A51AB42FE55C]) [n:127.0.0.1:34475_    ] o.a.s.c.OverseerElectionContext I am going to be the leader 127.0.0.1:34475_
   [junit4]   2> 689300 INFO  (TEST-BasicDistributedZkTest.test-seed#[ED47A51AB42FE55C]) [n:127.0.0.1:34475_    ] o.a.s.c.c.SolrZkClient makePath: /overseer_elect/leader
   [junit4]   2> 689300 INFO  (TEST-BasicDistributedZkTest.test-seed#[ED47A51AB42FE55C]) [n:127.0.0.1:34475_    ] o.a.s.c.Overseer Overseer (id=95202812514729988-127.0.0.1:34475_-n_0000000000) starting
   [junit4]   2> 689301 INFO  (TEST-BasicDistributedZkTest.test-seed#[ED47A51AB42FE55C]) [n:127.0.0.1:34475_    ] o.a.s.c.c.SolrZkClient makePath: /overseer/queue-work
   [junit4]   2> 689302 INFO  (TEST-BasicDistributedZkTest.test-seed#[ED47A51AB42FE55C]) [n:127.0.0.1:34475_    ] o.a.s.c.OverseerAutoReplicaFailoverThread Starting OverseerAutoReplicaFailoverThread autoReplicaFailoverWorkLoopDelay=10000 autoReplicaFailoverWaitAfterExpiration=30000 autoReplicaFailoverBadNodeExpiration=60000
   [junit4]   2> 689302 INFO  (TEST-BasicDistributedZkTest.test-seed#[ED47A51AB42FE55C]) [n:127.0.0.1:34475_    ] o.a.s.c.c.ZkStateReader Updating cluster state from ZooKeeper... 
   [junit4]   2> 689302 INFO  (OverseerCollectionConfigSetProcessor-95202812514729988-127.0.0.1:34475_-n_0000000000) [n:127.0.0.1:34475_    ] o.a.s.c.OverseerTaskProcessor Process current queue of overseer operations
   [junit4]   2> 689303 INFO  (OverseerStateUpdate-95202812514729988-127.0.0.1:34475_-n_0000000000) [n:127.0.0.1:34475_    ] o.a.s.c.Overseer Starting to work on the main queue
   [junit4]   2> 689330 INFO  (TEST-BasicDistributedZkTest.test-seed#[ED47A51AB42FE55C]) [n:127.0.0.1:34475_    ] o.a.s.c.CoreContainer Security conf doesn't exist. Skipping setup for authorization module.
   [junit4]   2> 689330 INFO  (TEST-BasicDistributedZkTest.test-seed#[ED47A51AB42FE55C]) [n:127.0.0.1:34475_    ] o.a.s.c.CoreContainer No authentication plugin used.
   [junit4]   2> 689331 INFO  (TEST-BasicDistributedZkTest.test-seed#[ED47A51AB42FE55C]) [n:127.0.0.1:34475_    ] o.a.s.c.CorePropertiesLocator Looking for core definitions underneath /home/jenkins/workspace/Lucene-Solr-5.x-Linux/solr/build/solr-core/test/J0/../../../../../../../../../home/jenkins/workspace/Lucene-Solr-5.x-Linux/solr/build/solr-core/test/J0/temp/solr.cloud.BasicDistributedZkTest_ED47A51AB42FE55C-001/control-001/cores
   [junit4]   2> 689332 INFO  (TEST-BasicDistributedZkTest.test-seed#[ED47A51AB42FE55C]) [n:127.0.0.1:34475_    ] o.a.s.c.CoreDescriptor Created CoreDescriptor: {name=collection1, config=solrconfig.xml, transient=false, schema=schema.xml, loadOnStartup=true, configSetProperties=configsetprops.json, collection=control_collection, coreNodeName=, dataDir=data/, shard=}
   [junit4]   2> 689332 INFO  (TEST-BasicDistributedZkTest.test-seed#[ED47A51AB42FE55C]) [n:127.0.0.1:34475_    ] o.a.s.c.CorePropertiesLocator Found core collection1 in /home/jenkins/workspace/Lucene-Solr-5.x-Linux/solr/build/solr-core/test/J0/../../../../../../../../../home/jenkins/workspace/Lucene-Solr-5.x-Linux/solr/build/solr-core/test/J0/temp/solr.cloud.BasicDistributedZkTest_ED47A51AB42FE55C-001/control-001/cores/collection1
   [junit4]   2> 689332 INFO  (TEST-BasicDistributedZkTest.test-seed#[ED47A51AB42FE55C]) [n:127.0.0.1:34475_    ] o.a.s.c.CorePropertiesLocator Found 1 core definitions
   [junit4]   2> 689332 INFO  (TEST-BasicDistributedZkTest.test-seed#[ED47A51AB42FE55C]) [n:127.0.0.1:34475_    ] o.a.s.s.SolrDispatchFilter user.dir=/home/jenkins/workspace/Lucene-Solr-5.x-Linux/solr/build/solr-core/test/J0
   [junit4]   2> 689332 INFO  (TEST-BasicDistributedZkTest.test-seed#[ED47A51AB42FE55C]) [n:127.0.0.1:34475_    ] o.a.s.s.SolrDispatchFilter SolrDispatchFilter.init() done
   [junit4]   2> 689332 INFO  (coreLoadExecutor-2140-thread-1-processing-n:127.0.0.1:34475_) [n:127.0.0.1:34475_ c:control_collection   x:collection1] o.a.s.c.ZkController publishing state=down
   [junit4]   2> 689333 INFO  (coreLoadExecutor-2140-thread-1-processing-n:127.0.0.1:34475_) [n:127.0.0.1:34475_ c:control_collection   x:collection1] o.a.s.c.ZkController numShards not found on descriptor - reading it from system property
   [junit4]   2> 689333 INFO  (OverseerStateUpdate-95202812514729988-127.0.0.1:34475_-n_0000000000) [n:127.0.0.1:34475_    ] o.a.s.c.Overseer processMessage: queueSize: 1, message = {
   [junit4]   2>   "core":"collection1",
   [junit4]   2>   "roles":null,
   [junit4]   2>   "base_url":"http://127.0.0.1:34475",
   [junit4]   2>   "node_name":"127.0.0.1:34475_",
   [junit4]   2>   "numShards":"1",
   [junit4]   2>   "state":"down",
   [junit4]   2>   "shard":null,
   [junit4]   2>   "collection":"control_collection",
   [junit4]   2>   "operation":"state"} current state version: 0
   [junit4]   2> 689333 INFO  (coreLoadExecutor-2140-thread-1-processing-n:127.0.0.1:34475_) [n:127.0.0.1:34475_ c:control_collection   x:collection1] o.a.s.c.ZkController look for our core node name
   [junit4]   2> 689333 INFO  (OverseerStateUpdate-95202812514729988-127.0.0.1:34475_-n_0000000000) [n:127.0.0.1:34475_    ] o.a.s.c.o.ReplicaMutator Update state numShards=1 message={
   [junit4]   2>   "core":"collection1",
   [junit4]   2>   "roles":null,
   [junit4]   2>   "base_url":"http://127.0.0.1:34475",
   [junit4]   2>   "node_name":"127.0.0.1:34475_",
   [junit4]   2>   "numShards":"1",
   [junit4]   2>   "state":"down",
   [junit4]   2>   "shard":null,
   [junit4]   2>   "collection":"control_collection",
   [junit4]   2>   "operation":"state"}
   [junit4]   2> 689334 INFO  (OverseerStateUpdate-95202812514729988-127.0.0.1:34475_-n_0000000000) [n:127.0.0.1:34475_    ] o.a.s.c.o.ClusterStateMutator building a new cName: control_collection
   [junit4]   2> 689334 INFO  (OverseerStateUpdate-95202812514729988-127.0.0.1:34475_-n_0000000000) [n:127.0.0.1:34475_    ] o.a.s.c.o.ReplicaMutator Assigning new node to shard shard=shard1
   [junit4]   2> 689334 INFO  (zkCallback-600-thread-1-processing-n:127.0.0.1:34475_) [n:127.0.0.1:34475_    ] o.a.s.c.c.ZkStateReader A cluster state change: [WatchedEvent state:SyncConnected type:NodeDataChanged path:/clusterstate.json], has occurred - updating... (live nodes size: [1])
   [junit4]   2> 690334 INFO  (coreLoadExecutor-2140-thread-1-processing-n:127.0.0.1:34475_) [n:127.0.0.1:34475_ c:control_collection   x:collection1] o.a.s.c.ZkController waiting to find shard id in clusterstate for collection1
   [junit4]   2> 690334 INFO  (coreLoadExecutor-2140-thread-1-processing-n:127.0.0.1:34475_) [n:127.0.0.1:34475_ c:control_collection   x:collection1] o.a.s.c.ZkController Check for collection zkNode:control_collection
   [junit4]   2> 690334 INFO  (coreLoadExecutor-2140-thread-1-processing-n:127.0.0.1:34475_) [n:127.0.0.1:34475_ c:control_collection   x:collection1] o.a.s.c.ZkController Collection zkNode exists
   [junit4]   2> 690334 INFO  (coreLoadExecutor-2140-thread-1-processing-n:127.0.0.1:34475_) [n:127.0.0.1:34475_ c:control_collection   x:collection1] o.a.s.c.c.ZkStateReader Load collection config from: [/collections/control_collection]
   [junit4]   2> 690334 INFO  (coreLoadExecutor-2140-thread-1-processing-n:127.0.0.1:34475_) [n:127.0.0.1:34475_ c:control_collection   x:collection1] o.a.s.c.c.ZkStateReader path=[/collections/control_collection] [configName]=[conf1] specified config exists in ZooKeeper
   [junit4]   2> 690334 INFO  (coreLoadExecutor-2140-thread-1-processing-n:127.0.0.1:34475_) [n:127.0.0.1:34475_ c:control_collection   x:collection1] o.a.s.c.SolrResourceLoader new SolrResourceLoader for directory: '/home/jenkins/workspace/Lucene-Solr-5.x-Linux/solr/build/solr-core/test/J0/temp/solr.cloud.BasicDistributedZkTest_ED47A51AB42FE55C-001/control-001/cores/collection1'
   [junit4]   2> 690334 INFO  (coreLoadExecutor-2140-thread-1-processing-n:127.0.0.1:34475_) [n:127.0.0.1:34475_ c:control_collection   x:collection1] o.a.s.c.SolrResourceLoader JNDI not configured for solr (NoInitialContextEx)
   [junit4]   2> 690334 INFO  (coreLoadExecutor-2140-thread-1-processing-n:127.0.0.1:34475_) [n:127.0.0.1:34475_ c:control_collection   x:collection1] o.a.s.c.SolrResourceLoader solr home defaulted to 'solr/' (could not find system property or JNDI)
   [junit4]   2> 690335 INFO  (coreLoadExecutor-2140-thread-1-processing-n:127.0.0.1:34475_) [n:127.0.0.1:34475_ c:control_collection   x:collection1] o.a.s.c.Config loaded config solrconfig.xml with version 0 
   [junit4]   2> 690338 INFO  (coreLoadExecutor-2140-thread-1-processing-n:127.0.0.1:34475_) [n:127.0.0.1:34475_ c:control_collection   x:collection1] o.a.s.c.SolrConfig current version of requestparams : -1
   [junit4]   2> 690341 INFO  (coreLoadExecutor-2140-thread-1-processing-n:127.0.0.1:34475_) [n:127.0.0.1:34475_ c:control_collection   x:collection1] o.a.s.c.SolrConfig Using Lucene MatchVersion: 5.5.0
   [junit4]   2> 690347 INFO  (coreLoadExecutor-2140-thread-1-processing-n:127.0.0.1:34475_) [n:127.0.0.1:34475_ c:control_collection   x:collection1] o.a.s.c.SolrConfig Loaded SolrConfig: solrconfig.xml
   [junit4]   2> 690352 INFO  (coreLoadExecutor-2140-thread-1-processing-n:127.0.0.1:34475_) [n:127.0.0.1:34475_ c:control_collection   x:collection1] o.a.s.s.IndexSchema [collection1] Schema name=test
   [junit4]   2> 690436 INFO  (coreLoadExecutor-2140-thread-1-processing-n:127.0.0.1:34475_) [n:127.0.0.1:34475_ c:control_collection   x:collection1] o.a.s.s.OpenExchangeRatesOrgProvider Initialized with rates=open-exchange-rates.json, refreshInterval=1440.
   [junit4]   2> 690440 INFO  (coreLoadExecutor-2140-thread-1-processing-n:127.0.0.1:34475_) [n:127.0.0.1:34475_ c:control_collection   x:collection1] o.a.s.s.IndexSchema default search field in schema is text
   [junit4]   2> 690441 INFO  (coreLoadExecutor-2140-thread-1-processing-n:127.0.0.1:34475_) [n:127.0.0.1:34475_ c:control_collection   x:collection1] o.a.s.s.IndexSchema unique key field: id
   [junit4]   2> 690452 INFO  (coreLoadExecutor-2140-thread-1-processing-n:127.0.0.1:34475_) [n:127.0.0.1:34475_ c:control_collection   x:collection1] o.a.s.s.FileExchangeRateProvider Reloading exchange rates from file currency.xml
   [junit4]   2> 690454 INFO  (coreLoadExecutor-2140-thread-1-processing-n:127.0.0.1:34475_) [n:127.0.0.1:34475_ c:control_collection   x:collection1] o.a.s.s.FileExchangeRateProvider Reloading exchange rates from file currency.xml
   [junit4]   2> 690455 INFO  (coreLoadExecutor-2140-thread-1-processing-n:127.0.0.1:34475_) [n:127.0.0.1:34475_ c:control_collection   x:collection1] o.a.s.s.OpenExchangeRatesOrgProvider Reloading exchange rates from open-exchange-rates.json
   [junit4]   2> 690456 INFO  (coreLoadExecutor-2140-thread-1-processing-n:127.0.0.1:34475_) [n:127.0.0.1:34475_ c:control_collection   x:collection1] o.a.s.s.OpenExchangeRatesOrgProvider Reloading exchange rates from open-exchange-rates.json
   [junit4]   2> 690457 INFO  (coreLoadExecutor-2140-thread-1-processing-n:127.0.0.1:34475_) [n:127.0.0.1:34475_ c:control_collection   x:collection1] o.a.s.c.ConfigSetProperties Did not find ConfigSet properties, assuming default properties: Can't find resource 'configsetprops.json' in classpath or '/configs/conf1', cwd=/home/jenkins/workspace/Lucene-Solr-5.x-Linux/solr/build/solr-core/test/J0
   [junit4]   2> 690457 INFO  (coreLoadExecutor-2140-thread-1-processing-n:127.0.0.1:34475_) [n:127.0.0.1:34475_ c:control_collection   x:collection1] o.a.s.c.CoreContainer Creating SolrCore 'collection1' using configuration from collection control_collection
   [junit4]   2> 690457 INFO  (coreLoadExecutor-2140-thread-1-processing-n:127.0.0.1:34475_) [n:127.0.0.1:34475_ c:control_collection s:shard1 r:core_node1 x:collection1] o.a.s.c.SolrCore org.apache.solr.core.MockDirectoryFactory
   [junit4]   2> 690457 INFO  (coreLoadExecutor-2140-thread-1-processing-n:127.0.0.1:34475_) [n:127.0.0.1:34475_ c:control_collection s:shard1 r:core_node1 x:collection1] o.a.s.c.SolrCore [[collection1] ] Opening new SolrCore at [/home/jenkins/workspace/Lucene-Solr-5.x-Linux/solr/build/solr-core/test/J0/temp/solr.cloud.BasicDistributedZkTest_ED47A51AB42FE55C-001/control-001/cores/collection1], dataDir=[/home/jenkins/workspace/Lucene-Solr-5.x-Linux/solr/build/solr-core/test/J0/../../../../../../../../../home/jenkins/workspace/Lucene-Solr-5.x-Linux/solr/build/solr-core/test/J0/temp/solr.cloud.BasicDistributedZkTest_ED47A51AB42FE55C-001/control-001/cores/collection1/data/]
   [junit4]   2> 690457 INFO  (coreLoadExecutor-2140-thread-1-processing-n:127.0.0.1:34475_) [n:127.0.0.1:34475_ c:control_collection s:shard1 r:core_node1 x:collection1] o.a.s.c.JmxMonitoredMap JMX monitoring is enabled. Adding Solr mbeans to JMX Server: com.sun.jmx.mbeanserver.JmxMBeanServer@187568c0
   [junit4]   2> 690458 INFO  (coreLoadExecutor-2140-thread-1-processing-n:127.0.0.1:34475_) [n:127.0.0.1:34475_ c:control_collection s:shard1 r:core_node1 x:collection1] o.a.s.c.CachingDirectoryFactory return new directory for /home/jenkins/workspace/Lucene-Solr-5.x-Linux/solr/build/solr-core/test/J0/../../../../../../../../../home/jenkins/workspace/Lucene-Solr-5.x-Linux/solr/build/solr-core/test/J0/temp/solr.cloud.BasicDistributedZkTest_ED47A51AB42FE55C-001/control-001/cores/collection1/data
   [junit4]   2> 690458 INFO  (coreLoadExecutor-2140-thread-1-processing-n:127.0.0.1:34475_) [n:127.0.0.1:34475_ c:control_collection s:shard1 r:core_node1 x:collection1] o.a.s.c.SolrCore New index directory detected: old=null new=/home/jenkins/workspace/Lucene-Solr-5.x-Linux/solr/build/solr-core/test/J0/../../../../../../../../../home/jenkins/workspace/Lucene-Solr-5.x-Linux/solr/build/solr-core/test/J0/temp/solr.cloud.BasicDistributedZkTest_ED47A51AB42FE55C-001/control-001/cores/collection1/data/index/
   [junit4]   2> 690458 WARN  (coreLoadExecutor-2140-thread-1-processing-n:127.0.0.1:34475_) [n:127.0.0.1:34475_ c:control_collection s:shard1 r:core_node1 x:collection1] o.a.s.c.SolrCore [collection1] Solr index directory '/home/jenkins/workspace/Lucene-Solr-5.x-Linux/solr/build/solr-core/test/J0/../../../../../../../../../home/jenkins/workspace/Lucene-Solr-5.x-Linux/solr/build/solr-core/test/J0/temp/solr.cloud.BasicDistributedZkTest_ED47A51AB42FE55C-001/control-001/cores/collection1/data/index' doesn't exist. Creating new index...
   [junit4]   2> 690458 INFO  (coreLoadExecutor-2140-thread-1-processing-n:127.0.0.1:34475_) [n:127.0.0.1:34475_ c:control_collection s:shard1 r:core_node1 x:collection1] o.a.s.c.CachingDirectoryFactory return new directory for /home/jenkins/workspace/Lucene-Solr-5.x-Linux/solr/build/solr-core/test/J0/../../../../../../../../../home/jenkins/workspace/Lucene-Solr-5.x-Linux/solr/build/solr-core/test/J0/temp/solr.cloud.BasicDistributedZkTest_ED47A51AB42FE55C-001/control-001/cores/collection1/data/index
   [junit4]   2> 690458 INFO  (coreLoadExecutor-2140-thread-1-processing-n:127.0.0.1:34475_) [n:127.0.0.1:34475_ c:control_collection s:shard1 r:core_node1 x:collection1] o.a.s.u.RandomMergePolicy RandomMergePolicy wrapping class org.apache.lucene.index.LogByteSizeMergePolicy: [LogByteSizeMergePolicy: minMergeSize=1677721, mergeFactor=30, maxMergeSize=2147483648, maxMergeSizeForForcedMerge=9223372036854775807, calibrateSizeByDeletes=false, maxMergeDocs=2147483647, maxCFSSegmentSizeMB=8.796093022207999E12, noCFSRatio=0.6131622363454978]
   [junit4]   2> 690459 INFO  (coreLoadExecutor-2140-thread-1-processing-n:127.0.0.1:34475_) [n:127.0.0.1:34475_ c:control_collection s:shard1 r:core_node1 x:collection1] o.a.s.c.SolrDeletionPolicy SolrDeletionPolicy.onCommit: commits: num=1
   [junit4]   2> 	commit{dir=MockDirectoryWrapper(RAMDirectory@7b3e6c2e lockFactory=org.apache.lucene.store.SingleInstanceLockFactory@13d05494),segFN=segments_1,generation=1}
   [junit4]   2> 690459 INFO  (coreLoadExecutor-2140-thread-1-processing-n:127.0.0.1:34475_) [n:127.0.0.1:34475_ c:control_collection s:shard1 r:core_node1 x:collection1] o.a.s.c.SolrDeletionPolicy newest commit generation = 1
   [junit4]   2> 690459 INFO  (OldIndexDirectoryCleanupThreadForCore-collection1) [n:127.0.0.1:34475_ c:control_collection s:shard1 r:core_node1 x:collection1] o.a.s.c.SolrCore Looking for old index directories to cleanup for core collection1 in /home/jenkins/workspace/Lucene-Solr-5.x-Linux/solr/build/solr-core/test/J0/../../../../../../../../../home/jenkins/workspace/Lucene-Solr-5.x-Linux/solr/build/solr-core/test/J0/temp/solr.cloud.BasicDistributedZkTest_ED47A51AB42FE55C-001/control-001/cores/collection1/data/
   [junit4]   2> 690459 WARN  (OldIndexDirectoryCleanupThreadForCore-collection1) [n:127.0.0.1:34475_ c:control_collection s:shard1 r:core_node1 x:collection1] o.a.s.c.DirectoryFactory /home/jenkins/workspace/Lucene-Solr-5.x-Linux/solr/build/solr-core/test/J0/../../../../../../../../../home/jenkins/workspace/Lucene-Solr-5.x-Linux/solr/build/solr-core/test/J0/temp/solr.cloud.BasicDistributedZkTest_ED47A51AB42FE55C-001/control-001/cores/collection1/data/ does not point to a valid data directory; skipping clean-up of old index directories.
   [junit4]   2> 690462 INFO  (coreLoadExecutor-2140-thread-1-processing-n:127.0.0.1:34475_) [n:127.0.0.1:34475_ c:control_collection s:shard1 r:core_node1 x:collection1] o.a.s.u.p.UpdateRequestProcessorChain creating updateRequestProcessorChain "nodistrib"
   [junit4]   2> 690462 INFO  (coreLoadExecutor-2140-thread-1-processing-n:127.0.0.1:34475_) [n:127.0.0.1:34475_ c:control_collection s:shard1 r:core_node1 x:collection1] o.a.s.u.p.UpdateRequestProcessorChain creating updateRequestProcessorChain "dedupe"
   [junit4]   2> 690462 INFO  (coreLoadExecutor-2140-thread-1-processing-n:127.0.0.1:34475_) [n:127.0.0.1:34475_ c:control_collection s:shard1 r:core_node1 x:collection1] o.a.s.u.p.UpdateRequestProcessorChain inserting DistributedUpdateProcessorFactory into updateRequestProcessorChain "dedupe"
   [junit4]   2> 690462 INFO  (coreLoadExecutor-2140-thread-1-processing-n:127.0.0.1:34475_) [n:127.0.0.1:34475_ c:control_collection s:shard1 r:core_node1 x:collection1] o.a.s.u.p.UpdateRequestProcessorChain creating updateRequestProcessorChain "stored_sig"
   [junit4]   2> 690462 INFO  (coreLoadExecutor-2140-thread-1-processing-n:127.0.0.1:34475_) [n:127.0.0.1:34475_ c:control_collection s:shard1 r:core_node1 x:collection1] o.a.s.u.p.UpdateRequestProcessorChain inserting DistributedUpdateProcessorFactory into updateRequestProcessorChain "stored_sig"
   [junit4]   2> 690462 INFO  (coreLoadExecutor-2140-thread-1-processing-n:127.0.0.1:34475_) [n:127.0.0.1:34475_ c:control_collection s:shard1 r:core_node1 x:collection1] o.a.s.u.p.UpdateRequestProcessorChain creating updateRequestProcessorChain "distrib-dup-test-chain-explicit"
   [junit4]   2> 690463 INFO  (coreLoadExecutor-2140-thread-1-processing-n:127.0.0.1:34475_) [n:127.0.0.1:34475_ c:control_collection s:shard1 r:core_node1 x:collection1] o.a.s.u.p.UpdateRequestProcessorChain creating updateRequestProcessorChain "distrib-dup-test-chain-implicit"
   [junit4]   2> 690463 INFO  (coreLoadExecutor-2140-thread-1-processing-n:127.0.0.1:34475_) [n:127.0.0.1:34475_ c:control_collection s:shard1 r:core_node1 x:collection1] o.a.s.u.p.UpdateRequestProcessorChain inserting DistributedUpdateProcessorFactory into updateRequestProcessorChain "distrib-dup-test-chain-implicit"
   [junit4]   2> 690463 INFO  (coreLoadExecutor-2140-thread-1-processing-n:127.0.0.1:34475_) [n:127.0.0.1:34475_ c:control_collection s:shard1 r:core_node1 x:collection1] o.a.s.c.SolrCore no updateRequestProcessorChain defined as default, creating implicit default
   [junit4]   2> 690463 WARN  (coreLoadExecutor-2140-thread-1-processing-n:127.0.0.1:34475_) [n:127.0.0.1:34475_ c:control_collection s:shard1 r:core_node1 x:collection1] o.a.s.c.RequestHandlers INVALID paramSet a in requestHandler {type = requestHandler,name = /dump,class = DumpRequestHandler,args = {defaults={a=A,b=B}}}
   [junit4]   2> 690464 INFO  (coreLoadExecutor-2140-thread-1-processing-n:127.0.0.1:34475_) [n:127.0.0.1:34475_ c:control_collection s:shard1 r:core_node1 x:collection1] o.a.s.h.l.XMLLoader xsltCacheLifetimeSeconds=60
   [junit4]   2> 690465 INFO  (coreLoadExecutor-2140-thread-1-processing-n:127.0.0.1:34475_) [n:127.0.0.1:34475_ c:control_collection s:shard1 r:core_node1 x:collection1] o.a.s.h.l.XMLLoader xsltCacheLifetimeSeconds=60
   [junit4]   2> 690465 INFO  (coreLoadExecutor-2140-thread-1-processing-n:127.0.0.1:34475_) [n:127.0.0.1:34475_ c:control_collection s:shard1 r:core_node1 x:collection1] o.a.s.h.l.XMLLoader xsltCacheLifetimeSeconds=60
   [junit4]   2> 690466 INFO  (coreLoadExecutor-2140-thread-1-processing-n:127.0.0.1:34475_) [n:127.0.0.1:34475_ c:control_collection s:shard1 r:core_node1 x:collection1] o.a.s.h.l.XMLLoader xsltCacheLifetimeSeconds=60
   [junit4]   2> 690468 INFO  (coreLoadExecutor-2140-thread-1-processing-n:127.0.0.1:34475_) [n:127.0.0.1:34475_ c:control_collection s:shard1 r:core_node1 x:collection1] o.a.s.c.RequestHandlers Registered paths: /admin/mbeans,standard,/dump,/update/csv,/update/json/docs,/admin/luke,/admin/segments,/get,/admin/system,/replication,/admin/properties,/config,/schema,/admin/plugins,/admin/logging,/update/json,/admin/threads,/admin/ping,/update,/admin/file
   [junit4]   2> 690468 INFO  (coreLoadExecutor-2140-thread-1-processing-n:127.0.0.1:34475_) [n:127.0.0.1:34475_ c:control_collection s:shard1 r:core_node1 x:collection1] o.a.s.c.SolrCore Using default statsCache cache: org.apache.solr.search.stats.LocalStatsCache
   [junit4]   2> 690469 INFO  (coreLoadExecutor-2140-thread-1-processing-n:127.0.0.1:34475_) [n:127.0.0.1:34475_ c:control_collection s:shard1 r:core_node1 x:collection1] o.a.s.u.UpdateHandler Using UpdateLog implementation: org.apache.solr.update.UpdateLog
   [junit4]   2> 690469 INFO  (coreLoadExecutor-2140-thread-1-processing-n:127.0.0.1:34475_) [n:127.0.0.1:34475_ c:control_collection s:shard1 r:core_node1 x:collection1] o.a.s.u.UpdateLog Initializing UpdateLog: dataDir= defaultSyncLevel=FLUSH numRecordsToKeep=100 maxNumLogsToKeep=10 numVersionBuckets=65536
   [junit4]   2> 690469 INFO  (coreLoadExecutor-2140-thread-1-processing-n:127.0.0.1:34475_) [n:127.0.0.1:34475_ c:control_collection s:shard1 r:core_node1 x:collection1] o.a.s.u.CommitTracker Hard AutoCommit: disabled
   [junit4]   2> 690469 INFO  (coreLoadExecutor-2140-thread-1-processing-n:127.0.0.1:34475_) [n:127.0.0.1:34475_ c:control_collection s:shard1 r:core_node1 x:collection1] o.a.s.u.CommitTracker Soft AutoCommit: disabled
   [junit4]   2> 690470 INFO  (coreLoadExecutor-2140-thread-1-processing-n:127.0.0.1:34475_) [n:127.0.0.1:34475_ c:control_collection s:shard1 r:core_node1 x:collection1] o.a.s.u.RandomMergePolicy RandomMergePolicy wrapping class org.apache.lucene.index.TieredMergePolicy: [TieredMergePolicy: maxMergeAtOnce=32, maxMergeAtOnceExplicit=17, maxMergedSegmentMB=27.8798828125, floorSegmentMB=0.3779296875, forceMergeDeletesPctAllowed=9.218371833117999, segmentsPerTier=32.0, maxCFSSegmentSizeMB=8.796093022207999E12, noCFSRatio=0.8785591722982053
   [junit4]   2> 690470 INFO  (coreLoadExecutor-2140-thread-1-processing-n:127.0.0.1:34475_) [n:127.0.0.1:34475_ c:control_collection s:shard1 r:core_node1 x:collection1] o.a.s.c.SolrDeletionPolicy SolrDeletionPolicy.onInit: commits: num=1
   [junit4]   2> 	commit{dir=MockDirectoryWrapper(RAMDirectory@7b3e6c2e lockFactory=org.apache.lucene.store.SingleInstanceLockFactory@13d05494),segFN=segments_1,generation=1}
   [junit4]   2> 690470 INFO  (coreLoadExecutor-2140-thread-1-processing-n:127.0.0.1:34475_) [n:127.0.0.1:34475_ c:control_collection s:shard1 r:core_node1 x:collection1] o.a.s.c.SolrDeletionPolicy newest commit generation = 1
   [junit4]   2> 690470 INFO  (coreLoadExecutor-2140-thread-1-processing-n:127.0.0.1:34475_) [n:127.0.0.1:34475_ c:control_collection s:shard1 r:core_node1 x:collection1] o.a.s.s.SolrIndexSearcher Opening Searcher@3c61b07a[collection1] main
   [junit4]   2> 690470 INFO  (coreLoadExecutor-2140-thread-1-processing-n:127.0.0.1:34475_) [n:127.0.0.1:34475_ c:control_collection s:shard1 r:core_node1 x:collection1] o.a.s.c.c.ZkStateReader Load collection config from: [/collections/control_collection]
   [junit4]   2> 690470 INFO  (coreLoadExecutor-2140-thread-1-processing-n:127.0.0.1:34475_) [n:127.0.0.1:34475_ c:control_collection s:shard1 r:core_node1 x:collection1] o.a.s.c.c.ZkStateReader path=[/collections/control_collection] [configName]=[conf1] specified config exists in ZooKeeper
   [junit4]   2> 690471 INFO  (coreLoadExecutor-2140-thread-1-processing-n:127.0.0.1:34475_) [n:127.0.0.1:34475_ c:control_collection s:shard1 r:core_node1 x:collection1] o.a.s.r.ManagedResourceStorage Setting up ZooKeeper-based storage for the RestManager with znodeBase: /configs/conf1
   [junit4]   2> 690471 INFO  (coreLoadExecutor-2140-thread-1-processing-n:127.0.0.1:34475_) [n:127.0.0.1:34475_ c:control_collection s:shard1 r:core_node1 x:collection1] o.a.s.r.ManagedResourceStorage Configured ZooKeeperStorageIO with znodeBase: /configs/conf1
   [junit4]   2> 690471 INFO  (coreLoadExecutor-2140-thread-1-processing-n:127.0.0.1:34475_) [n:127.0.0.1:34475_ c:control_collection s:shard1 r:core_node1 x:collection1] o.a.s.r.RestManager Initializing RestManager with initArgs: {}
   [junit4]   2> 690471 INFO  (coreLoadExecutor-2140-thread-1-processing-n:127.0.0.1:34475_) [n:127.0.0.1:34475_ c:control_collection s:shard1 r:core_node1 x:collection1] o.a.s.r.ManagedResourceStorage Reading _rest_managed.json using ZooKeeperStorageIO:path=/configs/conf1
   [junit4]   2> 690471 INFO  (coreLoadExecutor-2140-thread-1-processing-n:127.0.0.1:34475_) [n:127.0.0.1:34475_ c:control_collection s:shard1 r:core_node1 x:collection1] o.a.s.r.ManagedResourceStorage No data found for znode /configs/conf1/_rest_managed.json
   [junit4]   2> 690471 INFO  (coreLoadExecutor-2140-thread-1-processing-n:127.0.0.1:34475_) [n:127.0.0.1:34475_ c:control_collection s:shard1 r:core_node1 x:collection1] o.a.s.r.ManagedResourceStorage Loaded null at path _rest_managed.json using ZooKeeperStorageIO:path=/configs/conf1
   [junit4]   2> 690471 INFO  (coreLoadExecutor-2140-thread-1-processing-n:127.0.0.1:34475_) [n:127.0.0.1:34475_ c:control_collection s:shard1 r:core_node1 x:collection1] o.a.s.r.RestManager Initializing 0 registered ManagedResources
   [junit4]   2> 690471 INFO  (coreLoadExecutor-2140-thread-1-processing-n:127.0.0.1:34475_) [n:127.0.0.1:34475_ c:control_collection s:shard1 r:core_node1 x:collection1] o.a.s.h.ReplicationHandler Commits will be reserved for  10000
   [junit4]   2> 690472 INFO  (searcherExecutor-2141-thread-1-processing-n:127.0.0.1:34475_ x:collection1 s:shard1 c:control_collection r:core_node1) [n:127.0.0.1:34475_ c:control_collection s:shard1 r:core_node1 x:collection1] o.a.s.c.SolrCore [collection1] Registered new searcher Searcher@3c61b07a[collection1] main{ExitableDirectoryReader(UninvertingDirectoryReader())}
   [junit4]   2> 690472 INFO  (coreLoadExecutor-2140-thread-1-processing-n:127.0.0.1:34475_) [n:127.0.0.1:34475_ c:control_collection s:shard1 r:core_node1 x:collection1] o.a.s.u.UpdateLog Looking up max value of version field to seed version buckets
   [junit4]   2> 690472 INFO  (coreLoadExecutor-2140-thread-1-processing-n:127.0.0.1:34475_) [n:127.0.0.1:34475_ c:control_collection s:shard1 r:core_node1 x:collection1] o.a.s.u.VersionInfo Refreshing highest value of _version_ for 65536 version buckets from index
   [junit4]   2> 690472 INFO  (coreLoadExecutor-2140-thread-1-processing-n:127.0.0.1:34475_) [n:127.0.0.1:34475_ c:control_collection s:shard1 r:core_node1 x:collection1] o.a.s.u.VersionInfo No terms found for _version_, cannot seed version bucket highest value from index
   [junit4]   2> 690472 INFO  (coreLoadExecutor-2140-thread-1-processing-n:127.0.0.1:34475_) [n:127.0.0.1:34475_ c:control_collection s:shard1 r:core_node1 x:collection1] o.a.s.u.UpdateLog Could not find max version in index or recent updates, using new clock 1523245001679568896
   [junit4]   2> 690474 INFO  (coreLoadExecutor-2140-thread-1-processing-n:127.0.0.1:34475_) [n:127.0.0.1:34475_ c:control_collection s:shard1 r:core_node1 x:collection1] o.a.s.u.UpdateLog Took 1.0ms to seed version buckets with highest version 1523245001679568896
   [junit4]   2> 690474 INFO  (coreLoadExecutor-2140-thread-1-processing-n:127.0.0.1:34475_) [n:127.0.0.1:34475_ c:control_collection s:shard1 r:core_node1 x:collection1] o.a.s.c.ZkController watch zkdir /configs/conf1
   [junit4]   2> 690475 INFO  (coreLoadExecutor-2140-thread-1-processing-n:127.0.0.1:34475_) [n:127.0.0.1:34475_ c:control_collection s:shard1 r:core_node1 x:collection1] o.a.s.c.CoreContainer registering core: collection1
   [junit4]   2> 690475 INFO  (coreZkRegister-2134-thread-1-processing-n:127.0.0.1:34475_ x:collection1 s:shard1 c:control_collection r:core_node1) [n:127.0.0.1:34475_ c:control_collection s:shard1 r:core_node1 x:collection1] o.a.s.c.ZkController Register replica - core:collection1 address:http://127.0.0.1:34475 collection:control_collection shard:shard1
   [junit4]   2> 690476 INFO  (coreZkRegister-2134-thread-1-processing-n:127.0.0.1:34475_ x:collection1 s:shard1 c:control_collection r:core_node1) [n:127.0.0.1:34475_ c:control_collection s:shard1 r:core_node1 x:collection1] o.a.s.c.c.SolrZkClient makePath: /collections/control_collection/leader_elect/shard1/election
   [junit4]   2> 690477 INFO  (coreZkRegister-2134-thread-1-processing-n:127.0.0.1:34475_ x:collection1 s:shard1 c:control_collection r:core_node1) [n:127.0.0.1:34475_ c:control_collection s:shard1 r:core_node1 x:collection1] o.a.s.c.LeaderElector Joined leadership election with path: /collections/control_collection/leader_elect/shard1/election/95202812514729988-core_node1-n_0000000000
   [junit4]   2> 690477 INFO  (coreZkRegister-2134-thread-1-processing-n:127.0.0.1:34475_ x:collection1 s:shard1 c:control_collection r:core_node1) [n:127.0.0.1:34475_ c:control_collection s:shard1 r:core_node1 x:collection1] o.a.s.c.ShardLeaderElectionContext Running the leader process for shard=shard1 and weAreReplacement=false and leaderVoteWait=10000
   [junit4]   2> 690477 INFO  (coreZkRegister-2134-thread-1-processing-n:127.0.0.1:34475_ x:collection1 s:shard1 c:control_collection r:core_node1) [n:127.0.0.1:34475_ c:control_collection s:shard1 r:core_node1 x:collection1] o.a.s.c.ShardLeaderElectionContext Enough replicas found to continue.
   [junit4]   2> 690477 INFO  (coreZkRegister-2134-thread-1-processing-n:127.0.0.1:34475_ x:collection1 s:shard1 c:control_collection r:core_node1) [n:127.0.0.1:34475_ c:control_collection s:shard1 r:core_node1 x:collection1] o.a.s.c.ShardLeaderElectionContext I may be the new leader - try and sync
   [junit4]   2> 690477 INFO  (coreZkRegister-2134-thread-1-processing-n:127.0.0.1:34475_ x:collection1 s:shard1 c:control_collection r:core_node1) [n:127.0.0.1:34475_ c:control_collection s:shard1 r:core_node1 x:collection1] o.a.s.c.SyncStrategy Sync replicas to http://127.0.0.1:34475/collection1/
   [junit4]   2> 690477 INFO  (OverseerStateUpdate-95202812514729988-127.0.0.1:34475_-n_0000000000) [n:127.0.0.1:34475_    ] o.a.s.c.Overseer processMessage: queueSize: 1, message = {
   [junit4]   2>   "operation":"leader",
   [junit4]   2>   "shard":"shard1",
   [junit4]   2>   "collection":"control_collection"} current state version: 1
   [junit4]   2> 690477 INFO  (coreZkRegister-2134-thread-1-processing-n:127.0.0.1:34475_ x:collection1 s:shard1 c:control_collection r:core_node1) [n:127.0.0.1:34475_ c:control_collection s:shard1 r:core_node1 x:collection1] o.a.s.c.SyncStrategy Sync Success - now sync replicas to me
   [junit4]   2> 690477 INFO  (coreZkRegister-2134-thread-1-processing-n:127.0.0.1:34475_ x:collection1 s:shard1 c:control_collection r:core_node1) [n:127.0.0.1:34475_ c:control_collection s:shard1 r:core_node1 x:collection1] o.a.s.c.SyncStrategy http://127.0.0.1:34475/collection1/ has no replicas
   [junit4]   2> 690478 INFO  (coreZkRegister-2134-thread-1-processing-n:127.0.0.1:34475_ x:collection1 s:shard1 c:control_collection r:core_node1) [n:127.0.0.1:34475_ c:control_collection s:shard1 r:core_node1 x:collection1] o.a.s.c.c.SolrZkClient makePath: /collections/control_collection/leaders/shard1
   [junit4]   2> 690478 INFO  (coreZkRegister-2134-thread-1-processing-n:127.0.0.1:34475_ x:collection1 s:shard1 c:control_collection r:core_node1) [n:127.0.0.1:34475_ c:control_collection s:shard1 r:core_node1 x:collection1] o.a.s.c.ShardLeaderElectionContextBase Creating leader registration node
   [junit4]   2> 690479 INFO  (coreZkRegister-2134-thread-1-processing-n:127.0.0.1:34475_ x:collection1 s:shard1 c:control_collection r:core_node1) [n:127.0.0.1:34475_ c:control_collection s:shard1 r:core_node1 x:collection1] o.a.s.c.ShardLeaderElectionContext I am the new leader: http://127.0.0.1:34475/collection1/ shard1
   [junit4]   2> 690479 INFO  (OverseerStateUpdate-95202812514729988-127.0.0.1:34475_-n_0000000000) [n:127.0.0.1:34475_    ] o.a.s.c.Overseer processMessage: queueSize: 1, message = {
   [junit4]   2>   "operation":"leader",
   [junit4]   2>   "shard":"shard1",
   [junit4]   2>   "collection":"control_collection",
   [junit4]   2>   "base_url":"http://127.0.0.1:34475",
   [junit4]   2>   "core":"collection1",
   [junit4]   2>   "state":"active"} current state version: 1
   [junit4]   2> 690580 INFO  (zkCallback-600-thread-1-processing-n:127.0.0.1:34475_) [n:127.0.0.1:34475_    ] o.a.s.c.c.ZkStateReader A cluster state change: [WatchedEvent state:SyncConnected type:NodeDataChanged path:/clusterstate.json], has occurred - updating... (live nodes size: [1])
   [junit4]   2> 690629 INFO  (coreZkRegister-2134-thread-1-processing-n:127.0.0.1:34475_ x:collection1 s:shard1 c:control_collection r:core_node1) [n:127.0.0.1:34475_ c:control_collection s:shard1 r:core_node1 x:collection1] o.a.s.c.ZkController We are http://127.0.0.1:34475/collection1/ and leader is http://127.0.0.1:34475/collection1/
   [junit4]   2> 690630 INFO  (coreZkRegister-2134-thread-1-processing-n:127.0.0.1:34475_ x:collection1 s:shard1 c:control_collection r:core_node1) [n:127.0.0.1:34475_ c:control_collection s:shard1 r:core_node1 x:collection1] o.a.s.c.ZkController No LogReplay needed for core=collection1 baseURL=http://127.0.0.1:34475
   [junit4]   2> 690630 INFO  (coreZkRegister-2134-thread-1-processing-n:127.0.0.1:34475_ x:collection1 s:shard1 c:control_collection r:core_node1) [n:127.0.0.1:34475_ c:control_collection s:shard1 r:core_node1 x:collection1] o.a.s.c.ZkController I am the leader, no recovery necessary
   [junit4]   2> 690630 INFO  (coreZkRegister-2134-thread-1-processing-n:127.0.0.1:34475_ x:collection1 s:shard1 c:control_collection r:core_node1) [n:127.0.0.1:34475_ c:control_collection s:shard1 r:core_node1 x:collection1] o.a.s.c.ZkController publishing state=active
   [junit4]   2> 690630 INFO  (coreZkRegister-2134-thread-1-processing-n:127.0.0.1:34475_ x:collection1 s:shard1 c:control_collection r:core_node1) [n:127.0.0.1:34475_ c:control_collection s:shard1 r:core_node1 x:collection1] o.a.s.c.ZkController numShards not found on descriptor - reading it from system property
   [junit4]   2> 690631 INFO  (OverseerStateUpdate-95202812514729988-127.0.0.1:34475_-n_0000000000) [n:127.0.0.1:34475_    ] o.a.s.c.Overseer processMessage: queueSize: 1, message = {
   [junit4]   2>   "core":"collection1",
   [junit4]   2>   "core_node_name":"core_node1",
   [junit4]   2>   "roles":null,
   [junit4]   2>   "base_url":"http://127.0.0.1:34475",
   [junit4]   2>   "node_name":"127.0.0.1:34475_",
   [junit4]   2>   "numShards":"1",
   [junit4]   2>   "state":"active",
   [junit4]   2>   "shard":"shard1",
   [junit4]   2>   "collection":"control_collection",
   [junit4]   2>   "operation":"state"} current state version: 2
   [junit4]   2> 690631 INFO  (OverseerStateUpdate-95202812514729988-127.0.0.1:34475_-n_0000000000) [n:127.0.0.1:34475_    ] o.a.s.c.o.ReplicaMutator Update state numShards=1 message={
   [junit4]   2>   "core":"collection1",
   [junit4]   2>   "core_node_name":"core_node1",
   [junit4]   2>   "roles":null,
   [junit4]   2>   "base_url":"http://127.0.0.1:34475",
   [junit4]   2>   "node_name":"127.0.0.1:34475_",
   [junit4]   2>   "numShards":"1",
   [junit4]   2>   "state":"active",
   [junit4]   2>   "shard":"shard1",
   [junit4]   2>   "collection":"control_collection",
   [junit4]   2>   "operation":"state"}
   [junit4]   2> 690733 INFO  (zkCallback-600-thread-1-processing-n:127.0.0.1:34475_) [n:127.0.0.1:34475_    ] o.a.s.c.c.ZkStateReader A cluster state change: [WatchedEvent state:SyncConnected type:NodeDataChanged path:/clusterstate.json], has occurred - updating... (live nodes size: [1])
   [junit4]   2> 690834 INFO  (TEST-BasicDistributedZkTest.test-seed#[ED47A51AB42FE55C]) [    ] o.a.s.c.c.SolrZkClient Using default ZkCredentialsProvider
   [junit4]   2> 690834 INFO  (TEST-BasicDistributedZkTest.test-seed#[ED47A51AB42FE55C]) [    ] o.a.s.c.c.ConnectionManager Waiting for client to connect to ZooKeeper
   [junit4]   2> 690835 INFO  (zkCallback-602-thread-1) [    ] o.a.s.c.c.ConnectionManager Watcher org.apache.solr.common.cloud.ConnectionManager@1593c4e3 name:ZooKeeperConnection Watcher:127.0.0.1:48011/solr got event WatchedEvent state:SyncConnected type:None path:null path:null type:None
   [junit4]   2> 690835 INFO  (TEST-BasicDistributedZkTest.test-seed#[ED47A51AB42FE55C]) [    ] o.a.s.c.c.ConnectionManager Client is connected to ZooKeeper
   [junit4]   2> 690835 INFO  (TEST-BasicDistributedZkTest.test-seed#[ED47A51AB42FE55C]) [    ] o.a.s.c.c.SolrZkClient Using default ZkACLProvider
   [junit4]   2> 690835 INFO  (TEST-BasicDistributedZkTest.test-seed#[ED47A51AB42FE55C]) [    ] o.a.s.c.c.ZkStateReader Updating cluster state from ZooKeeper... 
   [junit4]   2> 690836 INFO  (TEST-BasicDistributedZkTest.test-seed#[ED47A51AB42FE55C]) [    ] o.a.s.c.ChaosMonkey monkey: init - expire sessions:false cause connection loss:false
   [junit4]   2> 690836 INFO  (TEST-BasicDistributedZkTest.test-seed#[ED47A51AB42FE55C]) [    ] o.a.s.c.AbstractFullDistribZkTestBase Creating collection1 with stateFormat=2
   [junit4]   2> 690836 INFO  (TEST-BasicDistributedZkTest.test-seed#[ED47A51AB42FE55C]) [    ] o.a.s.c.c.SolrZkClient Using default ZkCredentialsProvider
   [junit4]   2> 690836 INFO  (TEST-BasicDistributedZkTest.test-seed#[ED47A51AB42FE55C]) [    ] o.a.s.c.c.ConnectionManager Waiting for client to connect to ZooKeeper
   [junit4]   2> 690837 INFO  (zkCallback-603-thread-1) [    ] o.a.s.c.c.ConnectionManager Watcher org.apache.solr.common.cloud.ConnectionManager@3eaf9e95 name:ZooKeeperConnection Watcher:127.0.0.1:48011/solr got event WatchedEvent state:SyncConnected type:None path:null path:null type:None
   [junit4]   2> 690837 INFO  (TEST-BasicDistributedZkTest.test-seed#[ED47A51AB42FE55C]) [    ] o.a.s.c.c.ConnectionManager Client is connected to ZooKeeper
   [junit4]   2> 690837 INFO  (TEST-BasicDistributedZkTest.test-seed#[ED47A51AB42FE55C]) [    ] o.a.s.c.c.SolrZkClient Using default ZkACLProvider
   [junit4]   2> 690838 INFO  (OverseerStateUpdate-95202812514729988-127.0.0.1:34475_-n_0000000000) [n:127.0.0.1:34475_    ] o.a.s.c.Overseer processMessage: queueSize: 1, message = {
   [junit4]   2>   "operation":"create",
   [junit4]   2>   "name":"collection1",
   [junit4]   2>   "numShards":"2",
   [junit4]   2>   "stateFormat":"2"} current state version: 3
   [junit4]   2> 690838 INFO  (OverseerStateUpdate-95202812514729988-127.0.0.1:34475_-n_0000000000) [n:127.0.0.1:34475_    ] o.a.s.c.o.ClusterStateMutator building a new cName: collection1
   [junit4]   2> 690884 INFO  (TEST-BasicDistributedZkTest.test-seed#[ED47A51AB42FE55C]) [    ] o.a.s.SolrTestCaseJ4 Writing core.properties file to /home/jenkins/workspace/Lucene-Solr-5.x-Linux/solr/build/solr-core/test/J0/temp/solr.cloud.BasicDistributedZkTest_ED47A51AB42FE55C-001/shard-1-001/cores/collection1
   [junit4]   2> 690884 INFO  (TEST-BasicDistributedZkTest.test-seed#[ED47A51AB42FE55C]) [    ] o.a.s.c.AbstractFullDistribZkTestBase create jetty 1 in directory /home/jenkins/workspace/Lucene-Solr-5.x-Linux/solr/build/solr-core/test/J0/temp/solr.cloud.BasicDistributedZkTest_ED47A51AB42FE55C-001/shard-1-001
   [junit4]   2> 690886 INFO  (TEST-BasicDistributedZkTest.test-seed#[ED47A51AB42FE55C]) [    ] o.e.j.s.Server jetty-9.2.13.v20150730
   [junit4]   2> 690887 INFO  (TEST-BasicDistributedZkTest.test-seed#[ED47A51AB42FE55C]) [    ] o.e.j.s.h.ContextHandler Started o.e.j.s.ServletContextHandler@3ff97850{/,null,AVAILABLE}
   [junit4]   2> 690887 INFO  (TEST-BasicDistributedZkTest.test-seed#[ED47A51AB42FE55C]) [    ] o.e.j.s.ServerConnector Started ServerConnector@78c48a6c{HTTP/1.1}{127.0.0.1:51663}
   [junit4]   2> 690887 INFO  (TEST-BasicDistributedZkTest.test-seed#[ED47A51AB42FE55C]) [    ] o.e.j.s.Server Started @692861ms
   [junit4]   2> 690888 INFO  (TEST-BasicDistributedZkTest.test-seed#[ED47A51AB42FE55C]) [    ] o.a.s.c.s.e.JettySolrRunner Jetty properties: {solr.data.dir=/home/jenkins/workspace/Lucene-Solr-5.x-Linux/solr/build/solr-core/test/J0/temp/solr.cloud.BasicDistributedZkTest_ED47A51AB42FE55C-001/tempDir-001/jetty1, solrconfig=solrconfig.xml, hostContext=/, hostPort=51663, coreRootDirectory=/home/jenkins/workspace/Lucene-Solr-5.x-Linux/solr/build/solr-core/test/J0/temp/solr.cloud.BasicDistributedZkTest_ED47A51AB42FE55C-001/shard-1-001/cores}
   [junit4]   2> 690888 INFO  (TEST-BasicDistributedZkTest.test-seed#[ED47A51AB42FE55C]) [    ] o.a.s.s.SolrDispatchFilter SolrDispatchFilter.init(): sun.misc.Launcher$AppClassLoader@4e0e2f2a
   [junit4]   2> 690888 INFO  (TEST-BasicDistributedZkTest.test-seed#[ED47A51AB42FE55C]) [    ] o.a.s.c.SolrResourceLoader new SolrResourceLoader for directory: '/home/jenkins/workspace/Lucene-Solr-5.x-Linux/solr/build/solr-core/test/J0/temp/solr.cloud.BasicDistributedZkTest_ED47A51AB42FE55C-001/shard-1-001'
   [junit4]   2> 690888 INFO  (TEST-BasicDistributedZkTest.test-seed#[ED47A51AB42FE55C]) [    ] o.a.s.c.SolrResourceLoader JNDI not configured for solr (NoInitialContextEx)
   [junit4]   2> 690888 INFO  (TEST-BasicDistributedZkTest.test-seed#[ED47A51AB42FE55C]) [    ] o.a.s.c.SolrResourceLoader solr home defaulted to 'solr/' (could not find system property or JNDI)
   [junit4]   2> 690888 INFO  (TEST-BasicDistributedZkTest.test-seed#[ED47A51AB42FE55C]) [    ] o.a.s.c.c.SolrZkClient Using default ZkCredentialsProvider
   [junit4]   2> 690888 INFO  (TEST-BasicDistributedZkTest.test-seed#[ED47A51AB42FE55C]) [    ] o.a.s.c.c.ConnectionManager Waiting for client to connect to ZooKeeper
   [junit4]   2> 690889 INFO  (zkCallback-604-thread-1) [    ] o.a.s.c.c.ConnectionManager Watcher org.apache.solr.common.cloud.ConnectionManager@6c67246e name:ZooKeeperConnection Watcher:127.0.0.1:48011/solr got event WatchedEvent state:SyncConnected type:None path:null path:null type:None
   [junit4]   2> 690889 INFO  (TEST-BasicDistributedZkTest.test-seed#[ED47A51AB42FE55C]) [    ] o.a.s.c.c.ConnectionManager Client is connected to ZooKeeper
   [junit4]   2> 690889 INFO  (TEST-BasicDistributedZkTest.test-seed#[ED47A51AB42FE55C]) [    ] o.a.s.c.c.SolrZkClient Using default ZkACLProvider
   [junit4]   2> 690890 INFO  (TEST-BasicDistributedZkTest.test-seed#[ED47A51AB42FE55C]) [    ] o.a.s.s.SolrDispatchFilter Loading solr.xml from SolrHome (not found in ZooKeeper)
   [junit4]   2> 690890 INFO  (TEST-BasicDistributedZkTest.test-seed#[ED47A51AB42FE55C]) [    ] o.a.s.c.SolrXmlConfig Loading container configuration from /home/jenkins/workspace/Lucene-Solr-5.x-Linux/solr/build/solr-core/test/J0/temp/solr.cloud.BasicDistributedZkTest_ED47A51AB42FE55C-001/shard-1-001/solr.xml
   [junit4]   2> 690894 INFO  (TEST-BasicDistributedZkTest.test-seed#[ED47A51AB42FE55C]) [    ] o.a.s.c.CorePropertiesLocator Config-defined core root directory: /home/jenkins/workspace/Lucene-Solr-5.x-Linux/solr/build/solr-core/test/J0/temp/solr.cloud.BasicDistributedZkTest_ED47A51AB42FE55C-001/shard-1-001/cores
   [junit4]   2> 690894 INFO  (TEST-BasicDistributedZkTest.test-seed#[ED47A51AB42FE55C]) [    ] o.a.s.c.CoreContainer New CoreContainer 323589093
   [junit4]   2> 690894 INFO  (TEST-BasicDistributedZkTest.test-seed#[ED47A51AB42FE55C]) [    ] o.a.s.c.CoreContainer Loading cores into CoreContainer [instanceDir=/home/jenkins/workspace/Lucene-Solr-5.x-Linux/solr/build/solr-core/test/J0/temp/solr.cloud.BasicDistributedZkTest_ED47A51AB42FE55C-001/shard-1-001]
   [junit4]   2> 690894 WARN  (TEST-BasicDistributedZkTest.test-seed#[ED47A51AB42FE55C]) [    ] o.a.s.c.CoreContainer Couldn't add files from /home/jenkins/workspace/Lucene-Solr-5.x-Linux/solr/build/solr-core/test/J0/temp/solr.cloud.BasicDistributedZkTest_ED47A51AB42FE55C-001/shard-1-001/lib to classpath: /home/jenkins/workspace/Lucene-Solr-5.x-Linux/solr/build/solr-core/test/J0/temp/solr.cloud.BasicDistributedZkTest_ED47A51AB42FE55C-001/shard-1-001/lib
   [junit4]   2> 690894 INFO  (TEST-BasicDistributedZkTest.test-seed#[ED47A51AB42FE55C]) [    ] o.a.s.h.c.HttpShardHandlerFactory created with socketTimeout : 90000,urlScheme : ,connTimeout : 15000,maxConnectionsPerHost : 20,maxConnections : 10000,corePoolSize : 0,maximumPoolSize : 2147483647,maxThreadIdleTime : 5,sizeOfQueue : -1,fairnessPolicy : false,useRetries : false,
   [junit4]   2> 690895 INFO  (TEST-BasicDistributedZkTest.test-seed#[ED47A51AB42FE55C]) [    ] o.a.s.u.UpdateShardHandler Creating UpdateShardHandler HTTP client with params: socketTimeout=340000&connTimeout=45000&retry=true
   [junit4]   2> 690895 INFO  (TEST-BasicDistributedZkTest.test-seed#[ED47A51AB42FE55C]) [    ] o.a.s.l.LogWatcher SLF4J impl is org.slf4j.impl.Log4jLoggerFactory
   [junit4]   2> 690895 INFO  (TEST-BasicDistributedZkTest.test-seed#[ED47A51AB42FE55C]) [    ] o.a.s.l.LogWatcher Registering Log Listener [Log4j (org.slf4j.impl.Log4jLoggerFactory)]
   [junit4]   2> 690896 INFO  (TEST-BasicDistributedZkTest.test-seed#[ED47A51AB42FE55C]) [    ] o.a.s.c.ZkContainer Zookeeper client=127.0.0.1:48011/solr
   [junit4]   2> 690896 INFO  (TEST-BasicDistributedZkTest.test-seed#[ED47A51AB42FE55C]) [    ] o.a.s.c.ZkController zkHost includes chroot
   [junit4]   2> 690896 INFO  (TEST-BasicDistributedZkTest.test-seed#[ED47A51AB42FE55C]) [    ] o.a.s.c.c.SolrZkClient Using default ZkCredentialsProvider
   [junit4]   2> 690896 INFO  (TEST-BasicDistributedZkTest.test-seed#[ED47A51AB42FE55C]) [    ] o.a.s.c.c.ConnectionManager Waiting for client to connect to ZooKeeper
   [junit4]   2> 690897 INFO  (zkCallback-606-thread-1) [    ] o.a.s.c.c.ConnectionManager Watcher org.apache.solr.common.cloud.ConnectionManager@6226fda3 name:ZooKeeperConnection Watcher:127.0.0.1:48011 got event WatchedEvent state:SyncConnected type:None path:null path:null type:None
   [junit4]   2> 690897 INFO  (TEST-BasicDistributedZkTest.test-seed#[ED47A51AB42FE55C]) [    ] o.a.s.c.c.ConnectionManager Client is connected to ZooKeeper
   [junit4]   2> 690897 INFO  (TEST-BasicDistributedZkTest.test-seed#[ED47A51AB42FE55C]) [    ] o.a.s.c.c.SolrZkClient Using default ZkACLProvider
   [junit4]   2> 690899 INFO  (TEST-BasicDistributedZkTest.test-seed#[ED47A51AB42FE55C]) [n:127.0.0.1:51663_    ] o.a.s.c.c.ConnectionManager Waiting for client to connect to ZooKeeper
   [junit4]   2> 690899 INFO  (zkCallback-607-thread-1-processing-n:127.0.0.1:51663_) [n:127.0.0.1:51663_    ] o.a.s.c.c.ConnectionManager Watcher org.apache.solr.common.cloud.ConnectionManager@6b2030e4 name:ZooKeeperConnection Watcher:127.0.0.1:48011/solr got event WatchedEvent state:SyncConnected type:None path:null path:null type:None
   [junit4]   2> 690899 INFO  (TEST-BasicDistributedZkTest.test-seed#[ED47A51AB42FE55C]) [n:127.0.0.1:51663_    ] o.a.s.c.c.ConnectionManager Client is connected to ZooKeeper
   [junit4]   2> 690901 INFO  (TEST-BasicDistributedZkTest.test-seed#[ED47A51AB42FE55C]) [n:127.0.0.1:51663_    ] o.a.s.c.c.ZkStateReader Updating cluster state from ZooKeeper... 
   [junit4]   2> 690940 INFO  (OverseerStateUpdate-95202812514729988-127.0.0.1:34475_-n_0000000000) [n:127.0.0.1:34475_    ] o.a.s.c.o.ZkStateWriter going to create_collection /collections/collection1/state.json
   [junit4]   2> 691902 INFO  (TEST-BasicDistributedZkTest.test-seed#[ED47A51AB42FE55C]) [n:127.0.0.1:51663_    ] o.a.s.c.ZkController Register node as live in ZooKeeper:/live_nodes/127.0.0.1:51663_
   [junit4]   2> 691903 INFO  (TEST-BasicDistributedZkTest.test-seed#[ED47A51AB42FE55C]) [n:127.0.0.1:51663_    ] o.a.s.c.c.SolrZkClient makePath: /live_nodes/127.0.0.1:51663_
   [junit4]   2> 691903 INFO  (zkCallback-602-thread-1) [    ] o.a.s.c.c.ZkStateReader A live node change: [WatchedEvent state:SyncConnected type:NodeChildrenChanged path:/live_nodes], has occurred - updating... (live nodes size: [1])
   [junit4]   2> 691903 INFO  (zkCallback-607-thread-1-processing-n:127.0.0.1:51663_) [n:127.0.0.1:51663_    ] o.a.s.c.c.ZkStateReader A live node change: [WatchedEvent state:SyncConnected type:NodeChildrenChanged path:/live_nodes], has occurred - updating... (live nodes size: [1])
   [junit4]   2> 691903 INFO  (zkCallback-600-thread-1-processing-n:127.0.0.1:34475_) [n:127.0.0.1:34475_    ] o.a.s.c.c.ZkStateReader A live node change: [WatchedEvent state:SyncConnected type:NodeChildrenChanged path:/live_nodes], has occurred - updating... (live nodes size: [1])
   [junit4]   2> 691904 INFO  (TEST-BasicDistributedZkTest.test-seed#[ED47A51AB42FE55C]) [n:127.0.0.1:51663_    ] o.a.s.c.Overseer Overseer (id=null) closing
   [junit4]   2> 691904 INFO  (TEST-BasicDistributedZkTest.test-seed#[ED47A51AB42FE55C]) [n:127.0.0.1:51663_    ] o.a.s.c.LeaderElector Joined leadership election with path: /overseer_elect/election/95202812514729993-127.0.0.1:51663_-n_0000000001
   [junit4]   2> 691905 INFO  (TEST-BasicDistributedZkTest.test-seed#[ED47A51AB42FE55C]) [n:127.0.0.1:51663_    ] o.a.s.c.LeaderElector Watching path /overseer_elect/election/95202812514729988-127.0.0.1:34475_-n_0000000000 to know if I could be the leader
   [junit4]   2> 691914 INFO  (TEST-BasicDistributedZkTest.test-seed#[ED47A51AB42FE55C]) [n:127.0.0.1:51663_    ] o.a.s.c.CoreContainer Security conf doesn't exist. Skipping setup for authorization module.
   [junit4]   2> 691914 INFO  (TEST-BasicDistributedZkTest.test-seed#[ED47A51AB42FE55C]) [n:127.0.0.1:51663_    ] o.a.s.c.CoreContainer No authentication plugin used.
   [junit4]   2> 691914 INFO  (TEST-BasicDistributedZkTest.test-seed#[ED47A51AB42FE55C]) [n:127.0.0.1:51663_    ] o.a.s.c.CorePropertiesLocator Looking for core definitions underneath /home/jenkins/workspace/Lucene-Solr-5.x-Linux/solr/build/solr-core/test/J0/temp/solr.cloud.BasicDistributedZkTest_ED47A51AB42FE55C-001/shard-1-001/cores
   [junit4]   2> 691914 INFO  (TEST-BasicDistributedZkTest.test-seed#[ED47A51AB42FE55C]) [n:127.0.0.1:51663_    ] o.a.s.c.CoreDescriptor Created CoreDescriptor: {name=collection1, config=solrconfig.xml, transient=false, schema=schema.xml, loadOnStartup=true, configSetProperties=configsetprops.json, collection=collection1, coreNodeName=, dataDir=data/, shard=}
   [junit4]   2> 691914 INFO  (TEST-BasicDistributedZkTest.test-seed#[ED47A51AB42FE55C]) [n:127.0.0.1:51663_    ] o.a.s.c.CorePropertiesLocator Found core collection1 in /home/jenkins/workspace/Lucene-Solr-5.x-Linux/solr/build/solr-core/test/J0/temp/solr.cloud.BasicDistributedZkTest_ED47A51AB42FE55C-001/shard-1-001/cores/collection1
   [junit4]   2> 691915 INFO  (TEST-BasicDistributedZkTest.test-seed#[ED47A51AB42FE55C]) [n:127.0.0.1:51663_    ] o.a.s.c.CorePropertiesLocator Found 1 core definitions
   [junit4]   2> 691915 INFO  (TEST-BasicDistributedZkTest.test-seed#[ED47A51AB42FE55C]) [n:127.0.0.1:51663_    ] o.a.s.s.SolrDispatchFilter user.dir=/home/jenkins/workspace/Lucene-Solr-5.x-Linux/solr/build/solr-core/test/J0
   [junit4]   2> 691915 INFO  (TEST-BasicDistributedZkTest.test-seed#[ED47A51AB42FE55C]) [n:127.0.0.1:51663_    ] o.a.s.s.SolrDispatchFilter SolrDispatchFilter.init() done
   [junit4]   2> 691915 INFO  (coreLoadExecutor-2151-thread-1-processing-n:127.0.0.1:51663_) [n:127.0.0.1:51663_ c:collection1   x:collection1] o.a.s.c.ZkController publishing state=down
   [junit4]   2> 691915 INFO  (coreLoadExecutor-2151-thread-1-processing-n:127.0.0.1:51663_) [n:127.0.0.1:51663_ c:collection1   x:collection1] o.a.s.c.ZkController numShards not found on descriptor - reading it from system property
   [junit4]   2> 691916 INFO  (coreLoadExecutor-2151-thread-1-processing-n:127.0.0.1:51663_) [n:127.0.0.1:51663_ c:collection1   x:collection1] o.a.s.c.ZkController Registering watch for collection collection1
   [junit4]   2> 691916 INFO  (coreLoadExecutor-2151-thread-1-processing-n:127.0.0.1:51663_) [n:127.0.0.1:51663_ c:collection1   x:collection1] o.a.s.c.c.ZkStateReader addZkWatch [collection1]
   [junit4]   2> 691916 INFO  (OverseerStateUpdate-95202812514729988-127.0.0.1:34475_-n_0000000000) [n:127.0.0.1:34475_    ] o.a.s.c.Overseer processMessage: queueSize: 1, message = {
   [junit4]   2>   "core":"collection1",
   [junit4]   2>   "roles":null,
   [junit4]   2>   "base_url":"http://127.0.0.1:51663",
   [junit4]   2>   "node_name":"127.0.0.1:51663_",
   [junit4]   2>   "numShards":"2",
   [junit4]   2>   "state":"down",
   [junit4]   2>   "shard":null,
   [junit4]   2>   "collection":"collection1",
   [junit4]   2>   "operation":"state"} current state version: 3
   [junit4]   2> 691916 INFO  (coreLoadExecutor-2151-thread-1-processing-n:127.0.0.1:51663_) [n:127.0.0.1:51663_ c:collection1   x:collection1] o.a.s.c.c.ZkStateReader Add data for [collection1] ver [0]
   [junit4]   2> 691916 INFO  (coreLoadExecutor-2151-thread-1-processing-n:127.0.0.1:51663_) [n:127.0.0.1:51663_ c:collection1   x:collection1] o.a.s.c.ZkController look for our core node name
   [junit4]   2> 691916 INFO  (OverseerStateUpdate-95202812514729988-127.0.0.1:34475_-n_0000000000) [n:127.0.0.1:34475_    ] o.a.s.c.o.ReplicaMutator Update state numShards=2 message={
   [junit4]   2>   "core":"collection1",
   [junit4]   2>   "roles":null,
   [junit4]   2>   "base_url":"http://127.0.0.1:51663",
   [junit4]   2>   "node_name":"127.0.0.1:51663_",
   [junit4]   2>   "numShards":"2",
   [junit4]   2>   "state":"down",
   [junit4]   2>   "shard":null,
   [junit4]   2>   "collection":"collection1",
   [junit4]   2>   "operation":"state"}
   [junit4]   2> 691916 INFO  (OverseerStateUpdate-95202812514729988-127.0.0.1:34475_-n_0000000000) [n:127.0.0.1:34475_    ] o.a.s.c.o.ReplicaMutator Collection already exists with numShards=2
   [junit4]   2> 691916 INFO  (OverseerStateUpdate-95202812514729988-127.0.0.1:34475_-n_0000000000) [n:127.0.0.1:34475_    ] o.a.s.c.o.ReplicaMutator Assigning new node to shard shard=shard2
   [junit4]   2> 692017 INFO  (OverseerStateUpdate-95202812514729988-127.0.0.1:34475_-n_0000000000) [n:127.0.0.1:34475_    ] o.a.s.c.o.ZkStateWriter going to update_colle

[...truncated too long message...]

g-n_0000000004) [n:127.0.0.1:48631_w%2Fg    ] o.a.s.c.Overseer Overseer Loop exiting : 127.0.0.1:48631_w%2Fg
   [junit4]   2> 1826611 INFO  (zkCallback-1044-thread-3-processing-n:127.0.0.1:48631_w%2Fg) [n:127.0.0.1:48631_w%2Fg    ] o.a.s.c.c.ZkStateReader A live node change: [WatchedEvent state:SyncConnected type:NodeChildrenChanged path:/live_nodes], has occurred - updating... (live nodes size: [1])
   [junit4]   2> 1826611 WARN  (zkCallback-1044-thread-3-processing-n:127.0.0.1:48631_w%2Fg) [n:127.0.0.1:48631_w%2Fg    ] o.a.s.c.c.ZkStateReader ZooKeeper watch triggered, but Solr cannot talk to ZK: [KeeperErrorCode = Session expired for /live_nodes]
   [junit4]   2> 1826612 INFO  (TEST-ShardSplitTest.test-seed#[ED47A51AB42FE55C]) [    ] o.e.j.s.ServerConnector Stopped ServerConnector@6f895550{HTTP/1.1}{127.0.0.1:0}
   [junit4]   2> 1826612 INFO  (TEST-ShardSplitTest.test-seed#[ED47A51AB42FE55C]) [    ] o.e.j.s.h.ContextHandler Stopped o.e.j.s.ServletContextHandler@6e8476f9{/w/g,null,UNAVAILABLE}
   [junit4]   2> 1826613 INFO  (TEST-ShardSplitTest.test-seed#[ED47A51AB42FE55C]) [n:127.0.0.1:48631_w%2Fg c:collection1 s:shard1_1 r:core_node8 x:collection1_shard1_1_replica2] o.a.s.c.ZkTestServer connecting to 127.0.0.1:48166 48166
   [junit4]   2> 1826623 INFO  (Thread-3604) [    ] o.a.s.c.ZkTestServer connecting to 127.0.0.1:48166 48166
   [junit4]   2> 1826624 WARN  (Thread-3604) [    ] o.a.s.c.ZkTestServer Watch limit violations: 
   [junit4]   2> Maximum concurrent create/delete watches above limit:
   [junit4]   2> 
   [junit4]   2> 	6	/solr/aliases.json
   [junit4]   2> 	5	/solr/security.json
   [junit4]   2> 	5	/solr/configs/conf1
   [junit4]   2> 
   [junit4]   2> Maximum concurrent data watches above limit:
   [junit4]   2> 
   [junit4]   2> 	6	/solr/clusterstate.json
   [junit4]   2> 	4	/solr/collections/collection1/state.json
   [junit4]   2> 
   [junit4]   2> Maximum concurrent children watches above limit:
   [junit4]   2> 
   [junit4]   2> 	6	/solr/live_nodes
   [junit4]   2> 	6	/solr/collections
   [junit4]   2> 	4	/solr/overseer/queue
   [junit4]   2> 	4	/solr/overseer/collection-queue-work
   [junit4]   2> 	2	/solr/overseer/queue-work
   [junit4]   2> 
   [junit4]   2> NOTE: reproduce with: ant test  -Dtestcase=ShardSplitTest -Dtests.method=test -Dtests.seed=ED47A51AB42FE55C -Dtests.multiplier=3 -Dtests.slow=true -Dtests.locale=be -Dtests.timezone=America/St_Kitts -Dtests.asserts=true -Dtests.file.encoding=US-ASCII
   [junit4] FAILURE  536s J0 | ShardSplitTest.test <<<
   [junit4]    > Throwable #1: java.lang.AssertionError: There are still nodes recoverying - waited for 330 seconds
   [junit4]    > 	at __randomizedtesting.SeedInfo.seed([ED47A51AB42FE55C:65139AC01AD388A4]:0)
   [junit4]    > 	at org.apache.solr.cloud.AbstractDistribZkTestBase.waitForRecoveriesToFinish(AbstractDistribZkTestBase.java:175)
   [junit4]    > 	at org.apache.solr.cloud.AbstractDistribZkTestBase.waitForRecoveriesToFinish(AbstractDistribZkTestBase.java:136)
   [junit4]    > 	at org.apache.solr.cloud.AbstractDistribZkTestBase.waitForRecoveriesToFinish(AbstractDistribZkTestBase.java:131)
   [junit4]    > 	at org.apache.solr.cloud.AbstractFullDistribZkTestBase.waitForRecoveriesToFinish(AbstractFullDistribZkTestBase.java:825)
   [junit4]    > 	at org.apache.solr.cloud.ShardSplitTest.splitByUniqueKeyTest(ShardSplitTest.java:219)
   [junit4]    > 	at org.apache.solr.cloud.ShardSplitTest.test(ShardSplitTest.java:82)
   [junit4]    > 	at org.apache.solr.BaseDistributedSearchTestCase$ShardsRepeatRule$ShardsFixedStatement.callStatement(BaseDistributedSearchTestCase.java:965)
   [junit4]    > 	at org.apache.solr.BaseDistributedSearchTestCase$ShardsRepeatRule$ShardsStatement.evaluate(BaseDistributedSearchTestCase.java:940)
   [junit4]    > 	at java.lang.Thread.run(Thread.java:745)
   [junit4]   2> 1826625 INFO  (SUITE-ShardSplitTest-seed#[ED47A51AB42FE55C]-worker) [n:127.0.0.1:48631_w%2Fg c:collection1 s:shard1_1 r:core_node8 x:collection1_shard1_1_replica2] o.a.s.SolrTestCaseJ4 ###deleteCore
   [junit4]   2> NOTE: leaving temporary files on disk at: /home/jenkins/workspace/Lucene-Solr-5.x-Linux/solr/build/solr-core/test/J0/temp/solr.cloud.ShardSplitTest_ED47A51AB42FE55C-001
   [junit4]   2> Jan 13, 2016 10:26:11 AM com.carrotsearch.randomizedtesting.ThreadLeakControl checkThreadLeaks
   [junit4]   2> WARNING: Will linger awaiting termination of 2 leaked thread(s).
   [junit4]   2> NOTE: test params are: codec=Asserting(Lucene54): {_version_=Lucene50(blocksize=128), n_ti=Lucene50(blocksize=128), id=PostingsFormat(name=LuceneFixedGap)}, docValues:{}, sim=RandomSimilarityProvider(queryNorm=true,coord=no): {}, locale=be, timezone=America/St_Kitts
   [junit4]   2> NOTE: Linux 3.19.0-42-generic amd64/Oracle Corporation 1.8.0_66 (64-bit)/cpus=12,threads=1,free=82934592,total=514445312
   [junit4]   2> NOTE: All tests run in this JVM: [EchoParamsTest, DistributedQueryElevationComponentTest, MergeStrategyTest, TestLuceneMatchVersion, TestIBSimilarityFactory, AsyncMigrateRouteKeyTest, TestSolr4Spatial, PeerSyncTest, TestFoldingMultitermQuery, QueryElevationComponentTest, DistanceUnitsTest, RequiredFieldsTest, CacheHeaderTest, CollectionTooManyReplicasTest, StandardRequestHandlerTest, AnalyticsMergeStrategyTest, HLLSerializationTest, TestStressLucene, TestCloudInspectUtil, HdfsNNFailoverTest, ForceLeaderTest, DocumentAnalysisRequestHandlerTest, TestPivotHelperCode, TestRuleBasedAuthorizationPlugin, QueryEqualityTest, TestCloudSchemaless, TestImplicitCoreProperties, ExternalFileFieldSortTest, CoreAdminRequestStatusTest, TestCryptoKeys, TestStandardQParsers, AnalysisAfterCoreReloadTest, SystemInfoHandlerTest, TestRangeQuery, TestCSVLoader, HdfsRestartWhileUpdatingTest, ZkNodePropsTest, AliasIntegrationTest, TestComplexPhraseQParserPlugin, AddSchemaFieldsUpdateProcessorFactoryTest, TestArbitraryIndexDir, BasicZkTest, TestOrdValues, DocExpirationUpdateProcessorFactoryTest, ReplicationFactorTest, MultiThreadedOCPTest, PolyFieldTest, RAMDirectoryFactoryTest, DirectoryFactoryTest, TestRandomDVFaceting, DistributedQueryComponentCustomSortTest, TestRandomForceMergePolicy, TestShortCircuitedRequests, TestBinaryField, TestFileDictionaryLookup, CurrencyFieldOpenExchangeTest, TestManagedSchemaFieldTypeResource, AlternateDirectoryTest, SOLR749Test, PreAnalyzedFieldTest, SmileWriterTest, TestPseudoReturnFields, BitVectorTest, PathHierarchyTokenizerFactoryTest, CloudExitableDirectoryReaderTest, IndexSchemaRuntimeFieldTest, HdfsUnloadDistributedZkTest, XsltUpdateRequestHandlerTest, LeaderElectionIntegrationTest, TestFunctionQuery, TestDefaultSearchFieldResource, TestTestInjection, TestExclusionRuleCollectionAccess, BasicDistributedZkTest, TestLazyCores, DeleteShardTest, TestFieldCollectionResource, HdfsChaosMonkeyNothingIsSafeTest, TestChildDocTransformer, TestMissingGroups, TestClusterStateMutator, TestOmitPositions, ReturnFieldsTest, TestSolrConfigHandler, TestAnalyzedSuggestions, TestBulkSchemaAPI, TestEmbeddedSolrServerConstructors, TestAddFieldRealTimeGet, ConjunctionSolrSpellCheckerTest, PingRequestHandlerTest, TestRandomCollapseQParserPlugin, SecurityConfHandlerTest, ResponseLogComponentTest, CollectionsAPIDistributedZkTest, TestZkChroot, ShardRoutingCustomTest, TestDistributedGrouping, TestFaceting, TestHashPartitioner, TestRealTimeGet, TestStressReorder, TestJoin, StatsComponentTest, TestBadConfig, HighlighterTest, SoftAutoCommitTest, SuggesterFSTTest, CoreAdminHandlerTest, DocValuesTest, SuggesterTSTTest, TestTrie, SpatialFilterTest, SuggesterWFSTTest, SchemaVersionSpecificBehaviorTest, TestUpdate, FieldMutatingUpdateProcessorTest, DirectUpdateHandlerOptimizeTest, DefaultValueUpdateProcessorTest, DocValuesMultiTest, TestSolrDeletionPolicy1, SolrInfoMBeanTest, TestSurroundQueryParser, DisMaxRequestHandlerTest, TestWriterPerf, TestReversedWildcardFilterFactory, TermsComponentTest, XmlUpdateRequestHandlerTest, TestIndexingPerformance, FieldAnalysisRequestHandlerTest, LoggingHandlerTest, IndexSchemaTest, TestJmxIntegration, TestCSVResponseWriter, BinaryUpdateRequestHandlerTest, TestComponentsName, UpdateParamsTest, BadComponentTest, TestSolrDeletionPolicy2, TestDocSet, OutputWriterTest, NotRequiredUniqueKeyTest, TestCharFilters, TestCodecSupport, TestFastOutputStream, PluginInfoTest, DateMathParserTest, PrimUtilsTest, SpellingQueryConverterTest, TestDocumentBuilder, UUIDFieldTest, CursorPagingTest, TestHighlightDedupGrouping, TestSimpleTrackingShardHandler, AsyncCallRequestStatusResponseTest, ConfigSetsAPITest, DistribJoinFromCollectionTest, LeaderInitiatedRecoveryOnShardRestartTest, MigrateRouteKeyTest, RemoteQueryErrorTest, ShardSplitTest]
   [junit4] Completed [564/564 (3!)] on J0 in 536.69s, 1 test, 1 failure <<< FAILURES!

[...truncated 13 lines...]
BUILD FAILED
/home/jenkins/workspace/Lucene-Solr-5.x-Linux/build.xml:794: The following error occurred while executing this line:
/home/jenkins/workspace/Lucene-Solr-5.x-Linux/build.xml:738: The following error occurred while executing this line:
/home/jenkins/workspace/Lucene-Solr-5.x-Linux/build.xml:59: The following error occurred while executing this line:
/home/jenkins/workspace/Lucene-Solr-5.x-Linux/solr/build.xml:233: The following error occurred while executing this line:
/home/jenkins/workspace/Lucene-Solr-5.x-Linux/solr/common-build.xml:532: The following error occurred while executing this line:
/home/jenkins/workspace/Lucene-Solr-5.x-Linux/lucene/common-build.xml:1444: The following error occurred while executing this line:
/home/jenkins/workspace/Lucene-Solr-5.x-Linux/lucene/common-build.xml:1000: There were test failures: 564 suites (7 ignored), 2253 tests, 1 error, 2 failures, 83 ignored (39 assumptions) [seed: ED47A51AB42FE55C]

Total time: 53 minutes 4 seconds
Build step 'Invoke Ant' marked build as failure
Archiving artifacts
[WARNINGS] Skipping publisher since build result is FAILURE
Recording test results
Email was triggered for: Failure - Any
Sending email for trigger: Failure - Any



Mime
View raw message