lucene-dev mailing list archives

Site index · List index
Message view « Date » · « Thread »
Top « Date » · « Thread »
From Policeman Jenkins Server <jenk...@thetaphi.de>
Subject [JENKINS-EA] Lucene-Solr-5.x-Linux (32bit/jdk-9-ea+95) - Build # 15206 - Failure!
Date Sun, 10 Jan 2016 08:22:48 GMT
Build: http://jenkins.thetaphi.de/job/Lucene-Solr-5.x-Linux/15206/
Java: 32bit/jdk-9-ea+95 -client -XX:+UseConcMarkSweepGC -XX:-CompactStrings

2 tests failed.
FAILED:  org.apache.solr.cloud.CustomCollectionTest.test

Error Message:
expected:<3> but was:<0>

Stack Trace:
java.lang.AssertionError: expected:<3> but was:<0>
	at __randomizedtesting.SeedInfo.seed([A39F920AC40DF4A8:2BCBADD06AF19950]:0)
	at org.junit.Assert.fail(Assert.java:93)
	at org.junit.Assert.failNotEquals(Assert.java:647)
	at org.junit.Assert.assertEquals(Assert.java:128)
	at org.junit.Assert.assertEquals(Assert.java:472)
	at org.junit.Assert.assertEquals(Assert.java:456)
	at org.apache.solr.cloud.CustomCollectionTest.testCustomCollectionsAPI(CustomCollectionTest.java:214)
	at org.apache.solr.cloud.CustomCollectionTest.test(CustomCollectionTest.java:100)
	at sun.reflect.NativeMethodAccessorImpl.invoke0(Native Method)
	at sun.reflect.NativeMethodAccessorImpl.invoke(NativeMethodAccessorImpl.java:62)
	at sun.reflect.DelegatingMethodAccessorImpl.invoke(DelegatingMethodAccessorImpl.java:43)
	at java.lang.reflect.Method.invoke(Method.java:520)
	at com.carrotsearch.randomizedtesting.RandomizedRunner.invoke(RandomizedRunner.java:1764)
	at com.carrotsearch.randomizedtesting.RandomizedRunner$8.evaluate(RandomizedRunner.java:871)
	at com.carrotsearch.randomizedtesting.RandomizedRunner$9.evaluate(RandomizedRunner.java:907)
	at com.carrotsearch.randomizedtesting.RandomizedRunner$10.evaluate(RandomizedRunner.java:921)
	at org.apache.solr.BaseDistributedSearchTestCase$ShardsRepeatRule$ShardsFixedStatement.callStatement(BaseDistributedSearchTestCase.java:965)
	at org.apache.solr.BaseDistributedSearchTestCase$ShardsRepeatRule$ShardsStatement.evaluate(BaseDistributedSearchTestCase.java:940)
	at com.carrotsearch.randomizedtesting.rules.SystemPropertiesRestoreRule$1.evaluate(SystemPropertiesRestoreRule.java:57)
	at org.apache.lucene.util.TestRuleSetupTeardownChained$1.evaluate(TestRuleSetupTeardownChained.java:50)
	at org.apache.lucene.util.AbstractBeforeAfterRule$1.evaluate(AbstractBeforeAfterRule.java:46)
	at org.apache.lucene.util.TestRuleThreadAndTestName$1.evaluate(TestRuleThreadAndTestName.java:49)
	at org.apache.lucene.util.TestRuleIgnoreAfterMaxFailures$1.evaluate(TestRuleIgnoreAfterMaxFailures.java:65)
	at org.apache.lucene.util.TestRuleMarkFailure$1.evaluate(TestRuleMarkFailure.java:48)
	at com.carrotsearch.randomizedtesting.rules.StatementAdapter.evaluate(StatementAdapter.java:36)
	at com.carrotsearch.randomizedtesting.ThreadLeakControl$StatementRunner.run(ThreadLeakControl.java:367)
	at com.carrotsearch.randomizedtesting.ThreadLeakControl.forkTimeoutingTask(ThreadLeakControl.java:809)
	at com.carrotsearch.randomizedtesting.ThreadLeakControl$3.evaluate(ThreadLeakControl.java:460)
	at com.carrotsearch.randomizedtesting.RandomizedRunner.runSingleTest(RandomizedRunner.java:880)
	at com.carrotsearch.randomizedtesting.RandomizedRunner$5.evaluate(RandomizedRunner.java:781)
	at com.carrotsearch.randomizedtesting.RandomizedRunner$6.evaluate(RandomizedRunner.java:816)
	at com.carrotsearch.randomizedtesting.RandomizedRunner$7.evaluate(RandomizedRunner.java:827)
	at com.carrotsearch.randomizedtesting.rules.StatementAdapter.evaluate(StatementAdapter.java:36)
	at com.carrotsearch.randomizedtesting.rules.SystemPropertiesRestoreRule$1.evaluate(SystemPropertiesRestoreRule.java:57)
	at org.apache.lucene.util.AbstractBeforeAfterRule$1.evaluate(AbstractBeforeAfterRule.java:46)
	at com.carrotsearch.randomizedtesting.rules.StatementAdapter.evaluate(StatementAdapter.java:36)
	at org.apache.lucene.util.TestRuleStoreClassName$1.evaluate(TestRuleStoreClassName.java:42)
	at com.carrotsearch.randomizedtesting.rules.NoShadowingOrOverridesOnMethodsRule$1.evaluate(NoShadowingOrOverridesOnMethodsRule.java:40)
	at com.carrotsearch.randomizedtesting.rules.NoShadowingOrOverridesOnMethodsRule$1.evaluate(NoShadowingOrOverridesOnMethodsRule.java:40)
	at com.carrotsearch.randomizedtesting.rules.StatementAdapter.evaluate(StatementAdapter.java:36)
	at com.carrotsearch.randomizedtesting.rules.StatementAdapter.evaluate(StatementAdapter.java:36)
	at com.carrotsearch.randomizedtesting.rules.StatementAdapter.evaluate(StatementAdapter.java:36)
	at org.apache.lucene.util.TestRuleAssertionsRequired$1.evaluate(TestRuleAssertionsRequired.java:54)
	at org.apache.lucene.util.TestRuleMarkFailure$1.evaluate(TestRuleMarkFailure.java:48)
	at org.apache.lucene.util.TestRuleIgnoreAfterMaxFailures$1.evaluate(TestRuleIgnoreAfterMaxFailures.java:65)
	at org.apache.lucene.util.TestRuleIgnoreTestSuites$1.evaluate(TestRuleIgnoreTestSuites.java:55)
	at com.carrotsearch.randomizedtesting.rules.StatementAdapter.evaluate(StatementAdapter.java:36)
	at com.carrotsearch.randomizedtesting.ThreadLeakControl$StatementRunner.run(ThreadLeakControl.java:367)
	at java.lang.Thread.run(Thread.java:747)


FAILED:  org.apache.solr.cloud.TestAuthenticationFramework.testBasics

Error Message:
expected:<1> but was:<0>

Stack Trace:
java.lang.AssertionError: expected:<1> but was:<0>
	at __randomizedtesting.SeedInfo.seed([A39F920AC40DF4A8:9E473C26FCE3AAD8]:0)
	at org.junit.Assert.fail(Assert.java:93)
	at org.junit.Assert.failNotEquals(Assert.java:647)
	at org.junit.Assert.assertEquals(Assert.java:128)
	at org.junit.Assert.assertEquals(Assert.java:472)
	at org.junit.Assert.assertEquals(Assert.java:456)
	at org.apache.solr.cloud.TestMiniSolrCloudCluster.testCollectionCreateSearchDelete(TestMiniSolrCloudCluster.java:227)
	at org.apache.solr.cloud.TestAuthenticationFramework.testBasics(TestAuthenticationFramework.java:93)
	at sun.reflect.NativeMethodAccessorImpl.invoke0(Native Method)
	at sun.reflect.NativeMethodAccessorImpl.invoke(NativeMethodAccessorImpl.java:62)
	at sun.reflect.DelegatingMethodAccessorImpl.invoke(DelegatingMethodAccessorImpl.java:43)
	at java.lang.reflect.Method.invoke(Method.java:520)
	at com.carrotsearch.randomizedtesting.RandomizedRunner.invoke(RandomizedRunner.java:1764)
	at com.carrotsearch.randomizedtesting.RandomizedRunner$8.evaluate(RandomizedRunner.java:871)
	at com.carrotsearch.randomizedtesting.RandomizedRunner$9.evaluate(RandomizedRunner.java:907)
	at com.carrotsearch.randomizedtesting.RandomizedRunner$10.evaluate(RandomizedRunner.java:921)
	at com.carrotsearch.randomizedtesting.rules.SystemPropertiesRestoreRule$1.evaluate(SystemPropertiesRestoreRule.java:57)
	at org.apache.lucene.util.TestRuleSetupTeardownChained$1.evaluate(TestRuleSetupTeardownChained.java:50)
	at org.apache.lucene.util.AbstractBeforeAfterRule$1.evaluate(AbstractBeforeAfterRule.java:46)
	at org.apache.lucene.util.TestRuleThreadAndTestName$1.evaluate(TestRuleThreadAndTestName.java:49)
	at org.apache.lucene.util.TestRuleIgnoreAfterMaxFailures$1.evaluate(TestRuleIgnoreAfterMaxFailures.java:65)
	at org.apache.lucene.util.TestRuleMarkFailure$1.evaluate(TestRuleMarkFailure.java:48)
	at com.carrotsearch.randomizedtesting.rules.StatementAdapter.evaluate(StatementAdapter.java:36)
	at com.carrotsearch.randomizedtesting.ThreadLeakControl$StatementRunner.run(ThreadLeakControl.java:367)
	at com.carrotsearch.randomizedtesting.ThreadLeakControl.forkTimeoutingTask(ThreadLeakControl.java:809)
	at com.carrotsearch.randomizedtesting.ThreadLeakControl$3.evaluate(ThreadLeakControl.java:460)
	at com.carrotsearch.randomizedtesting.RandomizedRunner.runSingleTest(RandomizedRunner.java:880)
	at com.carrotsearch.randomizedtesting.RandomizedRunner$5.evaluate(RandomizedRunner.java:781)
	at com.carrotsearch.randomizedtesting.RandomizedRunner$6.evaluate(RandomizedRunner.java:816)
	at com.carrotsearch.randomizedtesting.RandomizedRunner$7.evaluate(RandomizedRunner.java:827)
	at com.carrotsearch.randomizedtesting.rules.StatementAdapter.evaluate(StatementAdapter.java:36)
	at com.carrotsearch.randomizedtesting.rules.SystemPropertiesRestoreRule$1.evaluate(SystemPropertiesRestoreRule.java:57)
	at org.apache.lucene.util.AbstractBeforeAfterRule$1.evaluate(AbstractBeforeAfterRule.java:46)
	at com.carrotsearch.randomizedtesting.rules.StatementAdapter.evaluate(StatementAdapter.java:36)
	at org.apache.lucene.util.TestRuleStoreClassName$1.evaluate(TestRuleStoreClassName.java:42)
	at com.carrotsearch.randomizedtesting.rules.NoShadowingOrOverridesOnMethodsRule$1.evaluate(NoShadowingOrOverridesOnMethodsRule.java:40)
	at com.carrotsearch.randomizedtesting.rules.NoShadowingOrOverridesOnMethodsRule$1.evaluate(NoShadowingOrOverridesOnMethodsRule.java:40)
	at com.carrotsearch.randomizedtesting.rules.StatementAdapter.evaluate(StatementAdapter.java:36)
	at com.carrotsearch.randomizedtesting.rules.StatementAdapter.evaluate(StatementAdapter.java:36)
	at com.carrotsearch.randomizedtesting.rules.StatementAdapter.evaluate(StatementAdapter.java:36)
	at org.apache.lucene.util.TestRuleAssertionsRequired$1.evaluate(TestRuleAssertionsRequired.java:54)
	at org.apache.lucene.util.TestRuleMarkFailure$1.evaluate(TestRuleMarkFailure.java:48)
	at org.apache.lucene.util.TestRuleIgnoreAfterMaxFailures$1.evaluate(TestRuleIgnoreAfterMaxFailures.java:65)
	at org.apache.lucene.util.TestRuleIgnoreTestSuites$1.evaluate(TestRuleIgnoreTestSuites.java:55)
	at com.carrotsearch.randomizedtesting.rules.StatementAdapter.evaluate(StatementAdapter.java:36)
	at com.carrotsearch.randomizedtesting.ThreadLeakControl$StatementRunner.run(ThreadLeakControl.java:367)
	at java.lang.Thread.run(Thread.java:747)




Build Log:
[...truncated 11173 lines...]
   [junit4] Suite: org.apache.solr.cloud.CustomCollectionTest
   [junit4]   2> Creating dataDir: /home/jenkins/workspace/Lucene-Solr-5.x-Linux/solr/build/solr-core/test/J2/temp/solr.cloud.CustomCollectionTest_A39F920AC40DF4A8-001/init-core-data-001
   [junit4]   2> 1323383 INFO  (SUITE-CustomCollectionTest-seed#[A39F920AC40DF4A8]-worker) [    ] o.a.s.BaseDistributedSearchTestCase Setting hostContext system property: /
   [junit4]   2> 1323385 INFO  (TEST-CustomCollectionTest.test-seed#[A39F920AC40DF4A8]) [    ] o.a.s.c.ZkTestServer STARTING ZK TEST SERVER
   [junit4]   2> 1323385 INFO  (Thread-4159) [    ] o.a.s.c.ZkTestServer client port:0.0.0.0/0.0.0.0:0
   [junit4]   2> 1323385 INFO  (Thread-4159) [    ] o.a.s.c.ZkTestServer Starting server
   [junit4]   2> 1323485 INFO  (TEST-CustomCollectionTest.test-seed#[A39F920AC40DF4A8]) [    ] o.a.s.c.ZkTestServer start zk server on port:33630
   [junit4]   2> 1323485 INFO  (TEST-CustomCollectionTest.test-seed#[A39F920AC40DF4A8]) [    ] o.a.s.c.c.SolrZkClient Using default ZkCredentialsProvider
   [junit4]   2> 1323486 INFO  (TEST-CustomCollectionTest.test-seed#[A39F920AC40DF4A8]) [    ] o.a.s.c.c.ConnectionManager Waiting for client to connect to ZooKeeper
   [junit4]   2> 1323488 INFO  (zkCallback-1733-thread-1) [    ] o.a.s.c.c.ConnectionManager Watcher org.apache.solr.common.cloud.ConnectionManager@38045d name:ZooKeeperConnection Watcher:127.0.0.1:33630 got event WatchedEvent state:SyncConnected type:None path:null path:null type:None
   [junit4]   2> 1323488 INFO  (TEST-CustomCollectionTest.test-seed#[A39F920AC40DF4A8]) [    ] o.a.s.c.c.ConnectionManager Client is connected to ZooKeeper
   [junit4]   2> 1323488 INFO  (TEST-CustomCollectionTest.test-seed#[A39F920AC40DF4A8]) [    ] o.a.s.c.c.SolrZkClient Using default ZkACLProvider
   [junit4]   2> 1323489 INFO  (TEST-CustomCollectionTest.test-seed#[A39F920AC40DF4A8]) [    ] o.a.s.c.c.SolrZkClient makePath: /solr
   [junit4]   2> 1323490 INFO  (TEST-CustomCollectionTest.test-seed#[A39F920AC40DF4A8]) [    ] o.a.s.c.c.SolrZkClient Using default ZkCredentialsProvider
   [junit4]   2> 1323491 INFO  (TEST-CustomCollectionTest.test-seed#[A39F920AC40DF4A8]) [    ] o.a.s.c.c.ConnectionManager Waiting for client to connect to ZooKeeper
   [junit4]   2> 1323491 INFO  (zkCallback-1734-thread-1) [    ] o.a.s.c.c.ConnectionManager Watcher org.apache.solr.common.cloud.ConnectionManager@1547109 name:ZooKeeperConnection Watcher:127.0.0.1:33630/solr got event WatchedEvent state:SyncConnected type:None path:null path:null type:None
   [junit4]   2> 1323491 INFO  (TEST-CustomCollectionTest.test-seed#[A39F920AC40DF4A8]) [    ] o.a.s.c.c.ConnectionManager Client is connected to ZooKeeper
   [junit4]   2> 1323492 INFO  (TEST-CustomCollectionTest.test-seed#[A39F920AC40DF4A8]) [    ] o.a.s.c.c.SolrZkClient Using default ZkACLProvider
   [junit4]   2> 1323492 INFO  (TEST-CustomCollectionTest.test-seed#[A39F920AC40DF4A8]) [    ] o.a.s.c.c.SolrZkClient makePath: /collections/collection1
   [junit4]   2> 1323493 INFO  (TEST-CustomCollectionTest.test-seed#[A39F920AC40DF4A8]) [    ] o.a.s.c.c.SolrZkClient makePath: /collections/collection1/shards
   [junit4]   2> 1323494 INFO  (TEST-CustomCollectionTest.test-seed#[A39F920AC40DF4A8]) [    ] o.a.s.c.c.SolrZkClient makePath: /collections/control_collection
   [junit4]   2> 1323495 INFO  (TEST-CustomCollectionTest.test-seed#[A39F920AC40DF4A8]) [    ] o.a.s.c.c.SolrZkClient makePath: /collections/control_collection/shards
   [junit4]   2> 1323496 INFO  (TEST-CustomCollectionTest.test-seed#[A39F920AC40DF4A8]) [    ] o.a.s.c.AbstractZkTestCase put /home/jenkins/workspace/Lucene-Solr-5.x-Linux/solr/core/src/test-files/solr/collection1/conf/solrconfig-tlog.xml to /configs/conf1/solrconfig.xml
   [junit4]   2> 1323496 INFO  (TEST-CustomCollectionTest.test-seed#[A39F920AC40DF4A8]) [    ] o.a.s.c.c.SolrZkClient makePath: /configs/conf1/solrconfig.xml
   [junit4]   2> 1323498 INFO  (TEST-CustomCollectionTest.test-seed#[A39F920AC40DF4A8]) [    ] o.a.s.c.AbstractZkTestCase put /home/jenkins/workspace/Lucene-Solr-5.x-Linux/solr/core/src/test-files/solr/collection1/conf/schema.xml to /configs/conf1/schema.xml
   [junit4]   2> 1323498 INFO  (TEST-CustomCollectionTest.test-seed#[A39F920AC40DF4A8]) [    ] o.a.s.c.c.SolrZkClient makePath: /configs/conf1/schema.xml
   [junit4]   2> 1323499 INFO  (TEST-CustomCollectionTest.test-seed#[A39F920AC40DF4A8]) [    ] o.a.s.c.AbstractZkTestCase put /home/jenkins/workspace/Lucene-Solr-5.x-Linux/solr/core/src/test-files/solr/collection1/conf/solrconfig.snippet.randomindexconfig.xml to /configs/conf1/solrconfig.snippet.randomindexconfig.xml
   [junit4]   2> 1323499 INFO  (TEST-CustomCollectionTest.test-seed#[A39F920AC40DF4A8]) [    ] o.a.s.c.c.SolrZkClient makePath: /configs/conf1/solrconfig.snippet.randomindexconfig.xml
   [junit4]   2> 1323500 INFO  (TEST-CustomCollectionTest.test-seed#[A39F920AC40DF4A8]) [    ] o.a.s.c.AbstractZkTestCase put /home/jenkins/workspace/Lucene-Solr-5.x-Linux/solr/core/src/test-files/solr/collection1/conf/stopwords.txt to /configs/conf1/stopwords.txt
   [junit4]   2> 1323500 INFO  (TEST-CustomCollectionTest.test-seed#[A39F920AC40DF4A8]) [    ] o.a.s.c.c.SolrZkClient makePath: /configs/conf1/stopwords.txt
   [junit4]   2> 1323501 INFO  (TEST-CustomCollectionTest.test-seed#[A39F920AC40DF4A8]) [    ] o.a.s.c.AbstractZkTestCase put /home/jenkins/workspace/Lucene-Solr-5.x-Linux/solr/core/src/test-files/solr/collection1/conf/protwords.txt to /configs/conf1/protwords.txt
   [junit4]   2> 1323501 INFO  (TEST-CustomCollectionTest.test-seed#[A39F920AC40DF4A8]) [    ] o.a.s.c.c.SolrZkClient makePath: /configs/conf1/protwords.txt
   [junit4]   2> 1323503 INFO  (TEST-CustomCollectionTest.test-seed#[A39F920AC40DF4A8]) [    ] o.a.s.c.AbstractZkTestCase put /home/jenkins/workspace/Lucene-Solr-5.x-Linux/solr/core/src/test-files/solr/collection1/conf/currency.xml to /configs/conf1/currency.xml
   [junit4]   2> 1323503 INFO  (TEST-CustomCollectionTest.test-seed#[A39F920AC40DF4A8]) [    ] o.a.s.c.c.SolrZkClient makePath: /configs/conf1/currency.xml
   [junit4]   2> 1323504 INFO  (TEST-CustomCollectionTest.test-seed#[A39F920AC40DF4A8]) [    ] o.a.s.c.AbstractZkTestCase put /home/jenkins/workspace/Lucene-Solr-5.x-Linux/solr/core/src/test-files/solr/collection1/conf/enumsConfig.xml to /configs/conf1/enumsConfig.xml
   [junit4]   2> 1323504 INFO  (TEST-CustomCollectionTest.test-seed#[A39F920AC40DF4A8]) [    ] o.a.s.c.c.SolrZkClient makePath: /configs/conf1/enumsConfig.xml
   [junit4]   2> 1323505 INFO  (TEST-CustomCollectionTest.test-seed#[A39F920AC40DF4A8]) [    ] o.a.s.c.AbstractZkTestCase put /home/jenkins/workspace/Lucene-Solr-5.x-Linux/solr/core/src/test-files/solr/collection1/conf/open-exchange-rates.json to /configs/conf1/open-exchange-rates.json
   [junit4]   2> 1323505 INFO  (TEST-CustomCollectionTest.test-seed#[A39F920AC40DF4A8]) [    ] o.a.s.c.c.SolrZkClient makePath: /configs/conf1/open-exchange-rates.json
   [junit4]   2> 1323506 INFO  (TEST-CustomCollectionTest.test-seed#[A39F920AC40DF4A8]) [    ] o.a.s.c.AbstractZkTestCase put /home/jenkins/workspace/Lucene-Solr-5.x-Linux/solr/core/src/test-files/solr/collection1/conf/mapping-ISOLatin1Accent.txt to /configs/conf1/mapping-ISOLatin1Accent.txt
   [junit4]   2> 1323506 INFO  (TEST-CustomCollectionTest.test-seed#[A39F920AC40DF4A8]) [    ] o.a.s.c.c.SolrZkClient makePath: /configs/conf1/mapping-ISOLatin1Accent.txt
   [junit4]   2> 1323507 INFO  (TEST-CustomCollectionTest.test-seed#[A39F920AC40DF4A8]) [    ] o.a.s.c.AbstractZkTestCase put /home/jenkins/workspace/Lucene-Solr-5.x-Linux/solr/core/src/test-files/solr/collection1/conf/old_synonyms.txt to /configs/conf1/old_synonyms.txt
   [junit4]   2> 1323507 INFO  (TEST-CustomCollectionTest.test-seed#[A39F920AC40DF4A8]) [    ] o.a.s.c.c.SolrZkClient makePath: /configs/conf1/old_synonyms.txt
   [junit4]   2> 1323508 INFO  (TEST-CustomCollectionTest.test-seed#[A39F920AC40DF4A8]) [    ] o.a.s.c.AbstractZkTestCase put /home/jenkins/workspace/Lucene-Solr-5.x-Linux/solr/core/src/test-files/solr/collection1/conf/synonyms.txt to /configs/conf1/synonyms.txt
   [junit4]   2> 1323508 INFO  (TEST-CustomCollectionTest.test-seed#[A39F920AC40DF4A8]) [    ] o.a.s.c.c.SolrZkClient makePath: /configs/conf1/synonyms.txt
   [junit4]   2> 1323595 INFO  (TEST-CustomCollectionTest.test-seed#[A39F920AC40DF4A8]) [    ] o.a.s.SolrTestCaseJ4 Writing core.properties file to /home/jenkins/workspace/Lucene-Solr-5.x-Linux/solr/build/solr-core/test/J2/temp/solr.cloud.CustomCollectionTest_A39F920AC40DF4A8-001/control-001/cores/collection1
   [junit4]   2> 1323596 INFO  (TEST-CustomCollectionTest.test-seed#[A39F920AC40DF4A8]) [    ] o.e.j.s.Server jetty-9.2.13.v20150730
   [junit4]   2> 1323598 INFO  (TEST-CustomCollectionTest.test-seed#[A39F920AC40DF4A8]) [    ] o.e.j.s.h.ContextHandler Started o.e.j.s.ServletContextHandler@a6bd49{/,null,AVAILABLE}
   [junit4]   2> 1323601 INFO  (TEST-CustomCollectionTest.test-seed#[A39F920AC40DF4A8]) [    ] o.e.j.s.ServerConnector Started ServerConnector@5f9a5d{HTTP/1.1}{127.0.0.1:54197}
   [junit4]   2> 1323601 INFO  (TEST-CustomCollectionTest.test-seed#[A39F920AC40DF4A8]) [    ] o.e.j.s.Server Started @1325122ms
   [junit4]   2> 1323601 INFO  (TEST-CustomCollectionTest.test-seed#[A39F920AC40DF4A8]) [    ] o.a.s.c.s.e.JettySolrRunner Jetty properties: {solr.data.dir=/home/jenkins/workspace/Lucene-Solr-5.x-Linux/solr/build/solr-core/test/J2/temp/solr.cloud.CustomCollectionTest_A39F920AC40DF4A8-001/tempDir-001/control/data, hostContext=/, hostPort=54197, coreRootDirectory=/home/jenkins/workspace/Lucene-Solr-5.x-Linux/solr/build/solr-core/test/J2/temp/solr.cloud.CustomCollectionTest_A39F920AC40DF4A8-001/control-001/cores}
   [junit4]   2> 1323601 INFO  (TEST-CustomCollectionTest.test-seed#[A39F920AC40DF4A8]) [    ] o.a.s.s.SolrDispatchFilter SolrDispatchFilter.init(): sun.misc.Launcher$AppClassLoader@1eb6432
   [junit4]   2> 1323601 INFO  (TEST-CustomCollectionTest.test-seed#[A39F920AC40DF4A8]) [    ] o.a.s.c.SolrResourceLoader new SolrResourceLoader for directory: '/home/jenkins/workspace/Lucene-Solr-5.x-Linux/solr/build/solr-core/test/J2/temp/solr.cloud.CustomCollectionTest_A39F920AC40DF4A8-001/control-001'
   [junit4]   2> 1323601 INFO  (TEST-CustomCollectionTest.test-seed#[A39F920AC40DF4A8]) [    ] o.a.s.c.SolrResourceLoader JNDI not configured for solr (NoInitialContextEx)
   [junit4]   2> 1323601 INFO  (TEST-CustomCollectionTest.test-seed#[A39F920AC40DF4A8]) [    ] o.a.s.c.SolrResourceLoader solr home defaulted to 'solr/' (could not find system property or JNDI)
   [junit4]   2> 1323602 INFO  (TEST-CustomCollectionTest.test-seed#[A39F920AC40DF4A8]) [    ] o.a.s.c.c.SolrZkClient Using default ZkCredentialsProvider
   [junit4]   2> 1323602 INFO  (TEST-CustomCollectionTest.test-seed#[A39F920AC40DF4A8]) [    ] o.a.s.c.c.ConnectionManager Waiting for client to connect to ZooKeeper
   [junit4]   2> 1323603 INFO  (zkCallback-1735-thread-1) [    ] o.a.s.c.c.ConnectionManager Watcher org.apache.solr.common.cloud.ConnectionManager@adf8ce name:ZooKeeperConnection Watcher:127.0.0.1:33630/solr got event WatchedEvent state:SyncConnected type:None path:null path:null type:None
   [junit4]   2> 1323603 INFO  (TEST-CustomCollectionTest.test-seed#[A39F920AC40DF4A8]) [    ] o.a.s.c.c.ConnectionManager Client is connected to ZooKeeper
   [junit4]   2> 1323604 INFO  (TEST-CustomCollectionTest.test-seed#[A39F920AC40DF4A8]) [    ] o.a.s.c.c.SolrZkClient Using default ZkACLProvider
   [junit4]   2> 1323604 INFO  (TEST-CustomCollectionTest.test-seed#[A39F920AC40DF4A8]) [    ] o.a.s.s.SolrDispatchFilter Loading solr.xml from SolrHome (not found in ZooKeeper)
   [junit4]   2> 1323604 INFO  (TEST-CustomCollectionTest.test-seed#[A39F920AC40DF4A8]) [    ] o.a.s.c.SolrXmlConfig Loading container configuration from /home/jenkins/workspace/Lucene-Solr-5.x-Linux/solr/build/solr-core/test/J2/temp/solr.cloud.CustomCollectionTest_A39F920AC40DF4A8-001/control-001/solr.xml
   [junit4]   2> 1323609 INFO  (TEST-CustomCollectionTest.test-seed#[A39F920AC40DF4A8]) [    ] o.a.s.c.CorePropertiesLocator Config-defined core root directory: /home/jenkins/workspace/Lucene-Solr-5.x-Linux/solr/build/solr-core/test/J2/temp/solr.cloud.CustomCollectionTest_A39F920AC40DF4A8-001/control-001/cores
   [junit4]   2> 1323609 INFO  (TEST-CustomCollectionTest.test-seed#[A39F920AC40DF4A8]) [    ] o.a.s.c.CoreContainer New CoreContainer 18613757
   [junit4]   2> 1323609 INFO  (TEST-CustomCollectionTest.test-seed#[A39F920AC40DF4A8]) [    ] o.a.s.c.CoreContainer Loading cores into CoreContainer [instanceDir=/home/jenkins/workspace/Lucene-Solr-5.x-Linux/solr/build/solr-core/test/J2/temp/solr.cloud.CustomCollectionTest_A39F920AC40DF4A8-001/control-001]
   [junit4]   2> 1323609 WARN  (TEST-CustomCollectionTest.test-seed#[A39F920AC40DF4A8]) [    ] o.a.s.c.CoreContainer Couldn't add files from /home/jenkins/workspace/Lucene-Solr-5.x-Linux/solr/build/solr-core/test/J2/temp/solr.cloud.CustomCollectionTest_A39F920AC40DF4A8-001/control-001/lib to classpath: /home/jenkins/workspace/Lucene-Solr-5.x-Linux/solr/build/solr-core/test/J2/temp/solr.cloud.CustomCollectionTest_A39F920AC40DF4A8-001/control-001/lib
   [junit4]   2> 1323610 INFO  (TEST-CustomCollectionTest.test-seed#[A39F920AC40DF4A8]) [    ] o.a.s.h.c.HttpShardHandlerFactory created with socketTimeout : 90000,urlScheme : ,connTimeout : 15000,maxConnectionsPerHost : 20,maxConnections : 10000,corePoolSize : 0,maximumPoolSize : 2147483647,maxThreadIdleTime : 5,sizeOfQueue : -1,fairnessPolicy : false,useRetries : false,
   [junit4]   2> 1323611 INFO  (TEST-CustomCollectionTest.test-seed#[A39F920AC40DF4A8]) [    ] o.a.s.u.UpdateShardHandler Creating UpdateShardHandler HTTP client with params: socketTimeout=340000&connTimeout=45000&retry=true
   [junit4]   2> 1323612 INFO  (TEST-CustomCollectionTest.test-seed#[A39F920AC40DF4A8]) [    ] o.a.s.l.LogWatcher SLF4J impl is org.slf4j.impl.Log4jLoggerFactory
   [junit4]   2> 1323612 INFO  (TEST-CustomCollectionTest.test-seed#[A39F920AC40DF4A8]) [    ] o.a.s.l.LogWatcher Registering Log Listener [Log4j (org.slf4j.impl.Log4jLoggerFactory)]
   [junit4]   2> 1323612 INFO  (TEST-CustomCollectionTest.test-seed#[A39F920AC40DF4A8]) [    ] o.a.s.c.ZkContainer Zookeeper client=127.0.0.1:33630/solr
   [junit4]   2> 1323612 INFO  (TEST-CustomCollectionTest.test-seed#[A39F920AC40DF4A8]) [    ] o.a.s.c.ZkController zkHost includes chroot
   [junit4]   2> 1323612 INFO  (TEST-CustomCollectionTest.test-seed#[A39F920AC40DF4A8]) [    ] o.a.s.c.c.SolrZkClient Using default ZkCredentialsProvider
   [junit4]   2> 1323612 INFO  (TEST-CustomCollectionTest.test-seed#[A39F920AC40DF4A8]) [    ] o.a.s.c.c.ConnectionManager Waiting for client to connect to ZooKeeper
   [junit4]   2> 1323613 INFO  (zkCallback-1737-thread-1) [    ] o.a.s.c.c.ConnectionManager Watcher org.apache.solr.common.cloud.ConnectionManager@8c734f name:ZooKeeperConnection Watcher:127.0.0.1:33630 got event WatchedEvent state:SyncConnected type:None path:null path:null type:None
   [junit4]   2> 1323613 INFO  (TEST-CustomCollectionTest.test-seed#[A39F920AC40DF4A8]) [    ] o.a.s.c.c.ConnectionManager Client is connected to ZooKeeper
   [junit4]   2> 1323614 INFO  (TEST-CustomCollectionTest.test-seed#[A39F920AC40DF4A8]) [    ] o.a.s.c.c.SolrZkClient Using default ZkACLProvider
   [junit4]   2> 1323615 INFO  (TEST-CustomCollectionTest.test-seed#[A39F920AC40DF4A8]) [    ] o.a.s.c.c.ConnectionManager Waiting for client to connect to ZooKeeper
   [junit4]   2> 1323615 INFO  (zkCallback-1738-thread-1) [    ] o.a.s.c.c.ConnectionManager Watcher org.apache.solr.common.cloud.ConnectionManager@1287cb name:ZooKeeperConnection Watcher:127.0.0.1:33630/solr got event WatchedEvent state:SyncConnected type:None path:null path:null type:None
   [junit4]   2> 1323616 INFO  (TEST-CustomCollectionTest.test-seed#[A39F920AC40DF4A8]) [    ] o.a.s.c.c.ConnectionManager Client is connected to ZooKeeper
   [junit4]   2> 1323616 INFO  (TEST-CustomCollectionTest.test-seed#[A39F920AC40DF4A8]) [    ] o.a.s.c.c.SolrZkClient makePath: /overseer/queue
   [junit4]   2> 1323617 INFO  (TEST-CustomCollectionTest.test-seed#[A39F920AC40DF4A8]) [    ] o.a.s.c.c.SolrZkClient makePath: /overseer/collection-queue-work
   [junit4]   2> 1323619 INFO  (TEST-CustomCollectionTest.test-seed#[A39F920AC40DF4A8]) [    ] o.a.s.c.c.SolrZkClient makePath: /overseer/collection-map-running
   [junit4]   2> 1323620 INFO  (TEST-CustomCollectionTest.test-seed#[A39F920AC40DF4A8]) [    ] o.a.s.c.c.SolrZkClient makePath: /overseer/collection-map-completed
   [junit4]   2> 1323621 INFO  (TEST-CustomCollectionTest.test-seed#[A39F920AC40DF4A8]) [    ] o.a.s.c.c.SolrZkClient makePath: /overseer/collection-map-failure
   [junit4]   2> 1323623 INFO  (TEST-CustomCollectionTest.test-seed#[A39F920AC40DF4A8]) [    ] o.a.s.c.c.SolrZkClient makePath: /live_nodes
   [junit4]   2> 1323624 INFO  (TEST-CustomCollectionTest.test-seed#[A39F920AC40DF4A8]) [    ] o.a.s.c.c.SolrZkClient makePath: /aliases.json
   [junit4]   2> 1323625 INFO  (TEST-CustomCollectionTest.test-seed#[A39F920AC40DF4A8]) [    ] o.a.s.c.c.SolrZkClient makePath: /clusterstate.json
   [junit4]   2> 1323626 INFO  (TEST-CustomCollectionTest.test-seed#[A39F920AC40DF4A8]) [    ] o.a.s.c.c.SolrZkClient makePath: /security.json
   [junit4]   2> 1323626 INFO  (TEST-CustomCollectionTest.test-seed#[A39F920AC40DF4A8]) [    ] o.a.s.c.ZkController Register node as live in ZooKeeper:/live_nodes/127.0.0.1:54197_
   [junit4]   2> 1323627 INFO  (TEST-CustomCollectionTest.test-seed#[A39F920AC40DF4A8]) [    ] o.a.s.c.c.SolrZkClient makePath: /live_nodes/127.0.0.1:54197_
   [junit4]   2> 1323628 INFO  (TEST-CustomCollectionTest.test-seed#[A39F920AC40DF4A8]) [    ] o.a.s.c.c.SolrZkClient makePath: /overseer_elect
   [junit4]   2> 1323628 INFO  (TEST-CustomCollectionTest.test-seed#[A39F920AC40DF4A8]) [    ] o.a.s.c.c.SolrZkClient makePath: /overseer_elect/election
   [junit4]   2> 1323629 INFO  (TEST-CustomCollectionTest.test-seed#[A39F920AC40DF4A8]) [    ] o.a.s.c.Overseer Overseer (id=null) closing
   [junit4]   2> 1323629 INFO  (TEST-CustomCollectionTest.test-seed#[A39F920AC40DF4A8]) [    ] o.a.s.c.LeaderElector Joined leadership election with path: /overseer_elect/election/95185385176956932-127.0.0.1:54197_-n_0000000000
   [junit4]   2> 1323629 INFO  (TEST-CustomCollectionTest.test-seed#[A39F920AC40DF4A8]) [    ] o.a.s.c.OverseerElectionContext I am going to be the leader 127.0.0.1:54197_
   [junit4]   2> 1323630 INFO  (TEST-CustomCollectionTest.test-seed#[A39F920AC40DF4A8]) [    ] o.a.s.c.c.SolrZkClient makePath: /overseer_elect/leader
   [junit4]   2> 1323630 INFO  (TEST-CustomCollectionTest.test-seed#[A39F920AC40DF4A8]) [    ] o.a.s.c.Overseer Overseer (id=95185385176956932-127.0.0.1:54197_-n_0000000000) starting
   [junit4]   2> 1323631 INFO  (TEST-CustomCollectionTest.test-seed#[A39F920AC40DF4A8]) [    ] o.a.s.c.c.SolrZkClient makePath: /overseer/queue-work
   [junit4]   2> 1323635 INFO  (TEST-CustomCollectionTest.test-seed#[A39F920AC40DF4A8]) [    ] o.a.s.c.OverseerAutoReplicaFailoverThread Starting OverseerAutoReplicaFailoverThread autoReplicaFailoverWorkLoopDelay=10000 autoReplicaFailoverWaitAfterExpiration=10000 autoReplicaFailoverBadNodeExpiration=60000
   [junit4]   2> 1323635 INFO  (OverseerCollectionConfigSetProcessor-95185385176956932-127.0.0.1:54197_-n_0000000000) [    ] o.a.s.c.OverseerTaskProcessor Process current queue of overseer operations
   [junit4]   2> 1323635 INFO  (TEST-CustomCollectionTest.test-seed#[A39F920AC40DF4A8]) [    ] o.a.s.c.c.ZkStateReader Updating cluster state from ZooKeeper... 
   [junit4]   2> 1323636 INFO  (OverseerStateUpdate-95185385176956932-127.0.0.1:54197_-n_0000000000) [    ] o.a.s.c.Overseer Starting to work on the main queue
   [junit4]   2> 1323689 INFO  (TEST-CustomCollectionTest.test-seed#[A39F920AC40DF4A8]) [    ] o.a.s.c.CoreContainer Security conf doesn't exist. Skipping setup for authorization module.
   [junit4]   2> 1323689 INFO  (TEST-CustomCollectionTest.test-seed#[A39F920AC40DF4A8]) [    ] o.a.s.c.CoreContainer No authentication plugin used.
   [junit4]   2> 1323689 INFO  (TEST-CustomCollectionTest.test-seed#[A39F920AC40DF4A8]) [    ] o.a.s.c.CorePropertiesLocator Looking for core definitions underneath /home/jenkins/workspace/Lucene-Solr-5.x-Linux/solr/build/solr-core/test/J2/temp/solr.cloud.CustomCollectionTest_A39F920AC40DF4A8-001/control-001/cores
   [junit4]   2> 1323690 INFO  (TEST-CustomCollectionTest.test-seed#[A39F920AC40DF4A8]) [    ] o.a.s.c.CoreDescriptor Created CoreDescriptor: {name=collection1, config=solrconfig.xml, transient=false, schema=schema.xml, loadOnStartup=true, configSetProperties=configsetprops.json, collection=control_collection, coreNodeName=, dataDir=data/, shard=}
   [junit4]   2> 1323690 INFO  (TEST-CustomCollectionTest.test-seed#[A39F920AC40DF4A8]) [    ] o.a.s.c.CorePropertiesLocator Found core collection1 in /home/jenkins/workspace/Lucene-Solr-5.x-Linux/solr/build/solr-core/test/J2/temp/solr.cloud.CustomCollectionTest_A39F920AC40DF4A8-001/control-001/cores/collection1
   [junit4]   2> 1323690 INFO  (TEST-CustomCollectionTest.test-seed#[A39F920AC40DF4A8]) [    ] o.a.s.c.CorePropertiesLocator Found 1 core definitions
   [junit4]   2> 1323691 INFO  (TEST-CustomCollectionTest.test-seed#[A39F920AC40DF4A8]) [    ] o.a.s.s.SolrDispatchFilter user.dir=/home/jenkins/workspace/Lucene-Solr-5.x-Linux/solr/build/solr-core/test/J2
   [junit4]   2> 1323691 INFO  (TEST-CustomCollectionTest.test-seed#[A39F920AC40DF4A8]) [    ] o.a.s.s.SolrDispatchFilter SolrDispatchFilter.init() done
   [junit4]   2> 1323691 INFO  (coreLoadExecutor-5258-thread-1) [    ] o.a.s.c.ZkController publishing state=down
   [junit4]   2> 1323691 INFO  (coreLoadExecutor-5258-thread-1) [    ] o.a.s.c.ZkController numShards not found on descriptor - reading it from system property
   [junit4]   2> 1323692 INFO  (OverseerStateUpdate-95185385176956932-127.0.0.1:54197_-n_0000000000) [    ] o.a.s.c.Overseer processMessage: queueSize: 1, message = {
   [junit4]   2>   "core":"collection1",
   [junit4]   2>   "roles":null,
   [junit4]   2>   "base_url":"http://127.0.0.1:54197",
   [junit4]   2>   "node_name":"127.0.0.1:54197_",
   [junit4]   2>   "numShards":"1",
   [junit4]   2>   "state":"down",
   [junit4]   2>   "shard":null,
   [junit4]   2>   "collection":"control_collection",
   [junit4]   2>   "operation":"state"} current state version: 0
   [junit4]   2> 1323692 INFO  (coreLoadExecutor-5258-thread-1) [    ] o.a.s.c.ZkController look for our core node name
   [junit4]   2> 1323692 INFO  (OverseerStateUpdate-95185385176956932-127.0.0.1:54197_-n_0000000000) [    ] o.a.s.c.o.ReplicaMutator Update state numShards=1 message={
   [junit4]   2>   "core":"collection1",
   [junit4]   2>   "roles":null,
   [junit4]   2>   "base_url":"http://127.0.0.1:54197",
   [junit4]   2>   "node_name":"127.0.0.1:54197_",
   [junit4]   2>   "numShards":"1",
   [junit4]   2>   "state":"down",
   [junit4]   2>   "shard":null,
   [junit4]   2>   "collection":"control_collection",
   [junit4]   2>   "operation":"state"}
   [junit4]   2> 1323693 INFO  (OverseerStateUpdate-95185385176956932-127.0.0.1:54197_-n_0000000000) [    ] o.a.s.c.o.ClusterStateMutator building a new cName: control_collection
   [junit4]   2> 1323693 INFO  (OverseerStateUpdate-95185385176956932-127.0.0.1:54197_-n_0000000000) [    ] o.a.s.c.o.ReplicaMutator Assigning new node to shard shard=shard1
   [junit4]   2> 1323694 INFO  (zkCallback-1738-thread-1) [    ] o.a.s.c.c.ZkStateReader A cluster state change: [WatchedEvent state:SyncConnected type:NodeDataChanged path:/clusterstate.json], has occurred - updating... (live nodes size: [1])
   [junit4]   2> 1324692 INFO  (coreLoadExecutor-5258-thread-1) [    ] o.a.s.c.ZkController waiting to find shard id in clusterstate for collection1
   [junit4]   2> 1324693 INFO  (coreLoadExecutor-5258-thread-1) [    ] o.a.s.c.ZkController Check for collection zkNode:control_collection
   [junit4]   2> 1324693 INFO  (coreLoadExecutor-5258-thread-1) [    ] o.a.s.c.ZkController Collection zkNode exists
   [junit4]   2> 1324693 INFO  (coreLoadExecutor-5258-thread-1) [    ] o.a.s.c.c.ZkStateReader Load collection config from: [/collections/control_collection]
   [junit4]   2> 1324693 INFO  (coreLoadExecutor-5258-thread-1) [    ] o.a.s.c.c.ZkStateReader path=[/collections/control_collection] [configName]=[conf1] specified config exists in ZooKeeper
   [junit4]   2> 1324693 INFO  (coreLoadExecutor-5258-thread-1) [    ] o.a.s.c.SolrResourceLoader new SolrResourceLoader for directory: '/home/jenkins/workspace/Lucene-Solr-5.x-Linux/solr/build/solr-core/test/J2/temp/solr.cloud.CustomCollectionTest_A39F920AC40DF4A8-001/control-001/cores/collection1'
   [junit4]   2> 1324694 INFO  (coreLoadExecutor-5258-thread-1) [    ] o.a.s.c.SolrResourceLoader JNDI not configured for solr (NoInitialContextEx)
   [junit4]   2> 1324694 INFO  (coreLoadExecutor-5258-thread-1) [    ] o.a.s.c.SolrResourceLoader solr home defaulted to 'solr/' (could not find system property or JNDI)
   [junit4]   2> 1324695 INFO  (coreLoadExecutor-5258-thread-1) [    ] o.a.s.c.Config loaded config solrconfig.xml with version 0 
   [junit4]   2> 1324699 INFO  (coreLoadExecutor-5258-thread-1) [    ] o.a.s.c.SolrConfig current version of requestparams : -1
   [junit4]   2> 1324705 INFO  (coreLoadExecutor-5258-thread-1) [    ] o.a.s.c.SolrConfig Using Lucene MatchVersion: 5.5.0
   [junit4]   2> 1324725 INFO  (coreLoadExecutor-5258-thread-1) [    ] o.a.s.c.SolrConfig Loaded SolrConfig: solrconfig.xml
   [junit4]   2> 1324733 INFO  (coreLoadExecutor-5258-thread-1) [    ] o.a.s.s.IndexSchema [collection1] Schema name=test
   [junit4]   2> 1324816 INFO  (coreLoadExecutor-5258-thread-1) [    ] o.a.s.s.OpenExchangeRatesOrgProvider Initialized with rates=open-exchange-rates.json, refreshInterval=1440.
   [junit4]   2> 1324820 INFO  (coreLoadExecutor-5258-thread-1) [    ] o.a.s.s.IndexSchema default search field in schema is text
   [junit4]   2> 1324821 INFO  (coreLoadExecutor-5258-thread-1) [    ] o.a.s.s.IndexSchema unique key field: id
   [junit4]   2> 1324829 INFO  (coreLoadExecutor-5258-thread-1) [    ] o.a.s.s.FileExchangeRateProvider Reloading exchange rates from file currency.xml
   [junit4]   2> 1324831 INFO  (coreLoadExecutor-5258-thread-1) [    ] o.a.s.s.FileExchangeRateProvider Reloading exchange rates from file currency.xml
   [junit4]   2> 1324832 INFO  (coreLoadExecutor-5258-thread-1) [    ] o.a.s.s.OpenExchangeRatesOrgProvider Reloading exchange rates from open-exchange-rates.json
   [junit4]   2> 1324833 INFO  (coreLoadExecutor-5258-thread-1) [    ] o.a.s.s.OpenExchangeRatesOrgProvider Reloading exchange rates from open-exchange-rates.json
   [junit4]   2> 1324835 INFO  (coreLoadExecutor-5258-thread-1) [    ] o.a.s.c.ConfigSetProperties Did not find ConfigSet properties, assuming default properties: Can't find resource 'configsetprops.json' in classpath or '/configs/conf1', cwd=/home/jenkins/workspace/Lucene-Solr-5.x-Linux/solr/build/solr-core/test/J2
   [junit4]   2> 1324835 INFO  (coreLoadExecutor-5258-thread-1) [    ] o.a.s.c.CoreContainer Creating SolrCore 'collection1' using configuration from collection control_collection
   [junit4]   2> 1324835 INFO  (coreLoadExecutor-5258-thread-1) [    ] o.a.s.c.SolrCore org.apache.solr.core.MockDirectoryFactory
   [junit4]   2> 1324835 INFO  (coreLoadExecutor-5258-thread-1) [    ] o.a.s.c.SolrCore [[collection1] ] Opening new SolrCore at [/home/jenkins/workspace/Lucene-Solr-5.x-Linux/solr/build/solr-core/test/J2/temp/solr.cloud.CustomCollectionTest_A39F920AC40DF4A8-001/control-001/cores/collection1], dataDir=[/home/jenkins/workspace/Lucene-Solr-5.x-Linux/solr/build/solr-core/test/J2/temp/solr.cloud.CustomCollectionTest_A39F920AC40DF4A8-001/control-001/cores/collection1/data/]
   [junit4]   2> 1324836 INFO  (coreLoadExecutor-5258-thread-1) [    ] o.a.s.c.JmxMonitoredMap JMX monitoring is enabled. Adding Solr mbeans to JMX Server: com.sun.jmx.mbeanserver.JmxMBeanServer@2f158e
   [junit4]   2> 1324836 INFO  (coreLoadExecutor-5258-thread-1) [    ] o.a.s.c.CachingDirectoryFactory return new directory for /home/jenkins/workspace/Lucene-Solr-5.x-Linux/solr/build/solr-core/test/J2/temp/solr.cloud.CustomCollectionTest_A39F920AC40DF4A8-001/control-001/cores/collection1/data
   [junit4]   2> 1324836 INFO  (coreLoadExecutor-5258-thread-1) [    ] o.a.s.c.SolrCore New index directory detected: old=null new=/home/jenkins/workspace/Lucene-Solr-5.x-Linux/solr/build/solr-core/test/J2/temp/solr.cloud.CustomCollectionTest_A39F920AC40DF4A8-001/control-001/cores/collection1/data/index/
   [junit4]   2> 1324836 WARN  (coreLoadExecutor-5258-thread-1) [    ] o.a.s.c.SolrCore [collection1] Solr index directory '/home/jenkins/workspace/Lucene-Solr-5.x-Linux/solr/build/solr-core/test/J2/temp/solr.cloud.CustomCollectionTest_A39F920AC40DF4A8-001/control-001/cores/collection1/data/index' doesn't exist. Creating new index...
   [junit4]   2> 1324837 INFO  (coreLoadExecutor-5258-thread-1) [    ] o.a.s.c.CachingDirectoryFactory return new directory for /home/jenkins/workspace/Lucene-Solr-5.x-Linux/solr/build/solr-core/test/J2/temp/solr.cloud.CustomCollectionTest_A39F920AC40DF4A8-001/control-001/cores/collection1/data/index
   [junit4]   2> 1324837 INFO  (coreLoadExecutor-5258-thread-1) [    ] o.a.s.u.RandomMergePolicy RandomMergePolicy wrapping class org.apache.lucene.index.AlcoholicMergePolicy: [AlcoholicMergePolicy: minMergeSize=0, mergeFactor=10, maxMergeSize=198136085, maxMergeSizeForForcedMerge=9223372036854775807, calibrateSizeByDeletes=true, maxMergeDocs=2147483647, maxCFSSegmentSizeMB=8.796093022207999E12, noCFSRatio=0.1]
   [junit4]   2> 1324837 INFO  (coreLoadExecutor-5258-thread-1) [    ] o.a.s.c.SolrDeletionPolicy SolrDeletionPolicy.onCommit: commits: num=1
   [junit4]   2> 	commit{dir=MockDirectoryWrapper(RAMDirectory@1164c24 lockFactory=org.apache.lucene.store.SingleInstanceLockFactory@17ffa2b),segFN=segments_1,generation=1}
   [junit4]   2> 1324837 INFO  (coreLoadExecutor-5258-thread-1) [    ] o.a.s.c.SolrDeletionPolicy newest commit generation = 1
   [junit4]   2> 1324838 INFO  (OldIndexDirectoryCleanupThreadForCore-collection1) [    ] o.a.s.c.SolrCore Looking for old index directories to cleanup for core collection1 in /home/jenkins/workspace/Lucene-Solr-5.x-Linux/solr/build/solr-core/test/J2/temp/solr.cloud.CustomCollectionTest_A39F920AC40DF4A8-001/control-001/cores/collection1/data/
   [junit4]   2> 1324838 WARN  (OldIndexDirectoryCleanupThreadForCore-collection1) [    ] o.a.s.c.DirectoryFactory /home/jenkins/workspace/Lucene-Solr-5.x-Linux/solr/build/solr-core/test/J2/temp/solr.cloud.CustomCollectionTest_A39F920AC40DF4A8-001/control-001/cores/collection1/data/ does not point to a valid data directory; skipping clean-up of old index directories.
   [junit4]   2> 1324840 INFO  (coreLoadExecutor-5258-thread-1) [    ] o.a.s.u.p.UpdateRequestProcessorChain creating updateRequestProcessorChain "nodistrib"
   [junit4]   2> 1324840 INFO  (coreLoadExecutor-5258-thread-1) [    ] o.a.s.u.p.UpdateRequestProcessorChain creating updateRequestProcessorChain "dedupe"
   [junit4]   2> 1324840 INFO  (coreLoadExecutor-5258-thread-1) [    ] o.a.s.u.p.UpdateRequestProcessorChain inserting DistributedUpdateProcessorFactory into updateRequestProcessorChain "dedupe"
   [junit4]   2> 1324841 INFO  (coreLoadExecutor-5258-thread-1) [    ] o.a.s.u.p.UpdateRequestProcessorChain creating updateRequestProcessorChain "stored_sig"
   [junit4]   2> 1324841 INFO  (coreLoadExecutor-5258-thread-1) [    ] o.a.s.u.p.UpdateRequestProcessorChain inserting DistributedUpdateProcessorFactory into updateRequestProcessorChain "stored_sig"
   [junit4]   2> 1324841 INFO  (coreLoadExecutor-5258-thread-1) [    ] o.a.s.u.p.UpdateRequestProcessorChain creating updateRequestProcessorChain "distrib-dup-test-chain-explicit"
   [junit4]   2> 1324841 INFO  (coreLoadExecutor-5258-thread-1) [    ] o.a.s.u.p.UpdateRequestProcessorChain creating updateRequestProcessorChain "distrib-dup-test-chain-implicit"
   [junit4]   2> 1324841 INFO  (coreLoadExecutor-5258-thread-1) [    ] o.a.s.u.p.UpdateRequestProcessorChain inserting DistributedUpdateProcessorFactory into updateRequestProcessorChain "distrib-dup-test-chain-implicit"
   [junit4]   2> 1324841 INFO  (coreLoadExecutor-5258-thread-1) [    ] o.a.s.c.SolrCore no updateRequestProcessorChain defined as default, creating implicit default
   [junit4]   2> 1324841 WARN  (coreLoadExecutor-5258-thread-1) [    ] o.a.s.c.RequestHandlers INVALID paramSet a in requestHandler {type = requestHandler,name = /dump,class = DumpRequestHandler,args = {defaults={a=A,b=B}}}
   [junit4]   2> 1324843 INFO  (coreLoadExecutor-5258-thread-1) [    ] o.a.s.h.l.XMLLoader xsltCacheLifetimeSeconds=60
   [junit4]   2> 1324843 INFO  (coreLoadExecutor-5258-thread-1) [    ] o.a.s.h.l.XMLLoader xsltCacheLifetimeSeconds=60
   [junit4]   2> 1324844 INFO  (coreLoadExecutor-5258-thread-1) [    ] o.a.s.h.l.XMLLoader xsltCacheLifetimeSeconds=60
   [junit4]   2> 1324845 INFO  (coreLoadExecutor-5258-thread-1) [    ] o.a.s.h.l.XMLLoader xsltCacheLifetimeSeconds=60
   [junit4]   2> 1324848 INFO  (coreLoadExecutor-5258-thread-1) [    ] o.a.s.c.RequestHandlers Registered paths: /admin/mbeans,standard,/dump,/update/csv,/update/json/docs,/admin/luke,/admin/segments,/get,/admin/system,/replication,/admin/properties,/config,/schema,/admin/plugins,/admin/logging,/update/json,/admin/threads,/admin/ping,/update,/admin/file
   [junit4]   2> 1324848 INFO  (coreLoadExecutor-5258-thread-1) [    ] o.a.s.c.SolrCore Using default statsCache cache: org.apache.solr.search.stats.LocalStatsCache
   [junit4]   2> 1324849 INFO  (coreLoadExecutor-5258-thread-1) [    ] o.a.s.u.UpdateHandler Using UpdateLog implementation: org.apache.solr.update.UpdateLog
   [junit4]   2> 1324849 INFO  (coreLoadExecutor-5258-thread-1) [    ] o.a.s.u.UpdateLog Initializing UpdateLog: dataDir= defaultSyncLevel=FLUSH numRecordsToKeep=100 maxNumLogsToKeep=10 numVersionBuckets=65536
   [junit4]   2> 1324849 INFO  (coreLoadExecutor-5258-thread-1) [    ] o.a.s.u.CommitTracker Hard AutoCommit: disabled
   [junit4]   2> 1324850 INFO  (coreLoadExecutor-5258-thread-1) [    ] o.a.s.u.CommitTracker Soft AutoCommit: disabled
   [junit4]   2> 1324850 INFO  (coreLoadExecutor-5258-thread-1) [    ] o.a.s.u.RandomMergePolicy RandomMergePolicy wrapping class org.apache.lucene.index.LogByteSizeMergePolicy: [LogByteSizeMergePolicy: minMergeSize=1677721, mergeFactor=35, maxMergeSize=2147483648, maxMergeSizeForForcedMerge=9223372036854775807, calibrateSizeByDeletes=true, maxMergeDocs=2147483647, maxCFSSegmentSizeMB=8.796093022207999E12, noCFSRatio=0.46072694133802383]
   [junit4]   2> 1324850 INFO  (coreLoadExecutor-5258-thread-1) [    ] o.a.s.c.SolrDeletionPolicy SolrDeletionPolicy.onInit: commits: num=1
   [junit4]   2> 	commit{dir=MockDirectoryWrapper(RAMDirectory@1164c24 lockFactory=org.apache.lucene.store.SingleInstanceLockFactory@17ffa2b),segFN=segments_1,generation=1}
   [junit4]   2> 1324850 INFO  (coreLoadExecutor-5258-thread-1) [    ] o.a.s.c.SolrDeletionPolicy newest commit generation = 1
   [junit4]   2> 1324850 INFO  (coreLoadExecutor-5258-thread-1) [    ] o.a.s.s.SolrIndexSearcher Opening Searcher@d3ace4[collection1] main
   [junit4]   2> 1324851 INFO  (coreLoadExecutor-5258-thread-1) [    ] o.a.s.c.c.ZkStateReader Load collection config from: [/collections/control_collection]
   [junit4]   2> 1324851 INFO  (coreLoadExecutor-5258-thread-1) [    ] o.a.s.c.c.ZkStateReader path=[/collections/control_collection] [configName]=[conf1] specified config exists in ZooKeeper
   [junit4]   2> 1324851 INFO  (coreLoadExecutor-5258-thread-1) [    ] o.a.s.r.ManagedResourceStorage Setting up ZooKeeper-based storage for the RestManager with znodeBase: /configs/conf1
   [junit4]   2> 1324851 INFO  (coreLoadExecutor-5258-thread-1) [    ] o.a.s.r.ManagedResourceStorage Configured ZooKeeperStorageIO with znodeBase: /configs/conf1
   [junit4]   2> 1324851 INFO  (coreLoadExecutor-5258-thread-1) [    ] o.a.s.r.RestManager Initializing RestManager with initArgs: {}
   [junit4]   2> 1324851 INFO  (coreLoadExecutor-5258-thread-1) [    ] o.a.s.r.ManagedResourceStorage Reading _rest_managed.json using ZooKeeperStorageIO:path=/configs/conf1
   [junit4]   2> 1324852 INFO  (coreLoadExecutor-5258-thread-1) [    ] o.a.s.r.ManagedResourceStorage No data found for znode /configs/conf1/_rest_managed.json
   [junit4]   2> 1324852 INFO  (coreLoadExecutor-5258-thread-1) [    ] o.a.s.r.ManagedResourceStorage Loaded null at path _rest_managed.json using ZooKeeperStorageIO:path=/configs/conf1
   [junit4]   2> 1324852 INFO  (coreLoadExecutor-5258-thread-1) [    ] o.a.s.r.RestManager Initializing 0 registered ManagedResources
   [junit4]   2> 1324852 INFO  (coreLoadExecutor-5258-thread-1) [    ] o.a.s.h.ReplicationHandler Commits will be reserved for  10000
   [junit4]   2> 1324852 INFO  (searcherExecutor-5259-thread-1) [    ] o.a.s.c.SolrCore [collection1] Registered new searcher Searcher@d3ace4[collection1] main{ExitableDirectoryReader(UninvertingDirectoryReader())}
   [junit4]   2> 1324852 INFO  (coreLoadExecutor-5258-thread-1) [    ] o.a.s.u.UpdateLog Looking up max value of version field to seed version buckets
   [junit4]   2> 1324852 INFO  (coreLoadExecutor-5258-thread-1) [    ] o.a.s.u.VersionInfo Refreshing highest value of _version_ for 65536 version buckets from index
   [junit4]   2> 1324852 INFO  (coreLoadExecutor-5258-thread-1) [    ] o.a.s.u.VersionInfo No terms found for _version_, cannot seed version bucket highest value from index
   [junit4]   2> 1324852 INFO  (coreLoadExecutor-5258-thread-1) [    ] o.a.s.u.UpdateLog Could not find max version in index or recent updates, using new clock 1522966164367474688
   [junit4]   2> 1324854 INFO  (coreLoadExecutor-5258-thread-1) [    ] o.a.s.u.UpdateLog Took 1.0ms to seed version buckets with highest version 1522966164367474688
   [junit4]   2> 1324854 INFO  (coreLoadExecutor-5258-thread-1) [    ] o.a.s.c.ZkController watch zkdir /configs/conf1
   [junit4]   2> 1324854 INFO  (coreLoadExecutor-5258-thread-1) [    ] o.a.s.c.CoreContainer registering core: collection1
   [junit4]   2> 1324855 INFO  (coreZkRegister-5252-thread-1) [    ] o.a.s.c.ZkController Register replica - core:collection1 address:http://127.0.0.1:54197 collection:control_collection shard:shard1
   [junit4]   2> 1324855 INFO  (coreZkRegister-5252-thread-1) [    ] o.a.s.c.c.SolrZkClient makePath: /collections/control_collection/leader_elect/shard1/election
   [junit4]   2> 1324857 INFO  (coreZkRegister-5252-thread-1) [    ] o.a.s.c.LeaderElector Joined leadership election with path: /collections/control_collection/leader_elect/shard1/election/95185385176956932-core_node1-n_0000000000
   [junit4]   2> 1324857 INFO  (coreZkRegister-5252-thread-1) [    ] o.a.s.c.ShardLeaderElectionContext Running the leader process for shard=shard1 and weAreReplacement=false and leaderVoteWait=180000
   [junit4]   2> 1324858 INFO  (coreZkRegister-5252-thread-1) [    ] o.a.s.c.ShardLeaderElectionContext Enough replicas found to continue.
   [junit4]   2> 1324858 INFO  (coreZkRegister-5252-thread-1) [    ] o.a.s.c.ShardLeaderElectionContext I may be the new leader - try and sync
   [junit4]   2> 1324858 INFO  (coreZkRegister-5252-thread-1) [    ] o.a.s.c.SyncStrategy Sync replicas to http://127.0.0.1:54197/collection1/
   [junit4]   2> 1324858 INFO  (OverseerStateUpdate-95185385176956932-127.0.0.1:54197_-n_0000000000) [    ] o.a.s.c.Overseer processMessage: queueSize: 1, message = {
   [junit4]   2>   "operation":"leader",
   [junit4]   2>   "shard":"shard1",
   [junit4]   2>   "collection":"control_collection"} current state version: 1
   [junit4]   2> 1324858 INFO  (coreZkRegister-5252-thread-1) [    ] o.a.s.c.SyncStrategy Sync Success - now sync replicas to me
   [junit4]   2> 1324859 INFO  (coreZkRegister-5252-thread-1) [    ] o.a.s.c.SyncStrategy http://127.0.0.1:54197/collection1/ has no replicas
   [junit4]   2> 1324859 INFO  (coreZkRegister-5252-thread-1) [    ] o.a.s.c.c.SolrZkClient makePath: /collections/control_collection/leaders/shard1
   [junit4]   2> 1324860 INFO  (coreZkRegister-5252-thread-1) [    ] o.a.s.c.ShardLeaderElectionContextBase Creating leader registration node
   [junit4]   2> 1324862 INFO  (coreZkRegister-5252-thread-1) [    ] o.a.s.c.ShardLeaderElectionContext I am the new leader: http://127.0.0.1:54197/collection1/ shard1
   [junit4]   2> 1324862 INFO  (OverseerStateUpdate-95185385176956932-127.0.0.1:54197_-n_0000000000) [    ] o.a.s.c.Overseer processMessage: queueSize: 1, message = {
   [junit4]   2>   "operation":"leader",
   [junit4]   2>   "shard":"shard1",
   [junit4]   2>   "collection":"control_collection",
   [junit4]   2>   "base_url":"http://127.0.0.1:54197",
   [junit4]   2>   "core":"collection1",
   [junit4]   2>   "state":"active"} current state version: 1
   [junit4]   2> 1324964 INFO  (zkCallback-1738-thread-1) [    ] o.a.s.c.c.ZkStateReader A cluster state change: [WatchedEvent state:SyncConnected type:NodeDataChanged path:/clusterstate.json], has occurred - updating... (live nodes size: [1])
   [junit4]   2> 1325013 INFO  (coreZkRegister-5252-thread-1) [    ] o.a.s.c.ZkController We are http://127.0.0.1:54197/collection1/ and leader is http://127.0.0.1:54197/collection1/
   [junit4]   2> 1325013 INFO  (coreZkRegister-5252-thread-1) [    ] o.a.s.c.ZkController No LogReplay needed for core=collection1 baseURL=http://127.0.0.1:54197
   [junit4]   2> 1325013 INFO  (coreZkRegister-5252-thread-1) [    ] o.a.s.c.ZkController I am the leader, no recovery necessary
   [junit4]   2> 1325013 INFO  (coreZkRegister-5252-thread-1) [    ] o.a.s.c.ZkController publishing state=active
   [junit4]   2> 1325013 INFO  (coreZkRegister-5252-thread-1) [    ] o.a.s.c.ZkController numShards not found on descriptor - reading it from system property
   [junit4]   2> 1325015 INFO  (OverseerStateUpdate-95185385176956932-127.0.0.1:54197_-n_0000000000) [    ] o.a.s.c.Overseer processMessage: queueSize: 1, message = {
   [junit4]   2>   "core":"collection1",
   [junit4]   2>   "core_node_name":"core_node1",
   [junit4]   2>   "roles":null,
   [junit4]   2>   "base_url":"http://127.0.0.1:54197",
   [junit4]   2>   "node_name":"127.0.0.1:54197_",
   [junit4]   2>   "numShards":"1",
   [junit4]   2>   "state":"active",
   [junit4]   2>   "shard":"shard1",
   [junit4]   2>   "collection":"control_collection",
   [junit4]   2>   "operation":"state"} current state version: 2
   [junit4]   2> 1325015 INFO  (OverseerStateUpdate-95185385176956932-127.0.0.1:54197_-n_0000000000) [    ] o.a.s.c.o.ReplicaMutator Update state numShards=1 message={
   [junit4]   2>   "core":"collection1",
   [junit4]   2>   "core_node_name":"core_node1",
   [junit4]   2>   "roles":null,
   [junit4]   2>   "base_url":"http://127.0.0.1:54197",
   [junit4]   2>   "node_name":"127.0.0.1:54197_",
   [junit4]   2>   "numShards":"1",
   [junit4]   2>   "state":"active",
   [junit4]   2>   "shard":"shard1",
   [junit4]   2>   "collection":"control_collection",
   [junit4]   2>   "operation":"state"}
   [junit4]   2> 1325117 INFO  (zkCallback-1738-thread-1) [    ] o.a.s.c.c.ZkStateReader A cluster state change: [WatchedEvent state:SyncConnected type:NodeDataChanged path:/clusterstate.json], has occurred - updating... (live nodes size: [1])
   [junit4]   2> 1325192 INFO  (TEST-CustomCollectionTest.test-seed#[A39F920AC40DF4A8]) [    ] o.a.s.c.c.SolrZkClient Using default ZkCredentialsProvider
   [junit4]   2> 1325193 INFO  (TEST-CustomCollectionTest.test-seed#[A39F920AC40DF4A8]) [    ] o.a.s.c.c.ConnectionManager Waiting for client to connect to ZooKeeper
   [junit4]   2> 1325194 INFO  (zkCallback-1740-thread-1) [    ] o.a.s.c.c.ConnectionManager Watcher org.apache.solr.common.cloud.ConnectionManager@1993206 name:ZooKeeperConnection Watcher:127.0.0.1:33630/solr got event WatchedEvent state:SyncConnected type:None path:null path:null type:None
   [junit4]   2> 1325195 INFO  (TEST-CustomCollectionTest.test-seed#[A39F920AC40DF4A8]) [    ] o.a.s.c.c.ConnectionManager Client is connected to ZooKeeper
   [junit4]   2> 1325195 INFO  (TEST-CustomCollectionTest.test-seed#[A39F920AC40DF4A8]) [    ] o.a.s.c.c.SolrZkClient Using default ZkACLProvider
   [junit4]   2> 1325195 INFO  (TEST-CustomCollectionTest.test-seed#[A39F920AC40DF4A8]) [    ] o.a.s.c.c.ZkStateReader Updating cluster state from ZooKeeper... 
   [junit4]   2> 1325197 INFO  (TEST-CustomCollectionTest.test-seed#[A39F920AC40DF4A8]) [    ] o.a.s.c.ChaosMonkey monkey: init - expire sessions:false cause connection loss:false
   [junit4]   2> 1325267 INFO  (TEST-CustomCollectionTest.test-seed#[A39F920AC40DF4A8]) [    ] o.a.s.SolrTestCaseJ4 Writing core.properties file to /home/jenkins/workspace/Lucene-Solr-5.x-Linux/solr/build/solr-core/test/J2/temp/solr.cloud.CustomCollectionTest_A39F920AC40DF4A8-001/shard-1-001/cores/collection1
   [junit4]   2> 1325268 INFO  (TEST-CustomCollectionTest.test-seed#[A39F920AC40DF4A8]) [    ] o.a.s.c.AbstractFullDistribZkTestBase create jetty 1 in directory /home/jenkins/workspace/Lucene-Solr-5.x-Linux/solr/build/solr-core/test/J2/temp/solr.cloud.CustomCollectionTest_A39F920AC40DF4A8-001/shard-1-001
   [junit4]   2> 1325268 INFO  (TEST-CustomCollectionTest.test-seed#[A39F920AC40DF4A8]) [    ] o.e.j.s.Server jetty-9.2.13.v20150730
   [junit4]   2> 1325269 INFO  (TEST-CustomCollectionTest.test-seed#[A39F920AC40DF4A8]) [    ] o.e.j.s.h.ContextHandler Started o.e.j.s.ServletContextHandler@9c7641{/,null,AVAILABLE}
   [junit4]   2> 1325270 INFO  (TEST-CustomCollectionTest.test-seed#[A39F920AC40DF4A8]) [    ] o.e.j.s.ServerConnector Started ServerConnector@1f14d86{HTTP/1.1}{127.0.0.1:46044}
   [junit4]   2> 1325270 INFO  (TEST-CustomCollectionTest.test-seed#[A39F920AC40DF4A8]) [    ] o.e.j.s.Server Started @1326791ms
   [junit4]   2> 1325270 INFO  (TEST-CustomCollectionTest.test-seed#[A39F920AC40DF4A8]) [    ] o.a.s.c.s.e.JettySolrRunner Jetty properties: {solr.data.dir=/home/jenkins/workspace/Lucene-Solr-5.x-Linux/solr/build/solr-core/test/J2/temp/solr.cloud.CustomCollectionTest_A39F920AC40DF4A8-001/tempDir-001/jetty1, solrconfig=solrconfig.xml, hostContext=/, hostPort=46044, coreRootDirectory=/home/jenkins/workspace/Lucene-Solr-5.x-Linux/solr/build/solr-core/test/J2/../../../../../../../../../home/jenkins/workspace/Lucene-Solr-5.x-Linux/solr/build/solr-core/test/J2/temp/solr.cloud.CustomCollectionTest_A39F920AC40DF4A8-001/shard-1-001/cores}
   [junit4]   2> 1325271 INFO  (TEST-CustomCollectionTest.test-seed#[A39F920AC40DF4A8]) [    ] o.a.s.s.SolrDispatchFilter SolrDispatchFilter.init(): sun.misc.Launcher$AppClassLoader@1eb6432
   [junit4]   2> 1325271 INFO  (TEST-CustomCollectionTest.test-seed#[A39F920AC40DF4A8]) [    ] o.a.s.c.SolrResourceLoader new SolrResourceLoader for directory: '/home/jenkins/workspace/Lucene-Solr-5.x-Linux/solr/build/solr-core/test/J2/temp/solr.cloud.CustomCollectionTest_A39F920AC40DF4A8-001/shard-1-001'
   [junit4]   2> 1325271 INFO  (TEST-CustomCollectionTest.test-seed#[A39F920AC40DF4A8]) [    ] o.a.s.c.SolrResourceLoader JNDI not configured for solr (NoInitialContextEx)
   [junit4]   2> 1325271 INFO  (TEST-CustomCollectionTest.test-seed#[A39F920AC40DF4A8]) [    ] o.a.s.c.SolrResourceLoader solr home defaulted to 'solr/' (could not find system property or JNDI)
   [junit4]   2> 1325271 INFO  (TEST-CustomCollectionTest.test-seed#[A39F920AC40DF4A8]) [    ] o.a.s.c.c.SolrZkClient Using default ZkCredentialsProvider
   [junit4]   2> 1325271 INFO  (TEST-CustomCollectionTest.test-seed#[A39F920AC40DF4A8]) [    ] o.a.s.c.c.ConnectionManager Waiting for client to connect to ZooKeeper
   [junit4]   2> 1325272 INFO  (zkCallback-1741-thread-1) [    ] o.a.s.c.c.ConnectionManager Watcher org.apache.solr.common.cloud.ConnectionManager@d0663b name:ZooKeeperConnection Watcher:127.0.0.1:33630/solr got event WatchedEvent state:SyncConnected type:None path:null path:null type:None
   [junit4]   2> 1325273 INFO  (TEST-CustomCollectionTest.test-seed#[A39F920AC40DF4A8]) [    ] o.a.s.c.c.ConnectionManager Client is connected to ZooKeeper
   [junit4]   2> 1325273 INFO  (TEST-CustomCollectionTest.test-seed#[A39F920AC40DF4A8]) [    ] o.a.s.c.c.SolrZkClient Using default ZkACLProvider
   [junit4]   2> 1325274 INFO  (TEST-CustomCollectionTest.test-seed#[A39F920AC40DF4A8]) [    ] o.a.s.s.SolrDispatchFilter Loading solr.xml from SolrHome (not found in ZooKeeper)
   [junit4]   2> 1325274 INFO  (TEST-CustomCollectionTest.test-seed#[A39F920AC40DF4A8]) [    ] o.a.s.c.SolrXmlConfig Loading container configuration from /home/jenkins/workspace/Lucene-Solr-5.x-Linux/solr/build/solr-core/test/J2/temp/solr.cloud.CustomCollectionTest_A39F920AC40DF4A8-001/shard-1-001/solr.xml
   [junit4]   2> 1325280 INFO  (TEST-CustomCollectionTest.test-seed#[A39F920AC40DF4A8]) [    ] o.a.s.c.CorePropertiesLocator Config-defined core root directory: /home/jenkins/workspace/Lucene-Solr-5.x-Linux/solr/build/solr-core/test/J2/../../../../../../../../../home/jenkins/workspace/Lucene-Solr-5.x-Linux/solr/build/solr-core/test/J2/temp/solr.cloud.CustomCollectionTest_A39F920AC40DF4A8-001/shard-1-001/cores
   [junit4]   2> 1325280 INFO  (TEST-CustomCollectionTest.test-seed#[A39F920AC40DF4A8]) [    ] o.a.s.c.CoreContainer New CoreContainer 10638508
   [junit4]   2> 1325280 INFO  (TEST-CustomCollectionTest.test-seed#[A39F920AC40DF4A8]) [    ] o.a.s.c.CoreContainer Loading cores into CoreContainer [instanceDir=/home/jenkins/workspace/Lucene-Solr-5.x-Linux/solr/build/solr-core/test/J2/temp/solr.cloud.CustomCollectionTest_A39F920AC40DF4A8-001/shard-1-001]
   [junit4]   2> 1325280 WARN  (TEST-CustomCollectionTest.test-seed#[A39F920AC40DF4A8]) [    ] o.a.s.c.CoreContainer Couldn't add files from /home/jenkins/workspace/Lucene-Solr-5.x-Linux/solr/build/solr-core/test/J2/temp/solr.cloud.CustomCollectionTest_A39F920AC40DF4A8-001/shard-1-001/lib to classpath: /home/jenkins/workspace/Lucene-Solr-5.x-Linux/solr/build/solr-core/test/J2/temp/solr.cloud.CustomCollectionTest_A39F920AC40DF4A8-001/shard-1-001/lib
   [junit4]   2> 1325280 INFO  (TEST-CustomCollectionTest.test-seed#[A39F920AC40DF4A8]) [    ] o.a.s.h.c.HttpShardHandlerFactory created with socketTimeout : 90000,urlScheme : ,connTimeout : 15000,maxConnectionsPerHost : 20,maxConnections : 10000,corePoolSize : 0,maximumPoolSize : 2147483647,maxThreadIdleTime : 5,sizeOfQueue : -1,fairnessPolicy : false,useRetries : false,
   [junit4]   2> 1325282 INFO  (TEST-CustomCollectionTest.test-seed#[A39F920AC40DF4A8]) [    ] o.a.s.u.UpdateShardHandler Creating UpdateShardHandler HTTP client with params: socketTimeout=340000&connTimeout=45000&retry=true
   [junit4]   2> 1325283 INFO  (TEST-CustomCollectionTest.test-seed#[A39F920AC40DF4A8]) [    ] o.a.s.l.LogWatcher SLF4J impl is org.slf4j.impl.Log4jLoggerFactory
   [junit4]   2> 1325283 INFO  (TEST-CustomCollectionTest.test-seed#[A39F920AC40DF4A8]) [    ] o.a.s.l.LogWatcher Registering Log Listener [Log4j (org.slf4j.impl.Log4jLoggerFactory)]
   [junit4]   2> 1325283 INFO  (TEST-CustomCollectionTest.test-seed#[A39F920AC40DF4A8]) [    ] o.a.s.c.ZkContainer Zookeeper client=127.0.0.1:33630/solr
   [junit4]   2> 1325283 INFO  (TEST-CustomCollectionTest.test-seed#[A39F920AC40DF4A8]) [    ] o.a.s.c.ZkController zkHost includes chroot
   [junit4]   2> 1325283 INFO  (TEST-CustomCollectionTest.test-seed#[A39F920AC40DF4A8]) [    ] o.a.s.c.c.SolrZkClient Using default ZkCredentialsProvider
   [junit4]   2> 1325283 INFO  (TEST-CustomCollectionTest.test-seed#[A39F920AC40DF4A8]) [    ] o.a.s.c.c.ConnectionManager Waiting for client to connect to ZooKeeper
   [junit4]   2> 1325284 INFO  (zkCallback-1743-thread-1) [    ] o.a.s.c.c.ConnectionManager Watcher org.apache.solr.common.cloud.ConnectionManager@19ae676 name:ZooKeeperConnection Watcher:127.0.0.1:33630 got event WatchedEvent state:SyncConnected type:None path:null path:null type:None
   [junit4]   2> 1325284 INFO  (TEST-CustomCollectionTest.test-seed#[A39F920AC40DF4A8]) [    ] o.a.s.c.c.ConnectionManager Client is connected to ZooKeeper
   [junit4]   2> 1325285 INFO  (TEST-CustomCollectionTest.test-seed#[A39F920AC40DF4A8]) [    ] o.a.s.c.c.SolrZkClient Using default ZkACLProvider
   [junit4]   2> 1325285 INFO  (TEST-CustomCollectionTest.test-seed#[A39F920AC40DF4A8]) [    ] o.a.s.c.c.ConnectionManager Waiting for client to connect to ZooKeeper
   [junit4]   2> 1325286 INFO  (zkCallback-1744-thread-1) [    ] o.a.s.c.c.ConnectionManager Watcher org.apache.solr.common.cloud.ConnectionManager@1acb575 name:ZooKeeperConnection Watcher:127.0.0.1:33630/solr got event WatchedEvent state:SyncConnected type:None path:null path:null type:None
   [junit4]   2> 1325286 INFO  (TEST-CustomCollectionTest.test-seed#[A39F920AC40DF4A8]) [    ] o.a.s.c.c.ConnectionManager Client is connected to ZooKeeper
   [junit4]   2> 1325290 INFO  (TEST-CustomCollectionTest.test-seed#[A39F920AC40DF4A8]) [    ] o.a.s.c.c.ZkStateReader Updating cluster state from ZooKeeper... 
   [junit4]   2> 1326293 INFO  (TEST-CustomCollectionTest.test-seed#[A39F920AC40DF4A8]) [    ] o.a.s.c.ZkController Register node as live in ZooKeeper:/live_nodes/127.0.0.1:46044_
   [junit4]   2> 1326293 INFO  (TEST-CustomCollectionTest.test-seed#[A39F920AC40DF4A8]) [    ] o.a.s.c.c.SolrZkClient makePath: /live_nodes/127.0.0.1:46044_
   [junit4]   2> 1326294 INFO  (zkCallback-1740-thread-1) [    ] o.a.s.c.c.ZkStateReader A live node change: [WatchedEvent state:SyncConnected type:NodeChildrenChanged path:/live_nodes], has occurred - updating... (live nodes size: [1])
   [junit4]   2> 1326294 INFO  (zkCallback-1738-thread-2) [    ] o.a.s.c.c.ZkStateReader A live node change: [WatchedEvent state:SyncConnected type:NodeChildrenChanged path:/live_nodes], has occurred - updating... (live nodes size: [1])
   [junit4]   2> 1326294 INFO  (zkCallback-1744-thread-1) [    ] o.a.s.c.c.ZkStateReader A live node change: [WatchedEvent state:SyncConnected type:NodeChildrenChanged path:/live_nodes], has occurred - updating... (live nodes size: [1])
   [junit4]   2> 1326295 INFO  (TEST-CustomCollectionTest.test-seed#[A39F920AC40DF4A8]) [    ] o.a.s.c.Overseer Overseer (id=null) closing
   [junit4]   2> 1326296 INFO  (TEST-CustomCollectionTest.test-seed#[A39F920AC40DF4A8]) [    ] o.a.s.c.LeaderElector Joined leadership election with path: /overseer_elect/election/95185385176956936-127.0.0.1:46044_-n_0000000001
   [junit4]   2> 1326296 INFO  (TEST-CustomCollectionTest.test-seed#[A39F920AC40DF4A8]) [    ] o.a.s.c.LeaderElector Watching path /overseer_elect/election/95185385176956932-127.0.0.1:54197_-n_0000000000 to know if I could be the leader
   [junit4]   2> 1326317 INFO  (TEST-CustomCollectionTest.test-seed#[A39F920AC40DF4A8]) [    ] o.a.s.c.CoreContainer Security conf doesn't exist. Skipping setup for authorization module.
   [junit4]   2> 1326317 INFO  (TEST-CustomCollectionTest.test-seed#[A39F920AC40DF4A8]) [    ] o.a.s.c.CoreContainer No authentication plugin used.
   [junit4]   2> 1326318 INFO  (TEST-CustomCollectionTest.test-seed#[A39F920AC40DF4A8]) [    ] o.a.s.c.CorePropertiesLocator Looking for core definitions underneath /home/jenkins/workspace/Lucene-Solr-5.x-Linux/solr/build/solr-core/test/J2/../../../../../../../../../home/jenkins/workspace/Lucene-Solr-5.x-Linux/solr/build/solr-core/test/J2/temp/solr.cloud.CustomCollectionTest_A39F920AC40DF4A8-001/shard-1-001/cores
   [junit4]   2> 1326318 INFO  (TEST-CustomCollectionTest.test-seed#[A39F920AC40DF4A8]) [    ] o.a.s.c.CoreDescriptor Created CoreDescriptor: {name=collection1, config=solrconfig.xml, transient=false, schema=schema.xml, loadOnStartup=true, configSetProperties=configsetprops.json, collection=collection1, coreNodeName=, dataDir=data/, shard=}
   [junit4]   2> 1326319 INFO  (TEST-CustomCollectionTest.test-seed#[A39F920AC40DF4A8]) [    ] o.a.s.c.CorePropertiesLocator Found core collection1 in /home/jenkins/workspace/Lucene-Solr-5.x-Linux/solr/build/solr-core/test/J2/../../../../../../../../../home/jenkins/workspace/Lucene-Solr-5.x-Linux/solr/build/solr-core/test/J2/temp/solr.cloud.CustomCollectionTest_A39F920AC40DF4A8-001/shard-1-001/cores/collection1
   [junit4]   2> 1326319 INFO  (TEST-CustomCollectionTest.test-seed#[A39F920AC40DF4A8]) [    ] o.a.s.c.CorePropertiesLocator Found 1 core definitions
   [junit4]   2> 1326319 INFO  (TEST-CustomCollectionTest.test-seed#[A39F920AC40DF4A8]) [    ] o.a.s.s.SolrDispatchFilter user.dir=/home/jenkins/workspace/Lucene-Solr-5.x-Linux/solr/build/solr-core/test/J2
   [junit4]   2> 1326319 INFO  (TEST-CustomCollectionTest.test-seed#[A39F920AC40DF4A8]) [    ] o.a.s.s.SolrDispatchFilter SolrDispatchFilter.init() done
   [junit4]   2> 1326319 INFO  (coreLoadExecutor-5269-thread-1) [    ] o.a.s.c.ZkController publishing state=down
   [junit4]   2> 1326319 INFO  (coreLoadExecutor-5269-thread-1) [    ] o.a.s.c.ZkController numShards not found on descriptor - reading it from system property
   [junit4]   2> 1326320 INFO  (coreLoadExecutor-5269-thread-1) [    ] o.a.s.c.ZkController look for our core node name
   [junit4]   2> 1326320 INFO  (OverseerStateUpdate-95185385176956932-127.0.0.1:54197_-n_0000000000) [    ] o.a.s.c.Overseer processMessage: queueSize: 1, message = {
   [junit4]   2>   "core":"collection1",
   [junit4]   2>   "roles":null,
   [junit4]   2>   "base_url":"http://127.0.0.1:46044",
   [junit4]   2>   "node_name":"127.0.0.1:46044_",
   [junit4]   2>   "numShards":"2",
   [junit4]   2>   "state":"down",
   [junit4]   2>   "shard":null,
   [junit4]   2>   "collection":"collection1",
   [junit4]   2>   "operation":"state"} current state version: 3
   [junit4]   2> 1326320 INFO  (OverseerStateUpdate-95185385176956932-127.0.0.1:54197_-n_0000000000) [    ] o.a.s.c.o.ReplicaMutator Update state numShards=2 message={
   [junit4]   2>   "core":"collection1",
   [junit4]   2>   "roles":null,
   [junit4]   2>   "base_url":"http://127.0.0.1:46044",
   [junit4]   2>   "node_name":"127.0.0.1:46044_",
   [junit4]   2>   "numShards":"2",
   [junit4]   2>   "state":"down",
   [junit4]   2>   "shard":null,
   [junit4]   2>   "collection":"collection1",
   [junit4]   2>   "operation":"state"}
   [junit4]   2> 1326321 INFO  (OverseerStateUpdate-95185385176956932-127.0.0.1:54197_-n_0000000000) [    ] o.a.s.c.o.ClusterStateMutator building a new cName: collection1
   [junit4]   2> 1326321 INFO  (OverseerStateUpdate-95185385176956932-127.0.0.1:54197_-n_0000000000) [    ] o.a.s.c.o.ReplicaMutator Assigning new node to shard shard=shard2
   [junit4]   2> 1326422 INFO  (zkCallback-1740-thread-1) [    ] o.a.s.c.c.ZkStateReader A cluster state change: [WatchedEvent state:SyncConnected type:NodeDataChanged path:/clusterstate.json], has occurred - updating... (live nodes size: [2])
   [junit4]   2> 1326422 INFO  (zkCallback-1744-thread-1) [    ] o.a.s.c.c.ZkStateReader A cluster state change: [WatchedEvent state:SyncConnected type:NodeDataChanged path:/clusterstate.json], has occurred - updating... (live nodes size: [2])
   [junit4]   2> 1326422 INFO  (zkCallback-1738-thread-2) [    ] o.a.s.c.c.ZkStateReader A cluster state change: [WatchedEvent state:SyncConnected type:NodeDataChanged path:/clusterstate.json], has occurred - updating... (live nodes size: [2])
   [junit4]   2> 1327320 INFO  (coreLoadExecutor-5269-thread-1) [    ] o.a.s.c.ZkController waiting to find shard id in clusterstate for collection1
   [junit4]   2> 1327321 INFO  (coreLoadExecutor-5269-thread-1) [    ] o.a.s.c.ZkController Check for collection zkNode:collection1
   [junit4]   2> 1327321 INFO  (coreLoadExecutor-5269-thread-1) [    ] o.a.s.c.ZkController Collection zkNode exists
   [junit4]   2> 1327321 INFO  (coreLoadExecutor-5269-thread-1) [    ] o.a.s.c.c.ZkStateReader Load collection config from: [/collections/collection1]
   [junit4]   2> 1327321 INFO  (coreLoadExecutor-5269-thread-1) [    ] o.a.s.c.c.ZkStateReader path=[/collections/collection1] [configName]=[conf1] specified config exists in ZooKeeper
   [junit4]   2> 1327321 INFO  (coreLoadExecutor-5269-thread-1) [    ] o.a.s.c.SolrResourceLoader new SolrResourceLoader for directory: '/home/jenkins/workspace/Lucene-Solr-5.x-Linux/solr/build/solr-core/test/J2/temp/solr.cloud.CustomCollectionTest_A39F920AC40DF4A8-001/shard-1-001/cores/collection1'
   [junit4]   2> 1327322 INFO  (coreLoadExecutor-5269-thread-1) [    ] o.a.s.c.SolrResourceLoader JNDI not configured for solr (NoInitialContextEx)
   [junit4]   2> 1327322 INFO  (coreLoadExecutor-5269-thread-1) [    ] o.a.s.c.SolrResourceLoader solr home defaulted to 'solr/' (could not find system property or JNDI)
   [junit4]   2> 1327323 INFO  (coreLoadExecutor-5269-thread-1) [    ] o.a.s.c.Config loaded config solrconfig.xml with version 0 
   [junit4]   2> 1327327 INFO  (coreLoadExecutor-5269-thread-1) [    ] o.a.s.c.SolrConfig current version of requestparams : -1
   [junit4]   2> 1327330 INFO  (coreLoadExecutor-5269-thread-1) [    ] o.a.s.c.SolrConfig Using Lucene MatchVersion: 5.5.0
   [junit4]   2> 1327337 INFO  (coreLoadExecutor-5269-thread-1) [    ] o.a.s.c.SolrConfig Loaded SolrConfig: solrconfig.xml
   [junit4]   2> 1327344 INFO  (coreLoadExecutor-5269-thread-1) [    ] o.a.s.s.IndexSchema [collection1] Schema name=test
   [junit4]   2> 1327422 INFO  (coreLoadExecutor-5269-thread-1) [    ] o.a.s.s.OpenExchangeRatesOrgProvider Initialized with rates=open-exchange-rates.json, refreshInterval=1440.
   [junit4]   2> 1327427 INFO  (coreLoadExecutor-5269-thread-1) [    ] o.a.s.s.IndexSchema default search field in schema is text
   [junit4]   2> 1327428 INFO  (coreLoadExecutor-5269-thread-1) [    ] o.a.s.s.IndexSchema unique key field: id
   [junit4]   2> 1327434 INFO  (coreLoadExecutor-5269-thread-1) [    ] o.a.s.s.FileExchangeRateProvider Reloading exchange rates from file currency.xml
   [junit4]   2> 1327435 INFO  (coreLoadExecutor-5269-thread-1) [    ] o.a.s.s.FileExchangeRateProvider Reloading exchange rates from file currency.xml
   [junit4]   2> 1327437 INFO  (coreLoadExecutor-5269-thread-1) [    ] o.a.s.s.OpenExchangeRatesOrgProvider Reloading exchange rates from open-exchange-rates.json
   [junit4]   2> 1327437 INFO  (coreLoadExecutor-5269-thread-1) [    ] o.a.s.s.OpenExchangeRatesOrgProvider Reloading exchange rates from open-exchange-rates.json
   [junit4]   2> 1327439 INFO  (coreLoadExecutor-5269-thread-1) [    ] o.a.s.c.ConfigSetProperties Did not find ConfigSet properties, assuming default properties: Can't find resource 'configsetprops.json' in classpath or '/configs/conf1', cwd=/home/jenkins/workspace/Lucene-Solr-5.x-Linux/solr/build/solr-core/test/J2
   [junit4]   2> 1327439 INFO  (coreLoadExecutor-5269-thread-1) [    ] o.a.s.c.CoreContainer Creating SolrCore 'collection1' using configuration from collection collection1
   [junit4]   2> 1327439 INFO  (coreLoadExecutor-5269-thread-1) [    ] o.a.s.c.SolrCore org.apache.solr.core.MockDirectoryFactory
   [junit4]   2> 1327439 INFO  (coreLoadExecutor-5269-thread-1) [    ] o.a.s.c.SolrCore [[collection1] ] Opening new SolrCore at [/home/jenkins/workspace/Lucene-Solr-5.x-Linux/solr/build/solr-core/test/J2/temp/solr.cloud.CustomCollectionTest_A39F920AC40DF4A8-001/shard-1-001/cores/collection1], dataDir=[/home/jenkins/workspace/Lucene-Solr-5.x-Linux/solr/build/solr-core/test/J2/../../../../../../../../../home/jenkins/workspace/Lucene-Solr-5.x-Linux/solr/build/solr-core/test/J2/temp/solr.cloud.CustomCollectionTest_A39F920AC40DF4A8-001/shard-1-001/cores/collection1/data/]
   [junit4]   2> 1327439 INFO  (coreLoadExecutor-5269-thread-1) [    ] o.a.s.c.JmxMonitoredMap JMX monitoring is enabled. Adding Solr mbeans to JMX Server: com.sun.jmx.mbeanserver.JmxMBeanServer@2f158e
   [junit4]   2> 1327440 INFO  (coreLoadExecutor-5269-thread-1) [    ] o.a.s.c.CachingDirectoryFactory return new directory for /home/jenkins/workspace/Lucene-Solr-5.x-Linux/solr/build/solr-core/test/J2/../../../../../../../../../home/jenkins/workspace/Lucene-Solr-5.x-Linux/solr/build/solr-core/test/J2/temp/solr.cloud.CustomCollectionTest_A39F920AC40DF4A8-001/shard-1-001/cores/collection1/data
   [junit4]   2> 1327440 INFO  (coreLoadExecutor-5269-thread-1) [    ] o.a.s.c.SolrCore New index directory detected: old=null new=/home/jenkins/workspace/Lucene-Solr-5.x-Linux/solr/build/solr-core/test/J2/../../../../../../../../../home/jenkins/workspace/Lucene-Solr-5.x-Linux/solr/build/solr-core/test/J2/temp/solr.cloud.CustomCollectionTest_A39F920AC40DF4A8-001/shard-1-001/cores/collection1/data/index/
   [junit4]   2> 1327440 WARN  (coreLoadExecutor-5269-thread-1) [    ] o.a.s.c.SolrCore [collection1] Solr index directory '/home/jenkins/workspace/Lucene-Solr-5.x-Linux/solr/build/solr-core/test/J2/../../../../../../../../../home/jenkins/workspace/Lucene-Solr-5.x-Linux/solr/build/solr-core/test/J2/temp/solr.cloud.CustomCollectionTest_A39F920AC40DF4A8-001/shard-1-001/cores/collection1/data/index' doesn't exist. Creating new index...
   [junit4]   2> 1327440 INFO  (coreLoadExecutor-5269-thread-1) [    ] o.a.s.c.CachingDirectoryFactory return new directory for /home/jenkins/workspace/Lucene-Solr-5.x-Linux/solr/build/solr-core/test/J2/../../../../../../../../../home/jenkins/workspace/Lucene-Solr-5.x-Linux/solr/build/solr-core/test/J2/temp/solr.cloud.CustomCollectionTest_A39F920AC40DF4A8-001/shard-1-001/cores/collection1/data/index
   [junit4]   2> 1327441 INFO  (coreLoadExecutor-5269-thread-1) [    ] o.a.s.u.RandomMergePolicy RandomMergePolicy wrapping class org.apache.lucene.index.AlcoholicMergePolicy: [AlcoholicMergePolicy: minMergeSize=0, mergeFactor=10, maxMergeSize=198136085, maxMergeSizeForForcedMerge=9223372036854775807, calibrateSizeByDeletes=true, maxMergeDocs=2147483647, maxCFSSegmentSizeMB=8.796093022207999E12, noCFSRatio=0.1]
   [junit4]   2> 1327441 INFO  (coreLoadExecutor-5269-thread-1) [    ] o.a.s.c.SolrDeletionPolicy SolrDeletionPolicy.onCommit: commits: num=1
   [junit4]   2> 	commit{dir=MockDirectoryWrapper(RAMDirectory@1f0d550 lockFactory=org.apache.lucene.store.SingleInstanceLockFactory@e25c9f),segFN=segments_1,generation=1}
   [junit4]   2> 1327442 INFO  (coreLoadExecutor-5269-thread-1) [    ] o.a.s.c.SolrDeletionPolicy newest commit generation = 1
   [junit4]   2> 1327442 INFO  (OldIndexDirectoryCleanupThreadForCore-collection1) [    ] o.a.s.c.SolrCore Looking for old index directories to cleanup for core collection1 in /home/jenkins/workspace/Lucene-Solr-5.x-Linux/solr/build/solr-core/test/J2/../../../../../../../../../home/jenkins/workspace/Lucene-Solr-5.x-Linux/solr/build/solr-core/test/J2/temp/solr.cloud.CustomCollectionTest_A39F920AC40DF4A8-001/shard-1-001/cores/collection1/data/
   [junit4]   2> 1327442 WARN  (OldIndexDirectoryCleanupThreadForCore-collection1) [    ] o.a.s.c.DirectoryFactory /home/jenkins/workspace/Lucene-Solr-5.x-Linux/solr/build/solr-core/test/J2/../../../../../../../../../home/jenkins/workspace/Lucene-Solr-5.x-Linux/solr/build/solr-core/test/J2/temp/solr.cloud.CustomCollectionTest_A39F920AC40DF4A8-001/shard-1-001/cores/collection1/data/ does not point to a valid data directory; skipping clean-up of old index directories.
   [junit4]   2> 1327445 INFO  (coreLoadExecutor-5269-thread-1) [    ] o.a.s.u.p.UpdateRequestProcessorChain creating updateRequestProcessorChain "nodistrib"
   [junit4]   2> 1327445 INFO  (coreLoadExecutor-5269-thread-1) [    ] o.a.s.u.p.UpdateRequestProcessorChain creating updateRequestProcessorChain "dedupe"
   [junit4]   2> 1327445 INFO  (coreLoadExecutor-5269-thread-1) [    ] o.a.s.u.p.UpdateRequestProcessorChain inserting DistributedUpdateProcessorFactory into updateRequestProcessorChain "dedupe"
   [junit4]   2> 1327445 INFO  (coreLoadExecutor-5269-thread-1) [    ] o.a.s.u.p.UpdateRequestProcessorChain creating updateRequestProcessorChain "stored_sig"
   [junit4]   2> 1327445 INFO  (coreLoadExecutor-5269-thread-1) [    ] o.a.s.u.p.UpdateRequestProcessorChain inserting DistributedUpdateProcessorFactory into updateRequestProcessorChain "stored_sig"
   [junit4]   2> 1327445 INFO  (coreLoadExecutor-5269-thread-1) [    ] o.a.s.u.p.UpdateRequestProcessorChain creating updateRequestProcessorChain "distrib-dup-test-chain-explicit"
   [junit4]   2> 1327445 INFO  (coreLoadExecutor-5269-thread-1) [    ] o.a.s.u.p.UpdateRequestProcessorChain creating updateRequestProcessorChain "distrib-dup-test-chain-implicit"
   [junit4]   2> 1327445 INFO  (coreLoadExecutor-5269-thread-1) [    ] o.a.s.u.p.UpdateRequestProcessorChain inserting DistributedUpdateProcessorFactory into updateRequestProcessorChain "distrib-dup-test-chain-implicit"
   [junit4]   2> 1327445 INFO  (coreLoadExecutor-5269-thread-1) [    ] o.a.s.c.SolrCore no updateRequestProcessorChain defined as default, creating implicit default
   [junit4]   2> 1327445 WARN  (coreLoadExecutor-5269-thread-1) [    ] o.a.s.c.RequestHandlers INVALID paramSet a in requestHandler {type = requestHandler,name = /dump,class = DumpRequestHandler,args = {defaults={a=A,b=B}}}
   [junit4]   2> 1327447 INFO  (coreLoadExecutor-5269-thread-1) [    ] o.a.s.h.l.XMLLoader xsltCacheLifetimeSeconds=60
   [junit4]   2> 1327447 INFO  (coreLoadExecutor-5269-thread-1) [    ] o.a.s.h.l.XMLLoader xsltCacheLifetimeSeconds=60
   [junit4]   2> 1327448 INFO  (coreLoadExecutor-5269-thread-1) [    ] o.a.s.h.l.XMLLoader xsltCacheLifetimeSeconds=60
   [junit4]   2> 1327449 INFO  (coreLoadExecutor-5269-thread-1) [    ] o.a.s.h.l.XMLLoader xsltCacheLifetimeSeconds=60
   [junit4]   2> 1327453 INFO  (coreLoadExecutor-5269-thread-1) [    ] o.a.s.c.RequestHandlers Registered paths: /admin/mbeans,standard,/dump,/update/csv,/update/json/docs,/admin/luke,/admin/segments,/get,/admin/system,/replication,/admin/properties,/config,/schema,/admin/plugins,/admin/logging,/update/json,/admin/threads,/admin/ping,/update,/admin/file
   [junit4]   2> 1327453 INFO  (coreLoadExecutor-5269-thread-1) [    ] o.a.s.c.SolrCore Using default statsCache cache: org.apache.solr.search.stats.LocalStatsCache
   [junit4]   2> 1327454 INFO  (coreLoadExecutor-5269-thread-1) [    ] o.a.s.u.UpdateHandler Using UpdateLog implementation: org.apache.solr.update.UpdateLog
   [junit4]   2> 1327454 INFO  (coreLoadExecutor-5269-thread-1) [    ] o.a.s.u.UpdateLog Initializing UpdateLog: dataDir= defaultSyncLevel=FLUSH numRecordsToKeep=100 maxNumLogsToKeep=10 numVersionBuckets=65536
   [junit4]   2> 1327455 INFO  (coreLoadExecutor-5269-thread-1) [    ] o.a.s.u.CommitTracker Hard AutoCommit: disabled
   [junit4]   2> 1327455 INFO  (coreLoadExecutor-5269-thread-1) [    ] o.a.s.u.CommitTracker Soft AutoCommit: disabled
   [junit4]   2> 1327455 INFO  (coreLoadExecutor-5269-thread-1) [    ] o.a.s.u.RandomMergePolicy RandomMergePolicy wrapping class org.apache.lucene.index.LogByteSizeMergePolicy: [LogByteSizeMergePolicy: minMergeSize=1677721, mergeFactor=35, maxMergeSize=2147483648, maxMergeSizeForForcedMerge=9223372036854775807, calibrateSizeByDeletes=true, maxMergeDocs=2147483647, maxCFSSegmentSizeMB=8.796093022207999E12, noCFSRatio=0.46072694133802383]
   [junit4]   2> 1327455 INFO  (coreLoadExecutor-5269-thread-1) [    ] o.a.s.c.SolrDeletionPolicy SolrDeletionPolicy.onInit: commits: num=1
   [junit4]   2> 	commit{dir=MockDirectoryWrapper(RAMDirectory@1f0d550 lockFactory=org.apache.lucene.store.SingleInstanceLockFactory@e25c9f),segFN=segments_1,generation=1}
   [junit4]   2> 1327455 INFO  (coreLoadExecutor-5269-thread-1) [    ] o.a.s.c.SolrDeletionPolicy newest commit generation = 1
   [junit4]   2> 1327455 INFO  (coreLoadExecutor-5269-thread-1) [    ] o.a.s.s.SolrIndexSearcher Opening Searcher@265361[collection1] main
   [junit4]   2> 1327455 INFO  (coreLoadExecutor-5269-thread-1) [    ] o.a.s.c.c.ZkStateReader Load collection config from: [/collections/collection1]
   [junit4]   2> 1327456 INFO  (coreLoadExecutor-5269-thread-1) [    ] o.a.s.c.c.ZkStateReader path=[/collections/collection1] [configName]=[conf1] specified config exists in ZooKeeper
   [junit4]   2> 1327456 INFO  (coreLoadExecutor-5269-thread-1) [    ] o.a.s.r.ManagedResourceStorage Setting up ZooKeeper-based storage for the RestManager with znodeBase: /configs/conf1
   [junit4]   2> 1327456 INFO  (coreLoadExecutor-5269-thread-1) [    ] o.a.s.r.ManagedResourceStorage Configured ZooKeeperStorageIO with znodeBase: /configs/conf1
   [junit4]   2> 1327456 INFO  (coreLoadExecutor-5269-thread-1) [    ] o.a.s.r.RestManager Initializing RestManager with initArgs: {}
   [junit4]   2> 1327456 INFO  (coreLoadExecutor-5269-thread-1) [    ] o.a.s.r.ManagedResourceStorage Reading _rest_managed.json using ZooKeeperStorageIO:path=/configs/conf1
   [junit4]   2> 1327456 INFO  (coreLoadExecutor-5269-thread-1) [    ] o.a.s.r.ManagedResourceStorage No data found for znode /configs/conf1/_rest_managed.json
   [junit4]   2> 1327456 INFO  (coreLoadExecutor-5269-thread-1) [    ] o.a.s.r.ManagedResourceStorage Loaded null at path _rest_managed.json using ZooKeeperStorageIO:path=/configs/conf1
   [junit4]   2> 1327457 INFO  (coreLoadExecutor-5269-thread-1) [    ] o.a.s.r.RestManager Initializing 0 registered ManagedResources
   [junit4]   2> 1327457 INFO  (coreLoadExecutor-5269-thread-1) [    ] o.a.s.h.ReplicationHandler Commits will be reserved for  10000
   [junit4]   2> 1327457 INFO  (searcherExecutor-5270-thread-1) [    ] o.a.s.c.SolrCore [collection1] Registered new searcher Searcher@265361[collection1] main{ExitableDirectoryReader(UninvertingDirectoryReader())}
   [junit4]   2> 1327457 INFO  (coreLoadExecutor-5269-thread-1) [    ] o.a.s.u.UpdateLog Looking up max value of version field to seed version buckets
   [junit4]   2> 1327457 INFO  (coreLoadExecutor-5269-thread-1) [    ] o.a.s.u.VersionInfo Refreshing highest value of _version_ for 65536 version buckets from index
   [junit4]   2> 1327457 INFO  (coreLoadExecutor-5269-thread-1) [    ] o.a.s.u.VersionInfo No terms found for _version_, cannot seed version bucket highest value from index
   [junit4]   2> 1327457 INFO  (coreLoadExecutor-5269-thread-1) [    ] o.a.s.u.UpdateLog Could not find max version in index or recent updates, using new clock 1522966167099015168
   [junit4]   2> 1327459 INFO  (coreLoadExecutor-5269-thread-1) [    ] o.a.s.u.UpdateLog Took 1.0ms to seed version buckets with highest version 1522966167099015168
   [junit4]   2> 1327459 INFO  (coreLoadExecutor-5269-thread-1) [    ] o.a.s.c.ZkController watch zkdir /configs/conf1
   [junit4]   2> 1327460 INFO  (coreLoadExecutor-5269-thread-1) [    ] o.a.s.c.CoreContainer registering core: collection1
   [junit4]   2> 1327460 INFO  (coreZkRegister-5264-thread-1) [    ] o.a.s.c.ZkController Register replica - core:collection1 address:http://127.0.0.1:46044 collection:collection1 shard:shard2
   [junit4]   2> 1327460 INFO  (coreZkRegister-5264-thread-1) [    ] o.a.s.c.c.SolrZkClient makePath: /collections/collection1/leader_elect/shard2/election
   [junit4]   2> 1327462 INFO  (coreZkRegister-5264-thread-1) [    ] o.a.s.c.LeaderElector Joined leadership election with path: /collections/collection1/leader_elect/shard2/election/95185385176956936-core_node1-n_0000000000
   [junit4]   2> 1327462 INFO  (coreZkRegister-5264-thread-1) [    ] o.a.s.c.ShardLeaderElectionContext Running the leader process for shard=shard2 and weAreReplacement=false and leaderVoteWait=180000
   [junit4]   2> 1327463 INFO  (coreZkRegister-5264-thread-1) [    ] o.a.s.c.ShardLeaderElectionContext Enough replicas found to continue.
   [junit4]   2> 1327463 INFO  (coreZkRegister-5264-thread-1) [    ] o.a.s.c.ShardLeaderElectionContext I may be the new leader - try and sync
   [junit4]   2> 1327463 INFO  (coreZkRegister-5264-thread-1) [    ] o.a.s.c.SyncStrategy Sync replicas to http://127.0.0.1:46044/collection1/
   [junit4]   2> 1327463 INFO  (coreZkRegister-5264-thread-1) [    ] o.a.s.c.SyncStrategy Sync Success - now sync replicas to me
   [junit4]   2> 1327463 INFO  (coreZkRegister-5264-thread-1) [    ] o.a.s.c.SyncStrategy http://127.0.0.1:46044/collection1/ has no replicas
   [junit4]   2> 1327463 INFO  (OverseerStateUpdate-95185385176956932-127.0.0.1:54197_-n_0000000000) [    ] o.a.s.c.Overseer processMessage: queueSize: 1, message = {
   [junit4]   2>   "operation":"leader",
   [junit4]   2>   "shard":"shard2",
   [junit4]   2>   "collection":"collection1"} current state version: 4
   [junit4]   2> 1327463 INFO  (coreZkRegister-5264-thread-1) [    ] o.a.s.c.c.SolrZkClient makePath: /collections/collection1/leaders/shard2
   [junit4]   2> 1327464 INFO  (coreZkRegister-5264-thread-1) [    ] o.a.s.c.ShardLeaderElectionContextBase Creating leader registration node
   [junit4]   2> 1327465 INFO  (coreZkRegister-5264-thread-1) [    ] o.a.s.c.ShardLeaderElectionContext I am the new leader: http://127.0.0.1:46044/collection1/ shard2
   [junit4]   2> 1327466 INFO  (OverseerStateUpdate-95185385176956932-127.0.0.1:54197_-n_0000000000) [    ] o.a.s.c.Overseer processMessage: queueSize: 1, message = {
   [junit4]   2>   "operation":"leader",
   [junit4]   2>   "shard":"shard2",
   [junit4]   2>   "collection":"collection1",
   [junit4]   2>   "base_url":"http://127.0.0.1:46044",
   [junit4]   2>   "core":"collection1",
   [junit4]   2>   "state":"active"} current state version: 4
   [junit4]   2> 1327568 INFO  (zkCallback-1740-thread-1) [    ] o.a.s.c.c.ZkStateReader A cluster state change: [WatchedEvent state:SyncConnected type:NodeDataChanged path:/clusterstate.json], has occurred - updating... (live nodes size: [2])
   [junit4]   2> 1327568 INFO  (zkCallback-1744-thread-1) [    ] o.a.s.c.c.ZkStateReader A cluster state change: [WatchedEvent state:SyncConnected type:NodeDataChanged path:/clusterstate.json], has occurred - updating... (live nodes size: [2])
   [junit4]   2> 1327568 INFO  (zkCallback-1738-thread-2) [    ] o.a.s.c.c.ZkStateReader A cluster state change: [WatchedEvent state:SyncConnected type:NodeDataChanged path:/clusterstate.json], has occurred - updating... (live nodes size: [2])
   [junit4]   2> 1327616 INFO  (coreZkRegister-5264-thread-1) [    ] o.a.s.c.ZkController We are http://127.0.0.1:46044/collection1/ and leader is http://127.0.0.1:46044/collection1/
   [junit4]   2> 1327616 INFO  (coreZkRegister-5264-thread-1) [    ] o.a.s.c.ZkController No LogReplay needed for core=collection1 baseURL=http://127.0.0.1:46044
   [junit4]   2> 1327616 INFO  (coreZkRegister-5264-thread-1) [    ] o.a.s.c.ZkController I am the leader, no recovery necessary
   [junit4]   2> 1327616 INFO  (coreZkRegister-5264-thread-1) [    ] o.a.s.c.ZkController publishing state=active
   [junit4]   2> 1327616 INFO  (coreZkRegister-5264-thread-1) [    ] o.a.s.c.ZkController numShards not found on descriptor - reading it from system property
   [junit4]   2> 1327617 INFO  (OverseerStateUpdate-95185385176956932-127.0.0.1:54197_-n_0000000000) [    ] o.a.s.c.Overseer processMessage: queueSize: 1, message = {
   [junit4]   2>   "core":"collection1",
   [junit4]   2>   "core_node_name":"core_node1",
   [junit4]   2>   "roles":null,
   [junit4]   2>   "base_url":"http://127.0.0.1:46044",
   [junit4]   2>   "node_name":"127.0.0.1:46044_",
   [junit4]   2>   "numShards":"2",
   [junit4]   2>   "state":"active",
   [junit4]   2>   "shard":"shard2",
   [junit4]   2>   "collection":"collection1",
   [junit4]   2>   "operation":"state"} current state version: 5
   [junit4]   2> 1327618 INFO  (OverseerStateUpdate-95185385176956932-127.0.0.1:54197_-n_0000000000) [    ] o.a.s.c.o.ReplicaMutator Update state numShards=2 message={
   [junit4]   2>   "core":"collection1",
   [junit4]   2>   "core_node_name":"core_node1",
   [junit4]   2>   "roles":null,
   [junit4]   2>   "base_url":"http://127.0.0.1:46044",
   [junit4]   2>   "node_name":"127.0.0.1:46044_",
   [junit4]   2>   "numShards":"2",
   [junit4]   2>   "state":"active",
   [junit4]   2>   "shard":"shard2",
   [junit4]   2>   "collection":"collection1",
   [junit4]   2>   "operation":"state"}
   [junit4]   2> 1327719 INFO  (zkCallback-1740-thread-1) [    ] o.a.s.c.c.ZkStateReader A cluster state change: [WatchedEvent state:SyncConnected type:NodeDataChanged path:/clusterstate.json], has occurred - updating... (live nodes size: [2])
   [junit4]   2> 1327719 INFO  (zkCallback-1744-thread-1) [    ] o.a.s.c.c.ZkStateReader A cluster state change: [WatchedEvent state:SyncConnected type:NodeDataChanged path:/clusterstate.json], has occurred - updating... (live nodes size: [2])
   [junit4]   2> 1327719 INFO  (zkCallback-1738-thread-2) [    ] o.a.s.c.c.ZkStateReader A cluster state chang

[...truncated too long message...]

lExecutor.runWorker(ThreadPoolExecutor.java:1158)
   [junit4]   2> 	at java.util.concurrent.ThreadPoolExecutor$Worker.run(ThreadPoolExecutor.java:632)
   [junit4]   2> 	at java.lang.Thread.run(Thread.java:747)
   [junit4]   2> 1565805 WARN  (zkCallback-2093-thread-1) [    ] o.a.s.c.c.ZkStateReader ZooKeeper watch triggered, but Solr cannot talk to ZK: [KeeperErrorCode = Session expired for /live_nodes]
   [junit4]   2> 1565805 WARN  (zkCallback-2092-thread-1) [    ] o.a.s.c.c.ZkStateReader ZooKeeper watch triggered, but Solr cannot talk to ZK: [KeeperErrorCode = Session expired for /live_nodes]
   [junit4]   2> 1565805 WARN  (zkCallback-2091-thread-1) [    ] o.a.s.c.c.ZkStateReader ZooKeeper watch triggered, but Solr cannot talk to ZK: [KeeperErrorCode = Session expired for /live_nodes]
   [junit4]   2> 1565805 WARN  (zkCallback-2094-thread-1) [    ] o.a.s.c.c.ZkStateReader ZooKeeper watch triggered, but Solr cannot talk to ZK: [KeeperErrorCode = Session expired for /live_nodes]
   [junit4]   2> 1565805 WARN  (zkCallback-2092-thread-2) [    ] o.a.s.c.LeaderElector 
   [junit4]   2> org.apache.zookeeper.KeeperException$SessionExpiredException: KeeperErrorCode = Session expired for /overseer_elect/election
   [junit4]   2> 	at org.apache.zookeeper.KeeperException.create(KeeperException.java:127)
   [junit4]   2> 	at org.apache.zookeeper.KeeperException.create(KeeperException.java:51)
   [junit4]   2> 	at org.apache.zookeeper.ZooKeeper.getChildren(ZooKeeper.java:1472)
   [junit4]   2> 	at org.apache.solr.common.cloud.SolrZkClient$6.execute(SolrZkClient.java:328)
   [junit4]   2> 	at org.apache.solr.common.cloud.SolrZkClient$6.execute(SolrZkClient.java:325)
   [junit4]   2> 	at org.apache.solr.common.cloud.ZkCmdExecutor.retryOperation(ZkCmdExecutor.java:61)
   [junit4]   2> 	at org.apache.solr.common.cloud.SolrZkClient.getChildren(SolrZkClient.java:325)
   [junit4]   2> 	at org.apache.solr.cloud.LeaderElector.checkIfIamLeader(LeaderElector.java:108)
   [junit4]   2> 	at org.apache.solr.cloud.LeaderElector.access$200(LeaderElector.java:59)
   [junit4]   2> 	at org.apache.solr.cloud.LeaderElector$ElectionWatcher.process(LeaderElector.java:389)
   [junit4]   2> 	at org.apache.solr.common.cloud.SolrZkClient$3$1.run(SolrZkClient.java:264)
   [junit4]   2> 	at java.util.concurrent.Executors$RunnableAdapter.call(Executors.java:514)
   [junit4]   2> 	at java.util.concurrent.FutureTask.run(FutureTask.java:266)
   [junit4]   2> 	at org.apache.solr.common.util.ExecutorUtil$MDCAwareThreadPoolExecutor$1.run(ExecutorUtil.java:232)
   [junit4]   2> 	at java.util.concurrent.ThreadPoolExecutor.runWorker(ThreadPoolExecutor.java:1158)
   [junit4]   2> 	at java.util.concurrent.ThreadPoolExecutor$Worker.run(ThreadPoolExecutor.java:632)
   [junit4]   2> 	at java.lang.Thread.run(Thread.java:747)
   [junit4]   2> 1565807 INFO  (jetty-launcher-2073-thread-4) [    ] o.e.j.s.h.ContextHandler Stopped o.e.j.s.ServletContextHandler@12a82fb{/solr,null,UNAVAILABLE}
   [junit4]   2> 1565806 INFO  (jetty-launcher-2073-thread-3) [    ] o.e.j.s.h.ContextHandler Stopped o.e.j.s.ServletContextHandler@f29a13{/solr,null,UNAVAILABLE}
   [junit4]   2> 1565807 INFO  (jetty-launcher-2073-thread-5) [    ] o.e.j.s.h.ContextHandler Stopped o.e.j.s.ServletContextHandler@1bc13ed{/solr,null,UNAVAILABLE}
   [junit4]   2> 1565806 INFO  (jetty-launcher-2073-thread-2) [    ] o.e.j.s.h.ContextHandler Stopped o.e.j.s.ServletContextHandler@1df72d4{/solr,null,UNAVAILABLE}
   [junit4]   2> 1565808 INFO  (TEST-TestAuthenticationFramework.testCollectionCreateWithoutCoresThenDelete-seed#[A39F920AC40DF4A8]) [    ] o.a.s.c.ZkTestServer connecting to 127.0.0.1:50623 50623
   [junit4]   2> 1565905 INFO  (Thread-5013) [    ] o.a.s.c.ZkTestServer connecting to 127.0.0.1:50623 50623
   [junit4]   2> 1565906 WARN  (Thread-5013) [    ] o.a.s.c.ZkTestServer Watch limit violations: 
   [junit4]   2> Maximum concurrent create/delete watches above limit:
   [junit4]   2> 
   [junit4]   2> 	7	/solr/aliases.json
   [junit4]   2> 	5	/solr/security.json
   [junit4]   2> 
   [junit4]   2> Maximum concurrent data watches above limit:
   [junit4]   2> 
   [junit4]   2> 	7	/solr/clusterstate.json
   [junit4]   2> 
   [junit4]   2> Maximum concurrent children watches above limit:
   [junit4]   2> 
   [junit4]   2> 	7	/solr/live_nodes
   [junit4]   2> 	7	/solr/collections
   [junit4]   2> 
   [junit4]   2> NOTE: leaving temporary files on disk at: /home/jenkins/workspace/Lucene-Solr-5.x-Linux/solr/build/solr-core/test/J2/temp/solr.cloud.TestAuthenticationFramework_A39F920AC40DF4A8-001
   [junit4]   2> Jan 10, 2016 8:19:16 AM com.carrotsearch.randomizedtesting.ThreadLeakControl checkThreadLeaks
   [junit4]   2> WARNING: Will linger awaiting termination of 1 leaked thread(s).
   [junit4]   2> NOTE: test params are: codec=FastDecompressionCompressingStoredFields(storedFieldsFormat=CompressingStoredFieldsFormat(compressionMode=FAST_DECOMPRESSION, chunkSize=4, maxDocsPerChunk=563, blockSize=6), termVectorsFormat=CompressingTermVectorsFormat(compressionMode=FAST_DECOMPRESSION, chunkSize=4, blockSize=6)), sim=RandomSimilarityProvider(queryNorm=true,coord=no): {}, locale=ebu, timezone=America/Nome
   [junit4]   2> NOTE: Linux 3.19.0-42-generic i386/Oracle Corporation 9-ea (32-bit)/cpus=12,threads=1,free=184552832,total=506593280
   [junit4]   2> NOTE: All tests run in this JVM: [TestScoreJoinQPNoScore, BadComponentTest, TestCollationField, TestExceedMaxTermLength, TestCharFilters, DistanceUnitsTest, DistribDocExpirationUpdateProcessorTest, SolrTestCaseJ4Test, SpatialRPTFieldTypeTest, ZkStateWriterTest, TestReversedWildcardFilterFactory, TestGroupingSearch, TestDownShardTolerantSearch, SuggesterTSTTest, TestSortingResponseWriter, CollectionStateFormat2Test, LeaderElectionTest, DirectUpdateHandlerOptimizeTest, FullSolrCloudDistribCmdsTest, TestTrieFacet, LeaderFailoverAfterPartitionTest, TestSchemaNameResource, TestCloudManagedSchemaConcurrent, SolrCoreCheckLockOnStartupTest, InfoHandlerTest, ShardSplitTest, CloudMLTQParserTest, TestTestInjection, TestSort, TestElisionMultitermQuery, TestPHPSerializedResponseWriter, BitVectorTest, DistributedFacetPivotWhiteBoxTest, StatelessScriptUpdateProcessorFactoryTest, HdfsBasicDistributedZkTest, TestManagedSchema, PreAnalyzedUpdateProcessorTest, TestPostingsSolrHighlighter, DistributedFacetPivotLongTailTest, TestRequestStatusCollectionAPI, TestInitParams, TestSearchPerf, TestShardHandlerFactory, XmlUpdateRequestHandlerTest, TestIndexingPerformance, TestSolrQueryParserResource, DirectSolrConnectionTest, StressHdfsTest, SimpleCollectionCreateDeleteTest, TestCollapseQParserPlugin, RequestHandlersTest, DistributedSuggestComponentTest, AnalysisErrorHandlingTest, TestDynamicLoading, ClusterStateTest, TestSolrXml, NoCacheHeaderTest, HdfsRecoveryZkTest, TestStressReorder, HdfsDirectoryFactoryTest, TestRecovery, TestFuzzyAnalyzedSuggestions, TestWriterPerf, QueryParsingTest, CoreAdminHandlerTest, TestZkChroot, TestUseDocValuesAsStored2, TestDynamicFieldResource, SliceStateTest, TestRestoreCore, TestManagedSynonymFilterFactory, CleanupOldIndexTest, TestDistributedMissingSort, SuggestComponentContextFilterQueryTest, TestUtils, TestCoreDiscovery, HighlighterConfigTest, TestReRankQParserPlugin, TestReload, TestSolrJ, TestFileDictionaryLookup, RegexBoostProcessorTest, TestRebalanceLeaders, BlockCacheTest, SampleTest, TestRestManager, TermVectorComponentDistributedTest, TestFieldSortValues, HdfsThreadLeakTest, TestMaxScoreQueryParser, StatsComponentTest, CollectionsAPIDistributedZkTest, TestReplicationHandler, SimpleFacetsTest, SolrCmdDistributorTest, PeerSyncTest, TestBadConfig, ShowFileRequestHandlerTest, SignatureUpdateProcessorFactoryTest, SuggesterFSTTest, SpatialFilterTest, PolyFieldTest, SchemaVersionSpecificBehaviorTest, TestUpdate, FieldMutatingUpdateProcessorTest, TestWordDelimiterFilterFactory, TestSolrDeletionPolicy1, CacheHeaderTest, TestQueryUtils, DirectSolrSpellCheckerTest, PrimitiveFieldTypeTest, TestValueSourceCache, RequiredFieldsTest, TestArbitraryIndexDir, ReturnFieldsTest, TestAnalyzedSuggestions, TestQuerySenderListener, AlternateDirectoryTest, TestSolrIndexConfig, CopyFieldTest, TestStressRecovery, TestSystemIdResolver, PrimUtilsTest, TestSuggestSpellingConverter, DOMUtilTest, RAMDirectoryFactoryTest, TestDocumentBuilder, ZkNodePropsTest, SystemInfoHandlerTest, FileUtilsTest, CircularListTest, TestRTGBase, CursorPagingTest, AliasIntegrationTest, CustomCollectionTest, OverriddenZkACLAndCredentialsProvidersTest, OverseerStatusTest, RemoteQueryErrorTest, SharedFSAutoReplicaFailoverTest, SolrCloudExampleTest, SolrXmlInZkTest, TestAuthenticationFramework]
   [junit4] Completed [454/563 (2!)] on J2 in 138.70s, 7 tests, 1 failure <<< FAILURES!

[...truncated 350 lines...]
BUILD FAILED
/home/jenkins/workspace/Lucene-Solr-5.x-Linux/build.xml:794: The following error occurred while executing this line:
/home/jenkins/workspace/Lucene-Solr-5.x-Linux/build.xml:738: The following error occurred while executing this line:
/home/jenkins/workspace/Lucene-Solr-5.x-Linux/build.xml:59: The following error occurred while executing this line:
/home/jenkins/workspace/Lucene-Solr-5.x-Linux/solr/build.xml:233: The following error occurred while executing this line:
/home/jenkins/workspace/Lucene-Solr-5.x-Linux/solr/common-build.xml:526: The following error occurred while executing this line:
/home/jenkins/workspace/Lucene-Solr-5.x-Linux/lucene/common-build.xml:1444: The following error occurred while executing this line:
/home/jenkins/workspace/Lucene-Solr-5.x-Linux/lucene/common-build.xml:1000: There were test failures: 563 suites (7 ignored), 2236 tests, 2 failures, 84 ignored (39 assumptions) [seed: A39F920AC40DF4A8]

Total time: 57 minutes 55 seconds
Build step 'Invoke Ant' marked build as failure
Archiving artifacts
[WARNINGS] Skipping publisher since build result is FAILURE
Recording test results
Email was triggered for: Failure - Any
Sending email for trigger: Failure - Any



Mime
View raw message