lucene-dev mailing list archives

Site index · List index
Message view « Date » · « Thread »
Top « Date » · « Thread »
From Policeman Jenkins Server <jenk...@thetaphi.de>
Subject [JENKINS] Lucene-Solr-trunk-Solaris (64bit/jdk1.8.0) - Build # 322 - Still Failing!
Date Sat, 09 Jan 2016 07:11:53 GMT
Build: http://jenkins.thetaphi.de/job/Lucene-Solr-trunk-Solaris/322/
Java: 64bit/jdk1.8.0 -XX:-UseCompressedOops -XX:+UseG1GC

2 tests failed.
FAILED:  org.apache.solr.cloud.LeaderFailoverAfterPartitionTest.test

Error Message:
Expected 2 of 3 replicas to be active but only found 1; [core_node3:{"core":"c8n_1x3_lf_shard1_replica2","base_url":"http://127.0.0.1:45030/n_/hp","node_name":"127.0.0.1:45030_n_%2Fhp","state":"active","leader":"true"}]; clusterState: DocCollection(c8n_1x3_lf)={   "replicationFactor":"3",   "shards":{"shard1":{       "range":"80000000-7fffffff",       "state":"active",       "replicas":{         "core_node1":{           "state":"down",           "base_url":"http://127.0.0.1:51924/n_/hp",           "core":"c8n_1x3_lf_shard1_replica3",           "node_name":"127.0.0.1:51924_n_%2Fhp"},         "core_node2":{           "core":"c8n_1x3_lf_shard1_replica1",           "base_url":"http://127.0.0.1:64073/n_/hp",           "node_name":"127.0.0.1:64073_n_%2Fhp",           "state":"down"},         "core_node3":{           "core":"c8n_1x3_lf_shard1_replica2",           "base_url":"http://127.0.0.1:45030/n_/hp",           "node_name":"127.0.0.1:45030_n_%2Fhp",           "state":"active",           "leader":"true"}}}},   "router":{"name":"compositeId"},   "maxShardsPerNode":"1",   "autoAddReplicas":"false"}

Stack Trace:
java.lang.AssertionError: Expected 2 of 3 replicas to be active but only found 1; [core_node3:{"core":"c8n_1x3_lf_shard1_replica2","base_url":"http://127.0.0.1:45030/n_/hp","node_name":"127.0.0.1:45030_n_%2Fhp","state":"active","leader":"true"}]; clusterState: DocCollection(c8n_1x3_lf)={
  "replicationFactor":"3",
  "shards":{"shard1":{
      "range":"80000000-7fffffff",
      "state":"active",
      "replicas":{
        "core_node1":{
          "state":"down",
          "base_url":"http://127.0.0.1:51924/n_/hp",
          "core":"c8n_1x3_lf_shard1_replica3",
          "node_name":"127.0.0.1:51924_n_%2Fhp"},
        "core_node2":{
          "core":"c8n_1x3_lf_shard1_replica1",
          "base_url":"http://127.0.0.1:64073/n_/hp",
          "node_name":"127.0.0.1:64073_n_%2Fhp",
          "state":"down"},
        "core_node3":{
          "core":"c8n_1x3_lf_shard1_replica2",
          "base_url":"http://127.0.0.1:45030/n_/hp",
          "node_name":"127.0.0.1:45030_n_%2Fhp",
          "state":"active",
          "leader":"true"}}}},
  "router":{"name":"compositeId"},
  "maxShardsPerNode":"1",
  "autoAddReplicas":"false"}
	at __randomizedtesting.SeedInfo.seed([6F91588C79C30CE:8EAD2A5269605D36]:0)
	at org.junit.Assert.fail(Assert.java:93)
	at org.junit.Assert.assertTrue(Assert.java:43)
	at org.apache.solr.cloud.LeaderFailoverAfterPartitionTest.testRf3WithLeaderFailover(LeaderFailoverAfterPartitionTest.java:171)
	at org.apache.solr.cloud.LeaderFailoverAfterPartitionTest.test(LeaderFailoverAfterPartitionTest.java:56)
	at sun.reflect.NativeMethodAccessorImpl.invoke0(Native Method)
	at sun.reflect.NativeMethodAccessorImpl.invoke(NativeMethodAccessorImpl.java:62)
	at sun.reflect.DelegatingMethodAccessorImpl.invoke(DelegatingMethodAccessorImpl.java:43)
	at java.lang.reflect.Method.invoke(Method.java:497)
	at com.carrotsearch.randomizedtesting.RandomizedRunner.invoke(RandomizedRunner.java:1764)
	at com.carrotsearch.randomizedtesting.RandomizedRunner$8.evaluate(RandomizedRunner.java:871)
	at com.carrotsearch.randomizedtesting.RandomizedRunner$9.evaluate(RandomizedRunner.java:907)
	at com.carrotsearch.randomizedtesting.RandomizedRunner$10.evaluate(RandomizedRunner.java:921)
	at org.apache.solr.BaseDistributedSearchTestCase$ShardsRepeatRule$ShardsFixedStatement.callStatement(BaseDistributedSearchTestCase.java:965)
	at org.apache.solr.BaseDistributedSearchTestCase$ShardsRepeatRule$ShardsStatement.evaluate(BaseDistributedSearchTestCase.java:940)
	at com.carrotsearch.randomizedtesting.rules.SystemPropertiesRestoreRule$1.evaluate(SystemPropertiesRestoreRule.java:57)
	at org.apache.lucene.util.TestRuleSetupTeardownChained$1.evaluate(TestRuleSetupTeardownChained.java:50)
	at org.apache.lucene.util.AbstractBeforeAfterRule$1.evaluate(AbstractBeforeAfterRule.java:46)
	at org.apache.lucene.util.TestRuleThreadAndTestName$1.evaluate(TestRuleThreadAndTestName.java:49)
	at org.apache.lucene.util.TestRuleIgnoreAfterMaxFailures$1.evaluate(TestRuleIgnoreAfterMaxFailures.java:65)
	at org.apache.lucene.util.TestRuleMarkFailure$1.evaluate(TestRuleMarkFailure.java:48)
	at com.carrotsearch.randomizedtesting.rules.StatementAdapter.evaluate(StatementAdapter.java:36)
	at com.carrotsearch.randomizedtesting.ThreadLeakControl$StatementRunner.run(ThreadLeakControl.java:367)
	at com.carrotsearch.randomizedtesting.ThreadLeakControl.forkTimeoutingTask(ThreadLeakControl.java:809)
	at com.carrotsearch.randomizedtesting.ThreadLeakControl$3.evaluate(ThreadLeakControl.java:460)
	at com.carrotsearch.randomizedtesting.RandomizedRunner.runSingleTest(RandomizedRunner.java:880)
	at com.carrotsearch.randomizedtesting.RandomizedRunner$5.evaluate(RandomizedRunner.java:781)
	at com.carrotsearch.randomizedtesting.RandomizedRunner$6.evaluate(RandomizedRunner.java:816)
	at com.carrotsearch.randomizedtesting.RandomizedRunner$7.evaluate(RandomizedRunner.java:827)
	at com.carrotsearch.randomizedtesting.rules.StatementAdapter.evaluate(StatementAdapter.java:36)
	at com.carrotsearch.randomizedtesting.rules.SystemPropertiesRestoreRule$1.evaluate(SystemPropertiesRestoreRule.java:57)
	at org.apache.lucene.util.AbstractBeforeAfterRule$1.evaluate(AbstractBeforeAfterRule.java:46)
	at com.carrotsearch.randomizedtesting.rules.StatementAdapter.evaluate(StatementAdapter.java:36)
	at org.apache.lucene.util.TestRuleStoreClassName$1.evaluate(TestRuleStoreClassName.java:42)
	at com.carrotsearch.randomizedtesting.rules.NoShadowingOrOverridesOnMethodsRule$1.evaluate(NoShadowingOrOverridesOnMethodsRule.java:40)
	at com.carrotsearch.randomizedtesting.rules.NoShadowingOrOverridesOnMethodsRule$1.evaluate(NoShadowingOrOverridesOnMethodsRule.java:40)
	at com.carrotsearch.randomizedtesting.rules.StatementAdapter.evaluate(StatementAdapter.java:36)
	at com.carrotsearch.randomizedtesting.rules.StatementAdapter.evaluate(StatementAdapter.java:36)
	at com.carrotsearch.randomizedtesting.rules.StatementAdapter.evaluate(StatementAdapter.java:36)
	at org.apache.lucene.util.TestRuleAssertionsRequired$1.evaluate(TestRuleAssertionsRequired.java:54)
	at org.apache.lucene.util.TestRuleMarkFailure$1.evaluate(TestRuleMarkFailure.java:48)
	at org.apache.lucene.util.TestRuleIgnoreAfterMaxFailures$1.evaluate(TestRuleIgnoreAfterMaxFailures.java:65)
	at org.apache.lucene.util.TestRuleIgnoreTestSuites$1.evaluate(TestRuleIgnoreTestSuites.java:55)
	at com.carrotsearch.randomizedtesting.rules.StatementAdapter.evaluate(StatementAdapter.java:36)
	at com.carrotsearch.randomizedtesting.ThreadLeakControl$StatementRunner.run(ThreadLeakControl.java:367)
	at java.lang.Thread.run(Thread.java:745)


FAILED:  org.apache.solr.core.TestArbitraryIndexDir.testLoadNewIndexDir

Error Message:
Exception during query

Stack Trace:
java.lang.RuntimeException: Exception during query
	at __randomizedtesting.SeedInfo.seed([6F91588C79C30CE:EFA3AEB05905A066]:0)
	at org.apache.solr.SolrTestCaseJ4.assertQ(SolrTestCaseJ4.java:755)
	at org.apache.solr.core.TestArbitraryIndexDir.testLoadNewIndexDir(TestArbitraryIndexDir.java:107)
	at sun.reflect.NativeMethodAccessorImpl.invoke0(Native Method)
	at sun.reflect.NativeMethodAccessorImpl.invoke(NativeMethodAccessorImpl.java:62)
	at sun.reflect.DelegatingMethodAccessorImpl.invoke(DelegatingMethodAccessorImpl.java:43)
	at java.lang.reflect.Method.invoke(Method.java:497)
	at com.carrotsearch.randomizedtesting.RandomizedRunner.invoke(RandomizedRunner.java:1764)
	at com.carrotsearch.randomizedtesting.RandomizedRunner$8.evaluate(RandomizedRunner.java:871)
	at com.carrotsearch.randomizedtesting.RandomizedRunner$9.evaluate(RandomizedRunner.java:907)
	at com.carrotsearch.randomizedtesting.RandomizedRunner$10.evaluate(RandomizedRunner.java:921)
	at com.carrotsearch.randomizedtesting.rules.SystemPropertiesRestoreRule$1.evaluate(SystemPropertiesRestoreRule.java:57)
	at com.carrotsearch.randomizedtesting.rules.SystemPropertiesRestoreRule$1.evaluate(SystemPropertiesRestoreRule.java:57)
	at org.apache.lucene.util.TestRuleSetupTeardownChained$1.evaluate(TestRuleSetupTeardownChained.java:50)
	at org.apache.lucene.util.AbstractBeforeAfterRule$1.evaluate(AbstractBeforeAfterRule.java:46)
	at org.apache.lucene.util.TestRuleThreadAndTestName$1.evaluate(TestRuleThreadAndTestName.java:49)
	at org.apache.lucene.util.TestRuleIgnoreAfterMaxFailures$1.evaluate(TestRuleIgnoreAfterMaxFailures.java:65)
	at org.apache.lucene.util.TestRuleMarkFailure$1.evaluate(TestRuleMarkFailure.java:48)
	at com.carrotsearch.randomizedtesting.rules.StatementAdapter.evaluate(StatementAdapter.java:36)
	at com.carrotsearch.randomizedtesting.ThreadLeakControl$StatementRunner.run(ThreadLeakControl.java:367)
	at com.carrotsearch.randomizedtesting.ThreadLeakControl.forkTimeoutingTask(ThreadLeakControl.java:809)
	at com.carrotsearch.randomizedtesting.ThreadLeakControl$3.evaluate(ThreadLeakControl.java:460)
	at com.carrotsearch.randomizedtesting.RandomizedRunner.runSingleTest(RandomizedRunner.java:880)
	at com.carrotsearch.randomizedtesting.RandomizedRunner$5.evaluate(RandomizedRunner.java:781)
	at com.carrotsearch.randomizedtesting.RandomizedRunner$6.evaluate(RandomizedRunner.java:816)
	at com.carrotsearch.randomizedtesting.RandomizedRunner$7.evaluate(RandomizedRunner.java:827)
	at com.carrotsearch.randomizedtesting.rules.StatementAdapter.evaluate(StatementAdapter.java:36)
	at com.carrotsearch.randomizedtesting.rules.SystemPropertiesRestoreRule$1.evaluate(SystemPropertiesRestoreRule.java:57)
	at org.apache.lucene.util.AbstractBeforeAfterRule$1.evaluate(AbstractBeforeAfterRule.java:46)
	at com.carrotsearch.randomizedtesting.rules.StatementAdapter.evaluate(StatementAdapter.java:36)
	at org.apache.lucene.util.TestRuleStoreClassName$1.evaluate(TestRuleStoreClassName.java:42)
	at com.carrotsearch.randomizedtesting.rules.NoShadowingOrOverridesOnMethodsRule$1.evaluate(NoShadowingOrOverridesOnMethodsRule.java:40)
	at com.carrotsearch.randomizedtesting.rules.NoShadowingOrOverridesOnMethodsRule$1.evaluate(NoShadowingOrOverridesOnMethodsRule.java:40)
	at com.carrotsearch.randomizedtesting.rules.StatementAdapter.evaluate(StatementAdapter.java:36)
	at com.carrotsearch.randomizedtesting.rules.StatementAdapter.evaluate(StatementAdapter.java:36)
	at com.carrotsearch.randomizedtesting.rules.StatementAdapter.evaluate(StatementAdapter.java:36)
	at org.apache.lucene.util.TestRuleAssertionsRequired$1.evaluate(TestRuleAssertionsRequired.java:54)
	at org.apache.lucene.util.TestRuleMarkFailure$1.evaluate(TestRuleMarkFailure.java:48)
	at org.apache.lucene.util.TestRuleIgnoreAfterMaxFailures$1.evaluate(TestRuleIgnoreAfterMaxFailures.java:65)
	at org.apache.lucene.util.TestRuleIgnoreTestSuites$1.evaluate(TestRuleIgnoreTestSuites.java:55)
	at com.carrotsearch.randomizedtesting.rules.StatementAdapter.evaluate(StatementAdapter.java:36)
	at com.carrotsearch.randomizedtesting.ThreadLeakControl$StatementRunner.run(ThreadLeakControl.java:367)
	at java.lang.Thread.run(Thread.java:745)
Caused by: java.lang.RuntimeException: REQUEST FAILED: xpath=*[count(//doc)=1]
	xml response was: <?xml version="1.0" encoding="UTF-8"?>
<response>
<lst name="responseHeader"><int name="status">0</int><int name="QTime">0</int></lst><result name="response" numFound="0" start="0"></result>
</response>

	request was:q=id:2&qt=standard&start=0&rows=20&version=2.2
	at org.apache.solr.SolrTestCaseJ4.assertQ(SolrTestCaseJ4.java:748)
	... 41 more




Build Log:
[...truncated 10417 lines...]
   [junit4] Suite: org.apache.solr.core.TestArbitraryIndexDir
   [junit4]   2> Creating dataDir: /export/home/jenkins/workspace/Lucene-Solr-trunk-Solaris/solr/build/solr-core/test/J0/temp/solr.core.TestArbitraryIndexDir_6F91588C79C30CE-001/init-core-data-001
   [junit4]   2> 1941173 INFO  (SUITE-TestArbitraryIndexDir-seed#[6F91588C79C30CE]-worker) [    ] o.a.s.SolrTestCaseJ4 Randomized ssl (false) and clientAuth (false)
   [junit4]   2> 1941175 INFO  (TEST-TestArbitraryIndexDir.testLoadNewIndexDir-seed#[6F91588C79C30CE]) [    ] o.a.s.SolrTestCaseJ4 ###Starting testLoadNewIndexDir
   [junit4]   2> 1941175 INFO  (TEST-TestArbitraryIndexDir.testLoadNewIndexDir-seed#[6F91588C79C30CE]) [    ] o.a.s.SolrTestCaseJ4 ####initCore
   [junit4]   2> 1941175 INFO  (TEST-TestArbitraryIndexDir.testLoadNewIndexDir-seed#[6F91588C79C30CE]) [    ] o.a.s.c.SolrResourceLoader new SolrResourceLoader for directory: '/export/home/jenkins/workspace/Lucene-Solr-trunk-Solaris/solr/core/src/test-files/solr/collection1'
   [junit4]   2> 1941175 INFO  (TEST-TestArbitraryIndexDir.testLoadNewIndexDir-seed#[6F91588C79C30CE]) [    ] o.a.s.c.SolrResourceLoader JNDI not configured for solr (NoInitialContextEx)
   [junit4]   2> 1941176 INFO  (TEST-TestArbitraryIndexDir.testLoadNewIndexDir-seed#[6F91588C79C30CE]) [    ] o.a.s.c.SolrResourceLoader using system property solr.solr.home: /export/home/jenkins/workspace/Lucene-Solr-trunk-Solaris/solr/core/src/test-files/solr
   [junit4]   2> 1941176 INFO  (TEST-TestArbitraryIndexDir.testLoadNewIndexDir-seed#[6F91588C79C30CE]) [    ] o.a.s.c.SolrResourceLoader Adding 'file:/export/home/jenkins/workspace/Lucene-Solr-trunk-Solaris/solr/core/src/test-files/solr/collection1/lib/classes/' to classloader
   [junit4]   2> 1941176 INFO  (TEST-TestArbitraryIndexDir.testLoadNewIndexDir-seed#[6F91588C79C30CE]) [    ] o.a.s.c.SolrResourceLoader Adding 'file:/export/home/jenkins/workspace/Lucene-Solr-trunk-Solaris/solr/core/src/test-files/solr/collection1/lib/README' to classloader
   [junit4]   2> 1941200 INFO  (TEST-TestArbitraryIndexDir.testLoadNewIndexDir-seed#[6F91588C79C30CE]) [    ] o.a.s.c.SolrConfig current version of requestparams : -1
   [junit4]   2> 1941207 INFO  (TEST-TestArbitraryIndexDir.testLoadNewIndexDir-seed#[6F91588C79C30CE]) [    ] o.a.s.c.SolrConfig Using Lucene MatchVersion: 6.0.0
   [junit4]   2> 1941223 INFO  (TEST-TestArbitraryIndexDir.testLoadNewIndexDir-seed#[6F91588C79C30CE]) [    ] o.a.s.c.SolrConfig Loaded SolrConfig: solrconfig.xml
   [junit4]   2> 1941227 INFO  (TEST-TestArbitraryIndexDir.testLoadNewIndexDir-seed#[6F91588C79C30CE]) [    ] o.a.s.s.IndexSchema [null] Schema name=test
   [junit4]   2> 1941282 INFO  (TEST-TestArbitraryIndexDir.testLoadNewIndexDir-seed#[6F91588C79C30CE]) [    ] o.a.s.s.IndexSchema default search field in schema is text
   [junit4]   2> 1941283 INFO  (TEST-TestArbitraryIndexDir.testLoadNewIndexDir-seed#[6F91588C79C30CE]) [    ] o.a.s.s.IndexSchema unique key field: id
   [junit4]   2> 1941283 WARN  (TEST-TestArbitraryIndexDir.testLoadNewIndexDir-seed#[6F91588C79C30CE]) [    ] o.a.s.s.IndexSchema Field text is not multivalued and destination for multiple copyFields (2)
   [junit4]   2> 1941299 INFO  (TEST-TestArbitraryIndexDir.testLoadNewIndexDir-seed#[6F91588C79C30CE]) [    ] o.a.s.s.FileExchangeRateProvider Reloading exchange rates from file currency.xml
   [junit4]   2> 1941300 INFO  (TEST-TestArbitraryIndexDir.testLoadNewIndexDir-seed#[6F91588C79C30CE]) [    ] o.a.s.s.FileExchangeRateProvider Reloading exchange rates from file currency.xml
   [junit4]   2> 1941302 INFO  (TEST-TestArbitraryIndexDir.testLoadNewIndexDir-seed#[6F91588C79C30CE]) [    ] o.a.s.c.SolrResourceLoader JNDI not configured for solr (NoInitialContextEx)
   [junit4]   2> 1941302 INFO  (TEST-TestArbitraryIndexDir.testLoadNewIndexDir-seed#[6F91588C79C30CE]) [    ] o.a.s.c.SolrResourceLoader using system property solr.solr.home: /export/home/jenkins/workspace/Lucene-Solr-trunk-Solaris/solr/core/src/test-files/solr
   [junit4]   2> 1941302 INFO  (TEST-TestArbitraryIndexDir.testLoadNewIndexDir-seed#[6F91588C79C30CE]) [    ] o.a.s.c.SolrResourceLoader new SolrResourceLoader for directory: '/export/home/jenkins/workspace/Lucene-Solr-trunk-Solaris/solr/core/src/test-files/solr'
   [junit4]   2> 1941302 INFO  (TEST-TestArbitraryIndexDir.testLoadNewIndexDir-seed#[6F91588C79C30CE]) [    ] o.a.s.c.SolrResourceLoader JNDI not configured for solr (NoInitialContextEx)
   [junit4]   2> 1941302 INFO  (TEST-TestArbitraryIndexDir.testLoadNewIndexDir-seed#[6F91588C79C30CE]) [    ] o.a.s.c.SolrResourceLoader using system property solr.solr.home: /export/home/jenkins/workspace/Lucene-Solr-trunk-Solaris/solr/core/src/test-files/solr
   [junit4]   2> 1941302 INFO  (TEST-TestArbitraryIndexDir.testLoadNewIndexDir-seed#[6F91588C79C30CE]) [    ] o.a.s.c.CoreContainer New CoreContainer 812298308
   [junit4]   2> 1941302 INFO  (TEST-TestArbitraryIndexDir.testLoadNewIndexDir-seed#[6F91588C79C30CE]) [    ] o.a.s.c.CoreContainer Loading cores into CoreContainer [instanceDir=/export/home/jenkins/workspace/Lucene-Solr-trunk-Solaris/solr/core/src/test-files/solr]
   [junit4]   2> 1941302 WARN  (TEST-TestArbitraryIndexDir.testLoadNewIndexDir-seed#[6F91588C79C30CE]) [    ] o.a.s.c.CoreContainer Couldn't add files from /export/home/jenkins/workspace/Lucene-Solr-trunk-Solaris/solr/core/src/test-files/solr/lib to classpath: /export/home/jenkins/workspace/Lucene-Solr-trunk-Solaris/solr/core/src/test-files/solr/lib
   [junit4]   2> 1941303 INFO  (TEST-TestArbitraryIndexDir.testLoadNewIndexDir-seed#[6F91588C79C30CE]) [    ] o.a.s.h.c.HttpShardHandlerFactory created with socketTimeout : 600000,connTimeout : 60000,maxConnectionsPerHost : 20,maxConnections : 10000,corePoolSize : 0,maximumPoolSize : 2147483647,maxThreadIdleTime : 5,sizeOfQueue : -1,fairnessPolicy : false,useRetries : false,
   [junit4]   2> 1941308 INFO  (TEST-TestArbitraryIndexDir.testLoadNewIndexDir-seed#[6F91588C79C30CE]) [    ] o.a.s.u.UpdateShardHandler Creating UpdateShardHandler HTTP client with params: socketTimeout=30000&connTimeout=30000&retry=true
   [junit4]   2> 1941309 INFO  (TEST-TestArbitraryIndexDir.testLoadNewIndexDir-seed#[6F91588C79C30CE]) [    ] o.a.s.l.LogWatcher SLF4J impl is org.slf4j.impl.Log4jLoggerFactory
   [junit4]   2> 1941309 INFO  (TEST-TestArbitraryIndexDir.testLoadNewIndexDir-seed#[6F91588C79C30CE]) [    ] o.a.s.l.LogWatcher Registering Log Listener [Log4j (org.slf4j.impl.Log4jLoggerFactory)]
   [junit4]   2> 1941309 INFO  (TEST-TestArbitraryIndexDir.testLoadNewIndexDir-seed#[6F91588C79C30CE]) [    ] o.a.s.c.CoreContainer Security conf doesn't exist. Skipping setup for authorization module.
   [junit4]   2> 1941309 INFO  (TEST-TestArbitraryIndexDir.testLoadNewIndexDir-seed#[6F91588C79C30CE]) [    ] o.a.s.c.CoreContainer No authentication plugin used.
   [junit4]   2> 1941310 INFO  (TEST-TestArbitraryIndexDir.testLoadNewIndexDir-seed#[6F91588C79C30CE]) [    ] o.a.s.c.CoreDescriptor Created CoreDescriptor: {name=collection1, config=solrconfig.xml, transient=false, schema=schema12.xml, loadOnStartup=true, configSetProperties=configsetprops.json, collection=collection1, dataDir=/export/home/jenkins/workspace/Lucene-Solr-trunk-Solaris/solr/build/solr-core/test/J0/temp/solr.core.TestArbitraryIndexDir_6F91588C79C30CE-001/init-core-data-001, shard=shard1}
   [junit4]   2> 1941310 INFO  (coreLoadExecutor-5045-thread-1) [    ] o.a.s.c.SolrResourceLoader new SolrResourceLoader for directory: '/export/home/jenkins/workspace/Lucene-Solr-trunk-Solaris/solr/core/src/test-files/solr/collection1'
   [junit4]   2> 1941311 INFO  (coreLoadExecutor-5045-thread-1) [    ] o.a.s.c.SolrResourceLoader JNDI not configured for solr (NoInitialContextEx)
   [junit4]   2> 1941311 INFO  (coreLoadExecutor-5045-thread-1) [    ] o.a.s.c.SolrResourceLoader using system property solr.solr.home: /export/home/jenkins/workspace/Lucene-Solr-trunk-Solaris/solr/core/src/test-files/solr
   [junit4]   2> 1941311 INFO  (coreLoadExecutor-5045-thread-1) [    ] o.a.s.c.SolrResourceLoader Adding 'file:/export/home/jenkins/workspace/Lucene-Solr-trunk-Solaris/solr/core/src/test-files/solr/collection1/lib/classes/' to classloader
   [junit4]   2> 1941311 INFO  (coreLoadExecutor-5045-thread-1) [    ] o.a.s.c.SolrResourceLoader Adding 'file:/export/home/jenkins/workspace/Lucene-Solr-trunk-Solaris/solr/core/src/test-files/solr/collection1/lib/README' to classloader
   [junit4]   2> 1941329 INFO  (coreLoadExecutor-5045-thread-1) [    ] o.a.s.c.SolrConfig current version of requestparams : -1
   [junit4]   2> 1941336 INFO  (coreLoadExecutor-5045-thread-1) [    ] o.a.s.c.SolrConfig Using Lucene MatchVersion: 6.0.0
   [junit4]   2> 1941350 INFO  (coreLoadExecutor-5045-thread-1) [    ] o.a.s.c.SolrConfig Loaded SolrConfig: solrconfig.xml
   [junit4]   2> 1941354 INFO  (coreLoadExecutor-5045-thread-1) [    ] o.a.s.s.IndexSchema [collection1] Schema name=test
   [junit4]   2> 1941409 INFO  (coreLoadExecutor-5045-thread-1) [    ] o.a.s.s.IndexSchema default search field in schema is text
   [junit4]   2> 1941410 INFO  (coreLoadExecutor-5045-thread-1) [    ] o.a.s.s.IndexSchema unique key field: id
   [junit4]   2> 1941410 WARN  (coreLoadExecutor-5045-thread-1) [    ] o.a.s.s.IndexSchema Field text is not multivalued and destination for multiple copyFields (2)
   [junit4]   2> 1941419 INFO  (coreLoadExecutor-5045-thread-1) [    ] o.a.s.s.FileExchangeRateProvider Reloading exchange rates from file currency.xml
   [junit4]   2> 1941429 INFO  (coreLoadExecutor-5045-thread-1) [    ] o.a.s.s.FileExchangeRateProvider Reloading exchange rates from file currency.xml
   [junit4]   2> 1941436 INFO  (coreLoadExecutor-5045-thread-1) [    ] o.a.s.c.ConfigSetProperties Did not find ConfigSet properties, assuming default properties: Can't find resource 'configsetprops.json' in classpath or '/export/home/jenkins/workspace/Lucene-Solr-trunk-Solaris/solr/core/src/test-files/solr/collection1'
   [junit4]   2> 1941436 INFO  (coreLoadExecutor-5045-thread-1) [    ] o.a.s.c.CoreContainer Creating SolrCore 'collection1' using configuration from instancedir /export/home/jenkins/workspace/Lucene-Solr-trunk-Solaris/solr/core/src/test-files/solr/collection1
   [junit4]   2> 1941436 INFO  (coreLoadExecutor-5045-thread-1) [    x:collection1] o.a.s.c.SolrCore org.apache.solr.core.MockFSDirectoryFactory
   [junit4]   2> 1941436 INFO  (coreLoadExecutor-5045-thread-1) [    x:collection1] o.a.s.c.SolrCore [[collection1] ] Opening new SolrCore at [/export/home/jenkins/workspace/Lucene-Solr-trunk-Solaris/solr/core/src/test-files/solr/collection1], dataDir=[/export/home/jenkins/workspace/Lucene-Solr-trunk-Solaris/solr/build/solr-core/test/J0/temp/solr.core.TestArbitraryIndexDir_6F91588C79C30CE-001/init-core-data-001/]
   [junit4]   2> 1941436 INFO  (coreLoadExecutor-5045-thread-1) [    x:collection1] o.a.s.c.JmxMonitoredMap JMX monitoring is enabled. Adding Solr mbeans to JMX Server: com.sun.jmx.mbeanserver.JmxMBeanServer@1a5b5a52
   [junit4]   2> 1941437 INFO  (coreLoadExecutor-5045-thread-1) [    x:collection1] o.a.s.c.CachingDirectoryFactory return new directory for /export/home/jenkins/workspace/Lucene-Solr-trunk-Solaris/solr/build/solr-core/test/J0/temp/solr.core.TestArbitraryIndexDir_6F91588C79C30CE-001/init-core-data-001
   [junit4]   2> 1941442 INFO  (coreLoadExecutor-5045-thread-1) [    x:collection1] o.a.s.c.SolrCore New index directory detected: old=null new=/export/home/jenkins/workspace/Lucene-Solr-trunk-Solaris/solr/build/solr-core/test/J0/temp/solr.core.TestArbitraryIndexDir_6F91588C79C30CE-001/init-core-data-001/index/
   [junit4]   2> 1941443 WARN  (coreLoadExecutor-5045-thread-1) [    x:collection1] o.a.s.c.SolrCore [collection1] Solr index directory '/export/home/jenkins/workspace/Lucene-Solr-trunk-Solaris/solr/build/solr-core/test/J0/temp/solr.core.TestArbitraryIndexDir_6F91588C79C30CE-001/init-core-data-001/index' doesn't exist. Creating new index...
   [junit4]   2> 1941443 INFO  (coreLoadExecutor-5045-thread-1) [    x:collection1] o.a.s.c.CachingDirectoryFactory return new directory for /export/home/jenkins/workspace/Lucene-Solr-trunk-Solaris/solr/build/solr-core/test/J0/temp/solr.core.TestArbitraryIndexDir_6F91588C79C30CE-001/init-core-data-001/index
   [junit4]   2> 1941443 INFO  (coreLoadExecutor-5045-thread-1) [    x:collection1] o.a.s.u.RandomMergePolicy RandomMergePolicy wrapping class org.apache.lucene.index.TieredMergePolicy: [TieredMergePolicy: maxMergeAtOnce=46, maxMergeAtOnceExplicit=42, maxMergedSegmentMB=87.390625, floorSegmentMB=0.37109375, forceMergeDeletesPctAllowed=17.250358285952743, segmentsPerTier=16.0, maxCFSSegmentSizeMB=8.796093022207999E12, noCFSRatio=1.0
   [junit4]   2> 1941476 INFO  (coreLoadExecutor-5045-thread-1) [    x:collection1] o.a.s.c.SolrDeletionPolicy SolrDeletionPolicy.onCommit: commits: num=1
   [junit4]   2> 	commit{dir=MockDirectoryWrapper(MMapDirectory@/export/home/jenkins/workspace/Lucene-Solr-trunk-Solaris/solr/build/solr-core/test/J0/temp/solr.core.TestArbitraryIndexDir_6F91588C79C30CE-001/init-core-data-001/index lockFactory=org.apache.lucene.store.SingleInstanceLockFactory@6a8ce771),segFN=segments_1,generation=1}
   [junit4]   2> 1941476 INFO  (coreLoadExecutor-5045-thread-1) [    x:collection1] o.a.s.c.SolrDeletionPolicy newest commit generation = 1
   [junit4]   2> 1941476 INFO  (OldIndexDirectoryCleanupThreadForCore-collection1) [    x:collection1] o.a.s.c.SolrCore Looking for old index directories to cleanup for core collection1 in /export/home/jenkins/workspace/Lucene-Solr-trunk-Solaris/solr/build/solr-core/test/J0/temp/solr.core.TestArbitraryIndexDir_6F91588C79C30CE-001/init-core-data-001/
   [junit4]   2> 1941479 INFO  (coreLoadExecutor-5045-thread-1) [    x:collection1] o.a.s.u.p.UpdateRequestProcessorChain creating updateRequestProcessorChain "dedupe"
   [junit4]   2> 1941479 INFO  (coreLoadExecutor-5045-thread-1) [    x:collection1] o.a.s.u.p.UpdateRequestProcessorChain inserting DistributedUpdateProcessorFactory into updateRequestProcessorChain "dedupe"
   [junit4]   2> 1941479 INFO  (coreLoadExecutor-5045-thread-1) [    x:collection1] o.a.s.u.p.UpdateRequestProcessorChain creating updateRequestProcessorChain "dedupe-allfields"
   [junit4]   2> 1941479 INFO  (coreLoadExecutor-5045-thread-1) [    x:collection1] o.a.s.u.p.UpdateRequestProcessorChain inserting DistributedUpdateProcessorFactory into updateRequestProcessorChain "dedupe-allfields"
   [junit4]   2> 1941479 INFO  (coreLoadExecutor-5045-thread-1) [    x:collection1] o.a.s.u.p.UpdateRequestProcessorChain creating updateRequestProcessorChain "stored_sig"
   [junit4]   2> 1941479 INFO  (coreLoadExecutor-5045-thread-1) [    x:collection1] o.a.s.u.p.UpdateRequestProcessorChain inserting DistributedUpdateProcessorFactory into updateRequestProcessorChain "stored_sig"
   [junit4]   2> 1941479 INFO  (coreLoadExecutor-5045-thread-1) [    x:collection1] o.a.s.u.p.UpdateRequestProcessorChain creating updateRequestProcessorChain "uniq-fields"
   [junit4]   2> 1941479 INFO  (coreLoadExecutor-5045-thread-1) [    x:collection1] o.a.s.u.p.UpdateRequestProcessorChain inserting DistributedUpdateProcessorFactory into updateRequestProcessorChain "uniq-fields"
   [junit4]   2> 1941479 INFO  (coreLoadExecutor-5045-thread-1) [    x:collection1] o.a.s.u.p.UpdateRequestProcessorChain creating updateRequestProcessorChain "distrib-dup-test-chain-explicit"
   [junit4]   2> 1941480 INFO  (coreLoadExecutor-5045-thread-1) [    x:collection1] o.a.s.u.p.UpdateRequestProcessorChain creating updateRequestProcessorChain "distrib-dup-test-chain-implicit"
   [junit4]   2> 1941480 INFO  (coreLoadExecutor-5045-thread-1) [    x:collection1] o.a.s.u.p.UpdateRequestProcessorChain inserting DistributedUpdateProcessorFactory into updateRequestProcessorChain "distrib-dup-test-chain-implicit"
   [junit4]   2> 1941480 INFO  (coreLoadExecutor-5045-thread-1) [    x:collection1] o.a.s.c.SolrCore no updateRequestProcessorChain defined as default, creating implicit default
   [junit4]   2> 1941482 INFO  (coreLoadExecutor-5045-thread-1) [    x:collection1] o.a.s.h.l.XMLLoader xsltCacheLifetimeSeconds=60
   [junit4]   2> 1941482 INFO  (coreLoadExecutor-5045-thread-1) [    x:collection1] o.a.s.h.l.XMLLoader xsltCacheLifetimeSeconds=60
   [junit4]   2> 1941483 INFO  (coreLoadExecutor-5045-thread-1) [    x:collection1] o.a.s.h.l.XMLLoader xsltCacheLifetimeSeconds=60
   [junit4]   2> 1941485 INFO  (coreLoadExecutor-5045-thread-1) [    x:collection1] o.a.s.h.l.XMLLoader xsltCacheLifetimeSeconds=60
   [junit4]   2> 1941487 INFO  (coreLoadExecutor-5045-thread-1) [    x:collection1] o.a.s.c.PluginBag requestHandler : 'lazy' created with startup=lazy 
   [junit4]   2> 1941499 INFO  (coreLoadExecutor-5045-thread-1) [    x:collection1] o.a.s.c.RequestHandlers Registered paths: /admin/mbeans,standard,spellCheckCompRH,lazy,/update/json/docs,/admin/luke,/export,spellCheckWithWordbreak_Direct,tvrh,/get,/admin/properties,/update/json,mltrh,/admin/threads,/search-facet-def,/update/csv,/sql,/search-facet-invariants,/admin/segments,spellCheckCompRH1,/mlt,/admin/system,/replication,dismax,defaults,/config,/stream,/schema,/admin/plugins,/admin/logging,spellCheckWithWordbreak,mock,/admin/ping,/update,/admin/file,/terms,spellCheckCompRH_Direct,/debug/dump
   [junit4]   2> 1941500 WARN  (coreLoadExecutor-5045-thread-1) [    x:collection1] o.a.s.c.SolrCore solrconfig.xml uses deprecated <admin/gettableFiles>, Please update your config to use the ShowFileRequestHandler.
   [junit4]   2> 1941500 INFO  (coreLoadExecutor-5045-thread-1) [    x:collection1] o.a.s.c.SolrCore Using default statsCache cache: org.apache.solr.search.stats.LocalStatsCache
   [junit4]   2> 1941500 INFO  (coreLoadExecutor-5045-thread-1) [    x:collection1] o.a.s.u.CommitTracker Hard AutoCommit: disabled
   [junit4]   2> 1941500 INFO  (coreLoadExecutor-5045-thread-1) [    x:collection1] o.a.s.u.CommitTracker Soft AutoCommit: disabled
   [junit4]   2> 1941501 INFO  (coreLoadExecutor-5045-thread-1) [    x:collection1] o.a.s.u.RandomMergePolicy RandomMergePolicy wrapping class org.apache.lucene.index.TieredMergePolicy: [TieredMergePolicy: maxMergeAtOnce=10, maxMergeAtOnceExplicit=11, maxMergedSegmentMB=99.6396484375, floorSegmentMB=1.26953125, forceMergeDeletesPctAllowed=26.903302972067472, segmentsPerTier=44.0, maxCFSSegmentSizeMB=8.796093022207999E12, noCFSRatio=0.294969917283319
   [junit4]   2> 1941501 INFO  (coreLoadExecutor-5045-thread-1) [    x:collection1] o.a.s.c.SolrDeletionPolicy SolrDeletionPolicy.onInit: commits: num=1
   [junit4]   2> 	commit{dir=MockDirectoryWrapper(MMapDirectory@/export/home/jenkins/workspace/Lucene-Solr-trunk-Solaris/solr/build/solr-core/test/J0/temp/solr.core.TestArbitraryIndexDir_6F91588C79C30CE-001/init-core-data-001/index lockFactory=org.apache.lucene.store.SingleInstanceLockFactory@6a8ce771),segFN=segments_1,generation=1}
   [junit4]   2> 1941501 INFO  (coreLoadExecutor-5045-thread-1) [    x:collection1] o.a.s.c.SolrDeletionPolicy newest commit generation = 1
   [junit4]   2> 1941502 INFO  (coreLoadExecutor-5045-thread-1) [    x:collection1] o.a.s.s.SolrIndexSearcher Opening Searcher@65d5ee98[collection1] main
   [junit4]   2> 1941502 INFO  (coreLoadExecutor-5045-thread-1) [    x:collection1] o.a.s.r.RestManager Initializing RestManager with initArgs: {storageIO=org.apache.solr.rest.ManagedResourceStorage$InMemoryStorageIO}
   [junit4]   2> 1941502 INFO  (coreLoadExecutor-5045-thread-1) [    x:collection1] o.a.s.r.ManagedResourceStorage Reading _rest_managed.json using InMemoryStorage
   [junit4]   2> 1941502 INFO  (coreLoadExecutor-5045-thread-1) [    x:collection1] o.a.s.r.RestManager Initializing 0 registered ManagedResources
   [junit4]   2> 1941502 INFO  (coreLoadExecutor-5045-thread-1) [    x:collection1] o.a.s.h.c.SpellCheckComponent Initializing spell checkers
   [junit4]   2> 1941511 INFO  (coreLoadExecutor-5045-thread-1) [    x:collection1] o.a.s.s.DirectSolrSpellChecker init: {name=direct,classname=DirectSolrSpellChecker,field=lowerfilt,minQueryLength=3}
   [junit4]   2> 1941568 INFO  (coreLoadExecutor-5045-thread-1) [    x:collection1] o.a.s.h.ReplicationHandler Commits will be reserved for  10000
   [junit4]   2> 1941568 INFO  (searcherExecutor-5046-thread-1-processing-x:collection1) [    x:collection1] o.a.s.h.c.SpellCheckComponent Loading spell index for spellchecker: default
   [junit4]   2> 1941568 INFO  (searcherExecutor-5046-thread-1-processing-x:collection1) [    x:collection1] o.a.s.h.c.SpellCheckComponent Loading spell index for spellchecker: direct
   [junit4]   2> 1941568 INFO  (searcherExecutor-5046-thread-1-processing-x:collection1) [    x:collection1] o.a.s.h.c.SpellCheckComponent Loading spell index for spellchecker: wordbreak
   [junit4]   2> 1941568 INFO  (searcherExecutor-5046-thread-1-processing-x:collection1) [    x:collection1] o.a.s.h.c.SpellCheckComponent Loading spell index for spellchecker: multipleFields
   [junit4]   2> 1941568 INFO  (coreLoadExecutor-5045-thread-1) [    x:collection1] o.a.s.c.CoreContainer registering core: collection1
   [junit4]   2> 1941569 INFO  (searcherExecutor-5046-thread-1-processing-x:collection1) [    x:collection1] o.a.s.h.c.SpellCheckComponent Loading spell index for spellchecker: jarowinkler
   [junit4]   2> 1941569 INFO  (searcherExecutor-5046-thread-1-processing-x:collection1) [    x:collection1] o.a.s.h.c.SpellCheckComponent Loading spell index for spellchecker: external
   [junit4]   2> 1941569 INFO  (searcherExecutor-5046-thread-1-processing-x:collection1) [    x:collection1] o.a.s.h.c.SpellCheckComponent Loading spell index for spellchecker: freq
   [junit4]   2> 1941569 INFO  (TEST-TestArbitraryIndexDir.testLoadNewIndexDir-seed#[6F91588C79C30CE]) [    ] o.a.s.SolrTestCaseJ4 ####initCore end
   [junit4]   2> 1941570 INFO  (searcherExecutor-5046-thread-1-processing-x:collection1) [    x:collection1] o.a.s.h.c.SpellCheckComponent Loading spell index for spellchecker: fqcn
   [junit4]   2> 1941570 INFO  (searcherExecutor-5046-thread-1-processing-x:collection1) [    x:collection1] o.a.s.h.c.SpellCheckComponent Loading spell index for spellchecker: perDict
   [junit4]   2> 1941571 INFO  (searcherExecutor-5046-thread-1-processing-x:collection1) [    x:collection1] o.a.s.c.SolrCore [collection1] Registered new searcher Searcher@65d5ee98[collection1] main{ExitableDirectoryReader(UninvertingDirectoryReader())}
   [junit4]   2> 1941571 INFO  (TEST-TestArbitraryIndexDir.testLoadNewIndexDir-seed#[6F91588C79C30CE]) [    ] o.a.s.u.p.LogUpdateProcessorFactory [collection1]  webapp=null path=null params={}{add=[1]} 0 1
   [junit4]   2> 1941609 INFO  (TEST-TestArbitraryIndexDir.testLoadNewIndexDir-seed#[6F91588C79C30CE]) [    ] o.a.s.u.DirectUpdateHandler2 start commit{,optimize=false,openSearcher=true,waitSearcher=true,expungeDeletes=false,softCommit=false,prepareCommit=false}
   [junit4]   2> 1941707 INFO  (TEST-TestArbitraryIndexDir.testLoadNewIndexDir-seed#[6F91588C79C30CE]) [    ] o.a.s.c.SolrDeletionPolicy SolrDeletionPolicy.onCommit: commits: num=2
   [junit4]   2> 	commit{dir=MockDirectoryWrapper(MMapDirectory@/export/home/jenkins/workspace/Lucene-Solr-trunk-Solaris/solr/build/solr-core/test/J0/temp/solr.core.TestArbitraryIndexDir_6F91588C79C30CE-001/init-core-data-001/index lockFactory=org.apache.lucene.store.SingleInstanceLockFactory@6a8ce771),segFN=segments_1,generation=1}
   [junit4]   2> 	commit{dir=MockDirectoryWrapper(MMapDirectory@/export/home/jenkins/workspace/Lucene-Solr-trunk-Solaris/solr/build/solr-core/test/J0/temp/solr.core.TestArbitraryIndexDir_6F91588C79C30CE-001/init-core-data-001/index lockFactory=org.apache.lucene.store.SingleInstanceLockFactory@6a8ce771),segFN=segments_2,generation=2}
   [junit4]   2> 1941708 INFO  (TEST-TestArbitraryIndexDir.testLoadNewIndexDir-seed#[6F91588C79C30CE]) [    ] o.a.s.c.SolrDeletionPolicy newest commit generation = 2
   [junit4]   2> 1941709 INFO  (TEST-TestArbitraryIndexDir.testLoadNewIndexDir-seed#[6F91588C79C30CE]) [    ] o.a.s.c.SolrCore New index directory detected: old=/export/home/jenkins/workspace/Lucene-Solr-trunk-Solaris/solr/build/solr-core/test/J0/temp/solr.core.TestArbitraryIndexDir_6F91588C79C30CE-001/init-core-data-001/index/ new=/export/home/jenkins/workspace/Lucene-Solr-trunk-Solaris/solr/build/solr-core/test/J0/temp/solr.core.TestArbitraryIndexDir_6F91588C79C30CE-001/init-core-data-001/index_temp
   [junit4]   2> 1941713 INFO  (TEST-TestArbitraryIndexDir.testLoadNewIndexDir-seed#[6F91588C79C30CE]) [    ] o.a.s.s.SolrIndexSearcher Opening Searcher@1bf3208[collection1] main
   [junit4]   2> 1941713 INFO  (TEST-TestArbitraryIndexDir.testLoadNewIndexDir-seed#[6F91588C79C30CE]) [    ] o.a.s.u.DirectUpdateHandler2 end_commit_flush
   [junit4]   2> 1941714 INFO  (searcherExecutor-5046-thread-1) [    ] o.a.s.c.SolrCore [collection1] Registered new searcher Searcher@1bf3208[collection1] main{ExitableDirectoryReader(UninvertingDirectoryReader(Uninverting(_0(6.0.0):C1)))}
   [junit4]   2> 1941714 INFO  (TEST-TestArbitraryIndexDir.testLoadNewIndexDir-seed#[6F91588C79C30CE]) [    ] o.a.s.u.p.LogUpdateProcessorFactory [collection1]  webapp=null path=null params={}{commit=} 0 105
   [junit4]   2> 1941714 INFO  (TEST-TestArbitraryIndexDir.testLoadNewIndexDir-seed#[6F91588C79C30CE]) [    ] o.a.s.c.SolrResourceLoader new SolrResourceLoader for directory: '/export/home/jenkins/workspace/Lucene-Solr-trunk-Solaris/solr/core/src/test-files/solr/collection1'
   [junit4]   2> 1941714 INFO  (TEST-TestArbitraryIndexDir.testLoadNewIndexDir-seed#[6F91588C79C30CE]) [    ] o.a.s.c.SolrResourceLoader JNDI not configured for solr (NoInitialContextEx)
   [junit4]   2> 1941714 INFO  (TEST-TestArbitraryIndexDir.testLoadNewIndexDir-seed#[6F91588C79C30CE]) [    ] o.a.s.c.SolrResourceLoader using system property solr.solr.home: /export/home/jenkins/workspace/Lucene-Solr-trunk-Solaris/solr/core/src/test-files/solr
   [junit4]   2> 1941715 INFO  (TEST-TestArbitraryIndexDir.testLoadNewIndexDir-seed#[6F91588C79C30CE]) [    ] o.a.s.c.SolrResourceLoader Adding 'file:/export/home/jenkins/workspace/Lucene-Solr-trunk-Solaris/solr/core/src/test-files/solr/collection1/lib/classes/' to classloader
   [junit4]   2> 1941715 INFO  (TEST-TestArbitraryIndexDir.testLoadNewIndexDir-seed#[6F91588C79C30CE]) [    ] o.a.s.c.SolrResourceLoader Adding 'file:/export/home/jenkins/workspace/Lucene-Solr-trunk-Solaris/solr/core/src/test-files/solr/collection1/lib/README' to classloader
   [junit4]   2> 1941739 INFO  (TEST-TestArbitraryIndexDir.testLoadNewIndexDir-seed#[6F91588C79C30CE]) [    ] o.a.s.c.SolrConfig current version of requestparams : -1
   [junit4]   2> 1941745 INFO  (TEST-TestArbitraryIndexDir.testLoadNewIndexDir-seed#[6F91588C79C30CE]) [    ] o.a.s.c.SolrConfig Using Lucene MatchVersion: 6.0.0
   [junit4]   2> 1941759 INFO  (TEST-TestArbitraryIndexDir.testLoadNewIndexDir-seed#[6F91588C79C30CE]) [    ] o.a.s.c.SolrConfig Loaded SolrConfig: solrconfig.xml
   [junit4]   2> 1941762 INFO  (TEST-TestArbitraryIndexDir.testLoadNewIndexDir-seed#[6F91588C79C30CE]) [    ] o.a.s.s.IndexSchema [collection1] Schema name=test
   [junit4]   2> 1941830 INFO  (TEST-TestArbitraryIndexDir.testLoadNewIndexDir-seed#[6F91588C79C30CE]) [    ] o.a.s.s.IndexSchema default search field in schema is text
   [junit4]   2> 1941830 INFO  (TEST-TestArbitraryIndexDir.testLoadNewIndexDir-seed#[6F91588C79C30CE]) [    ] o.a.s.s.IndexSchema unique key field: id
   [junit4]   2> 1941831 WARN  (TEST-TestArbitraryIndexDir.testLoadNewIndexDir-seed#[6F91588C79C30CE]) [    ] o.a.s.s.IndexSchema Field text is not multivalued and destination for multiple copyFields (2)
   [junit4]   2> 1941835 INFO  (TEST-TestArbitraryIndexDir.testLoadNewIndexDir-seed#[6F91588C79C30CE]) [    ] o.a.s.s.FileExchangeRateProvider Reloading exchange rates from file currency.xml
   [junit4]   2> 1941850 INFO  (TEST-TestArbitraryIndexDir.testLoadNewIndexDir-seed#[6F91588C79C30CE]) [    ] o.a.s.s.FileExchangeRateProvider Reloading exchange rates from file currency.xml
   [junit4]   2> 1941854 INFO  (TEST-TestArbitraryIndexDir.testLoadNewIndexDir-seed#[6F91588C79C30CE]) [    ] o.a.s.c.ConfigSetProperties Did not find ConfigSet properties, assuming default properties: Can't find resource 'configsetprops.json' in classpath or '/export/home/jenkins/workspace/Lucene-Solr-trunk-Solaris/solr/core/src/test-files/solr/collection1'
   [junit4]   2> 1941854 INFO  (TEST-TestArbitraryIndexDir.testLoadNewIndexDir-seed#[6F91588C79C30CE]) [    ] o.a.s.c.CoreContainer Reloading SolrCore 'collection1' using configuration from instancedir /export/home/jenkins/workspace/Lucene-Solr-trunk-Solaris/solr/core/src/test-files/solr/collection1
   [junit4]   2> 1941854 INFO  (TEST-TestArbitraryIndexDir.testLoadNewIndexDir-seed#[6F91588C79C30CE]) [    x:collection1] o.a.s.c.SolrCore [[collection1] ] Opening new SolrCore at [/export/home/jenkins/workspace/Lucene-Solr-trunk-Solaris/solr/core/src/test-files/solr/collection1], dataDir=[/export/home/jenkins/workspace/Lucene-Solr-trunk-Solaris/solr/build/solr-core/test/J0/temp/solr.core.TestArbitraryIndexDir_6F91588C79C30CE-001/init-core-data-001/]
   [junit4]   2> 1941854 INFO  (TEST-TestArbitraryIndexDir.testLoadNewIndexDir-seed#[6F91588C79C30CE]) [    x:collection1] o.a.s.c.JmxMonitoredMap JMX monitoring is enabled. Adding Solr mbeans to JMX Server: com.sun.jmx.mbeanserver.JmxMBeanServer@1a5b5a52
   [junit4]   2> 1941856 INFO  (TEST-TestArbitraryIndexDir.testLoadNewIndexDir-seed#[6F91588C79C30CE]) [    x:collection1] o.a.s.c.SolrCore New index directory detected: old=null new=/export/home/jenkins/workspace/Lucene-Solr-trunk-Solaris/solr/build/solr-core/test/J0/temp/solr.core.TestArbitraryIndexDir_6F91588C79C30CE-001/init-core-data-001/index_temp
   [junit4]   2> 1941857 INFO  (OldIndexDirectoryCleanupThreadForCore-collection1) [    x:collection1] o.a.s.c.SolrCore Looking for old index directories to cleanup for core collection1 in /export/home/jenkins/workspace/Lucene-Solr-trunk-Solaris/solr/build/solr-core/test/J0/temp/solr.core.TestArbitraryIndexDir_6F91588C79C30CE-001/init-core-data-001/
   [junit4]   2> 1941857 INFO  (OldIndexDirectoryCleanupThreadForCore-collection1) [    x:collection1] o.a.s.c.DirectoryFactory Found 1 old index directories to clean-up under /export/home/jenkins/workspace/Lucene-Solr-trunk-Solaris/solr/build/solr-core/test/J0/temp/solr.core.TestArbitraryIndexDir_6F91588C79C30CE-001/init-core-data-001/
   [junit4]   2> 1941857 WARN  (OldIndexDirectoryCleanupThreadForCore-collection1) [    x:collection1] o.a.s.c.CachingDirectoryFactory Cannot delete directory /export/home/jenkins/workspace/Lucene-Solr-trunk-Solaris/solr/build/solr-core/test/J0/temp/solr.core.TestArbitraryIndexDir_6F91588C79C30CE-001/init-core-data-001/index as it is still being referenced in the cache!
   [junit4]   2> 1941857 WARN  (OldIndexDirectoryCleanupThreadForCore-collection1) [    x:collection1] o.a.s.c.DirectoryFactory Delete old index directory /export/home/jenkins/workspace/Lucene-Solr-trunk-Solaris/solr/build/solr-core/test/J0/temp/solr.core.TestArbitraryIndexDir_6F91588C79C30CE-001/init-core-data-001/index failed.
   [junit4]   2> 1941860 INFO  (TEST-TestArbitraryIndexDir.testLoadNewIndexDir-seed#[6F91588C79C30CE]) [    x:collection1] o.a.s.u.p.UpdateRequestProcessorChain creating updateRequestProcessorChain "dedupe"
   [junit4]   2> 1941860 INFO  (TEST-TestArbitraryIndexDir.testLoadNewIndexDir-seed#[6F91588C79C30CE]) [    x:collection1] o.a.s.u.p.UpdateRequestProcessorChain inserting DistributedUpdateProcessorFactory into updateRequestProcessorChain "dedupe"
   [junit4]   2> 1941860 INFO  (TEST-TestArbitraryIndexDir.testLoadNewIndexDir-seed#[6F91588C79C30CE]) [    x:collection1] o.a.s.u.p.UpdateRequestProcessorChain creating updateRequestProcessorChain "dedupe-allfields"
   [junit4]   2> 1941860 INFO  (TEST-TestArbitraryIndexDir.testLoadNewIndexDir-seed#[6F91588C79C30CE]) [    x:collection1] o.a.s.u.p.UpdateRequestProcessorChain inserting DistributedUpdateProcessorFactory into updateRequestProcessorChain "dedupe-allfields"
   [junit4]   2> 1941860 INFO  (TEST-TestArbitraryIndexDir.testLoadNewIndexDir-seed#[6F91588C79C30CE]) [    x:collection1] o.a.s.u.p.UpdateRequestProcessorChain creating updateRequestProcessorChain "stored_sig"
   [junit4]   2> 1941860 INFO  (TEST-TestArbitraryIndexDir.testLoadNewIndexDir-seed#[6F91588C79C30CE]) [    x:collection1] o.a.s.u.p.UpdateRequestProcessorChain inserting DistributedUpdateProcessorFactory into updateRequestProcessorChain "stored_sig"
   [junit4]   2> 1941860 INFO  (TEST-TestArbitraryIndexDir.testLoadNewIndexDir-seed#[6F91588C79C30CE]) [    x:collection1] o.a.s.u.p.UpdateRequestProcessorChain creating updateRequestProcessorChain "uniq-fields"
   [junit4]   2> 1941861 INFO  (TEST-TestArbitraryIndexDir.testLoadNewIndexDir-seed#[6F91588C79C30CE]) [    x:collection1] o.a.s.u.p.UpdateRequestProcessorChain inserting DistributedUpdateProcessorFactory into updateRequestProcessorChain "uniq-fields"
   [junit4]   2> 1941861 INFO  (TEST-TestArbitraryIndexDir.testLoadNewIndexDir-seed#[6F91588C79C30CE]) [    x:collection1] o.a.s.u.p.UpdateRequestProcessorChain creating updateRequestProcessorChain "distrib-dup-test-chain-explicit"
   [junit4]   2> 1941861 INFO  (TEST-TestArbitraryIndexDir.testLoadNewIndexDir-seed#[6F91588C79C30CE]) [    x:collection1] o.a.s.u.p.UpdateRequestProcessorChain creating updateRequestProcessorChain "distrib-dup-test-chain-implicit"
   [junit4]   2> 1941861 INFO  (TEST-TestArbitraryIndexDir.testLoadNewIndexDir-seed#[6F91588C79C30CE]) [    x:collection1] o.a.s.u.p.UpdateRequestProcessorChain inserting DistributedUpdateProcessorFactory into updateRequestProcessorChain "distrib-dup-test-chain-implicit"
   [junit4]   2> 1941861 INFO  (TEST-TestArbitraryIndexDir.testLoadNewIndexDir-seed#[6F91588C79C30CE]) [    x:collection1] o.a.s.c.SolrCore no updateRequestProcessorChain defined as default, creating implicit default
   [junit4]   2> 1941863 INFO  (TEST-TestArbitraryIndexDir.testLoadNewIndexDir-seed#[6F91588C79C30CE]) [    x:collection1] o.a.s.h.l.XMLLoader xsltCacheLifetimeSeconds=60
   [junit4]   2> 1941863 INFO  (TEST-TestArbitraryIndexDir.testLoadNewIndexDir-seed#[6F91588C79C30CE]) [    x:collection1] o.a.s.h.l.XMLLoader xsltCacheLifetimeSeconds=60
   [junit4]   2> 1941864 INFO  (TEST-TestArbitraryIndexDir.testLoadNewIndexDir-seed#[6F91588C79C30CE]) [    x:collection1] o.a.s.h.l.XMLLoader xsltCacheLifetimeSeconds=60
   [junit4]   2> 1941865 INFO  (TEST-TestArbitraryIndexDir.testLoadNewIndexDir-seed#[6F91588C79C30CE]) [    x:collection1] o.a.s.h.l.XMLLoader xsltCacheLifetimeSeconds=60
   [junit4]   2> 1941866 INFO  (TEST-TestArbitraryIndexDir.testLoadNewIndexDir-seed#[6F91588C79C30CE]) [    x:collection1] o.a.s.c.CachingDirectoryFactory return new directory for /export/home/jenkins/workspace/Lucene-Solr-trunk-Solaris/solr/build/solr-core/test/J0/temp/solr.core.TestArbitraryIndexDir_6F91588C79C30CE-001/init-core-data-001/index_temp
   [junit4]   2> 1941871 INFO  (TEST-TestArbitraryIndexDir.testLoadNewIndexDir-seed#[6F91588C79C30CE]) [    x:collection1] o.a.s.c.PluginBag requestHandler : 'lazy' created with startup=lazy 
   [junit4]   2> 1941873 INFO  (TEST-TestArbitraryIndexDir.testLoadNewIndexDir-seed#[6F91588C79C30CE]) [    x:collection1] o.a.s.c.RequestHandlers Registered paths: /admin/mbeans,standard,spellCheckCompRH,lazy,/update/json/docs,/admin/luke,/export,spellCheckWithWordbreak_Direct,tvrh,/get,/admin/properties,/update/json,mltrh,/admin/threads,/search-facet-def,/update/csv,/sql,/search-facet-invariants,/admin/segments,spellCheckCompRH1,/mlt,/admin/system,/replication,dismax,defaults,/config,/stream,/schema,/admin/plugins,/admin/logging,spellCheckWithWordbreak,mock,/admin/ping,/update,/admin/file,/terms,spellCheckCompRH_Direct,/debug/dump
   [junit4]   2> 1941873 WARN  (TEST-TestArbitraryIndexDir.testLoadNewIndexDir-seed#[6F91588C79C30CE]) [    x:collection1] o.a.s.c.SolrCore solrconfig.xml uses deprecated <admin/gettableFiles>, Please update your config to use the ShowFileRequestHandler.
   [junit4]   2> 1941874 INFO  (TEST-TestArbitraryIndexDir.testLoadNewIndexDir-seed#[6F91588C79C30CE]) [    x:collection1] o.a.s.c.SolrCore Using default statsCache cache: org.apache.solr.search.stats.LocalStatsCache
   [junit4]   2> 1941874 INFO  (TEST-TestArbitraryIndexDir.testLoadNewIndexDir-seed#[6F91588C79C30CE]) [    x:collection1] o.a.s.u.CommitTracker Hard AutoCommit: disabled
   [junit4]   2> 1941874 INFO  (TEST-TestArbitraryIndexDir.testLoadNewIndexDir-seed#[6F91588C79C30CE]) [    x:collection1] o.a.s.u.CommitTracker Soft AutoCommit: disabled
   [junit4]   2> 1941875 INFO  (TEST-TestArbitraryIndexDir.testLoadNewIndexDir-seed#[6F91588C79C30CE]) [    x:collection1] o.a.s.s.SolrIndexSearcher Opening Searcher@79ddefd6[collection1] main
   [junit4]   2> 1941875 INFO  (TEST-TestArbitraryIndexDir.testLoadNewIndexDir-seed#[6F91588C79C30CE]) [    x:collection1] o.a.s.r.RestManager Initializing RestManager with initArgs: {storageIO=org.apache.solr.rest.ManagedResourceStorage$InMemoryStorageIO}
   [junit4]   2> 1941875 INFO  (TEST-TestArbitraryIndexDir.testLoadNewIndexDir-seed#[6F91588C79C30CE]) [    x:collection1] o.a.s.r.ManagedResourceStorage Reading _rest_managed.json using InMemoryStorage
   [junit4]   2> 1941875 INFO  (TEST-TestArbitraryIndexDir.testLoadNewIndexDir-seed#[6F91588C79C30CE]) [    x:collection1] o.a.s.r.RestManager Initializing 0 registered ManagedResources
   [junit4]   2> 1941875 INFO  (TEST-TestArbitraryIndexDir.testLoadNewIndexDir-seed#[6F91588C79C30CE]) [    x:collection1] o.a.s.h.c.SpellCheckComponent Initializing spell checkers
   [junit4]   2> 1941876 INFO  (TEST-TestArbitraryIndexDir.testLoadNewIndexDir-seed#[6F91588C79C30CE]) [    x:collection1] o.a.s.s.DirectSolrSpellChecker init: {name=direct,classname=DirectSolrSpellChecker,field=lowerfilt,minQueryLength=3}
   [junit4]   2> 1941879 INFO  (TEST-TestArbitraryIndexDir.testLoadNewIndexDir-seed#[6F91588C79C30CE]) [    x:collection1] o.a.s.h.ReplicationHandler Commits will be reserved for  10000
   [junit4]   2> 1941880 INFO  (searcherExecutor-5050-thread-1-processing-x:collection1) [    x:collection1] o.a.s.h.c.SpellCheckComponent Loading spell index for spellchecker: default
   [junit4]   2> 1941881 INFO  (searcherExecutor-5050-thread-1-processing-x:collection1) [    x:collection1] o.a.s.h.c.SpellCheckComponent Loading spell index for spellchecker: direct
   [junit4]   2> 1941881 INFO  (searcherExecutor-5050-thread-1-processing-x:collection1) [    x:collection1] o.a.s.h.c.SpellCheckComponent Loading spell index for spellchecker: wordbreak
   [junit4]   2> 1941881 INFO  (searcherExecutor-5050-thread-1-processing-x:collection1) [    x:collection1] o.a.s.h.c.SpellCheckComponent Loading spell index for spellchecker: multipleFields
   [junit4]   2> 1941881 INFO  (searcherExecutor-5050-thread-1-processing-x:collection1) [    x:collection1] o.a.s.h.c.SpellCheckComponent Loading spell index for spellchecker: jarowinkler
   [junit4]   2> 1941881 INFO  (searcherExecutor-5050-thread-1-processing-x:collection1) [    x:collection1] o.a.s.h.c.SpellCheckComponent Loading spell index for spellchecker: external
   [junit4]   2> 1941884 INFO  (searcherExecutor-5050-thread-1-processing-x:collection1) [    x:collection1] o.a.s.h.c.SpellCheckComponent Loading spell index for spellchecker: freq
   [junit4]   2> 1941885 INFO  (searcherExecutor-5050-thread-1-processing-x:collection1) [    x:collection1] o.a.s.h.c.SpellCheckComponent Loading spell index for spellchecker: fqcn
   [junit4]   2> 1941886 INFO  (searcherExecutor-5050-thread-1-processing-x:collection1) [    x:collection1] o.a.s.h.c.SpellCheckComponent Loading spell index for spellchecker: perDict
   [junit4]   2> 1941887 INFO  (searcherExecutor-5050-thread-1-processing-x:collection1) [    x:collection1] o.a.s.c.SolrCore [collection1] Registered new searcher Searcher@79ddefd6[collection1] main{ExitableDirectoryReader(UninvertingDirectoryReader(Uninverting(_0(6.0.0):C1)))}
   [junit4]   2> 1941887 INFO  (TEST-TestArbitraryIndexDir.testLoadNewIndexDir-seed#[6F91588C79C30CE]) [    x:collection1] o.a.s.u.DefaultSolrCoreState Closing old IndexWriter... core=collection1
   [junit4]   2> 1941888 INFO  (TEST-TestArbitraryIndexDir.testLoadNewIndexDir-seed#[6F91588C79C30CE]) [    x:collection1] o.a.s.u.RandomMergePolicy RandomMergePolicy wrapping class org.apache.lucene.index.LogByteSizeMergePolicy: [LogByteSizeMergePolicy: minMergeSize=1677721, mergeFactor=37, maxMergeSize=2147483648, maxMergeSizeForForcedMerge=9223372036854775807, calibrateSizeByDeletes=true, maxMergeDocs=2147483647, maxCFSSegmentSizeMB=8.796093022207999E12, noCFSRatio=0.1305805416291885]
   [junit4]   2> 1941891 INFO  (TEST-TestArbitraryIndexDir.testLoadNewIndexDir-seed#[6F91588C79C30CE]) [    x:collection1] o.a.s.c.SolrDeletionPolicy SolrDeletionPolicy.onInit: commits: num=1
   [junit4]   2> 	commit{dir=MockDirectoryWrapper(NIOFSDirectory@/export/home/jenkins/workspace/Lucene-Solr-trunk-Solaris/solr/build/solr-core/test/J0/temp/solr.core.TestArbitraryIndexDir_6F91588C79C30CE-001/init-core-data-001/index_temp lockFactory=org.apache.lucene.store.SingleInstanceLockFactory@3632db40),segFN=segments_1,generation=1}
   [junit4]   2> 1941891 INFO  (TEST-TestArbitraryIndexDir.testLoadNewIndexDir-seed#[6F91588C79C30CE]) [    x:collection1] o.a.s.c.SolrDeletionPolicy newest commit generation = 1
   [junit4]   2> 1941891 INFO  (TEST-TestArbitraryIndexDir.testLoadNewIndexDir-seed#[6F91588C79C30CE]) [    x:collection1] o.a.s.u.DefaultSolrCoreState New IndexWriter is ready to be used.
   [junit4]   2> 1941893 INFO  (TEST-TestArbitraryIndexDir.testLoadNewIndexDir-seed#[6F91588C79C30CE]) [    x:collection1] o.a.s.s.SolrIndexSearcher Opening Searcher@a53962f[collection1] main
   [junit4]   2> 1941893 INFO  (TEST-TestArbitraryIndexDir.testLoadNewIndexDir-seed#[6F91588C79C30CE]) [    x:collection1] o.a.s.c.CoreContainer replacing core: collection1
   [junit4]   2> 1941893 INFO  (TEST-TestArbitraryIndexDir.testLoadNewIndexDir-seed#[6F91588C79C30CE]) [    x:collection1] o.a.s.c.SolrCore [collection1]  CLOSING SolrCore org.apache.solr.core.SolrCore@4df56117
   [junit4]   2> 1941893 INFO  (TEST-TestArbitraryIndexDir.testLoadNewIndexDir-seed#[6F91588C79C30CE]) [    x:collection1] o.a.s.u.DirectUpdateHandler2 closing DirectUpdateHandler2{commits=1,autocommits=0,soft autocommits=0,optimizes=0,rollbacks=0,expungeDeletes=0,docsPending=0,adds=0,deletesById=0,deletesByQuery=0,errors=0,cumulative_adds=1,cumulative_deletesById=0,cumulative_deletesByQuery=0,cumulative_errors=0}
   [junit4]   2> 1941893 INFO  (TEST-TestArbitraryIndexDir.testLoadNewIndexDir-seed#[6F91588C79C30CE]) [    x:collection1] o.a.s.c.SolrCore [collection1] Closing main searcher on request.
   [junit4]   2> 1941901 INFO  (TEST-TestArbitraryIndexDir.testLoadNewIndexDir-seed#[6F91588C79C30CE]) [    x:collection1] o.a.s.c.S.Request [collection1]  webapp=null path=null params={q=id:2&qt=standard&start=0&rows=20&version=2.2} hits=0 status=0 QTime=0
   [junit4]   2> 1941902 ERROR (TEST-TestArbitraryIndexDir.testLoadNewIndexDir-seed#[6F91588C79C30CE]) [    x:collection1] o.a.s.SolrTestCaseJ4 REQUEST FAILED: xpath=*[count(//doc)=1]
   [junit4]   2> 	xml response was: <?xml version="1.0" encoding="UTF-8"?>
   [junit4]   2> <response>
   [junit4]   2> <lst name="responseHeader"><int name="status">0</int><int name="QTime">0</int></lst><result name="response" numFound="0" start="0"></result>
   [junit4]   2> </response>
   [junit4]   2> 
   [junit4]   2> 	request was:q=id:2&qt=standard&start=0&rows=20&version=2.2
   [junit4]   2> 1941902 ERROR (TEST-TestArbitraryIndexDir.testLoadNewIndexDir-seed#[6F91588C79C30CE]) [    x:collection1] o.a.s.SolrTestCaseJ4 REQUEST FAILED: q=id:2&qt=standard&start=0&rows=20&version=2.2:java.lang.RuntimeException: REQUEST FAILED: xpath=*[count(//doc)=1]
   [junit4]   2> 	xml response was: <?xml version="1.0" encoding="UTF-8"?>
   [junit4]   2> <response>
   [junit4]   2> <lst name="responseHeader"><int name="status">0</int><int name="QTime">0</int></lst><result name="response" numFound="0" start="0"></result>
   [junit4]   2> </response>
   [junit4]   2> 
   [junit4]   2> 	request was:q=id:2&qt=standard&start=0&rows=20&version=2.2
   [junit4]   2> 	at org.apache.solr.SolrTestCaseJ4.assertQ(SolrTestCaseJ4.java:748)
   [junit4]   2> 	at org.apache.solr.core.TestArbitraryIndexDir.testLoadNewIndexDir(TestArbitraryIndexDir.java:107)
   [junit4]   2> 	at sun.reflect.NativeMethodAccessorImpl.invoke0(Native Method)
   [junit4]   2> 	at sun.reflect.NativeMethodAccessorImpl.invoke(NativeMethodAccessorImpl.java:62)
   [junit4]   2> 	at sun.reflect.DelegatingMethodAccessorImpl.invoke(DelegatingMethodAccessorImpl.java:43)
   [junit4]   2> 	at java.lang.reflect.Method.invoke(Method.java:497)
   [junit4]   2> 	at com.carrotsearch.randomizedtesting.RandomizedRunner.invoke(RandomizedRunner.java:1764)
   [junit4]   2> 	at com.carrotsearch.randomizedtesting.RandomizedRunner$8.evaluate(RandomizedRunner.java:871)
   [junit4]   2> 	at com.carrotsearch.randomizedtesting.RandomizedRunner$9.evaluate(RandomizedRunner.java:907)
   [junit4]   2> 	at com.carrotsearch.randomizedtesting.RandomizedRunner$10.evaluate(RandomizedRunner.java:921)
   [junit4]   2> 	at com.carrotsearch.randomizedtesting.rules.SystemPropertiesRestoreRule$1.evaluate(SystemPropertiesRestoreRule.java:57)
   [junit4]   2> 	at com.carrotsearch.randomizedtesting.rules.SystemPropertiesRestoreRule$1.evaluate(SystemPropertiesRestoreRule.java:57)
   [junit4]   2> 	at org.apache.lucene.util.TestRuleSetupTeardownChained$1.evaluate(TestRuleSetupTeardownChained.java:50)
   [junit4]   2> 	at org.apache.lucene.util.AbstractBeforeAfterRule$1.evaluate(AbstractBeforeAfterRule.java:46)
   [junit4]   2> 	at org.apache.lucene.util.TestRuleThreadAndTestName$1.evaluate(TestRuleThreadAndTestName.java:49)
   [junit4]   2> 	at org.apache.lucene.util.TestRuleIgnoreAfterMaxFailures$1.evaluate(TestRuleIgnoreAfterMaxFailures.java:65)
   [junit4]   2> 	at org.apache.lucene.util.TestRuleMarkFailure$1.evaluate(TestRuleMarkFailure.java:48)
   [junit4]   2> 	at com.carrotsearch.randomizedtesting.rules.StatementAdapter.evaluate(StatementAdapter.java:36)
   [junit4]   2> 	at com.carrotsearch.randomizedtesting.ThreadLeakControl$StatementRunner.run(ThreadLeakControl.java:367)
   [junit4]   2> 	at com.carrotsearch.randomizedtesting.ThreadLeakControl.forkTimeoutingTask(ThreadLeakControl.java:809)
   [junit4]   2> 	at com.carrotsearch.randomizedtesting.ThreadLeakControl$3.evaluate(ThreadLeakControl.java:460)
   [junit4]   2> 	at com.carrotsearch.randomizedtesting.RandomizedRunner.runSingleTest(RandomizedRunner.java:880)
   [junit4]   2> 	at com.carrotsearch.randomizedtesting.RandomizedRunner$5.evaluate(RandomizedRunner.java:781)
   [junit4]   2> 	at com.carrotsearch.randomizedtesting.RandomizedRunner$6.evaluate(RandomizedRunner.java:816)
   [junit4]   2> 	at com.carrotsearch.randomizedtesting.RandomizedRunner$7.evaluate(RandomizedRunner.java:827)
   [junit4]   2> 	at com.carrotsearch.randomizedtesting.rules.StatementAdapter.evaluate(StatementAdapter.java:36)
   [junit4]   2> 	at com.carrotsearch.randomizedtesting.rules.SystemPropertiesRestoreRule$1.evaluate(SystemPropertiesRestoreRule.java:57)
   [junit4]   2> 	at org.apache.lucene.util.AbstractBeforeAfterRule$1.evaluate(AbstractBeforeAfterRule.java:46)
   [junit4]   2> 	at com.carrotsearch.randomizedtesting.rules.StatementAdapter.evaluate(StatementAdapter.java:36)
   [junit4]   2> 	at org.apache.lucene.util.TestRuleStoreClassName$1.evaluate(TestRuleStoreClassName.java:42)
   [junit4]   2> 	at com.carrotsearch.randomizedtesting.rules.NoShadowingOrOverridesOnMethodsRule$1.evaluate(NoShadowingOrOverridesOnMethodsRule.java:40)
   [junit4]   2> 	at com.carrotsearch.randomizedtesting.rules.NoShadowingOrOverridesOnMethodsRule$1.evaluate(NoShadowingOrOverridesOnMethodsRule.java:40)
   [junit4]   2> 	at com.carrotsearch.randomizedtesting.rules.StatementAdapter.evaluate(StatementAdapter.java:36)
   [junit4]   2> 	at com.carrotsearch.randomizedtesting.rules.StatementAdapter.evaluate(StatementAdapter.java:36)
   [junit4]   2> 	at com.carrotsearch.randomizedtesting.rules.StatementAdapter.evaluate(StatementAdapter.java:36)
   [junit4]   2> 	at org.apache.lucene.util.TestRuleAssertionsRequired$1.evaluate(TestRuleAssertionsRequired.java:54)
   [junit4]   2> 	at org.apache.lucene.util.TestRuleMarkFailure$1.evaluate(TestRuleMarkFailure.java:48)
   [junit4]   2> 	at org.apache.lucene.util.TestRuleIgnoreAfterMaxFailures$1.evaluate(TestRuleIgnoreAfterMaxFailures.java:65)
   [junit4]   2> 	at org.apache.lucene.util.TestRuleIgnoreTestSuites$1.evaluate(TestRuleIgnoreTestSuites.java:55)
   [junit4]   2> 	at com.carrotsearch.randomizedtesting.rules.StatementAdapter.evaluate(StatementAdapter.java:36)
   [junit4]   2> 	at com.carrotsearch.randomizedtesting.ThreadLeakControl$StatementRunner.run(ThreadLeakControl.java:367)
   [junit4]   2> 	at java.lang.Thread.run(Thread.java:745)
   [junit4]   2> 
   [junit4]   2> 1941903 INFO  (TEST-TestArbitraryIndexDir.testLoadNewIndexDir-seed#[6F91588C79C30CE]) [    x:collection1] o.a.s.SolrTestCaseJ4 ###Ending testLoadNewIndexDir
   [junit4]   2> 1941906 INFO  (searcherExecutor-5050-thread-1-processing-x:collection1) [    x:collection1] o.a.s.c.SolrCore [collection1] Registered new searcher Searcher@a53962f[collection1] main{ExitableDirectoryReader(UninvertingDirectoryReader(Uninverting(_0(6.0.0):c1)))}
   [junit4]   2> NOTE: reproduce with: ant test  -Dtestcase=TestArbitraryIndexDir -Dtests.method=testLoadNewIndexDir -Dtests.seed=6F91588C79C30CE -Dtests.slow=true -Dtests.locale=is_IS -Dtests.timezone=America/Monterrey -Dtests.asserts=true -Dtests.file.encoding=US-ASCII
   [junit4] ERROR   0.74s J0 | TestArbitraryIndexDir.testLoadNewIndexDir <<<
   [junit4]    > Throwable #1: java.lang.RuntimeException: Exception during query
   [junit4]    > 	at __randomizedtesting.SeedInfo.seed([6F91588C79C30CE:EFA3AEB05905A066]:0)
   [junit4]    > 	at org.apache.solr.SolrTestCaseJ4.assertQ(SolrTestCaseJ4.java:755)
   [junit4]    > 	at org.apache.solr.core.TestArbitraryIndexDir.testLoadNewIndexDir(TestArbitraryIndexDir.java:107)
   [junit4]    > 	at java.lang.Thread.run(Thread.java:745)
   [junit4]    > Caused by: java.lang.RuntimeException: REQUEST FAILED: xpath=*[count(//doc)=1]
   [junit4]    > 	xml response was: <?xml version="1.0" encoding="UTF-8"?>
   [junit4]    > <response>
   [junit4]    > <lst name="responseHeader"><int name="status">0</int><int name="QTime">0</int></lst><result name="response" numFound="0" start="0"></result>
   [junit4]    > </response>
   [junit4]    > 	request was:q=id:2&qt=standard&start=0&rows=20&version=2.2
   [junit4]    > 	at org.apache.solr.SolrTestCaseJ4.assertQ(SolrTestCaseJ4.java:748)
   [junit4]    > 	... 41 more
   [junit4]   2> 1941911 INFO  (SUITE-TestArbitraryIndexDir-seed#[6F91588C79C30CE]-worker) [    x:collection1] o.a.s.SolrTestCaseJ4 ###deleteCore
   [junit4]   2> 1941911 INFO  (SUITE-TestArbitraryIndexDir-seed#[6F91588C79C30CE]-worker) [    x:collection1] o.a.s.c.CoreContainer Shutting down CoreContainer instance=812298308
   [junit4]   2> 1941914 INFO  (SUITE-TestArbitraryIndexDir-seed#[6F91588C79C30CE]-worker) [    x:collection1] o.a.s.c.SolrCore [collection1]  CLOSING SolrCore org.apache.solr.core.SolrCore@1ad6575c
   [junit4]   2> 1941915 INFO  (SUITE-TestArbitraryIndexDir-seed#[6F91588C79C30CE]-worker) [    x:collection1] o.a.s.u.DirectUpdateHandler2 closing DirectUpdateHandler2{commits=0,autocommits=0,soft autocommits=0,optimizes=0,rollbacks=0,expungeDeletes=0,docsPending=0,adds=0,deletesById=0,deletesByQuery=0,errors=0,cumulative_adds=0,cumulative_deletesById=0,cumulative_deletesByQuery=0,cumulative_errors=0}
   [junit4]   2> 1941915 INFO  (SUITE-TestArbitraryIndexDir-seed#[6F91588C79C30CE]-worker) [    x:collection1] o.a.s.u.SolrCoreState Closing SolrCoreState
   [junit4]   2> 1941915 INFO  (SUITE-TestArbitraryIndexDir-seed#[6F91588C79C30CE]-worker) [    x:collection1] o.a.s.u.DefaultSolrCoreState SolrCoreState ref count has reached 0 - closing IndexWriter
   [junit4]   2> 1941915 INFO  (SUITE-TestArbitraryIndexDir-seed#[6F91588C79C30CE]-worker) [    x:collection1] o.a.s.u.DefaultSolrCoreState closing IndexWriter with IndexWriterCloser
   [junit4]   2> 1941917 INFO  (SUITE-TestArbitraryIndexDir-seed#[6F91588C79C30CE]-worker) [    x:collection1] o.a.s.c.SolrCore [collection1] Closing main searcher on request.
   [junit4]   2> 1941927 INFO  (SUITE-TestArbitraryIndexDir-seed#[6F91588C79C30CE]-worker) [    x:collection1] o.a.s.c.CachingDirectoryFactory Closing MockFSDirectoryFactory - 3 directories currently being tracked
   [junit4]   2> 1941927 INFO  (SUITE-TestArbitraryIndexDir-seed#[6F91588C79C30CE]-worker) [    x:collection1] o.a.s.c.CachingDirectoryFactory looking to close /export/home/jenkins/workspace/Lucene-Solr-trunk-Solaris/solr/build/solr-core/test/J0/temp/solr.core.TestArbitraryIndexDir_6F91588C79C30CE-001/init-core-data-001 [CachedDir<<refCount=0;path=/export/home/jenkins/workspace/Lucene-Solr-trunk-Solaris/solr/build/solr-core/test/J0/temp/solr.core.TestArbitraryIndexDir_6F91588C79C30CE-001/init-core-data-001;done=false>>]
   [junit4]   2> 1941927 INFO  (SUITE-TestArbitraryIndexDir-seed#[6F91588C79C30CE]-worker) [    x:collection1] o.a.s.c.CachingDirectoryFactory Closing directory: /export/home/jenkins/workspace/Lucene-Solr-trunk-Solaris/solr/build/solr-core/test/J0/temp/solr.core.TestArbitraryIndexDir_6F91588C79C30CE-001/init-core-data-001
   [junit4]   2> 1941927 INFO  (SUITE-TestArbitraryIndexDir-seed#[6F91588C79C30CE]-worker) [    x:collection1] o.a.s.c.CachingDirectoryFactory looking to close /export/home/jenkins/workspace/Lucene-Solr-trunk-Solaris/solr/build/solr-core/test/J0/temp/solr.core.TestArbitraryIndexDir_6F91588C79C30CE-001/init-core-data-001/index_temp [CachedDir<<refCount=0;path=/export/home/jenkins/workspace/Lucene-Solr-trunk-Solaris/solr/build/solr-core/test/J0/temp/solr.core.TestArbitraryIndexDir_6F91588C79C30CE-001/init-core-data-001/index_temp;done=false>>]
   [junit4]   2> 1941927 INFO  (SUITE-TestArbitraryIndexDir-seed#[6F91588C79C30CE]-worker) [    x:collection1] o.a.s.c.CachingDirectoryFactory Closing directory: /export/home/jenkins/workspace/Lucene-Solr-trunk-Solaris/solr/build/solr-core/test/J0/temp/solr.core.TestArbitraryIndexDir_6F91588C79C30CE-001/init-core-data-001/index_temp
   [junit4]   2> 1941930 INFO  (SUITE-TestArbitraryIndexDir-seed#[6F91588C79C30CE]-worker) [    x:collection1] o.a.s.c.CachingDirectoryFactory looking to close /export/home/jenkins/workspace/Lucene-Solr-trunk-Solaris/solr/build/solr-core/test/J0/temp/solr.core.TestArbitraryIndexDir_6F91588C79C30CE-001/init-core-data-001/index [CachedDir<<refCount=0;path=/export/home/jenkins/workspace/Lucene-Solr-trunk-Solaris/solr/build/solr-core/test/J0/temp/solr.core.TestArbitraryIndexDir_6F91588C79C30CE-001/init-core-data-001/index;done=false>>]
   [junit4]   2> 1941930 INFO  (SUITE-TestArbitraryIndexDir-seed#[6F91588C79C30CE]-worker) [    x:collection1] o.a.s.c.CachingDirectoryFactory Closing directory: /export/home/jenkins/workspace/Lucene-Solr-trunk-Solaris/solr/build/solr-core/test/J0/temp/solr.core.TestArbitraryIndexDir_6F91588C79C30CE-001/init-core-data-001/index
   [junit4]   2> NOTE: leaving temporary files on disk at: /export/home/jenkins/workspace/Lucene-Solr-trunk-Solaris/solr/build/solr-core/test/J0/temp/solr.core.TestArbitraryIndexDir_6F91588C79C30CE-001
   [junit4]   2> NOTE: test params are: codec=Asserting(Lucene60), sim=ClassicSimilarity, locale=is_IS, timezone=America/Monterrey
   [junit4]   2> NOTE: SunOS 5.11 amd64/Oracle Corporation 1.8.0_66 (64-bit)/cpus=3,threads=1,free=307057008,total=423624704
   [junit4]   2> NOTE: All tests run in this JVM: [TestSearchPerf, TestShortCircuitedRequests, DistributedExpandComponentTest, AnalysisAfterCoreReloadTest, MBeansHandlerTest, TestFieldTypeResource, SchemaVersionSpecificBehaviorTest, TestDistribDocBasedVersion, TestHashPartitioner, TestHighFrequencyDictionaryFactory, SuggestComponentTest, CursorPagingTest, TestOrdValues, TestFieldResource, TestTrackingShardHandlerFactory, TestConfigSetsAPIZkFailure, RequiredFieldsTest, TestEmbeddedSolrServerConstructors, ChaosMonkeyNothingIsSafeTest, TestConfig, TestCodecSupport, TestSchemaResource, TestManagedResource, TestUniqueKeyFieldResource, PrimitiveFieldTypeTest, DocumentAnalysisRequestHandlerTest, HdfsBasicDistributedZk2Test, TestStressUserVersions, SolrIndexConfigTest, TestClassicSimilarityFactory, BadComponentTest, TestLuceneMatchVersion, XsltUpdateRequestHandlerTest, CursorMarkTest, TestStressVersions, TestLeaderInitiatedRecoveryThread, CurrencyFieldXmlFileTest, TestSQLHandler, DeleteShardTest, BlockJoinFacetRandomTest, PeerSyncTest, SimplePostToolTest, TestPostingsSolrHighlighter, TestIntervalFaceting, CircularListTest, ResponseHeaderTest, StatelessScriptUpdateProcessorFactoryTest, TestInfoStreamLogging, TestExactStatsCache, OverseerTaskQueueTest, TestStressReorder, TestOverriddenPrefixQueryForCustomFieldType, HdfsRecoverLeaseTest, HighlighterMaxOffsetTest, TestLRUCache, TestSchemaVersionResource, HdfsDirectoryFactoryTest, TestInitQParser, ClusterStateUpdateTest, RulesTest, TestLazyCores, DistributedFacetPivotSmallTest, HdfsChaosMonkeyNothingIsSafeTest, TestCursorMarkWithoutUniqueKey, TestConfigSetProperties, TestSolrConfigHandlerConcurrent, BitVectorTest, DirectSolrSpellCheckerTest, CloudMLTQParserTest, AddBlockUpdateTest, TestFastLRUCache, PreAnalyzedUpdateProcessorTest, HighlighterTest, UUIDUpdateProcessorFallbackTest, TestDistribIDF, SliceStateTest, TestCustomSort, PingRequestHandlerTest, TestReqParamsAPI, TestConfigSetsAPI, UUIDFieldTest, TestQuerySenderNoQuery, ForceLeaderTest, ScriptEngineTest, SampleTest, URLClassifyProcessorTest, DistributedQueryComponentCustomSortTest, TestRequestForwarding, DOMUtilTest, TestSolrDynamicMBean, TestCSVLoader, InfoHandlerTest, ExternalFileFieldSortTest, BasicAuthIntegrationTest, TestRebalanceLeaders, TestDynamicFieldResource, AlternateDirectoryTest, SpatialRPTFieldTypeTest, TestDocSet, TestSolr4Spatial2, HdfsCollectionsAPIDistributedZkTest, TestXIncludeConfig, CollectionsAPIAsyncDistributedZkTest, DistributedQueueTest, TestLFUCache, TestGroupingSearch, TestFaceting, TestSolrQueryResponse, TestExclusionRuleCollectionAccess, ChangedSchemaMergeTest, SuggesterFSTTest, BigEndianAscendingWordDeserializerTest, SoftAutoCommitTest, TestManagedSynonymFilterFactory, SolrCoreTest, TestComponentsName, TestCloudPivotFacet, DirectoryFactoryTest, PrimUtilsTest, TestCloudManagedSchema, DistributedFacetPivotLongTailTest, DirectUpdateHandlerTest, DistributedSpellCheckComponentTest, TestRandomCollapseQParserPlugin, FastVectorHighlighterTest, TestObjectReleaseTracker, TestFunctionQuery, TestAnalyzedSuggestions, ShardRoutingTest, HLLUtilTest, TestSurroundQueryParser, GraphQueryTest, TestRuleBasedAuthorizationPlugin, TestPseudoReturnFields, RestartWhileUpdatingTest, TestMissingGroups, QueryEqualityTest, BasicDistributedZkTest, ChaosMonkeySafeLeaderTest, UnloadDistributedZkTest, SyncSliceTest, OverseerTest, BasicZkTest, RecoveryZkTest, TestReplicationHandler, TestRandomFaceting, LeaderElectionTest, TestRandomDVFaceting, ZkCLITest, ShardRoutingCustomTest, TestDistributedSearch, TestWriterPerf, TermsComponentTest, TestValueSourceCache, FieldAnalysisRequestHandlerTest, TestArbitraryIndexDir]
   [junit4] Completed [357/575 (1!)] on J0 in 0.79s, 1 test, 1 error <<< FAILURES!

[...truncated 262 lines...]
   [junit4] Suite: org.apache.solr.cloud.LeaderFailoverAfterPartitionTest
   [junit4]   2> Creating dataDir: /export/home/jenkins/workspace/Lucene-Solr-trunk-Solaris/solr/build/solr-core/test/J0/temp/solr.cloud.LeaderFailoverAfterPartitionTest_6F91588C79C30CE-001/init-core-data-001
   [junit4]   2> 2272023 INFO  (SUITE-LeaderFailoverAfterPartitionTest-seed#[6F91588C79C30CE]-worker) [    ] o.a.s.BaseDistributedSearchTestCase Setting hostContext system property: /n_/hp
   [junit4]   2> 2272025 INFO  (TEST-LeaderFailoverAfterPartitionTest.test-seed#[6F91588C79C30CE]) [    ] o.a.s.c.ZkTestServer STARTING ZK TEST SERVER
   [junit4]   2> 2272026 INFO  (Thread-5808) [    ] o.a.s.c.ZkTestServer client port:0.0.0.0/0.0.0.0:0
   [junit4]   2> 2272026 INFO  (Thread-5808) [    ] o.a.s.c.ZkTestServer Starting server
   [junit4]   2> 2272126 INFO  (TEST-LeaderFailoverAfterPartitionTest.test-seed#[6F91588C79C30CE]) [    ] o.a.s.c.ZkTestServer start zk server on port:42428
   [junit4]   2> 2272126 INFO  (TEST-LeaderFailoverAfterPartitionTest.test-seed#[6F91588C79C30CE]) [    ] o.a.s.c.c.SolrZkClient Using default ZkCredentialsProvider
   [junit4]   2> 2272126 INFO  (TEST-LeaderFailoverAfterPartitionTest.test-seed#[6F91588C79C30CE]) [    ] o.a.s.c.c.ConnectionManager Waiting for client to connect to ZooKeeper
   [junit4]   2> 2272129 INFO  (zkCallback-2240-thread-1) [    ] o.a.s.c.c.ConnectionManager Watcher org.apache.solr.common.cloud.ConnectionManager@16920e80 name:ZooKeeperConnection Watcher:127.0.0.1:42428 got event WatchedEvent state:SyncConnected type:None path:null path:null type:None
   [junit4]   2> 2272130 INFO  (TEST-LeaderFailoverAfterPartitionTest.test-seed#[6F91588C79C30CE]) [    ] o.a.s.c.c.ConnectionManager Client is connected to ZooKeeper
   [junit4]   2> 2272130 INFO  (TEST-LeaderFailoverAfterPartitionTest.test-seed#[6F91588C79C30CE]) [    ] o.a.s.c.c.SolrZkClient Using default ZkACLProvider
   [junit4]   2> 2272130 INFO  (TEST-LeaderFailoverAfterPartitionTest.test-seed#[6F91588C79C30CE]) [    ] o.a.s.c.c.SolrZkClient makePath: /solr
   [junit4]   2> 2272135 INFO  (TEST-LeaderFailoverAfterPartitionTest.test-seed#[6F91588C79C30CE]) [    ] o.a.s.c.c.SolrZkClient Using default ZkCredentialsProvider
   [junit4]   2> 2272135 INFO  (TEST-LeaderFailoverAfterPartitionTest.test-seed#[6F91588C79C30CE]) [    ] o.a.s.c.c.ConnectionManager Waiting for client to connect to ZooKeeper
   [junit4]   2> 2272136 INFO  (zkCallback-2241-thread-1) [    ] o.a.s.c.c.ConnectionManager Watcher org.apache.solr.common.cloud.ConnectionManager@2196fa51 name:ZooKeeperConnection Watcher:127.0.0.1:42428/solr got event WatchedEvent state:SyncConnected type:None path:null path:null type:None
   [junit4]   2> 2272137 INFO  (TEST-LeaderFailoverAfterPartitionTest.test-seed#[6F91588C79C30CE]) [    ] o.a.s.c.c.ConnectionManager Client is connected to ZooKeeper
   [junit4]   2> 2272137 INFO  (TEST-LeaderFailoverAfterPartitionTest.test-seed#[6F91588C79C30CE]) [    ] o.a.s.c.c.SolrZkClient Using default ZkACLProvider
   [junit4]   2> 2272137 INFO  (TEST-LeaderFailoverAfterPartitionTest.test-seed#[6F91588C79C30CE]) [    ] o.a.s.c.c.SolrZkClient makePath: /collections/collection1
   [junit4]   2> 2272139 INFO  (TEST-LeaderFailoverAfterPartitionTest.test-seed#[6F91588C79C30CE]) [    ] o.a.s.c.c.SolrZkClient makePath: /collections/collection1/shards
   [junit4]   2> 2272141 INFO  (TEST-LeaderFailoverAfterPartitionTest.test-seed#[6F91588C79C30CE]) [    ] o.a.s.c.c.SolrZkClient makePath: /collections/control_collection
   [junit4]   2> 2272143 INFO  (TEST-LeaderFailoverAfterPartitionTest.test-seed#[6F91588C79C30CE]) [    ] o.a.s.c.c.SolrZkClient makePath: /collections/control_collection/shards
   [junit4]   2> 2272146 INFO  (TEST-LeaderFailoverAfterPartitionTest.test-seed#[6F91588C79C30CE]) [    ] o.a.s.c.AbstractZkTestCase put /export/home/jenkins/workspace/Lucene-Solr-trunk-Solaris/solr/core/src/test-files/solr/collection1/conf/solrconfig-tlog.xml to /configs/conf1/solrconfig.xml
   [junit4]   2> 2272146 INFO  (TEST-LeaderFailoverAfterPartitionTest.test-seed#[6F91588C79C30CE]) [    ] o.a.s.c.c.SolrZkClient makePath: /configs/conf1/solrconfig.xml
   [junit4]   2> 2272149 INFO  (TEST-LeaderFailoverAfterPartitionTest.test-seed#[6F91588C79C30CE]) [    ] o.a.s.c.AbstractZkTestCase put /export/home/jenkins/workspace/Lucene-Solr-trunk-Solaris/solr/core/src/test-files/solr/collection1/conf/schema.xml to /configs/conf1/schema.xml
   [junit4]   2> 2272149 INFO  (TEST-LeaderFailoverAfterPartitionTest.test-seed#[6F91588C79C30CE]) [    ] o.a.s.c.c.SolrZkClient makePath: /configs/conf1/schema.xml
   [junit4]   2> 2272152 INFO  (TEST-LeaderFailoverAfterPartitionTest.test-seed#[6F91588C79C30CE]) [    ] o.a.s.c.AbstractZkTestCase put /export/home/jenkins/workspace/Lucene-Solr-trunk-Solaris/solr/core/src/test-files/solr/collection1/conf/solrconfig.snippet.randomindexconfig.xml to /configs/conf1/solrconfig.snippet.randomindexconfig.xml
   [junit4]   2> 2272152 INFO  (TEST-LeaderFailoverAfterPartitionTest.test-seed#[6F91588C79C30CE]) [    ] o.a.s.c.c.SolrZkClient makePath: /configs/conf1/solrconfig.snippet.randomindexconfig.xml
   [junit4]   2> 2272154 INFO  (TEST-LeaderFailoverAfterPartitionTest.test-seed#[6F91588C79C30CE]) [    ] o.a.s.c.AbstractZkTestCase put /export/home/jenkins/workspace/Lucene-Solr-trunk-Solaris/solr/core/src/test-files/solr/collection1/conf/stopwords.txt to /configs/conf1/stopwords.txt
   [junit4]   2> 2272154 INFO  (TEST-LeaderFailoverAfterPartitionTest.test-seed#[6F91588C79C30CE]) [    ] o.a.s.c.c.SolrZkClient makePath: /configs/conf1/stopwords.txt
   [junit4]   2> 2272157 INFO  (TEST-LeaderFailoverAfterPartitionTest.test-seed#[6F91588C79C30CE]) [    ] o.a.s.c.AbstractZkTestCase put /export/home/jenkins/workspace/Lucene-Solr-trunk-Solaris/solr/core/src/test-files/solr/collection1/conf/protwords.txt to /configs/conf1/protwords.txt
   [junit4]   2> 2272157 INFO  (TEST-LeaderFailoverAfterPartitionTest.test-seed#[6F91588C79C30CE]) [    ] o.a.s.c.c.SolrZkClient makePath: /configs/conf1/protwords.txt
   [junit4]   2> 2272159 INFO  (TEST-LeaderFailoverAfterPartitionTest.test-seed#[6F91588C79C30CE]) [    ] o.a.s.c.AbstractZkTestCase put /export/home/jenkins/workspace/Lucene-Solr-trunk-Solaris/solr/core/src/test-files/solr/collection1/conf/currency.xml to /configs/conf1/currency.xml
   [junit4]   2> 2272159 INFO  (TEST-LeaderFailoverAfterPartitionTest.test-seed#[6F91588C79C30CE]) [    ] o.a.s.c.c.SolrZkClient makePath: /configs/conf1/currency.xml
   [junit4]   2> 2272161 INFO  (TEST-LeaderFailoverAfterPartitionTest.test-seed#[6F91588C79C30CE]) [    ] o.a.s.c.AbstractZkTestCase put /export/home/jenkins/workspace/Lucene-Solr-trunk-Solaris/solr/core/src/test-files/solr/collection1/conf/enumsConfig.xml to /configs/conf1/enumsConfig.xml
   [junit4]   2> 2272162 INFO  (TEST-LeaderFailoverAfterPartitionTest.test-seed#[6F91588C79C30CE]) [    ] o.a.s.c.c.SolrZkClient makePath: /configs/conf1/enumsConfig.xml
   [junit4]   2> 2272164 INFO  (TEST-LeaderFailoverAfterPartitionTest.test-seed#[6F91588C79C30CE]) [    ] o.a.s.c.AbstractZkTestCase put /export/home/jenkins/workspace/Lucene-Solr-trunk-Solaris/solr/core/src/test-files/solr/collection1/conf/open-exchange-rates.json to /configs/conf1/open-exchange-rates.json
   [junit4]   2> 2272164 INFO  (TEST-LeaderFailoverAfterPartitionTest.test-seed#[6F91588C79C30CE]) [    ] o.a.s.c.c.SolrZkClient makePath: /configs/conf1/open-exchange-rates.json
   [junit4]   2> 2272166 INFO  (TEST-LeaderFailoverAfterPartitionTest.test-seed#[6F91588C79C30CE]) [    ] o.a.s.c.AbstractZkTestCase put /export/home/jenkins/workspace/Lucene-Solr-trunk-Solaris/solr/core/src/test-files/solr/collection1/conf/mapping-ISOLatin1Accent.txt to /configs/conf1/mapping-ISOLatin1Accent.txt
   [junit4]   2> 2272166 INFO  (TEST-LeaderFailoverAfterPartitionTest.test-seed#[6F91588C79C30CE]) [    ] o.a.s.c.c.SolrZkClient makePath: /configs/conf1/mapping-ISOLatin1Accent.txt
   [junit4]   2> 2272169 INFO  (TEST-LeaderFailoverAfterPartitionTest.test-seed#[6F91588C79C30CE]) [    ] o.a.s.c.AbstractZkTestCase put /export/home/jenkins/workspace/Lucene-Solr-trunk-Solaris/solr/core/src/test-files/solr/collection1/conf/old_synonyms.txt to /configs/conf1/old_synonyms.txt
   [junit4]   2> 2272169 INFO  (TEST-LeaderFailoverAfterPartitionTest.test-seed#[6F91588C79C30CE]) [    ] o.a.s.c.c.SolrZkClient makePath: /configs/conf1/old_synonyms.txt
   [junit4]   2> 2272171 INFO  (TEST-LeaderFailoverAfterPartitionTest.test-seed#[6F91588C79C30CE]) [    ] o.a.s.c.AbstractZkTestCase put /export/home/jenkins/workspace/Lucene-Solr-trunk-Solaris/solr/core/src/test-files/solr/collection1/conf/synonyms.txt to /configs/conf1/synonyms.txt
   [junit4]   2> 2272171 INFO  (TEST-LeaderFailoverAfterPartitionTest.test-seed#[6F91588C79C30CE]) [    ] o.a.s.c.c.SolrZkClient makePath: /configs/conf1/synonyms.txt
   [junit4]   2> 2272789 INFO  (TEST-LeaderFailoverAfterPartitionTest.test-seed#[6F91588C79C30CE]) [    ] o.a.s.SolrTestCaseJ4 Writing core.properties file to /export/home/jenkins/workspace/Lucene-Solr-trunk-Solaris/solr/build/solr-core/test/J0/temp/solr.cloud.LeaderFailoverAfterPartitionTest_6F91588C79C30CE-001/control-001/cores/collection1
   [junit4]   2> 2272808 INFO  (TEST-LeaderFailoverAfterPartitionTest.test-seed#[6F91588C79C30CE]) [    ] o.e.j.s.Server jetty-9.2.13.v20150730
   [junit4]   2> 2272809 INFO  (TEST-LeaderFailoverAfterPartitionTest.test-seed#[6F91588C79C30CE]) [    ] o.e.j.s.h.ContextHandler Started o.e.j.s.ServletContextHandler@63670dc4{/n_/hp,null,AVAILABLE}
   [junit4]   2> 2272810 INFO  (TEST-LeaderFailoverAfterPartitionTest.test-seed#[6F91588C79C30CE]) [    ] o.e.j.s.ServerConnector Started ServerConnector@3b90aceb{HTTP/1.1}{127.0.0.1:34530}
   [junit4]   2> 2272810 INFO  (TEST-LeaderFailoverAfterPartitionTest.test-seed#[6F91588C79C30CE]) [    ] o.e.j.s.Server Started @2276493ms
   [junit4]   2> 2272811 INFO  (TEST-LeaderFailoverAfterPartitionTest.test-seed#[6F91588C79C30CE]) [    ] o.a.s.c.s.e.JettySolrRunner Jetty properties: {solr.data.dir=/export/home/jenkins/workspace/Lucene-Solr-trunk-Solaris/solr/build/solr-core/test/J0/temp/solr.cloud.LeaderFailoverAfterPartitionTest_6F91588C79C30CE-001/tempDir-001/control/data, hostContext=/n_/hp, hostPort=45030, coreRootDirectory=/export/home/jenkins/workspace/Lucene-Solr-trunk-Solaris/solr/build/solr-core/test/J0/temp/solr.cloud.LeaderFailoverAfterPartitionTest_6F91588C79C30CE-001/control-001/cores}
   [junit4]   2> 2272811 INFO  (TEST-LeaderFailoverAfterPartitionTest.test-seed#[6F91588C79C30CE]) [    ] o.a.s.s.SolrDispatchFilter SolrDispatchFilter.init(): sun.misc.Launcher$AppClassLoader@659e0bfd
   [junit4]   2> 2272811 INFO  (TEST-LeaderFailoverAfterPartitionTest.test-seed#[6F91588C79C30CE]) [    ] o.a.s.c.SolrResourceLoader new SolrResourceLoader for directory: '/export/home/jenkins/workspace/Lucene-Solr-trunk-Solaris/solr/build/solr-core/test/J0/temp/solr.cloud.LeaderFailoverAfterPartitionTest_6F91588C79C30CE-001/control-001'
   [junit4]   2> 2272811 INFO  (TEST-LeaderFailoverAfterPartitionTest.test-seed#[6F91588C79C30CE]) [    ] o.a.s.c.SolrResourceLoader JNDI not configured for solr (NoInitialContextEx)
   [junit4]   2> 2272811 INFO  (TEST-LeaderFailoverAfterPartitionTest.test-seed#[6F91588C79C30CE]) [    ] o.a.s.c.SolrResourceLoader solr home defaulted to 'solr/' (could not find system property or JNDI)
   [junit4]   2> 2272811 INFO  (TEST-LeaderFailoverAfterPartitionTest.test-seed#[6F91588C79C30CE]) [    ] o.a.s.c.c.SolrZkClient Using default ZkCredentialsProvider
   [junit4]   2> 2272812 INFO  (TEST-LeaderFailoverAfterPartitionTest.test-seed#[6F91588C79C30CE]) [    ] o.a.s.c.c.ConnectionManager Waiting for client to connect to ZooKeeper
   [junit4]   2> 2272814 INFO  (zkCallback-2242-thread-1) [    ] o.a.s.c.c.ConnectionManager Watcher org.apache.solr.common.cloud.ConnectionManager@6fdffd5c name:ZooKeeperConnection Watcher:127.0.0.1:42428/solr got event WatchedEvent state:SyncConnected type:None path:null path:null type:None
   [junit4]   2> 2272814 INFO  (TEST-LeaderFailoverAfterPartitionTest.test-seed#[6F91588C79C30CE]) [    ] o.a.s.c.c.ConnectionManager Client is connected to ZooKeeper
   [junit4]   2> 2272815 INFO  (TEST-LeaderFailoverAfterPartitionTest.test-seed#[6F91588C79C30CE]) [    ] o.a.s.c.c.SolrZkClient Using default ZkACLProvider
   [junit4]   2> 2272816 INFO  (TEST-LeaderFailoverAfterPartitionTest.test-seed#[6F91588C79C30CE]) [    ] o.a.s.s.SolrDispatchFilter Loading solr.xml from SolrHome (not found in ZooKeeper)
   [junit4]   2> 2272816 INFO  (TEST-LeaderFailoverAfterPartitionTest.test-seed#[6F91588C79C30CE]) [    ] o.a.s.c.SolrXmlConfig Loading container configuration from /export/home/jenkins/workspace/Lucene-Solr-trunk-Solaris/solr/build/solr-core/test/J0/temp/solr.cloud.LeaderFailoverAfterPartitionTest_6F91588C79C30CE-001/control-001/solr.xml
   [junit4]   2> 2272816 WARN  (NIOServerCxn.Factory:0.0.0.0/0.0.0.0:0) [    ] o.a.z.s.NIOServerCnxn caught end of stream exception
   [junit4]   2> EndOfStreamException: Unable to read additional data from client sessionid 0x152252586f20002, likely client has closed socket
   [junit4]   2> 	at org.apache.zookeeper.server.NIOServerCnxn.doIO(NIOServerCnxn.java:228)
   [junit4]   2> 	at org.apache.zookeeper.server.NIOServerCnxnFactory.run(NIOServerCnxnFactory.java:208)
   [junit4]   2> 	at java.lang.Thread.run(Thread.java:745)
   [junit4]   2> 2272821 INFO  (TEST-LeaderFailoverAfterPartitionTest.test-seed#[6F91588C79C30CE]) [    ] o.a.s.c.CorePropertiesLocator Config-defined core root directory: /export/home/jenkins/workspace/Lucene-Solr-trunk-Solaris/solr/build/solr-core/test/J0/temp/solr.cloud.LeaderFailoverAfterPartitionTest_6F91588C79C30CE-001/control-001/cores
   [junit4]   2> 2272821 INFO  (TEST-LeaderFailoverAfterPartitionTest.test-seed#[6F91588C79C30CE]) [    ] o.a.s.c.CoreContainer New CoreContainer 866078462
   [junit4]   2> 2272821 INFO  (TEST-LeaderFailoverAfterPartitionTest.test-seed#[6F91588C79C30CE]) [    ] o.a.s.c.CoreContainer Loading cores into CoreContainer [instanceDir=/export/home/jenkins/workspace/Lucene-Solr-trunk-Solaris/solr/build/solr-core/test/J0/temp/solr.cloud.LeaderFailoverAfterPartitionTest_6F91588C79C30CE-001/control-001]
   [junit4]   2> 2272821 WARN  (TEST-LeaderFailoverAfterPartitionTest.test-seed#[6F91588C79C30CE]) [    ] o.a.s.c.CoreContainer Couldn't add files from /export/home/jenkins/workspace/Lucene-Solr-trunk-Solaris/solr/build/solr-core/test/J0/temp/solr.cloud.LeaderFailoverAfterPartitionTest_6F91588C79C30CE-001/control-001/lib to classpath: /export/home/jenkins/workspace/Lucene-Solr-trunk-Solaris/solr/build/solr-core/test/J0/temp/solr.cloud.LeaderFailoverAfterPartitionTest_6F91588C79C30CE-001/control-001/lib
   [junit4]   2> 2272821 INFO  (TEST-LeaderFailoverAfterPartitionTest.test-seed#[6F91588C79C30CE]) [    ] o.a.s.h.c.HttpShardHandlerFactory created with socketTimeout : 90000,urlScheme : ,connTimeout : 15000,maxConnectionsPerHost : 20,maxConnections : 10000,corePoolSize : 0,maximumPoolSize : 2147483647,maxThreadIdleTime : 5,sizeOfQueue : -1,fairnessPolicy : false,useRetries : false,
   [junit4]   2> 2272822 INFO  (TEST-LeaderFailoverAfterPartitionTest.test-seed#[6F91588C79C30CE]) [    ] o.a.s.u.UpdateShardHandler Creating UpdateShardHandler HTTP client with params: socketTimeout=340000&connTimeout=45000&retry=true
   [junit4]   2> 2272823 INFO  (TEST-LeaderFailoverAfterPartitionTest.test-seed#[6F91588C79C30CE]) [    ] o.a.s.l.LogWatcher SLF4J impl is org.slf4j.impl.Log4jLoggerFactory
   [junit4]   2> 2272823 INFO  (TEST-LeaderFailoverAfterPartitionTest.test-seed#[6F91588C79C30CE]) [    ] o.a.s.l.LogWatcher Registering Log Listener [Log4j (org.slf4j.impl.Log4jLoggerFactory)]
   [junit4]   2> 2272823 INFO  (TEST-LeaderFailoverAfterPartitionTest.test-seed#[6F91588C79C30CE]) [    ] o.a.s.c.ZkContainer Zookeeper client=127.0.0.1:42428/solr
   [junit4]   2> 2272823 INFO  (TEST-LeaderFailoverAfterPartitionTest.test-seed#[6F91588C79C30CE]) [    ] o.a.s.c.ZkController zkHost includes chroot
   [junit4]   2> 2272823 INFO  (TEST-LeaderFailoverAfterPartitionTest.test-seed#[6F91588C79C30CE]) [    ] o.a.s.c.c.SolrZkClient Using default ZkCredentialsProvider
   [junit4]   2> 2272823 INFO  (TEST-LeaderFailoverAfterPartitionTest.test-seed#[6F91588C79C30CE]) [    ] o.a.s.c.c.ConnectionManager Waiting for client to connect to ZooKeeper
   [junit4]   2> 2272825 INFO  (zkCallback-2245-thread-1) [    ] o.a.s.c.c.ConnectionManager Watcher org.apache.solr.common.cloud.ConnectionManager@24bdcf94 name:ZooKeeperConnection Watcher:127.0.0.1:42428 got event WatchedEvent state:SyncConnected type:None path:null path:null type:None
   [junit4]   2> 2272825 INFO  (TEST-LeaderFailoverAfterPartitionTest.test-seed#[6F91588C79C30CE]) [    ] o.a.s.c.c.ConnectionManager Client is connected to ZooKeeper
   [junit4]   2> 2272825 INFO  (TEST-LeaderFailoverAfterPartitionTest.test-seed#[6F91588C79C30CE]) [    ] o.a.s.c.c.SolrZkClient Using default ZkACLProvider
   [junit4]   2> 2272827 INFO  (TEST-LeaderFailoverAfterPartitionTest.test-seed#[6F91588C79C30CE]) [n:127.0.0.1:45030_n_%2Fhp    ] o.a.s.c.c.ConnectionManager Waiting for client to connect to ZooKeeper
   [junit4]   2> 2272829 INFO  (zkCallback-2246-thread-1-processing-n:127.0.0.1:45030_n_%2Fhp) [n:127.0.0.1:45030_n_%2Fhp    ] o.a.s.c.c.ConnectionManager Watcher org.apache.solr.common.cloud.ConnectionManager@c28833 name:ZooKeeperConnection Watcher:127.0.0.1:42428/solr got event WatchedEvent state:SyncConnected type:None path:null path:null type:None
   [junit4]   2> 2272829 INFO  (TEST-LeaderFailoverAfterPartitionTest.test-seed#[6F91588C79C30CE]) [n:127.0.0.1:45030_n_%2Fhp    ] o.a.s.c.c.ConnectionManager Client is connected to ZooKeeper
   [junit4]   2> 2272830 INFO  (TEST-LeaderFailoverAfterPartitionTest.test-seed#[6F91588C79C30CE]) [n:127.0.0.1:45030_n_%2Fhp    ] o.a.s.c.c.SolrZkClient makePath: /overseer/queue
   [junit4]   2> 2272833 INFO  (TEST-LeaderFailoverAfterPartitionTest.test-seed#[6F91588C79C30CE]) [n:127.0.0.1:45030_n_%2Fhp    ] o.a.s.c.c.SolrZkClient makePath: /overseer/collection-queue-work
   [junit4]   2> 2272837 INFO  (TEST-LeaderFailoverAfterPartitionTest.test-seed#[6F91588C79C30CE]) [n:127.0.0.1:45030_n_%2Fhp    ] o.a.s.c.c.SolrZkClient makePath: /overseer/collection-map-running
   [junit4]   2> 2272840 INFO  (TEST-LeaderFailoverAfterPartitionTest.test-seed#[6F91588C79C30CE]) [n:127.0.0.1:45030_n_%2Fhp    ] o.a.s.c.c.SolrZkClient makePath: /overseer/collection-map-completed
   [junit4]   2> 2272843 INFO  (TEST-LeaderFailoverAfterPartitionTest.t

[...truncated too long message...]

 http://127.0.0.1:56392/n_/hp, target: http://127.0.0.1:60327/n_/hp
   [junit4]   2> 2401395 WARN  (TEST-LeaderFailoverAfterPartitionTest.test-seed#[6F91588C79C30CE]) [n:127.0.0.1:51924_n_%2Fhp c:c8n_1x3_lf s:shard1 r:core_node1 x:c8n_1x3_lf_shard1_replica3] o.a.s.c.SocketProxy Closing 0 connections to: http://127.0.0.1:64073/n_/hp, target: http://127.0.0.1:45093/n_/hp
   [junit4]   2> NOTE: reproduce with: ant test  -Dtestcase=LeaderFailoverAfterPartitionTest -Dtests.method=test -Dtests.seed=6F91588C79C30CE -Dtests.slow=true -Dtests.locale=zh_HK -Dtests.timezone=CTT -Dtests.asserts=true -Dtests.file.encoding=US-ASCII
   [junit4] FAILURE  129s J0 | LeaderFailoverAfterPartitionTest.test <<<
   [junit4]    > Throwable #1: java.lang.AssertionError: Expected 2 of 3 replicas to be active but only found 1; [core_node3:{"core":"c8n_1x3_lf_shard1_replica2","base_url":"http://127.0.0.1:45030/n_/hp","node_name":"127.0.0.1:45030_n_%2Fhp","state":"active","leader":"true"}]; clusterState: DocCollection(c8n_1x3_lf)={
   [junit4]    >   "replicationFactor":"3",
   [junit4]    >   "shards":{"shard1":{
   [junit4]    >       "range":"80000000-7fffffff",
   [junit4]    >       "state":"active",
   [junit4]    >       "replicas":{
   [junit4]    >         "core_node1":{
   [junit4]    >           "state":"down",
   [junit4]    >           "base_url":"http://127.0.0.1:51924/n_/hp",
   [junit4]    >           "core":"c8n_1x3_lf_shard1_replica3",
   [junit4]    >           "node_name":"127.0.0.1:51924_n_%2Fhp"},
   [junit4]    >         "core_node2":{
   [junit4]    >           "core":"c8n_1x3_lf_shard1_replica1",
   [junit4]    >           "base_url":"http://127.0.0.1:64073/n_/hp",
   [junit4]    >           "node_name":"127.0.0.1:64073_n_%2Fhp",
   [junit4]    >           "state":"down"},
   [junit4]    >         "core_node3":{
   [junit4]    >           "core":"c8n_1x3_lf_shard1_replica2",
   [junit4]    >           "base_url":"http://127.0.0.1:45030/n_/hp",
   [junit4]    >           "node_name":"127.0.0.1:45030_n_%2Fhp",
   [junit4]    >           "state":"active",
   [junit4]    >           "leader":"true"}}}},
   [junit4]    >   "router":{"name":"compositeId"},
   [junit4]    >   "maxShardsPerNode":"1",
   [junit4]    >   "autoAddReplicas":"false"}
   [junit4]    > 	at __randomizedtesting.SeedInfo.seed([6F91588C79C30CE:8EAD2A5269605D36]:0)
   [junit4]    > 	at org.apache.solr.cloud.LeaderFailoverAfterPartitionTest.testRf3WithLeaderFailover(LeaderFailoverAfterPartitionTest.java:171)
   [junit4]    > 	at org.apache.solr.cloud.LeaderFailoverAfterPartitionTest.test(LeaderFailoverAfterPartitionTest.java:56)
   [junit4]    > 	at org.apache.solr.BaseDistributedSearchTestCase$ShardsRepeatRule$ShardsFixedStatement.callStatement(BaseDistributedSearchTestCase.java:965)
   [junit4]    > 	at org.apache.solr.BaseDistributedSearchTestCase$ShardsRepeatRule$ShardsStatement.evaluate(BaseDistributedSearchTestCase.java:940)
   [junit4]    > 	at java.lang.Thread.run(Thread.java:745)
   [junit4]   2> 2401398 INFO  (SUITE-LeaderFailoverAfterPartitionTest-seed#[6F91588C79C30CE]-worker) [n:127.0.0.1:51924_n_%2Fhp c:c8n_1x3_lf s:shard1 r:core_node1 x:c8n_1x3_lf_shard1_replica3] o.a.s.SolrTestCaseJ4 ###deleteCore
   [junit4]   2> NOTE: leaving temporary files on disk at: /export/home/jenkins/workspace/Lucene-Solr-trunk-Solaris/solr/build/solr-core/test/J0/temp/solr.cloud.LeaderFailoverAfterPartitionTest_6F91588C79C30CE-001
   [junit4]   2> NOTE: test params are: codec=Asserting(Lucene60): {range_facet_l_dv=PostingsFormat(name=Asserting), _version_=FST50, multiDefault=BlockTreeOrds(blocksize=128), a_t=FST50, intDefault=FST50, id=PostingsFormat(name=Asserting), range_facet_i_dv=FST50, text=PostingsFormat(name=Memory doPackFST= true), range_facet_l=FST50, timestamp=FST50}, docValues:{range_facet_l_dv=DocValuesFormat(name=Direct), range_facet_i_dv=DocValuesFormat(name=Lucene54), timestamp=DocValuesFormat(name=Lucene54)}, sim=RandomSimilarityProvider(queryNorm=false,coord=yes): {}, locale=zh_HK, timezone=CTT
   [junit4]   2> NOTE: SunOS 5.11 amd64/Oracle Corporation 1.8.0_66 (64-bit)/cpus=3,threads=1,free=254333904,total=536870912
   [junit4]   2> NOTE: All tests run in this JVM: [TestSearchPerf, TestShortCircuitedRequests, DistributedExpandComponentTest, AnalysisAfterCoreReloadTest, MBeansHandlerTest, TestFieldTypeResource, SchemaVersionSpecificBehaviorTest, TestDistribDocBasedVersion, TestHashPartitioner, TestHighFrequencyDictionaryFactory, SuggestComponentTest, CursorPagingTest, TestOrdValues, TestFieldResource, TestTrackingShardHandlerFactory, TestConfigSetsAPIZkFailure, RequiredFieldsTest, TestEmbeddedSolrServerConstructors, ChaosMonkeyNothingIsSafeTest, TestConfig, TestCodecSupport, TestSchemaResource, TestManagedResource, TestUniqueKeyFieldResource, PrimitiveFieldTypeTest, DocumentAnalysisRequestHandlerTest, HdfsBasicDistributedZk2Test, TestStressUserVersions, SolrIndexConfigTest, TestClassicSimilarityFactory, BadComponentTest, TestLuceneMatchVersion, XsltUpdateRequestHandlerTest, CursorMarkTest, TestStressVersions, TestLeaderInitiatedRecoveryThread, CurrencyFieldXmlFileTest, TestSQLHandler, DeleteShardTest, BlockJoinFacetRandomTest, PeerSyncTest, SimplePostToolTest, TestPostingsSolrHighlighter, TestIntervalFaceting, CircularListTest, ResponseHeaderTest, StatelessScriptUpdateProcessorFactoryTest, TestInfoStreamLogging, TestExactStatsCache, OverseerTaskQueueTest, TestStressReorder, TestOverriddenPrefixQueryForCustomFieldType, HdfsRecoverLeaseTest, HighlighterMaxOffsetTest, TestLRUCache, TestSchemaVersionResource, HdfsDirectoryFactoryTest, TestInitQParser, ClusterStateUpdateTest, RulesTest, TestLazyCores, DistributedFacetPivotSmallTest, HdfsChaosMonkeyNothingIsSafeTest, TestCursorMarkWithoutUniqueKey, TestConfigSetProperties, TestSolrConfigHandlerConcurrent, BitVectorTest, DirectSolrSpellCheckerTest, CloudMLTQParserTest, AddBlockUpdateTest, TestFastLRUCache, PreAnalyzedUpdateProcessorTest, HighlighterTest, UUIDUpdateProcessorFallbackTest, TestDistribIDF, SliceStateTest, TestCustomSort, PingRequestHandlerTest, TestReqParamsAPI, TestConfigSetsAPI, UUIDFieldTest, TestQuerySenderNoQuery, ForceLeaderTest, ScriptEngineTest, SampleTest, URLClassifyProcessorTest, DistributedQueryComponentCustomSortTest, TestRequestForwarding, DOMUtilTest, TestSolrDynamicMBean, TestCSVLoader, InfoHandlerTest, ExternalFileFieldSortTest, BasicAuthIntegrationTest, TestRebalanceLeaders, TestDynamicFieldResource, AlternateDirectoryTest, SpatialRPTFieldTypeTest, TestDocSet, TestSolr4Spatial2, HdfsCollectionsAPIDistributedZkTest, TestXIncludeConfig, CollectionsAPIAsyncDistributedZkTest, DistributedQueueTest, TestLFUCache, TestGroupingSearch, TestFaceting, TestSolrQueryResponse, TestExclusionRuleCollectionAccess, ChangedSchemaMergeTest, SuggesterFSTTest, BigEndianAscendingWordDeserializerTest, SoftAutoCommitTest, TestManagedSynonymFilterFactory, SolrCoreTest, TestComponentsName, TestCloudPivotFacet, DirectoryFactoryTest, PrimUtilsTest, TestCloudManagedSchema, DistributedFacetPivotLongTailTest, DirectUpdateHandlerTest, DistributedSpellCheckComponentTest, TestRandomCollapseQParserPlugin, FastVectorHighlighterTest, TestObjectReleaseTracker, TestFunctionQuery, TestAnalyzedSuggestions, ShardRoutingTest, HLLUtilTest, TestSurroundQueryParser, GraphQueryTest, TestRuleBasedAuthorizationPlugin, TestPseudoReturnFields, RestartWhileUpdatingTest, TestMissingGroups, QueryEqualityTest, BasicDistributedZkTest, ChaosMonkeySafeLeaderTest, UnloadDistributedZkTest, SyncSliceTest, OverseerTest, BasicZkTest, RecoveryZkTest, TestReplicationHandler, TestRandomFaceting, LeaderElectionTest, TestRandomDVFaceting, ZkCLITest, ShardRoutingCustomTest, TestDistributedSearch, TestWriterPerf, TermsComponentTest, TestValueSourceCache, FieldAnalysisRequestHandlerTest, TestArbitraryIndexDir, IndexSchemaTest, TestCollationField, JSONWriterTest, JsonLoaderTest, TestPartialUpdateDeduplication, TestBinaryResponseWriter, UpdateParamsTest, ResponseLogComponentTest, TestSolrDeletionPolicy2, NumericFieldsTest, MinimalSchemaTest, OutputWriterTest, DirectSolrConnectionTest, TestPhraseSuggestions, EchoParamsTest, TestDFRSimilarityFactory, TestIBSimilarityFactory, TestFastWriter, TimeZoneUtilsTest, DateMathParserTest, TestSystemIdResolver, RAMDirectoryFactoryTest, TestSolrJ, TestDocumentBuilder, SystemInfoHandlerTest, DistributedMLTComponentTest, TestTolerantSearch, AssignTest, AsyncMigrateRouteKeyTest, CollectionStateFormat2Test, CustomCollectionTest, DistribJoinFromCollectionTest, DistributedVersionInfoTest, LeaderFailoverAfterPartitionTest]
   [junit4] Completed [432/575 (2!)] on J0 in 129.39s, 1 test, 1 failure <<< FAILURES!

[...truncated 492 lines...]
BUILD FAILED
/export/home/jenkins/workspace/Lucene-Solr-trunk-Solaris/build.xml:784: The following error occurred while executing this line:
/export/home/jenkins/workspace/Lucene-Solr-trunk-Solaris/build.xml:728: The following error occurred while executing this line:
/export/home/jenkins/workspace/Lucene-Solr-trunk-Solaris/build.xml:59: The following error occurred while executing this line:
/export/home/jenkins/workspace/Lucene-Solr-trunk-Solaris/solr/build.xml:233: The following error occurred while executing this line:
/export/home/jenkins/workspace/Lucene-Solr-trunk-Solaris/solr/common-build.xml:516: The following error occurred while executing this line:
/export/home/jenkins/workspace/Lucene-Solr-trunk-Solaris/lucene/common-build.xml:1424: The following error occurred while executing this line:
/export/home/jenkins/workspace/Lucene-Solr-trunk-Solaris/lucene/common-build.xml:981: There were test failures: 575 suites (8 ignored), 2290 tests, 1 error, 1 failure, 85 ignored (70 assumptions) [seed: 6F91588C79C30CE]

Total time: 81 minutes 30 seconds
Build step 'Invoke Ant' marked build as failure
Archiving artifacts
[WARNINGS] Skipping publisher since build result is FAILURE
Recording test results
Email was triggered for: Failure - Any
Sending email for trigger: Failure - Any



Mime
View raw message