lucene-dev mailing list archives

Site index · List index
Message view « Date » · « Thread »
Top « Date » · « Thread »
From Policeman Jenkins Server <jenk...@thetaphi.de>
Subject [JENKINS] Lucene-Solr-5.x-Linux (64bit/jdk1.8.0_66) - Build # 15189 - Failure!
Date Fri, 08 Jan 2016 19:33:02 GMT
Build: http://jenkins.thetaphi.de/job/Lucene-Solr-5.x-Linux/15189/
Java: 64bit/jdk1.8.0_66 -XX:-UseCompressedOops -XX:+UseSerialGC

5 tests failed.
FAILED:  junit.framework.TestSuite.org.apache.solr.cloud.MigrateRouteKeyTest

Error Message:
ObjectTracker found 3 object(s) that were not released!!! [MockDirectoryWrapper, MockDirectoryWrapper, SolrCore]

Stack Trace:
java.lang.AssertionError: ObjectTracker found 3 object(s) that were not released!!! [MockDirectoryWrapper, MockDirectoryWrapper, SolrCore]
	at __randomizedtesting.SeedInfo.seed([FC43CF849DD0E08]:0)
	at org.junit.Assert.fail(Assert.java:93)
	at org.junit.Assert.assertTrue(Assert.java:43)
	at org.junit.Assert.assertNull(Assert.java:551)
	at org.apache.solr.SolrTestCaseJ4.afterClass(SolrTestCaseJ4.java:228)
	at sun.reflect.GeneratedMethodAccessor17.invoke(Unknown Source)
	at sun.reflect.DelegatingMethodAccessorImpl.invoke(DelegatingMethodAccessorImpl.java:43)
	at java.lang.reflect.Method.invoke(Method.java:497)
	at com.carrotsearch.randomizedtesting.RandomizedRunner.invoke(RandomizedRunner.java:1764)
	at com.carrotsearch.randomizedtesting.RandomizedRunner$7.evaluate(RandomizedRunner.java:834)
	at com.carrotsearch.randomizedtesting.rules.StatementAdapter.evaluate(StatementAdapter.java:36)
	at com.carrotsearch.randomizedtesting.rules.SystemPropertiesRestoreRule$1.evaluate(SystemPropertiesRestoreRule.java:57)
	at org.apache.lucene.util.AbstractBeforeAfterRule$1.evaluate(AbstractBeforeAfterRule.java:46)
	at com.carrotsearch.randomizedtesting.rules.StatementAdapter.evaluate(StatementAdapter.java:36)
	at org.apache.lucene.util.TestRuleStoreClassName$1.evaluate(TestRuleStoreClassName.java:42)
	at com.carrotsearch.randomizedtesting.rules.NoShadowingOrOverridesOnMethodsRule$1.evaluate(NoShadowingOrOverridesOnMethodsRule.java:40)
	at com.carrotsearch.randomizedtesting.rules.NoShadowingOrOverridesOnMethodsRule$1.evaluate(NoShadowingOrOverridesOnMethodsRule.java:40)
	at com.carrotsearch.randomizedtesting.rules.StatementAdapter.evaluate(StatementAdapter.java:36)
	at com.carrotsearch.randomizedtesting.rules.StatementAdapter.evaluate(StatementAdapter.java:36)
	at com.carrotsearch.randomizedtesting.rules.StatementAdapter.evaluate(StatementAdapter.java:36)
	at org.apache.lucene.util.TestRuleAssertionsRequired$1.evaluate(TestRuleAssertionsRequired.java:54)
	at org.apache.lucene.util.TestRuleMarkFailure$1.evaluate(TestRuleMarkFailure.java:48)
	at org.apache.lucene.util.TestRuleIgnoreAfterMaxFailures$1.evaluate(TestRuleIgnoreAfterMaxFailures.java:65)
	at org.apache.lucene.util.TestRuleIgnoreTestSuites$1.evaluate(TestRuleIgnoreTestSuites.java:55)
	at com.carrotsearch.randomizedtesting.rules.StatementAdapter.evaluate(StatementAdapter.java:36)
	at com.carrotsearch.randomizedtesting.ThreadLeakControl$StatementRunner.run(ThreadLeakControl.java:367)
	at java.lang.Thread.run(Thread.java:745)


FAILED:  org.apache.solr.cloud.DistribJoinFromCollectionTest.test

Error Message:
Error from server at http://127.0.0.1:40289/ct_o/ew/to_2x2_shard1_replica2: SolrCloud join: from_1x2 has a local replica (from_1x2_shard1_replica1) on 127.0.0.1:40289_ct_o%2Few, but it is down

Stack Trace:
org.apache.solr.client.solrj.impl.HttpSolrClient$RemoteSolrException: Error from server at http://127.0.0.1:40289/ct_o/ew/to_2x2_shard1_replica2: SolrCloud join: from_1x2 has a local replica (from_1x2_shard1_replica1) on 127.0.0.1:40289_ct_o%2Few, but it is down
	at __randomizedtesting.SeedInfo.seed([FC43CF849DD0E08:87900322E72163F0]:0)
	at org.apache.solr.client.solrj.impl.HttpSolrClient.executeMethod(HttpSolrClient.java:575)
	at org.apache.solr.client.solrj.impl.HttpSolrClient.request(HttpSolrClient.java:241)
	at org.apache.solr.client.solrj.impl.HttpSolrClient.request(HttpSolrClient.java:230)
	at org.apache.solr.client.solrj.impl.LBHttpSolrClient.doRequest(LBHttpSolrClient.java:372)
	at org.apache.solr.client.solrj.impl.LBHttpSolrClient.request(LBHttpSolrClient.java:325)
	at org.apache.solr.client.solrj.impl.CloudSolrClient.sendRequest(CloudSolrClient.java:1100)
	at org.apache.solr.client.solrj.impl.CloudSolrClient.requestWithRetryOnStaleState(CloudSolrClient.java:871)
	at org.apache.solr.client.solrj.impl.CloudSolrClient.request(CloudSolrClient.java:807)
	at org.apache.solr.client.solrj.SolrClient.request(SolrClient.java:1220)
	at org.apache.solr.cloud.DistribJoinFromCollectionTest.testJoins(DistribJoinFromCollectionTest.java:132)
	at org.apache.solr.cloud.DistribJoinFromCollectionTest.test(DistribJoinFromCollectionTest.java:103)
	at sun.reflect.NativeMethodAccessorImpl.invoke0(Native Method)
	at sun.reflect.NativeMethodAccessorImpl.invoke(NativeMethodAccessorImpl.java:62)
	at sun.reflect.DelegatingMethodAccessorImpl.invoke(DelegatingMethodAccessorImpl.java:43)
	at java.lang.reflect.Method.invoke(Method.java:497)
	at com.carrotsearch.randomizedtesting.RandomizedRunner.invoke(RandomizedRunner.java:1764)
	at com.carrotsearch.randomizedtesting.RandomizedRunner$8.evaluate(RandomizedRunner.java:871)
	at com.carrotsearch.randomizedtesting.RandomizedRunner$9.evaluate(RandomizedRunner.java:907)
	at com.carrotsearch.randomizedtesting.RandomizedRunner$10.evaluate(RandomizedRunner.java:921)
	at org.apache.solr.BaseDistributedSearchTestCase$ShardsRepeatRule$ShardsFixedStatement.callStatement(BaseDistributedSearchTestCase.java:965)
	at org.apache.solr.BaseDistributedSearchTestCase$ShardsRepeatRule$ShardsStatement.evaluate(BaseDistributedSearchTestCase.java:940)
	at com.carrotsearch.randomizedtesting.rules.SystemPropertiesRestoreRule$1.evaluate(SystemPropertiesRestoreRule.java:57)
	at org.apache.lucene.util.TestRuleSetupTeardownChained$1.evaluate(TestRuleSetupTeardownChained.java:50)
	at org.apache.lucene.util.AbstractBeforeAfterRule$1.evaluate(AbstractBeforeAfterRule.java:46)
	at org.apache.lucene.util.TestRuleThreadAndTestName$1.evaluate(TestRuleThreadAndTestName.java:49)
	at org.apache.lucene.util.TestRuleIgnoreAfterMaxFailures$1.evaluate(TestRuleIgnoreAfterMaxFailures.java:65)
	at org.apache.lucene.util.TestRuleMarkFailure$1.evaluate(TestRuleMarkFailure.java:48)
	at com.carrotsearch.randomizedtesting.rules.StatementAdapter.evaluate(StatementAdapter.java:36)
	at com.carrotsearch.randomizedtesting.ThreadLeakControl$StatementRunner.run(ThreadLeakControl.java:367)
	at com.carrotsearch.randomizedtesting.ThreadLeakControl.forkTimeoutingTask(ThreadLeakControl.java:809)
	at com.carrotsearch.randomizedtesting.ThreadLeakControl$3.evaluate(ThreadLeakControl.java:460)
	at com.carrotsearch.randomizedtesting.RandomizedRunner.runSingleTest(RandomizedRunner.java:880)
	at com.carrotsearch.randomizedtesting.RandomizedRunner$5.evaluate(RandomizedRunner.java:781)
	at com.carrotsearch.randomizedtesting.RandomizedRunner$6.evaluate(RandomizedRunner.java:816)
	at com.carrotsearch.randomizedtesting.RandomizedRunner$7.evaluate(RandomizedRunner.java:827)
	at com.carrotsearch.randomizedtesting.rules.StatementAdapter.evaluate(StatementAdapter.java:36)
	at com.carrotsearch.randomizedtesting.rules.SystemPropertiesRestoreRule$1.evaluate(SystemPropertiesRestoreRule.java:57)
	at org.apache.lucene.util.AbstractBeforeAfterRule$1.evaluate(AbstractBeforeAfterRule.java:46)
	at com.carrotsearch.randomizedtesting.rules.StatementAdapter.evaluate(StatementAdapter.java:36)
	at org.apache.lucene.util.TestRuleStoreClassName$1.evaluate(TestRuleStoreClassName.java:42)
	at com.carrotsearch.randomizedtesting.rules.NoShadowingOrOverridesOnMethodsRule$1.evaluate(NoShadowingOrOverridesOnMethodsRule.java:40)
	at com.carrotsearch.randomizedtesting.rules.NoShadowingOrOverridesOnMethodsRule$1.evaluate(NoShadowingOrOverridesOnMethodsRule.java:40)
	at com.carrotsearch.randomizedtesting.rules.StatementAdapter.evaluate(StatementAdapter.java:36)
	at com.carrotsearch.randomizedtesting.rules.StatementAdapter.evaluate(StatementAdapter.java:36)
	at com.carrotsearch.randomizedtesting.rules.StatementAdapter.evaluate(StatementAdapter.java:36)
	at org.apache.lucene.util.TestRuleAssertionsRequired$1.evaluate(TestRuleAssertionsRequired.java:54)
	at org.apache.lucene.util.TestRuleMarkFailure$1.evaluate(TestRuleMarkFailure.java:48)
	at org.apache.lucene.util.TestRuleIgnoreAfterMaxFailures$1.evaluate(TestRuleIgnoreAfterMaxFailures.java:65)
	at org.apache.lucene.util.TestRuleIgnoreTestSuites$1.evaluate(TestRuleIgnoreTestSuites.java:55)
	at com.carrotsearch.randomizedtesting.rules.StatementAdapter.evaluate(StatementAdapter.java:36)
	at com.carrotsearch.randomizedtesting.ThreadLeakControl$StatementRunner.run(ThreadLeakControl.java:367)
	at java.lang.Thread.run(Thread.java:745)


FAILED:  org.apache.solr.cloud.ShardSplitTest.test

Error Message:
There are still nodes recoverying - waited for 330 seconds

Stack Trace:
java.lang.AssertionError: There are still nodes recoverying - waited for 330 seconds
	at __randomizedtesting.SeedInfo.seed([FC43CF849DD0E08:87900322E72163F0]:0)
	at org.junit.Assert.fail(Assert.java:93)
	at org.apache.solr.cloud.AbstractDistribZkTestBase.waitForRecoveriesToFinish(AbstractDistribZkTestBase.java:175)
	at org.apache.solr.cloud.AbstractDistribZkTestBase.waitForRecoveriesToFinish(AbstractDistribZkTestBase.java:136)
	at org.apache.solr.cloud.AbstractDistribZkTestBase.waitForRecoveriesToFinish(AbstractDistribZkTestBase.java:131)
	at org.apache.solr.cloud.AbstractFullDistribZkTestBase.waitForRecoveriesToFinish(AbstractFullDistribZkTestBase.java:825)
	at org.apache.solr.cloud.ShardSplitTest.splitByUniqueKeyTest(ShardSplitTest.java:219)
	at org.apache.solr.cloud.ShardSplitTest.test(ShardSplitTest.java:82)
	at sun.reflect.NativeMethodAccessorImpl.invoke0(Native Method)
	at sun.reflect.NativeMethodAccessorImpl.invoke(NativeMethodAccessorImpl.java:62)
	at sun.reflect.DelegatingMethodAccessorImpl.invoke(DelegatingMethodAccessorImpl.java:43)
	at java.lang.reflect.Method.invoke(Method.java:497)
	at com.carrotsearch.randomizedtesting.RandomizedRunner.invoke(RandomizedRunner.java:1764)
	at com.carrotsearch.randomizedtesting.RandomizedRunner$8.evaluate(RandomizedRunner.java:871)
	at com.carrotsearch.randomizedtesting.RandomizedRunner$9.evaluate(RandomizedRunner.java:907)
	at com.carrotsearch.randomizedtesting.RandomizedRunner$10.evaluate(RandomizedRunner.java:921)
	at org.apache.solr.BaseDistributedSearchTestCase$ShardsRepeatRule$ShardsFixedStatement.callStatement(BaseDistributedSearchTestCase.java:965)
	at org.apache.solr.BaseDistributedSearchTestCase$ShardsRepeatRule$ShardsStatement.evaluate(BaseDistributedSearchTestCase.java:940)
	at com.carrotsearch.randomizedtesting.rules.SystemPropertiesRestoreRule$1.evaluate(SystemPropertiesRestoreRule.java:57)
	at org.apache.lucene.util.TestRuleSetupTeardownChained$1.evaluate(TestRuleSetupTeardownChained.java:50)
	at org.apache.lucene.util.AbstractBeforeAfterRule$1.evaluate(AbstractBeforeAfterRule.java:46)
	at org.apache.lucene.util.TestRuleThreadAndTestName$1.evaluate(TestRuleThreadAndTestName.java:49)
	at org.apache.lucene.util.TestRuleIgnoreAfterMaxFailures$1.evaluate(TestRuleIgnoreAfterMaxFailures.java:65)
	at org.apache.lucene.util.TestRuleMarkFailure$1.evaluate(TestRuleMarkFailure.java:48)
	at com.carrotsearch.randomizedtesting.rules.StatementAdapter.evaluate(StatementAdapter.java:36)
	at com.carrotsearch.randomizedtesting.ThreadLeakControl$StatementRunner.run(ThreadLeakControl.java:367)
	at com.carrotsearch.randomizedtesting.ThreadLeakControl.forkTimeoutingTask(ThreadLeakControl.java:809)
	at com.carrotsearch.randomizedtesting.ThreadLeakControl$3.evaluate(ThreadLeakControl.java:460)
	at com.carrotsearch.randomizedtesting.RandomizedRunner.runSingleTest(RandomizedRunner.java:880)
	at com.carrotsearch.randomizedtesting.RandomizedRunner$5.evaluate(RandomizedRunner.java:781)
	at com.carrotsearch.randomizedtesting.RandomizedRunner$6.evaluate(RandomizedRunner.java:816)
	at com.carrotsearch.randomizedtesting.RandomizedRunner$7.evaluate(RandomizedRunner.java:827)
	at com.carrotsearch.randomizedtesting.rules.StatementAdapter.evaluate(StatementAdapter.java:36)
	at com.carrotsearch.randomizedtesting.rules.SystemPropertiesRestoreRule$1.evaluate(SystemPropertiesRestoreRule.java:57)
	at org.apache.lucene.util.AbstractBeforeAfterRule$1.evaluate(AbstractBeforeAfterRule.java:46)
	at com.carrotsearch.randomizedtesting.rules.StatementAdapter.evaluate(StatementAdapter.java:36)
	at org.apache.lucene.util.TestRuleStoreClassName$1.evaluate(TestRuleStoreClassName.java:42)
	at com.carrotsearch.randomizedtesting.rules.NoShadowingOrOverridesOnMethodsRule$1.evaluate(NoShadowingOrOverridesOnMethodsRule.java:40)
	at com.carrotsearch.randomizedtesting.rules.NoShadowingOrOverridesOnMethodsRule$1.evaluate(NoShadowingOrOverridesOnMethodsRule.java:40)
	at com.carrotsearch.randomizedtesting.rules.StatementAdapter.evaluate(StatementAdapter.java:36)
	at com.carrotsearch.randomizedtesting.rules.StatementAdapter.evaluate(StatementAdapter.java:36)
	at com.carrotsearch.randomizedtesting.rules.StatementAdapter.evaluate(StatementAdapter.java:36)
	at org.apache.lucene.util.TestRuleAssertionsRequired$1.evaluate(TestRuleAssertionsRequired.java:54)
	at org.apache.lucene.util.TestRuleMarkFailure$1.evaluate(TestRuleMarkFailure.java:48)
	at org.apache.lucene.util.TestRuleIgnoreAfterMaxFailures$1.evaluate(TestRuleIgnoreAfterMaxFailures.java:65)
	at org.apache.lucene.util.TestRuleIgnoreTestSuites$1.evaluate(TestRuleIgnoreTestSuites.java:55)
	at com.carrotsearch.randomizedtesting.rules.StatementAdapter.evaluate(StatementAdapter.java:36)
	at com.carrotsearch.randomizedtesting.ThreadLeakControl$StatementRunner.run(ThreadLeakControl.java:367)
	at java.lang.Thread.run(Thread.java:745)


FAILED:  org.apache.solr.cloud.TestAuthenticationFramework.testCollectionCreateSearchDelete

Error Message:
expected:<1> but was:<0>

Stack Trace:
java.lang.AssertionError: expected:<1> but was:<0>
	at __randomizedtesting.SeedInfo.seed([FC43CF849DD0E08:AC3E925DCE35E4AD]:0)
	at org.junit.Assert.fail(Assert.java:93)
	at org.junit.Assert.failNotEquals(Assert.java:647)
	at org.junit.Assert.assertEquals(Assert.java:128)
	at org.junit.Assert.assertEquals(Assert.java:472)
	at org.junit.Assert.assertEquals(Assert.java:456)
	at org.apache.solr.cloud.TestMiniSolrCloudCluster.testCollectionCreateSearchDelete(TestMiniSolrCloudCluster.java:175)
	at sun.reflect.NativeMethodAccessorImpl.invoke0(Native Method)
	at sun.reflect.NativeMethodAccessorImpl.invoke(NativeMethodAccessorImpl.java:62)
	at sun.reflect.DelegatingMethodAccessorImpl.invoke(DelegatingMethodAccessorImpl.java:43)
	at java.lang.reflect.Method.invoke(Method.java:497)
	at com.carrotsearch.randomizedtesting.RandomizedRunner.invoke(RandomizedRunner.java:1764)
	at com.carrotsearch.randomizedtesting.RandomizedRunner$8.evaluate(RandomizedRunner.java:871)
	at com.carrotsearch.randomizedtesting.RandomizedRunner$9.evaluate(RandomizedRunner.java:907)
	at com.carrotsearch.randomizedtesting.RandomizedRunner$10.evaluate(RandomizedRunner.java:921)
	at com.carrotsearch.randomizedtesting.rules.SystemPropertiesRestoreRule$1.evaluate(SystemPropertiesRestoreRule.java:57)
	at org.apache.lucene.util.TestRuleSetupTeardownChained$1.evaluate(TestRuleSetupTeardownChained.java:50)
	at org.apache.lucene.util.AbstractBeforeAfterRule$1.evaluate(AbstractBeforeAfterRule.java:46)
	at org.apache.lucene.util.TestRuleThreadAndTestName$1.evaluate(TestRuleThreadAndTestName.java:49)
	at org.apache.lucene.util.TestRuleIgnoreAfterMaxFailures$1.evaluate(TestRuleIgnoreAfterMaxFailures.java:65)
	at org.apache.lucene.util.TestRuleMarkFailure$1.evaluate(TestRuleMarkFailure.java:48)
	at com.carrotsearch.randomizedtesting.rules.StatementAdapter.evaluate(StatementAdapter.java:36)
	at com.carrotsearch.randomizedtesting.ThreadLeakControl$StatementRunner.run(ThreadLeakControl.java:367)
	at com.carrotsearch.randomizedtesting.ThreadLeakControl.forkTimeoutingTask(ThreadLeakControl.java:809)
	at com.carrotsearch.randomizedtesting.ThreadLeakControl$3.evaluate(ThreadLeakControl.java:460)
	at com.carrotsearch.randomizedtesting.RandomizedRunner.runSingleTest(RandomizedRunner.java:880)
	at com.carrotsearch.randomizedtesting.RandomizedRunner$5.evaluate(RandomizedRunner.java:781)
	at com.carrotsearch.randomizedtesting.RandomizedRunner$6.evaluate(RandomizedRunner.java:816)
	at com.carrotsearch.randomizedtesting.RandomizedRunner$7.evaluate(RandomizedRunner.java:827)
	at com.carrotsearch.randomizedtesting.rules.StatementAdapter.evaluate(StatementAdapter.java:36)
	at com.carrotsearch.randomizedtesting.rules.SystemPropertiesRestoreRule$1.evaluate(SystemPropertiesRestoreRule.java:57)
	at org.apache.lucene.util.AbstractBeforeAfterRule$1.evaluate(AbstractBeforeAfterRule.java:46)
	at com.carrotsearch.randomizedtesting.rules.StatementAdapter.evaluate(StatementAdapter.java:36)
	at org.apache.lucene.util.TestRuleStoreClassName$1.evaluate(TestRuleStoreClassName.java:42)
	at com.carrotsearch.randomizedtesting.rules.NoShadowingOrOverridesOnMethodsRule$1.evaluate(NoShadowingOrOverridesOnMethodsRule.java:40)
	at com.carrotsearch.randomizedtesting.rules.NoShadowingOrOverridesOnMethodsRule$1.evaluate(NoShadowingOrOverridesOnMethodsRule.java:40)
	at com.carrotsearch.randomizedtesting.rules.StatementAdapter.evaluate(StatementAdapter.java:36)
	at com.carrotsearch.randomizedtesting.rules.StatementAdapter.evaluate(StatementAdapter.java:36)
	at com.carrotsearch.randomizedtesting.rules.StatementAdapter.evaluate(StatementAdapter.java:36)
	at org.apache.lucene.util.TestRuleAssertionsRequired$1.evaluate(TestRuleAssertionsRequired.java:54)
	at org.apache.lucene.util.TestRuleMarkFailure$1.evaluate(TestRuleMarkFailure.java:48)
	at org.apache.lucene.util.TestRuleIgnoreAfterMaxFailures$1.evaluate(TestRuleIgnoreAfterMaxFailures.java:65)
	at org.apache.lucene.util.TestRuleIgnoreTestSuites$1.evaluate(TestRuleIgnoreTestSuites.java:55)
	at com.carrotsearch.randomizedtesting.rules.StatementAdapter.evaluate(StatementAdapter.java:36)
	at com.carrotsearch.randomizedtesting.ThreadLeakControl$StatementRunner.run(ThreadLeakControl.java:367)
	at java.lang.Thread.run(Thread.java:745)


FAILED:  org.apache.solr.cloud.TestAuthenticationFramework.testBasics

Error Message:
expected:<1> but was:<0>

Stack Trace:
java.lang.AssertionError: expected:<1> but was:<0>
	at __randomizedtesting.SeedInfo.seed([FC43CF849DD0E08:321C92D471335078]:0)
	at org.junit.Assert.fail(Assert.java:93)
	at org.junit.Assert.failNotEquals(Assert.java:647)
	at org.junit.Assert.assertEquals(Assert.java:128)
	at org.junit.Assert.assertEquals(Assert.java:472)
	at org.junit.Assert.assertEquals(Assert.java:456)
	at org.apache.solr.cloud.TestMiniSolrCloudCluster.testCollectionCreateSearchDelete(TestMiniSolrCloudCluster.java:227)
	at org.apache.solr.cloud.TestAuthenticationFramework.testBasics(TestAuthenticationFramework.java:93)
	at sun.reflect.NativeMethodAccessorImpl.invoke0(Native Method)
	at sun.reflect.NativeMethodAccessorImpl.invoke(NativeMethodAccessorImpl.java:62)
	at sun.reflect.DelegatingMethodAccessorImpl.invoke(DelegatingMethodAccessorImpl.java:43)
	at java.lang.reflect.Method.invoke(Method.java:497)
	at com.carrotsearch.randomizedtesting.RandomizedRunner.invoke(RandomizedRunner.java:1764)
	at com.carrotsearch.randomizedtesting.RandomizedRunner$8.evaluate(RandomizedRunner.java:871)
	at com.carrotsearch.randomizedtesting.RandomizedRunner$9.evaluate(RandomizedRunner.java:907)
	at com.carrotsearch.randomizedtesting.RandomizedRunner$10.evaluate(RandomizedRunner.java:921)
	at com.carrotsearch.randomizedtesting.rules.SystemPropertiesRestoreRule$1.evaluate(SystemPropertiesRestoreRule.java:57)
	at org.apache.lucene.util.TestRuleSetupTeardownChained$1.evaluate(TestRuleSetupTeardownChained.java:50)
	at org.apache.lucene.util.AbstractBeforeAfterRule$1.evaluate(AbstractBeforeAfterRule.java:46)
	at org.apache.lucene.util.TestRuleThreadAndTestName$1.evaluate(TestRuleThreadAndTestName.java:49)
	at org.apache.lucene.util.TestRuleIgnoreAfterMaxFailures$1.evaluate(TestRuleIgnoreAfterMaxFailures.java:65)
	at org.apache.lucene.util.TestRuleMarkFailure$1.evaluate(TestRuleMarkFailure.java:48)
	at com.carrotsearch.randomizedtesting.rules.StatementAdapter.evaluate(StatementAdapter.java:36)
	at com.carrotsearch.randomizedtesting.ThreadLeakControl$StatementRunner.run(ThreadLeakControl.java:367)
	at com.carrotsearch.randomizedtesting.ThreadLeakControl.forkTimeoutingTask(ThreadLeakControl.java:809)
	at com.carrotsearch.randomizedtesting.ThreadLeakControl$3.evaluate(ThreadLeakControl.java:460)
	at com.carrotsearch.randomizedtesting.RandomizedRunner.runSingleTest(RandomizedRunner.java:880)
	at com.carrotsearch.randomizedtesting.RandomizedRunner$5.evaluate(RandomizedRunner.java:781)
	at com.carrotsearch.randomizedtesting.RandomizedRunner$6.evaluate(RandomizedRunner.java:816)
	at com.carrotsearch.randomizedtesting.RandomizedRunner$7.evaluate(RandomizedRunner.java:827)
	at com.carrotsearch.randomizedtesting.rules.StatementAdapter.evaluate(StatementAdapter.java:36)
	at com.carrotsearch.randomizedtesting.rules.SystemPropertiesRestoreRule$1.evaluate(SystemPropertiesRestoreRule.java:57)
	at org.apache.lucene.util.AbstractBeforeAfterRule$1.evaluate(AbstractBeforeAfterRule.java:46)
	at com.carrotsearch.randomizedtesting.rules.StatementAdapter.evaluate(StatementAdapter.java:36)
	at org.apache.lucene.util.TestRuleStoreClassName$1.evaluate(TestRuleStoreClassName.java:42)
	at com.carrotsearch.randomizedtesting.rules.NoShadowingOrOverridesOnMethodsRule$1.evaluate(NoShadowingOrOverridesOnMethodsRule.java:40)
	at com.carrotsearch.randomizedtesting.rules.NoShadowingOrOverridesOnMethodsRule$1.evaluate(NoShadowingOrOverridesOnMethodsRule.java:40)
	at com.carrotsearch.randomizedtesting.rules.StatementAdapter.evaluate(StatementAdapter.java:36)
	at com.carrotsearch.randomizedtesting.rules.StatementAdapter.evaluate(StatementAdapter.java:36)
	at com.carrotsearch.randomizedtesting.rules.StatementAdapter.evaluate(StatementAdapter.java:36)
	at org.apache.lucene.util.TestRuleAssertionsRequired$1.evaluate(TestRuleAssertionsRequired.java:54)
	at org.apache.lucene.util.TestRuleMarkFailure$1.evaluate(TestRuleMarkFailure.java:48)
	at org.apache.lucene.util.TestRuleIgnoreAfterMaxFailures$1.evaluate(TestRuleIgnoreAfterMaxFailures.java:65)
	at org.apache.lucene.util.TestRuleIgnoreTestSuites$1.evaluate(TestRuleIgnoreTestSuites.java:55)
	at com.carrotsearch.randomizedtesting.rules.StatementAdapter.evaluate(StatementAdapter.java:36)
	at com.carrotsearch.randomizedtesting.ThreadLeakControl$StatementRunner.run(ThreadLeakControl.java:367)
	at java.lang.Thread.run(Thread.java:745)




Build Log:
[...truncated 10682 lines...]
   [junit4] Suite: org.apache.solr.cloud.TestAuthenticationFramework
   [junit4]   2> 634732 INFO  (TEST-TestAuthenticationFramework.testExtraFilters-seed#[FC43CF849DD0E08]) [    ] o.a.s.c.ZkTestServer STARTING ZK TEST SERVER
   [junit4]   2> 634732 INFO  (Thread-1882) [    ] o.a.s.c.ZkTestServer client port:0.0.0.0/0.0.0.0:0
   [junit4]   2> 634732 INFO  (Thread-1882) [    ] o.a.s.c.ZkTestServer Starting server
   [junit4]   2> 634832 INFO  (TEST-TestAuthenticationFramework.testExtraFilters-seed#[FC43CF849DD0E08]) [    ] o.a.s.c.ZkTestServer start zk server on port:50375
   [junit4]   2> 634832 INFO  (TEST-TestAuthenticationFramework.testExtraFilters-seed#[FC43CF849DD0E08]) [    ] o.a.s.c.c.SolrZkClient Using default ZkCredentialsProvider
   [junit4]   2> 634833 INFO  (TEST-TestAuthenticationFramework.testExtraFilters-seed#[FC43CF849DD0E08]) [    ] o.a.s.c.c.ConnectionManager Waiting for client to connect to ZooKeeper
   [junit4]   2> 634872 INFO  (zkCallback-507-thread-1) [    ] o.a.s.c.c.ConnectionManager Watcher org.apache.solr.common.cloud.ConnectionManager@2992e5a5 name:ZooKeeperConnection Watcher:127.0.0.1:50375 got event WatchedEvent state:SyncConnected type:None path:null path:null type:None
   [junit4]   2> 634872 INFO  (TEST-TestAuthenticationFramework.testExtraFilters-seed#[FC43CF849DD0E08]) [    ] o.a.s.c.c.ConnectionManager Client is connected to ZooKeeper
   [junit4]   2> 634873 INFO  (TEST-TestAuthenticationFramework.testExtraFilters-seed#[FC43CF849DD0E08]) [    ] o.a.s.c.c.SolrZkClient Using default ZkACLProvider
   [junit4]   2> 634873 INFO  (TEST-TestAuthenticationFramework.testExtraFilters-seed#[FC43CF849DD0E08]) [    ] o.a.s.c.c.SolrZkClient makePath: /solr/solr.xml
   [junit4]   2> 634905 INFO  (jetty-launcher-506-thread-3) [    ] o.e.j.s.Server jetty-9.2.13.v20150730
   [junit4]   2> 634905 INFO  (jetty-launcher-506-thread-1) [    ] o.e.j.s.Server jetty-9.2.13.v20150730
   [junit4]   2> 634906 INFO  (jetty-launcher-506-thread-4) [    ] o.e.j.s.Server jetty-9.2.13.v20150730
   [junit4]   2> 634906 INFO  (jetty-launcher-506-thread-2) [    ] o.e.j.s.Server jetty-9.2.13.v20150730
   [junit4]   2> 634906 INFO  (jetty-launcher-506-thread-5) [    ] o.e.j.s.Server jetty-9.2.13.v20150730
   [junit4]   2> 634921 INFO  (jetty-launcher-506-thread-1) [    ] o.e.j.s.h.ContextHandler Started o.e.j.s.ServletContextHandler@2677ee12{/solr,null,AVAILABLE}
   [junit4]   2> 634921 INFO  (jetty-launcher-506-thread-4) [    ] o.e.j.s.h.ContextHandler Started o.e.j.s.ServletContextHandler@248f65a6{/solr,null,AVAILABLE}
   [junit4]   2> 634921 INFO  (jetty-launcher-506-thread-5) [    ] o.e.j.s.h.ContextHandler Started o.e.j.s.ServletContextHandler@3d112c6f{/solr,null,AVAILABLE}
   [junit4]   2> 634921 INFO  (jetty-launcher-506-thread-3) [    ] o.e.j.s.h.ContextHandler Started o.e.j.s.ServletContextHandler@79422c9b{/solr,null,AVAILABLE}
   [junit4]   2> 634921 INFO  (jetty-launcher-506-thread-5) [    ] o.e.j.s.ServerConnector Started ServerConnector@3e14752f{HTTP/1.1}{127.0.0.1:44619}
   [junit4]   2> 634922 INFO  (jetty-launcher-506-thread-4) [    ] o.e.j.s.ServerConnector Started ServerConnector@54c44ed8{HTTP/1.1}{127.0.0.1:43205}
   [junit4]   2> 634922 INFO  (jetty-launcher-506-thread-5) [    ] o.e.j.s.Server Started @636417ms
   [junit4]   2> 634922 INFO  (jetty-launcher-506-thread-4) [    ] o.e.j.s.Server Started @636417ms
   [junit4]   2> 634922 INFO  (jetty-launcher-506-thread-5) [    ] o.a.s.c.s.e.JettySolrRunner Jetty properties: {hostContext=/solr, hostPort=44619}
   [junit4]   2> 634922 INFO  (jetty-launcher-506-thread-4) [    ] o.a.s.c.s.e.JettySolrRunner Jetty properties: {hostContext=/solr, hostPort=43205}
   [junit4]   2> 634922 INFO  (jetty-launcher-506-thread-5) [    ] o.a.s.s.SolrDispatchFilter SolrDispatchFilter.init(): sun.misc.Launcher$AppClassLoader@4e0e2f2a
   [junit4]   2> 634922 INFO  (jetty-launcher-506-thread-4) [    ] o.a.s.s.SolrDispatchFilter SolrDispatchFilter.init(): sun.misc.Launcher$AppClassLoader@4e0e2f2a
   [junit4]   2> 634922 INFO  (jetty-launcher-506-thread-5) [    ] o.a.s.c.SolrResourceLoader new SolrResourceLoader for directory: '/home/jenkins/workspace/Lucene-Solr-5.x-Linux/solr/build/solr-core/test/J2/temp/solr.cloud.TestAuthenticationFramework_FC43CF849DD0E08-001/tempDir-001/node5'
   [junit4]   2> 634922 INFO  (jetty-launcher-506-thread-4) [    ] o.a.s.c.SolrResourceLoader new SolrResourceLoader for directory: '/home/jenkins/workspace/Lucene-Solr-5.x-Linux/solr/build/solr-core/test/J2/temp/solr.cloud.TestAuthenticationFramework_FC43CF849DD0E08-001/tempDir-001/node4'
   [junit4]   2> 634922 INFO  (jetty-launcher-506-thread-5) [    ] o.a.s.c.SolrResourceLoader JNDI not configured for solr (NoInitialContextEx)
   [junit4]   2> 634922 INFO  (jetty-launcher-506-thread-4) [    ] o.a.s.c.SolrResourceLoader JNDI not configured for solr (NoInitialContextEx)
   [junit4]   2> 634922 INFO  (jetty-launcher-506-thread-4) [    ] o.a.s.c.SolrResourceLoader solr home defaulted to 'solr/' (could not find system property or JNDI)
   [junit4]   2> 634922 INFO  (jetty-launcher-506-thread-4) [    ] o.a.s.c.c.SolrZkClient Using default ZkCredentialsProvider
   [junit4]   2> 634921 INFO  (jetty-launcher-506-thread-1) [    ] o.e.j.s.ServerConnector Started ServerConnector@75c3ee65{HTTP/1.1}{127.0.0.1:35253}
   [junit4]   2> 634923 INFO  (jetty-launcher-506-thread-1) [    ] o.e.j.s.Server Started @636418ms
   [junit4]   2> 634923 INFO  (jetty-launcher-506-thread-1) [    ] o.a.s.c.s.e.JettySolrRunner Jetty properties: {hostContext=/solr, hostPort=35253}
   [junit4]   2> 634922 INFO  (jetty-launcher-506-thread-3) [    ] o.e.j.s.ServerConnector Started ServerConnector@483de7a8{HTTP/1.1}{127.0.0.1:45063}
   [junit4]   2> 634923 INFO  (jetty-launcher-506-thread-3) [    ] o.e.j.s.Server Started @636418ms
   [junit4]   2> 634923 INFO  (jetty-launcher-506-thread-3) [    ] o.a.s.c.s.e.JettySolrRunner Jetty properties: {hostContext=/solr, hostPort=45063}
   [junit4]   2> 634923 INFO  (jetty-launcher-506-thread-1) [    ] o.a.s.s.SolrDispatchFilter SolrDispatchFilter.init(): sun.misc.Launcher$AppClassLoader@4e0e2f2a
   [junit4]   2> 634923 INFO  (jetty-launcher-506-thread-1) [    ] o.a.s.c.SolrResourceLoader new SolrResourceLoader for directory: '/home/jenkins/workspace/Lucene-Solr-5.x-Linux/solr/build/solr-core/test/J2/temp/solr.cloud.TestAuthenticationFramework_FC43CF849DD0E08-001/tempDir-001/node1'
   [junit4]   2> 634923 INFO  (jetty-launcher-506-thread-3) [    ] o.a.s.s.SolrDispatchFilter SolrDispatchFilter.init(): sun.misc.Launcher$AppClassLoader@4e0e2f2a
   [junit4]   2> 634923 INFO  (jetty-launcher-506-thread-1) [    ] o.a.s.c.SolrResourceLoader JNDI not configured for solr (NoInitialContextEx)
   [junit4]   2> 634923 INFO  (jetty-launcher-506-thread-3) [    ] o.a.s.c.SolrResourceLoader new SolrResourceLoader for directory: '/home/jenkins/workspace/Lucene-Solr-5.x-Linux/solr/build/solr-core/test/J2/temp/solr.cloud.TestAuthenticationFramework_FC43CF849DD0E08-001/tempDir-001/node3'
   [junit4]   2> 634924 INFO  (jetty-launcher-506-thread-3) [    ] o.a.s.c.SolrResourceLoader JNDI not configured for solr (NoInitialContextEx)
   [junit4]   2> 634922 INFO  (jetty-launcher-506-thread-5) [    ] o.a.s.c.SolrResourceLoader solr home defaulted to 'solr/' (could not find system property or JNDI)
   [junit4]   2> 634924 INFO  (jetty-launcher-506-thread-3) [    ] o.a.s.c.SolrResourceLoader solr home defaulted to 'solr/' (could not find system property or JNDI)
   [junit4]   2> 634924 INFO  (jetty-launcher-506-thread-1) [    ] o.a.s.c.SolrResourceLoader solr home defaulted to 'solr/' (could not find system property or JNDI)
   [junit4]   2> 634924 INFO  (jetty-launcher-506-thread-5) [    ] o.a.s.c.c.SolrZkClient Using default ZkCredentialsProvider
   [junit4]   2> 634924 INFO  (jetty-launcher-506-thread-2) [    ] o.e.j.s.h.ContextHandler Started o.e.j.s.ServletContextHandler@7dc20cb8{/solr,null,AVAILABLE}
   [junit4]   2> 634924 INFO  (jetty-launcher-506-thread-3) [    ] o.a.s.c.c.SolrZkClient Using default ZkCredentialsProvider
   [junit4]   2> 634924 INFO  (jetty-launcher-506-thread-1) [    ] o.a.s.c.c.SolrZkClient Using default ZkCredentialsProvider
   [junit4]   2> 634924 INFO  (jetty-launcher-506-thread-4) [    ] o.a.s.c.c.ConnectionManager Waiting for client to connect to ZooKeeper
   [junit4]   2> 634924 INFO  (jetty-launcher-506-thread-2) [    ] o.e.j.s.ServerConnector Started ServerConnector@a4b4d4a{HTTP/1.1}{127.0.0.1:38344}
   [junit4]   2> 634924 INFO  (jetty-launcher-506-thread-2) [    ] o.e.j.s.Server Started @636420ms
   [junit4]   2> 634924 INFO  (jetty-launcher-506-thread-2) [    ] o.a.s.c.s.e.JettySolrRunner Jetty properties: {hostContext=/solr, hostPort=38344}
   [junit4]   2> 634925 INFO  (jetty-launcher-506-thread-2) [    ] o.a.s.s.SolrDispatchFilter SolrDispatchFilter.init(): sun.misc.Launcher$AppClassLoader@4e0e2f2a
   [junit4]   2> 634925 INFO  (jetty-launcher-506-thread-2) [    ] o.a.s.c.SolrResourceLoader new SolrResourceLoader for directory: '/home/jenkins/workspace/Lucene-Solr-5.x-Linux/solr/build/solr-core/test/J2/temp/solr.cloud.TestAuthenticationFramework_FC43CF849DD0E08-001/tempDir-001/node2'
   [junit4]   2> 634925 INFO  (jetty-launcher-506-thread-2) [    ] o.a.s.c.SolrResourceLoader JNDI not configured for solr (NoInitialContextEx)
   [junit4]   2> 634925 INFO  (jetty-launcher-506-thread-2) [    ] o.a.s.c.SolrResourceLoader solr home defaulted to 'solr/' (could not find system property or JNDI)
   [junit4]   2> 634925 INFO  (jetty-launcher-506-thread-2) [    ] o.a.s.c.c.SolrZkClient Using default ZkCredentialsProvider
   [junit4]   2> 634925 INFO  (jetty-launcher-506-thread-3) [    ] o.a.s.c.c.ConnectionManager Waiting for client to connect to ZooKeeper
   [junit4]   2> 634927 INFO  (jetty-launcher-506-thread-5) [    ] o.a.s.c.c.ConnectionManager Waiting for client to connect to ZooKeeper
   [junit4]   2> 634927 INFO  (jetty-launcher-506-thread-2) [    ] o.a.s.c.c.ConnectionManager Waiting for client to connect to ZooKeeper
   [junit4]   2> 634928 INFO  (jetty-launcher-506-thread-1) [    ] o.a.s.c.c.ConnectionManager Waiting for client to connect to ZooKeeper
   [junit4]   2> 634941 INFO  (zkCallback-508-thread-1) [    ] o.a.s.c.c.ConnectionManager Watcher org.apache.solr.common.cloud.ConnectionManager@740606db name:ZooKeeperConnection Watcher:127.0.0.1:50375/solr got event WatchedEvent state:SyncConnected type:None path:null path:null type:None
   [junit4]   2> 634941 INFO  (zkCallback-510-thread-1) [    ] o.a.s.c.c.ConnectionManager Watcher org.apache.solr.common.cloud.ConnectionManager@7d8b055a name:ZooKeeperConnection Watcher:127.0.0.1:50375/solr got event WatchedEvent state:SyncConnected type:None path:null path:null type:None
   [junit4]   2> 634941 INFO  (jetty-launcher-506-thread-4) [    ] o.a.s.c.c.ConnectionManager Client is connected to ZooKeeper
   [junit4]   2> 634941 INFO  (jetty-launcher-506-thread-3) [    ] o.a.s.c.c.ConnectionManager Client is connected to ZooKeeper
   [junit4]   2> 634942 INFO  (jetty-launcher-506-thread-3) [    ] o.a.s.c.c.SolrZkClient Using default ZkACLProvider
   [junit4]   2> 634942 INFO  (jetty-launcher-506-thread-4) [    ] o.a.s.c.c.SolrZkClient Using default ZkACLProvider
   [junit4]   2> 634950 INFO  (zkCallback-509-thread-1) [    ] o.a.s.c.c.ConnectionManager Watcher org.apache.solr.common.cloud.ConnectionManager@59bed6c3 name:ZooKeeperConnection Watcher:127.0.0.1:50375/solr got event WatchedEvent state:SyncConnected type:None path:null path:null type:None
   [junit4]   2> 634950 INFO  (zkCallback-512-thread-1) [    ] o.a.s.c.c.ConnectionManager Watcher org.apache.solr.common.cloud.ConnectionManager@102f8ae1 name:ZooKeeperConnection Watcher:127.0.0.1:50375/solr got event WatchedEvent state:SyncConnected type:None path:null path:null type:None
   [junit4]   2> 634950 INFO  (zkCallback-511-thread-1) [    ] o.a.s.c.c.ConnectionManager Watcher org.apache.solr.common.cloud.ConnectionManager@4a99bed name:ZooKeeperConnection Watcher:127.0.0.1:50375/solr got event WatchedEvent state:SyncConnected type:None path:null path:null type:None
   [junit4]   2> 634950 INFO  (jetty-launcher-506-thread-5) [    ] o.a.s.c.c.ConnectionManager Client is connected to ZooKeeper
   [junit4]   2> 634950 INFO  (jetty-launcher-506-thread-1) [    ] o.a.s.c.c.ConnectionManager Client is connected to ZooKeeper
   [junit4]   2> 634950 INFO  (jetty-launcher-506-thread-3) [    ] o.a.s.s.SolrDispatchFilter solr.xml found in ZooKeeper. Loading...
   [junit4]   2> 634950 INFO  (jetty-launcher-506-thread-4) [    ] o.a.s.s.SolrDispatchFilter solr.xml found in ZooKeeper. Loading...
   [junit4]   2> 634950 INFO  (jetty-launcher-506-thread-1) [    ] o.a.s.c.c.SolrZkClient Using default ZkACLProvider
   [junit4]   2> 634950 INFO  (jetty-launcher-506-thread-5) [    ] o.a.s.c.c.SolrZkClient Using default ZkACLProvider
   [junit4]   2> 634950 INFO  (jetty-launcher-506-thread-2) [    ] o.a.s.c.c.ConnectionManager Client is connected to ZooKeeper
   [junit4]   2> 634951 INFO  (jetty-launcher-506-thread-2) [    ] o.a.s.c.c.SolrZkClient Using default ZkACLProvider
   [junit4]   2> 634951 INFO  (jetty-launcher-506-thread-1) [    ] o.a.s.s.SolrDispatchFilter solr.xml found in ZooKeeper. Loading...
   [junit4]   2> 634951 INFO  (jetty-launcher-506-thread-5) [    ] o.a.s.s.SolrDispatchFilter solr.xml found in ZooKeeper. Loading...
   [junit4]   2> 634951 INFO  (jetty-launcher-506-thread-2) [    ] o.a.s.s.SolrDispatchFilter solr.xml found in ZooKeeper. Loading...
   [junit4]   2> 634969 INFO  (jetty-launcher-506-thread-5) [    ] o.a.s.c.CorePropertiesLocator Config-defined core root directory: /home/jenkins/workspace/Lucene-Solr-5.x-Linux/solr/build/solr-core/test/J2/temp/solr.cloud.TestAuthenticationFramework_FC43CF849DD0E08-001/tempDir-001/node5/.
   [junit4]   2> 634969 INFO  (jetty-launcher-506-thread-5) [    ] o.a.s.c.CoreContainer New CoreContainer 1589533602
   [junit4]   2> 634969 INFO  (jetty-launcher-506-thread-5) [    ] o.a.s.c.CoreContainer Loading cores into CoreContainer [instanceDir=/home/jenkins/workspace/Lucene-Solr-5.x-Linux/solr/build/solr-core/test/J2/temp/solr.cloud.TestAuthenticationFramework_FC43CF849DD0E08-001/tempDir-001/node5]
   [junit4]   2> 634969 WARN  (jetty-launcher-506-thread-5) [    ] o.a.s.c.CoreContainer Couldn't add files from /home/jenkins/workspace/Lucene-Solr-5.x-Linux/solr/build/solr-core/test/J2/temp/solr.cloud.TestAuthenticationFramework_FC43CF849DD0E08-001/tempDir-001/node5/lib to classpath: /home/jenkins/workspace/Lucene-Solr-5.x-Linux/solr/build/solr-core/test/J2/temp/solr.cloud.TestAuthenticationFramework_FC43CF849DD0E08-001/tempDir-001/node5/lib
   [junit4]   2> 634970 INFO  (jetty-launcher-506-thread-5) [    ] o.a.s.h.c.HttpShardHandlerFactory created with socketTimeout : 90000,urlScheme : ,connTimeout : 15000,maxConnectionsPerHost : 20,maxConnections : 10000,corePoolSize : 0,maximumPoolSize : 2147483647,maxThreadIdleTime : 5,sizeOfQueue : -1,fairnessPolicy : false,useRetries : false,
   [junit4]   2> 634971 INFO  (jetty-launcher-506-thread-5) [    ] o.a.s.u.UpdateShardHandler Creating UpdateShardHandler HTTP client with params: socketTimeout=340000&connTimeout=45000&retry=true
   [junit4]   2> 634971 INFO  (jetty-launcher-506-thread-5) [    ] o.a.s.l.LogWatcher SLF4J impl is org.slf4j.impl.Log4jLoggerFactory
   [junit4]   2> 634971 INFO  (jetty-launcher-506-thread-5) [    ] o.a.s.l.LogWatcher Registering Log Listener [Log4j (org.slf4j.impl.Log4jLoggerFactory)]
   [junit4]   2> 634971 INFO  (jetty-launcher-506-thread-5) [    ] o.a.s.c.ZkContainer Zookeeper client=127.0.0.1:50375/solr
   [junit4]   2> 634971 INFO  (jetty-launcher-506-thread-5) [    ] o.a.s.c.ZkController zkHost includes chroot
   [junit4]   2> 634971 INFO  (jetty-launcher-506-thread-5) [    ] o.a.s.c.c.SolrZkClient Using default ZkCredentialsProvider
   [junit4]   2> 634972 INFO  (jetty-launcher-506-thread-5) [    ] o.a.s.c.c.ConnectionManager Waiting for client to connect to ZooKeeper
   [junit4]   2> 634977 WARN  (NIOServerCxn.Factory:0.0.0.0/0.0.0.0:0) [    ] o.a.z.s.NIOServerCnxn caught end of stream exception
   [junit4]   2> EndOfStreamException: Unable to read additional data from client sessionid 0x15222a68b510002, likely client has closed socket
   [junit4]   2> 	at org.apache.zookeeper.server.NIOServerCnxn.doIO(NIOServerCnxn.java:228)
   [junit4]   2> 	at org.apache.zookeeper.server.NIOServerCnxnFactory.run(NIOServerCnxnFactory.java:208)
   [junit4]   2> 	at java.lang.Thread.run(Thread.java:745)
   [junit4]   2> 634977 INFO  (jetty-launcher-506-thread-2) [    ] o.a.s.c.CorePropertiesLocator Config-defined core root directory: /home/jenkins/workspace/Lucene-Solr-5.x-Linux/solr/build/solr-core/test/J2/temp/solr.cloud.TestAuthenticationFramework_FC43CF849DD0E08-001/tempDir-001/node2/.
   [junit4]   2> 634977 INFO  (jetty-launcher-506-thread-4) [    ] o.a.s.c.CorePropertiesLocator Config-defined core root directory: /home/jenkins/workspace/Lucene-Solr-5.x-Linux/solr/build/solr-core/test/J2/temp/solr.cloud.TestAuthenticationFramework_FC43CF849DD0E08-001/tempDir-001/node4/.
   [junit4]   2> 634978 INFO  (jetty-launcher-506-thread-2) [    ] o.a.s.c.CoreContainer New CoreContainer 1938171965
   [junit4]   2> 634978 INFO  (jetty-launcher-506-thread-4) [    ] o.a.s.c.CoreContainer New CoreContainer 1265047574
   [junit4]   2> 634977 INFO  (jetty-launcher-506-thread-3) [    ] o.a.s.c.CorePropertiesLocator Config-defined core root directory: /home/jenkins/workspace/Lucene-Solr-5.x-Linux/solr/build/solr-core/test/J2/temp/solr.cloud.TestAuthenticationFramework_FC43CF849DD0E08-001/tempDir-001/node3/.
   [junit4]   2> 634977 INFO  (jetty-launcher-506-thread-1) [    ] o.a.s.c.CorePropertiesLocator Config-defined core root directory: /home/jenkins/workspace/Lucene-Solr-5.x-Linux/solr/build/solr-core/test/J2/temp/solr.cloud.TestAuthenticationFramework_FC43CF849DD0E08-001/tempDir-001/node1/.
   [junit4]   2> 634978 INFO  (jetty-launcher-506-thread-3) [    ] o.a.s.c.CoreContainer New CoreContainer 1801878679
   [junit4]   2> 634978 INFO  (jetty-launcher-506-thread-4) [    ] o.a.s.c.CoreContainer Loading cores into CoreContainer [instanceDir=/home/jenkins/workspace/Lucene-Solr-5.x-Linux/solr/build/solr-core/test/J2/temp/solr.cloud.TestAuthenticationFramework_FC43CF849DD0E08-001/tempDir-001/node4]
   [junit4]   2> 634978 INFO  (jetty-launcher-506-thread-1) [    ] o.a.s.c.CoreContainer New CoreContainer 1818577751
   [junit4]   2> 634978 INFO  (jetty-launcher-506-thread-1) [    ] o.a.s.c.CoreContainer Loading cores into CoreContainer [instanceDir=/home/jenkins/workspace/Lucene-Solr-5.x-Linux/solr/build/solr-core/test/J2/temp/solr.cloud.TestAuthenticationFramework_FC43CF849DD0E08-001/tempDir-001/node1]
   [junit4]   2> 634978 INFO  (jetty-launcher-506-thread-2) [    ] o.a.s.c.CoreContainer Loading cores into CoreContainer [instanceDir=/home/jenkins/workspace/Lucene-Solr-5.x-Linux/solr/build/solr-core/test/J2/temp/solr.cloud.TestAuthenticationFramework_FC43CF849DD0E08-001/tempDir-001/node2]
   [junit4]   2> 634979 WARN  (jetty-launcher-506-thread-4) [    ] o.a.s.c.CoreContainer Couldn't add files from /home/jenkins/workspace/Lucene-Solr-5.x-Linux/solr/build/solr-core/test/J2/temp/solr.cloud.TestAuthenticationFramework_FC43CF849DD0E08-001/tempDir-001/node4/lib to classpath: /home/jenkins/workspace/Lucene-Solr-5.x-Linux/solr/build/solr-core/test/J2/temp/solr.cloud.TestAuthenticationFramework_FC43CF849DD0E08-001/tempDir-001/node4/lib
   [junit4]   2> 634979 WARN  (jetty-launcher-506-thread-1) [    ] o.a.s.c.CoreContainer Couldn't add files from /home/jenkins/workspace/Lucene-Solr-5.x-Linux/solr/build/solr-core/test/J2/temp/solr.cloud.TestAuthenticationFramework_FC43CF849DD0E08-001/tempDir-001/node1/lib to classpath: /home/jenkins/workspace/Lucene-Solr-5.x-Linux/solr/build/solr-core/test/J2/temp/solr.cloud.TestAuthenticationFramework_FC43CF849DD0E08-001/tempDir-001/node1/lib
   [junit4]   2> 634979 WARN  (jetty-launcher-506-thread-2) [    ] o.a.s.c.CoreContainer Couldn't add files from /home/jenkins/workspace/Lucene-Solr-5.x-Linux/solr/build/solr-core/test/J2/temp/solr.cloud.TestAuthenticationFramework_FC43CF849DD0E08-001/tempDir-001/node2/lib to classpath: /home/jenkins/workspace/Lucene-Solr-5.x-Linux/solr/build/solr-core/test/J2/temp/solr.cloud.TestAuthenticationFramework_FC43CF849DD0E08-001/tempDir-001/node2/lib
   [junit4]   2> 634980 INFO  (jetty-launcher-506-thread-1) [    ] o.a.s.h.c.HttpShardHandlerFactory created with socketTimeout : 90000,urlScheme : ,connTimeout : 15000,maxConnectionsPerHost : 20,maxConnections : 10000,corePoolSize : 0,maximumPoolSize : 2147483647,maxThreadIdleTime : 5,sizeOfQueue : -1,fairnessPolicy : false,useRetries : false,
   [junit4]   2> 634980 INFO  (jetty-launcher-506-thread-2) [    ] o.a.s.h.c.HttpShardHandlerFactory created with socketTimeout : 90000,urlScheme : ,connTimeout : 15000,maxConnectionsPerHost : 20,maxConnections : 10000,corePoolSize : 0,maximumPoolSize : 2147483647,maxThreadIdleTime : 5,sizeOfQueue : -1,fairnessPolicy : false,useRetries : false,
   [junit4]   2> 634978 INFO  (jetty-launcher-506-thread-3) [    ] o.a.s.c.CoreContainer Loading cores into CoreContainer [instanceDir=/home/jenkins/workspace/Lucene-Solr-5.x-Linux/solr/build/solr-core/test/J2/temp/solr.cloud.TestAuthenticationFramework_FC43CF849DD0E08-001/tempDir-001/node3]
   [junit4]   2> 634979 INFO  (jetty-launcher-506-thread-4) [    ] o.a.s.h.c.HttpShardHandlerFactory created with socketTimeout : 90000,urlScheme : ,connTimeout : 15000,maxConnectionsPerHost : 20,maxConnections : 10000,corePoolSize : 0,maximumPoolSize : 2147483647,maxThreadIdleTime : 5,sizeOfQueue : -1,fairnessPolicy : false,useRetries : false,
   [junit4]   2> 634980 WARN  (jetty-launcher-506-thread-3) [    ] o.a.s.c.CoreContainer Couldn't add files from /home/jenkins/workspace/Lucene-Solr-5.x-Linux/solr/build/solr-core/test/J2/temp/solr.cloud.TestAuthenticationFramework_FC43CF849DD0E08-001/tempDir-001/node3/lib to classpath: /home/jenkins/workspace/Lucene-Solr-5.x-Linux/solr/build/solr-core/test/J2/temp/solr.cloud.TestAuthenticationFramework_FC43CF849DD0E08-001/tempDir-001/node3/lib
   [junit4]   2> 634980 INFO  (jetty-launcher-506-thread-3) [    ] o.a.s.h.c.HttpShardHandlerFactory created with socketTimeout : 90000,urlScheme : ,connTimeout : 15000,maxConnectionsPerHost : 20,maxConnections : 10000,corePoolSize : 0,maximumPoolSize : 2147483647,maxThreadIdleTime : 5,sizeOfQueue : -1,fairnessPolicy : false,useRetries : false,
   [junit4]   2> 634980 INFO  (jetty-launcher-506-thread-4) [    ] o.a.s.u.UpdateShardHandler Creating UpdateShardHandler HTTP client with params: socketTimeout=340000&connTimeout=45000&retry=true
   [junit4]   2> 634980 INFO  (jetty-launcher-506-thread-2) [    ] o.a.s.u.UpdateShardHandler Creating UpdateShardHandler HTTP client with params: socketTimeout=340000&connTimeout=45000&retry=true
   [junit4]   2> 634980 INFO  (jetty-launcher-506-thread-1) [    ] o.a.s.u.UpdateShardHandler Creating UpdateShardHandler HTTP client with params: socketTimeout=340000&connTimeout=45000&retry=true
   [junit4]   2> 634980 INFO  (jetty-launcher-506-thread-3) [    ] o.a.s.u.UpdateShardHandler Creating UpdateShardHandler HTTP client with params: socketTimeout=340000&connTimeout=45000&retry=true
   [junit4]   2> 634981 INFO  (jetty-launcher-506-thread-4) [    ] o.a.s.l.LogWatcher SLF4J impl is org.slf4j.impl.Log4jLoggerFactory
   [junit4]   2> 634981 INFO  (jetty-launcher-506-thread-4) [    ] o.a.s.l.LogWatcher Registering Log Listener [Log4j (org.slf4j.impl.Log4jLoggerFactory)]
   [junit4]   2> 634981 INFO  (jetty-launcher-506-thread-4) [    ] o.a.s.c.ZkContainer Zookeeper client=127.0.0.1:50375/solr
   [junit4]   2> 634981 INFO  (jetty-launcher-506-thread-4) [    ] o.a.s.c.ZkController zkHost includes chroot
   [junit4]   2> 634981 INFO  (jetty-launcher-506-thread-4) [    ] o.a.s.c.c.SolrZkClient Using default ZkCredentialsProvider
   [junit4]   2> 634981 INFO  (jetty-launcher-506-thread-1) [    ] o.a.s.l.LogWatcher SLF4J impl is org.slf4j.impl.Log4jLoggerFactory
   [junit4]   2> 634981 INFO  (jetty-launcher-506-thread-2) [    ] o.a.s.l.LogWatcher SLF4J impl is org.slf4j.impl.Log4jLoggerFactory
   [junit4]   2> 634981 INFO  (jetty-launcher-506-thread-1) [    ] o.a.s.l.LogWatcher Registering Log Listener [Log4j (org.slf4j.impl.Log4jLoggerFactory)]
   [junit4]   2> 634981 INFO  (zkCallback-514-thread-1) [    ] o.a.s.c.c.ConnectionManager Watcher org.apache.solr.common.cloud.ConnectionManager@58ef8f9f name:ZooKeeperConnection Watcher:127.0.0.1:50375 got event WatchedEvent state:SyncConnected type:None path:null path:null type:None
   [junit4]   2> 634981 INFO  (jetty-launcher-506-thread-2) [    ] o.a.s.l.LogWatcher Registering Log Listener [Log4j (org.slf4j.impl.Log4jLoggerFactory)]
   [junit4]   2> 634981 INFO  (jetty-launcher-506-thread-3) [    ] o.a.s.l.LogWatcher SLF4J impl is org.slf4j.impl.Log4jLoggerFactory
   [junit4]   2> 634982 INFO  (jetty-launcher-506-thread-3) [    ] o.a.s.l.LogWatcher Registering Log Listener [Log4j (org.slf4j.impl.Log4jLoggerFactory)]
   [junit4]   2> 634982 INFO  (jetty-launcher-506-thread-4) [    ] o.a.s.c.c.ConnectionManager Waiting for client to connect to ZooKeeper
   [junit4]   2> 634982 INFO  (jetty-launcher-506-thread-5) [    ] o.a.s.c.c.ConnectionManager Client is connected to ZooKeeper
   [junit4]   2> 634982 INFO  (jetty-launcher-506-thread-1) [    ] o.a.s.c.ZkContainer Zookeeper client=127.0.0.1:50375/solr
   [junit4]   2> 634982 INFO  (jetty-launcher-506-thread-1) [    ] o.a.s.c.ZkController zkHost includes chroot
   [junit4]   2> 634982 INFO  (jetty-launcher-506-thread-3) [    ] o.a.s.c.ZkContainer Zookeeper client=127.0.0.1:50375/solr
   [junit4]   2> 634982 INFO  (jetty-launcher-506-thread-2) [    ] o.a.s.c.ZkContainer Zookeeper client=127.0.0.1:50375/solr
   [junit4]   2> 634983 INFO  (jetty-launcher-506-thread-3) [    ] o.a.s.c.ZkController zkHost includes chroot
   [junit4]   2> 634983 INFO  (jetty-launcher-506-thread-2) [    ] o.a.s.c.ZkController zkHost includes chroot
   [junit4]   2> 634983 INFO  (jetty-launcher-506-thread-3) [    ] o.a.s.c.c.SolrZkClient Using default ZkCredentialsProvider
   [junit4]   2> 634983 INFO  (jetty-launcher-506-thread-2) [    ] o.a.s.c.c.SolrZkClient Using default ZkCredentialsProvider
   [junit4]   2> 634982 INFO  (jetty-launcher-506-thread-5) [    ] o.a.s.c.c.SolrZkClient Using default ZkACLProvider
   [junit4]   2> 634982 INFO  (jetty-launcher-506-thread-1) [    ] o.a.s.c.c.SolrZkClient Using default ZkCredentialsProvider
   [junit4]   2> 634983 INFO  (jetty-launcher-506-thread-2) [    ] o.a.s.c.c.ConnectionManager Waiting for client to connect to ZooKeeper
   [junit4]   2> 634983 INFO  (jetty-launcher-506-thread-3) [    ] o.a.s.c.c.ConnectionManager Waiting for client to connect to ZooKeeper
   [junit4]   2> 634991 INFO  (jetty-launcher-506-thread-1) [    ] o.a.s.c.c.ConnectionManager Waiting for client to connect to ZooKeeper
   [junit4]   2> 634991 INFO  (zkCallback-519-thread-1) [    ] o.a.s.c.c.ConnectionManager Watcher org.apache.solr.common.cloud.ConnectionManager@29e6bf37 name:ZooKeeperConnection Watcher:127.0.0.1:50375 got event WatchedEvent state:SyncConnected type:None path:null path:null type:None
   [junit4]   2> 634992 INFO  (jetty-launcher-506-thread-4) [    ] o.a.s.c.c.ConnectionManager Client is connected to ZooKeeper
   [junit4]   2> 634992 INFO  (jetty-launcher-506-thread-4) [    ] o.a.s.c.c.SolrZkClient Using default ZkACLProvider
   [junit4]   2> 634998 INFO  (zkCallback-521-thread-1) [    ] o.a.s.c.c.ConnectionManager Watcher org.apache.solr.common.cloud.ConnectionManager@5d59370 name:ZooKeeperConnection Watcher:127.0.0.1:50375 got event WatchedEvent state:SyncConnected type:None path:null path:null type:None
   [junit4]   2> 634998 INFO  (zkCallback-522-thread-1) [    ] o.a.s.c.c.ConnectionManager Watcher org.apache.solr.common.cloud.ConnectionManager@417dfd09 name:ZooKeeperConnection Watcher:127.0.0.1:50375 got event WatchedEvent state:SyncConnected type:None path:null path:null type:None
   [junit4]   2> 634998 INFO  (jetty-launcher-506-thread-3) [    ] o.a.s.c.c.ConnectionManager Client is connected to ZooKeeper
   [junit4]   2> 634998 INFO  (jetty-launcher-506-thread-2) [    ] o.a.s.c.c.ConnectionManager Client is connected to ZooKeeper
   [junit4]   2> 634998 INFO  (jetty-launcher-506-thread-3) [    ] o.a.s.c.c.SolrZkClient Using default ZkACLProvider
   [junit4]   2> 634998 INFO  (jetty-launcher-506-thread-2) [    ] o.a.s.c.c.SolrZkClient Using default ZkACLProvider
   [junit4]   2> 635009 INFO  (zkCallback-520-thread-1) [    ] o.a.s.c.c.ConnectionManager Watcher org.apache.solr.common.cloud.ConnectionManager@1f9763bd name:ZooKeeperConnection Watcher:127.0.0.1:50375 got event WatchedEvent state:SyncConnected type:None path:null path:null type:None
   [junit4]   2> 635009 INFO  (jetty-launcher-506-thread-1) [    ] o.a.s.c.c.ConnectionManager Client is connected to ZooKeeper
   [junit4]   2> 635009 INFO  (jetty-launcher-506-thread-5) [n:127.0.0.1:44619_solr    ] o.a.s.c.c.ConnectionManager Waiting for client to connect to ZooKeeper
   [junit4]   2> 635009 INFO  (jetty-launcher-506-thread-1) [    ] o.a.s.c.c.SolrZkClient Using default ZkACLProvider
   [junit4]   2> 635020 WARN  (NIOServerCxn.Factory:0.0.0.0/0.0.0.0:0) [    ] o.a.z.s.NIOServerCnxn caught end of stream exception
   [junit4]   2> EndOfStreamException: Unable to read additional data from client sessionid 0x15222a68b510009, likely client has closed socket
   [junit4]   2> 	at org.apache.zookeeper.server.NIOServerCnxn.doIO(NIOServerCnxn.java:228)
   [junit4]   2> 	at org.apache.zookeeper.server.NIOServerCnxnFactory.run(NIOServerCnxnFactory.java:208)
   [junit4]   2> 	at java.lang.Thread.run(Thread.java:745)
   [junit4]   2> 635020 INFO  (jetty-launcher-506-thread-2) [n:127.0.0.1:38344_solr    ] o.a.s.c.c.ConnectionManager Waiting for client to connect to ZooKeeper
   [junit4]   2> 635020 INFO  (jetty-launcher-506-thread-4) [n:127.0.0.1:43205_solr    ] o.a.s.c.c.ConnectionManager Waiting for client to connect to ZooKeeper
   [junit4]   2> 635022 INFO  (jetty-launcher-506-thread-3) [n:127.0.0.1:45063_solr    ] o.a.s.c.c.ConnectionManager Waiting for client to connect to ZooKeeper
   [junit4]   2> 635022 INFO  (zkCallback-523-thread-1-processing-n:127.0.0.1:44619_solr) [n:127.0.0.1:44619_solr    ] o.a.s.c.c.ConnectionManager Watcher org.apache.solr.common.cloud.ConnectionManager@4cc57f75 name:ZooKeeperConnection Watcher:127.0.0.1:50375/solr got event WatchedEvent state:SyncConnected type:None path:null path:null type:None
   [junit4]   2> 635022 INFO  (jetty-launcher-506-thread-5) [n:127.0.0.1:44619_solr    ] o.a.s.c.c.ConnectionManager Client is connected to ZooKeeper
   [junit4]   2> 635031 INFO  (zkCallback-525-thread-1-processing-n:127.0.0.1:43205_solr) [n:127.0.0.1:43205_solr    ] o.a.s.c.c.ConnectionManager Watcher org.apache.solr.common.cloud.ConnectionManager@4b78b844 name:ZooKeeperConnection Watcher:127.0.0.1:50375/solr got event WatchedEvent state:SyncConnected type:None path:null path:null type:None
   [junit4]   2> 635031 INFO  (zkCallback-524-thread-1-processing-n:127.0.0.1:38344_solr) [n:127.0.0.1:38344_solr    ] o.a.s.c.c.ConnectionManager Watcher org.apache.solr.common.cloud.ConnectionManager@58b491d2 name:ZooKeeperConnection Watcher:127.0.0.1:50375/solr got event WatchedEvent state:SyncConnected type:None path:null path:null type:None
   [junit4]   2> 635031 INFO  (jetty-launcher-506-thread-4) [n:127.0.0.1:43205_solr    ] o.a.s.c.c.ConnectionManager Client is connected to ZooKeeper
   [junit4]   2> 635031 INFO  (jetty-launcher-506-thread-2) [n:127.0.0.1:38344_solr    ] o.a.s.c.c.ConnectionManager Client is connected to ZooKeeper
   [junit4]   2> 635040 INFO  (zkCallback-526-thread-1-processing-n:127.0.0.1:45063_solr) [n:127.0.0.1:45063_solr    ] o.a.s.c.c.ConnectionManager Watcher org.apache.solr.common.cloud.ConnectionManager@2fee6b02 name:ZooKeeperConnection Watcher:127.0.0.1:50375/solr got event WatchedEvent state:SyncConnected type:None path:null path:null type:None
   [junit4]   2> 635040 INFO  (jetty-launcher-506-thread-1) [n:127.0.0.1:35253_solr    ] o.a.s.c.c.ConnectionManager Waiting for client to connect to ZooKeeper
   [junit4]   2> 635040 INFO  (jetty-launcher-506-thread-3) [n:127.0.0.1:45063_solr    ] o.a.s.c.c.ConnectionManager Client is connected to ZooKeeper
   [junit4]   2> 635048 INFO  (jetty-launcher-506-thread-5) [n:127.0.0.1:44619_solr    ] o.a.s.c.c.SolrZkClient makePath: /overseer/queue
   [junit4]   2> 635057 INFO  (jetty-launcher-506-thread-2) [n:127.0.0.1:38344_solr    ] o.a.s.c.c.SolrZkClient makePath: /overseer/queue
   [junit4]   2> 635057 INFO  (jetty-launcher-506-thread-3) [n:127.0.0.1:45063_solr    ] o.a.s.c.c.SolrZkClient makePath: /overseer/queue
   [junit4]   2> 635057 INFO  (jetty-launcher-506-thread-4) [n:127.0.0.1:43205_solr    ] o.a.s.c.c.SolrZkClient makePath: /overseer/queue
   [junit4]   2> 635057 INFO  (zkCallback-527-thread-1-processing-n:127.0.0.1:35253_solr) [n:127.0.0.1:35253_solr    ] o.a.s.c.c.ConnectionManager Watcher org.apache.solr.common.cloud.ConnectionManager@372e8f41 name:ZooKeeperConnection Watcher:127.0.0.1:50375/solr got event WatchedEvent state:SyncConnected type:None path:null path:null type:None
   [junit4]   2> 635057 INFO  (jetty-launcher-506-thread-1) [n:127.0.0.1:35253_solr    ] o.a.s.c.c.ConnectionManager Client is connected to ZooKeeper
   [junit4]   2> 635087 INFO  (jetty-launcher-506-thread-2) [n:127.0.0.1:38344_solr    ] o.a.s.c.c.SolrZkClient makePath: /overseer/collection-queue-work
   [junit4]   2> 635087 INFO  (jetty-launcher-506-thread-3) [n:127.0.0.1:45063_solr    ] o.a.s.c.c.SolrZkClient makePath: /overseer/collection-queue-work
   [junit4]   2> 635087 INFO  (jetty-launcher-506-thread-4) [n:127.0.0.1:43205_solr    ] o.a.s.c.c.SolrZkClient makePath: /overseer/collection-queue-work
   [junit4]   2> 635087 INFO  (jetty-launcher-506-thread-5) [n:127.0.0.1:44619_solr    ] o.a.s.c.c.SolrZkClient makePath: /overseer/collection-queue-work
   [junit4]   2> 635088 INFO  (jetty-launcher-506-thread-1) [n:127.0.0.1:35253_solr    ] o.a.s.c.c.SolrZkClient makePath: /overseer/collection-queue-work
   [junit4]   2> 635158 INFO  (jetty-launcher-506-thread-3) [n:127.0.0.1:45063_solr    ] o.a.s.c.c.SolrZkClient makePath: /overseer/collection-map-running
   [junit4]   2> 635158 INFO  (jetty-launcher-506-thread-4) [n:127.0.0.1:43205_solr    ] o.a.s.c.c.SolrZkClient makePath: /overseer/collection-map-running
   [junit4]   2> 635158 INFO  (jetty-launcher-506-thread-5) [n:127.0.0.1:44619_solr    ] o.a.s.c.c.SolrZkClient makePath: /overseer/collection-map-running
   [junit4]   2> 635172 INFO  (jetty-launcher-506-thread-1) [n:127.0.0.1:35253_solr    ] o.a.s.c.c.SolrZkClient makePath: /overseer/collection-map-running
   [junit4]   2> 635172 INFO  (jetty-launcher-506-thread-2) [n:127.0.0.1:38344_solr    ] o.a.s.c.c.SolrZkClient makePath: /overseer/collection-map-running
   [junit4]   2> 635213 INFO  (jetty-launcher-506-thread-3) [n:127.0.0.1:45063_solr    ] o.a.s.c.c.SolrZkClient makePath: /overseer/collection-map-completed
   [junit4]   2> 635222 INFO  (jetty-launcher-506-thread-4) [n:127.0.0.1:43205_solr    ] o.a.s.c.c.SolrZkClient makePath: /overseer/collection-map-completed
   [junit4]   2> 635222 INFO  (jetty-launcher-506-thread-5) [n:127.0.0.1:44619_solr    ] o.a.s.c.c.SolrZkClient makePath: /overseer/collection-map-completed
   [junit4]   2> 635222 INFO  (jetty-launcher-506-thread-2) [n:127.0.0.1:38344_solr    ] o.a.s.c.c.SolrZkClient makePath: /overseer/collection-map-completed
   [junit4]   2> 635222 INFO  (jetty-launcher-506-thread-1) [n:127.0.0.1:35253_solr    ] o.a.s.c.c.SolrZkClient makePath: /overseer/collection-map-completed
   [junit4]   2> 635268 INFO  (jetty-launcher-506-thread-3) [n:127.0.0.1:45063_solr    ] o.a.s.c.c.SolrZkClient makePath: /overseer/collection-map-failure
   [junit4]   2> 635268 INFO  (jetty-launcher-506-thread-2) [n:127.0.0.1:38344_solr    ] o.a.s.c.c.SolrZkClient makePath: /overseer/collection-map-failure
   [junit4]   2> 635268 INFO  (jetty-launcher-506-thread-1) [n:127.0.0.1:35253_solr    ] o.a.s.c.c.SolrZkClient makePath: /overseer/collection-map-failure
   [junit4]   2> 635268 INFO  (jetty-launcher-506-thread-4) [n:127.0.0.1:43205_solr    ] o.a.s.c.c.SolrZkClient makePath: /overseer/collection-map-failure
   [junit4]   2> 635268 INFO  (jetty-launcher-506-thread-5) [n:127.0.0.1:44619_solr    ] o.a.s.c.c.SolrZkClient makePath: /overseer/collection-map-failure
   [junit4]   2> 635347 INFO  (jetty-launcher-506-thread-3) [n:127.0.0.1:45063_solr    ] o.a.s.c.c.SolrZkClient makePath: /live_nodes
   [junit4]   2> 635347 INFO  (jetty-launcher-506-thread-2) [n:127.0.0.1:38344_solr    ] o.a.s.c.c.SolrZkClient makePath: /live_nodes
   [junit4]   2> 635347 INFO  (jetty-launcher-506-thread-4) [n:127.0.0.1:43205_solr    ] o.a.s.c.c.SolrZkClient makePath: /live_nodes
   [junit4]   2> 635347 INFO  (jetty-launcher-506-thread-1) [n:127.0.0.1:35253_solr    ] o.a.s.c.c.SolrZkClient makePath: /live_nodes
   [junit4]   2> 635348 INFO  (jetty-launcher-506-thread-5) [n:127.0.0.1:44619_solr    ] o.a.s.c.c.SolrZkClient makePath: /live_nodes
   [junit4]   2> 635365 INFO  (jetty-launcher-506-thread-2) [n:127.0.0.1:38344_solr    ] o.a.s.c.c.SolrZkClient makePath: /collections
   [junit4]   2> 635367 INFO  (jetty-launcher-506-thread-3) [n:127.0.0.1:45063_solr    ] o.a.s.c.c.SolrZkClient makePath: /collections
   [junit4]   2> 635367 INFO  (jetty-launcher-506-thread-4) [n:127.0.0.1:43205_solr    ] o.a.s.c.c.SolrZkClient makePath: /collections
   [junit4]   2> 635367 INFO  (jetty-launcher-506-thread-1) [n:127.0.0.1:35253_solr    ] o.a.s.c.c.SolrZkClient makePath: /collections
   [junit4]   2> 635367 INFO  (jetty-launcher-506-thread-5) [n:127.0.0.1:44619_solr    ] o.a.s.c.c.SolrZkClient makePath: /collections
   [junit4]   2> 635387 INFO  (jetty-launcher-506-thread-3) [n:127.0.0.1:45063_solr    ] o.a.s.c.c.SolrZkClient makePath: /aliases.json
   [junit4]   2> 635387 INFO  (jetty-launcher-506-thread-4) [n:127.0.0.1:43205_solr    ] o.a.s.c.c.SolrZkClient makePath: /aliases.json
   [junit4]   2> 635387 INFO  (jetty-launcher-506-thread-5) [n:127.0.0.1:44619_solr    ] o.a.s.c.c.SolrZkClient makePath: /aliases.json
   [junit4]   2> 635387 INFO  (jetty-launcher-506-thread-2) [n:127.0.0.1:38344_solr    ] o.a.s.c.c.SolrZkClient makePath: /aliases.json
   [junit4]   2> 635387 INFO  (jetty-launcher-506-thread-1) [n:127.0.0.1:35253_solr    ] o.a.s.c.c.SolrZkClient makePath: /aliases.json
   [junit4]   2> 635398 INFO  (jetty-launcher-506-thread-4) [n:127.0.0.1:43205_solr    ] o.a.s.c.c.SolrZkClient makePath: /clusterstate.json
   [junit4]   2> 635408 INFO  (jetty-launcher-506-thread-2) [n:127.0.0.1:38344_solr    ] o.a.s.c.c.SolrZkClient makePath: /clusterstate.json
   [junit4]   2> 635409 INFO  (jetty-launcher-506-thread-3) [n:127.0.0.1:45063_solr    ] o.a.s.c.c.SolrZkClient makePath: /clusterstate.json
   [junit4]   2> 635408 INFO  (jetty-launcher-506-thread-5) [n:127.0.0.1:44619_solr    ] o.a.s.c.c.SolrZkClient makePath: /clusterstate.json
   [junit4]   2> 635409 INFO  (jetty-launcher-506-thread-1) [n:127.0.0.1:35253_solr    ] o.a.s.c.c.SolrZkClient makePath: /clusterstate.json
   [junit4]   2> 635432 INFO  (jetty-launcher-506-thread-2) [n:127.0.0.1:38344_solr    ] o.a.s.c.c.SolrZkClient makePath: /security.json
   [junit4]   2> 635432 INFO  (jetty-launcher-506-thread-4) [n:127.0.0.1:43205_solr    ] o.a.s.c.c.SolrZkClient makePath: /security.json
   [junit4]   2> 635432 INFO  (jetty-launcher-506-thread-3) [n:127.0.0.1:45063_solr    ] o.a.s.c.c.SolrZkClient makePath: /security.json
   [junit4]   2> 635432 INFO  (jetty-launcher-506-thread-1) [n:127.0.0.1:35253_solr    ] o.a.s.c.c.SolrZkClient makePath: /security.json
   [junit4]   2> 635432 INFO  (jetty-launcher-506-thread-5) [n:127.0.0.1:44619_solr    ] o.a.s.c.c.SolrZkClient makePath: /security.json
   [junit4]   2> 635434 INFO  (jetty-launcher-506-thread-3) [n:127.0.0.1:45063_solr    ] o.a.s.c.ZkController Register node as live in ZooKeeper:/live_nodes/127.0.0.1:45063_solr
   [junit4]   2> 635444 INFO  (jetty-launcher-506-thread-4) [n:127.0.0.1:43205_solr    ] o.a.s.c.ZkController Register node as live in ZooKeeper:/live_nodes/127.0.0.1:43205_solr
   [junit4]   2> 635444 INFO  (jetty-launcher-506-thread-2) [n:127.0.0.1:38344_solr    ] o.a.s.c.ZkController Register node as live in ZooKeeper:/live_nodes/127.0.0.1:38344_solr
   [junit4]   2> 635455 INFO  (jetty-launcher-506-thread-3) [n:127.0.0.1:45063_solr    ] o.a.s.c.c.SolrZkClient makePath: /live_nodes/127.0.0.1:45063_solr
   [junit4]   2> 635458 INFO  (jetty-launcher-506-thread-4) [n:127.0.0.1:43205_solr    ] o.a.s.c.c.SolrZkClient makePath: /live_nodes/127.0.0.1:43205_solr
   [junit4]   2> 635458 INFO  (jetty-launcher-506-thread-2) [n:127.0.0.1:38344_solr    ] o.a.s.c.c.SolrZkClient makePath: /live_nodes/127.0.0.1:38344_solr
   [junit4]   2> 635458 INFO  (jetty-launcher-506-thread-5) [n:127.0.0.1:44619_solr    ] o.a.s.c.ZkController Register node as live in ZooKeeper:/live_nodes/127.0.0.1:44619_solr
   [junit4]   2> 635458 INFO  (jetty-launcher-506-thread-1) [n:127.0.0.1:35253_solr    ] o.a.s.c.ZkController Register node as live in ZooKeeper:/live_nodes/127.0.0.1:35253_solr
   [junit4]   2> 635467 INFO  (jetty-launcher-506-thread-5) [n:127.0.0.1:44619_solr    ] o.a.s.c.c.SolrZkClient makePath: /live_nodes/127.0.0.1:44619_solr
   [junit4]   2> 635467 INFO  (jetty-launcher-506-thread-1) [n:127.0.0.1:35253_solr    ] o.a.s.c.c.SolrZkClient makePath: /live_nodes/127.0.0.1:35253_solr
   [junit4]   2> 635479 INFO  (jetty-launcher-506-thread-4) [n:127.0.0.1:43205_solr    ] o.a.s.c.c.SolrZkClient makePath: /overseer_elect
   [junit4]   2> 635479 INFO  (jetty-launcher-506-thread-2) [n:127.0.0.1:38344_solr    ] o.a.s.c.c.SolrZkClient makePath: /overseer_elect
   [junit4]   2> 635479 INFO  (jetty-launcher-506-thread-3) [n:127.0.0.1:45063_solr    ] o.a.s.c.c.SolrZkClient makePath: /overseer_elect
   [junit4]   2> 635522 INFO  (jetty-launcher-506-thread-4) [n:127.0.0.1:43205_solr    ] o.a.s.c.c.SolrZkClient makePath: /overseer_elect/election
   [junit4]   2> 635522 INFO  (jetty-launcher-506-thread-3) [n:127.0.0.1:45063_solr    ] o.a.s.c.c.SolrZkClient makePath: /overseer_elect/election
   [junit4]   2> 635522 INFO  (jetty-launcher-506-thread-1) [n:127.0.0.1:35253_solr    ] o.a.s.c.c.SolrZkClient makePath: /overseer_elect/election
   [junit4]   2> 635522 INFO  (jetty-launcher-506-thread-5) [n:127.0.0.1:44619_solr    ] o.a.s.c.c.SolrZkClient makePath: /overseer_elect/election
   [junit4]   2> 635522 INFO  (jetty-launcher-506-thread-2) [n:127.0.0.1:38344_solr    ] o.a.s.c.c.SolrZkClient makePath: /overseer_elect/election
   [junit4]   2> 635532 INFO  (jetty-launcher-506-thread-5) [n:127.0.0.1:44619_solr    ] o.a.s.c.Overseer Overseer (id=null) closing
   [junit4]   2> 635532 INFO  (jetty-launcher-506-thread-3) [n:127.0.0.1:45063_solr    ] o.a.s.c.Overseer Overseer (id=null) closing
   [junit4]   2> 635532 INFO  (jetty-launcher-506-thread-2) [n:127.0.0.1:38344_solr    ] o.a.s.c.Overseer Overseer (id=null) closing
   [junit4]   2> 635532 INFO  (jetty-launcher-506-thread-1) [n:127.0.0.1:35253_solr    ] o.a.s.c.Overseer Overseer (id=null) closing
   [junit4]   2> 635532 INFO  (jetty-launcher-506-thread-4) [n:127.0.0.1:43205_solr    ] o.a.s.c.Overseer Overseer (id=null) closing
   [junit4]   2> 635533 INFO  (jetty-launcher-506-thread-5) [n:127.0.0.1:44619_solr    ] o.a.s.c.LeaderElector Joined leadership election with path: /overseer_elect/election/95176640825458699-127.0.0.1:44619_solr-n_0000000000
   [junit4]   2> 635544 INFO  (jetty-launcher-506-thread-1) [n:127.0.0.1:35253_solr    ] o.a.s.c.LeaderElector Joined leadership election with path: /overseer_elect/election/95176640825458703-127.0.0.1:35253_solr-n_0000000002
   [junit4]   2> 635544 INFO  (jetty-launcher-506-thread-2) [n:127.0.0.1:38344_solr    ] o.a.s.c.LeaderElector Joined leadership election with path: /overseer_elect/election/95176640825458701-127.0.0.1:38344_solr-n_0000000003
   [junit4]   2> 635544 INFO  (jetty-launcher-506-thread-5) [n:127.0.0.1:44619_solr    ] o.a.s.c.OverseerElectionContext I am going to be the leader 127.0.0.1:44619_solr
   [junit4]   2> 635544 INFO  (jetty-launcher-506-thread-5) [n:127.0.0.1:44619_solr    ] o.a.s.c.c.SolrZkClient makePath: /overseer_elect/leader
   [junit4]   2> 635544 INFO  (jetty-launcher-506-thread-4) [n:127.0.0.1:43205_solr    ] o.a.s.c.LeaderElector Joined leadership election with path: /overseer_elect/election/95176640825458700-127.0.0.1:43205_solr-n_0000000004
   [junit4]   2> 635544 INFO  (jetty-launcher-506-thread-3) [n:127.0.0.1:45063_solr    ] o.a.s.c.LeaderElector Joined leadership election with path: /overseer_elect/election/95176640825458702-127.0.0.1:45063_solr-n_0000000001
   [junit4]   2> 635544 INFO  (jetty-launcher-506-thread-1) [n:127.0.0.1:35253_solr    ] o.a.s.c.LeaderElector Watching path /overseer_elect/election/95176640825458702-127.0.0.1:45063_solr-n_0000000001 to know if I could be the leader
   [junit4]   2> 635544 INFO  (jetty-launcher-506-thread-2) [n:127.0.0.1:38344_solr    ] o.a.s.c.LeaderElector Watching path /overseer_elect/election/95176640825458703-127.0.0.1:35253_solr-n_0000000002 to know if I could be the leader
   [junit4]   2> 635544 INFO  (jetty-launcher-506-thread-1) [n:127.0.0.1:35253_solr    ] o.a.s.c.c.ZkStateReader Updating cluster state from ZooKeeper... 
   [junit4]   2> 635544 INFO  (jetty-launcher-506-thread-2) [n:127.0.0.1:38344_solr    ] o.a.s.c.c.ZkStateReader Updating cluster state from ZooKeeper... 
   [junit4]   2> 635545 INFO  (jetty-launcher-506-thread-4) [n:127.0.0.1:43205_solr    ] o.a.s.c.LeaderElector Watching path /overseer_elect/election/95176640825458701-127.0.0.1:38344_solr-n_0000000003 to know if I could be the leader
   [junit4]   2> 635545 INFO  (jetty-launcher-506-thread-4) [n:127.0.0.1:43205_solr    ] o.a.s.c.c.ZkStateReader Updating cluster state from ZooKeeper... 
   [junit4]   2> 635546 INFO  (jetty-launcher-506-thread-3) [n:127.0.0.1:45063_solr    ] o.a.s.c.LeaderElector Watching path /overseer_elect/election/95176640825458699-127.0.0.1:44619_solr-n_0000000000 to know if I could be the leader
   [junit4]   2> 635546 INFO  (jetty-launcher-506-thread-3) [n:127.0.0.1:45063_solr    ] o.a.s.c.c.ZkStateReader Updating cluster state from ZooKeeper... 
   [junit4]   2> 635546 INFO  (jetty-launcher-506-thread-5) [n:127.0.0.1:44619_solr    ] o.a.s.c.Overseer Overseer (id=95176640825458699-127.0.0.1:44619_solr-n_0000000000) starting
   [junit4]   2> 635552 INFO  (jetty-launcher-506-thread-5) [n:127.0.0.1:44619_solr    ] o.a.s.c.c.SolrZkClient makePath: /overseer/queue-work
   [junit4]   2> 635561 INFO  (jetty-launcher-506-thread-2) [n:127.0.0.1:38344_solr    ] o.a.s.c.CoreContainer Security conf doesn't exist. Skipping setup for authorization module.
   [junit4]   2> 635561 INFO  (jetty-launcher-506-thread-2) [n:127.0.0.1:38344_solr    ] o.a.s.c.CoreContainer Authentication plugin class obtained from system property 'authenticationPlugin': org.apache.solr.cloud.TestAuthenticationFramework$MockAuthenticationPlugin
   [junit4]   2> 635561 INFO  (jetty-launcher-506-thread-2) [n:127.0.0.1:38344_solr    ] o.a.s.c.CoreContainer Reconfiguring the shard handler factory and update shard handler.
   [junit4]   2> 635561 INFO  (jetty-launcher-506-thread-2) [n:127.0.0.1:38344_solr    ] o.a.s.h.c.HttpShardHandlerFactory Reconfiguring the default client with: org.apache.solr.cloud.TestAuthenticationFramework$MockAuthenticationPlugin$MockClientConfigurer@40c64e66
   [junit4]   2> 635561 INFO  (jetty-launcher-506-thread-3) [n:127.0.0.1:45063_solr    ] o.a.s.c.CoreContainer Security conf doesn't exist. Skipping setup for authorization module.
   [junit4]   2> 635561 INFO  (jetty-launcher-506-thread-3) [n:127.0.0.1:45063_solr    ] o.a.s.c.CoreContainer Authentication plugin class obtained from system property 'authenticationPlugin': org.apache.solr.cloud.TestAuthenticationFramework$MockAuthenticationPlugin
   [junit4]   2> 635561 INFO  (jetty-launcher-506-thread-3) [n:127.0.0.1:45063_solr    ] o.a.s.c.CoreContainer Reconfiguring the shard handler factory and update shard handler.
   [junit4]   2> 635561 INFO  (jetty-launcher-506-thread-3) [n:127.0.0.1:45063_solr    ] o.a.s.h.c.HttpShardHandlerFactory Reconfiguring the default client with: org.apache.solr.cloud.TestAuthenticationFramework$MockAuthenticationPlugin$MockClientConfigurer@1f1c3521
   [junit4]   2> 635561 INFO  (jetty-launcher-506-thread-3) [n:127.0.0.1:45063_solr    ] o.a.s.u.UpdateShardHandler Reconfiguring the default client with: org.apache.solr.cloud.TestAuthenticationFramework$MockAuthenticationPlugin$MockClientConfigurer@1f1c3521
   [junit4]   2> 635561 INFO  (jetty-launcher-506-thread-2) [n:127.0.0.1:38344_solr    ] o.a.s.u.UpdateShardHandler Reconfiguring the default client with: org.apache.solr.cloud.TestAuthenticationFramework$MockAuthenticationPlugin$MockClientConfigurer@40c64e66
   [junit4]   2> 635562 INFO  (jetty-launcher-506-thread-3) [n:127.0.0.1:45063_solr    ] o.a.s.c.CorePropertiesLocator Looking for core definitions underneath /home/jenkins/workspace/Lucene-Solr-5.x-Linux/solr/build/solr-core/test/J2/temp/solr.cloud.TestAuthenticationFramework_FC43CF849DD0E08-001/tempDir-001/node3/.
   [junit4]   2> 635562 INFO  (jetty-launcher-506-thread-2) [n:127.0.0.1:38344_solr    ] o.a.s.c.CorePropertiesLocator Looking for core definitions underneath /home/jenkins/workspace/Lucene-Solr-5.x-Linux/solr/build/solr-core/test/J2/temp/solr.cloud.TestAuthenticationFramework_FC43CF849DD0E08-001/tempDir-001/node2/.
   [junit4]   2> 635562 INFO  (jetty-launcher-506-thread-3) [n:127.0.0.1:45063_solr    ] o.a.s.c.CorePropertiesLocator Found 0 core definitions
   [junit4]   2> 635562 INFO  (jetty-launcher-506-thread-2) [n:127.0.0.1:38344_solr    ] o.a.s.c.CorePropertiesLocator Found 0 core definitions
   [junit4]   2> 635565 INFO  (jetty-launcher-506-thread-4) [n:127.0.0.1:43205_solr    ] o.a.s.c.CoreContainer Security conf doesn't exist. Skipping setup for authorization module.
   [junit4]   2> 635565 INFO  (jetty-launcher-506-thread-4) [n:127.0.0.1:43205_solr    ] o.a.s.c.CoreContainer Authentication plugin class obtained from system property 'authenticationPlugin': org.apache.solr.cloud.TestAuthenticationFramework$MockAuthenticationPlugin
   [junit4]   2> 635565 INFO  (jetty-launcher-506-thread-4) [n:127.0.0.1:43205_solr    ] o.a.s.c.CoreContainer Reconfiguring the shard handler factory and update shard handler.
   [junit4]   2> 635565 INFO  (jetty-launcher-506-thread-4) [n:127.0.0.1:43205_solr    ] o.a.s.h.c.HttpShardHandlerFactory Reconfiguring the default client with: org.apache.solr.cloud.TestAuthenticationFramework$MockAuthenticationPlugin$MockClientConfigurer@5de42209
   [junit4]   2> 635565 INFO  (jetty-launcher-506-thread-4) [n:127.0.0.1:43205_solr    ] o.a.s.u.UpdateShardHandler Reconfiguring the default client with: org.apache.solr.cloud.TestAuthenticationFramework$MockAuthenticationPlugin$MockClientConfigurer@5de42209
   [junit4]   2> 635565 INFO  (jetty-launcher-506-thread-4) [n:127.0.0.1:43205_solr    ] o.a.s.c.CorePropertiesLocator Looking for core definitions underneath /home/jenkins/workspace/Lucene-Solr-5.x-Linux/solr/build/solr-core/test/J2/temp/solr.cloud.TestAuthenticationFramework_FC43CF849DD0E08-001/tempDir-001/node4/.
   [junit4]   2> 635566 INFO  (jetty-launcher-506-thread-4) [n:127.0.0.1:43205_solr    ] o.a.s.c.CorePropertiesLocator Found 0 core definitions
   [junit4]   2> 635566 INFO  (jetty-launcher-506-thread-1) [n:127.0.0.1:35253_solr    ] o.a.s.c.CoreContainer Security conf doesn't exist. Skipping setup for authorization module.
   [junit4]   2> 635567 INFO  (jetty-launcher-506-thread-1) [n:127.0.0.1:35253_solr    ] o.a.s.c.CoreContainer Authentication plugin class obtained from system property 'authenticationPlugin': org.apache.solr.cloud.TestAuthenticationFramework$MockAuthenticationPlugin
   [junit4]   2> 635567 INFO  (jetty-launcher-506-thread-1) [n:127.0.0.1:35253_solr    ] o.a.s.c.CoreContainer Reconfiguring the shard handler factory and update shard handler.
   [junit4]   2> 635567 INFO  (jetty-launcher-506-thread-1) [n:127.0.0.1:35253_solr    ] o.a.s.h.c.HttpShardHandlerFactory Reconfiguring the default client with: org.apache.solr.cloud.TestAuthenticationFramework$MockAuthenticationPlugin$MockClientConfigurer@15d4776b
   [junit4]   2> 635567 INFO  (jetty-launcher-506-thread-4) [n:127.0.0.1:43205_solr    ] o.a.s.s.SolrDispatchFilter user.dir=/home/jenkins/workspace/Lucene-Solr-5.x-Linux/solr/build/solr-core/test/J2
   [junit4]   2> 635567 INFO  (jetty-launcher-506-thread-2) [n:127.0.0.1:38344_solr    ] o.a.s.s.SolrDispatchFilter user.dir=/home/jenkins/workspace/Lucene-Solr-5.x-Linux/solr/build/solr-core/test/J2
   [junit4]   2> 635567 INFO  (jetty-launcher-506-thread-2) [n:127.0.0.1:38344_solr    ] o.a.s.s.SolrDispatchFilter SolrDispatchFilter.init() done
   [junit4]   2> 635567 INFO  (jetty-launcher-506-thread-3) [n:127.0.0.1:45063_solr    ] o.a.s.s.SolrDispatchFilter user.dir=/home/jenkins/workspace/Lucene-Solr-5.x-Linux/solr/build/solr-core/test/J2
   [junit4]   2> 635567 INFO  (jetty-launcher-506-thread-3) [n:127.0.0.1:45063_solr    ] o.a.s.s.SolrDispatchFilter SolrDispatchFilter.init() done
   [junit4]   2> 635567 INFO  (jetty-launcher-506-thread-1) [n:127.0.0.1:35253_solr    ] o.a.s.u.UpdateShardHandler Reconfiguring the default client with: org.apache.solr.cloud.TestAuthenticationFramework$MockAuthenticationPlugin$MockClientConfigurer@15d4776b
   [junit4]   2> 635567 INFO  (jetty-launcher-506-thread-4) [n:127.0.0.1:43205_solr    ] o.a.s.s.SolrDispatchFilter SolrDispatchFilter.init() done
   [junit4]   2> 635568 INFO  (jetty-launcher-506-thread-1) [n:127.0.0.1:35253_solr    ] o.a.s.c.CorePropertiesLocator Looking for core definitions underneath /home/jenkins/workspace/Lucene-Solr-5.x-Linux/solr/build/solr-core/test/J2/temp/solr.cloud.TestAuthenticationFramework_FC43CF849DD0E08-001/tempDir-001/node1/.
   [junit4]   2> 635568 INFO  (jetty-launcher-506-thread-1) [n:127.0.0.1:35253_solr    ] o.a.s.c.CorePropertiesLocator Found 0 core definitions
   [junit4]   2> 635569 INFO  (jetty-launcher-506-thread-1) [n:127.0.0.1:35253_solr    ] o.a.s.s.SolrDispatchFilter user.dir=/home/jenkins/workspace/Lucene-Solr-5.x-Linux/solr/build/solr-core/test/J2
   [junit4]   2> 635569 INFO  (jetty-launcher-506-thread-1) [n:127.0.0.1:35253_solr    ] o.a.s.s.SolrDispatchFilter SolrDispatchFilter.init() done
   [junit4]   2> 635578 INFO  (jetty-launcher-506-thread-5) [n:127.0.0.1:44619_solr    ] o.a.s.c.OverseerAutoReplicaFailoverThread Starting OverseerAutoReplicaFailoverThread autoReplicaFailoverWorkLoopDelay=10000 autoReplicaFailoverWaitAfterExpiration=30000 autoReplicaFailoverBadNodeExpiration=60000
   [junit4]   2> 635578 INFO  (OverseerCollectionConfigSetProcessor-95176640825458699-127.0.0.1:44619_solr-n_0000000000) [n:127.0.0.1:44619_solr    ] o.a.s.c.OverseerTaskProcessor Process current queue of overseer operations
   [junit4]   2> 635578 INFO  (jetty-launcher-506-thread-5) [n:127.0.0.1:44619_solr    ] o.a.s.c.c.ZkStateReader Updating cluster state from ZooKeeper... 
   [junit4]   2> 635578 INFO  (OverseerStateUpdate-95176640825458699-127.0.0.1:44619_solr-n_0000000000) [n:127.0.0.1:44619_solr    ] o.a.s.c.Overseer Starting to work on the main queue
   [junit4]   2> 635590 INFO  (jetty-launcher-506-thread-5) [n:127.0.0.1:44619_solr    ] o.a.s.c.CoreContainer Security conf doesn't exist. Skipping setup for authorization module.
   [junit4]   2> 635590 INFO  (jetty-launcher-506-thread-5) [n:127.0.0.1:44619_solr    ] o.a.s.c.CoreContainer Authentication plugin class obtained from system property 'authenticationPlugin': org.apache.solr.cloud.TestAuthenticationFramework$MockAuthenticationPlugin
   [junit4]   2> 635590 INFO  (jetty-launcher-506-thread-5) [n:127.0.0.1:44619_solr    ] o.a.s.c.CoreContainer Reconfiguring the shard handler factory and update shard handler.
   [junit4]   2> 635590 INFO  (jetty-launcher-506-thread-5) [n:127.0.0.1:44619_solr    ] o.a.s.h.c.HttpShardHandlerFactory Reconfiguring the default client with: org.apache.solr.cloud.TestAuthenticationFramework$MockAuthenticationPlugin$MockClientConfigurer@1c1c0c8e
   [junit4]   2> 635591 INFO  (jetty-launcher-506-thread-5) [n:127.0.0.1:44619_solr    ] o.a.s.u.UpdateShardHandler Reconfiguring the default client with: org.apache.solr.cloud.TestAuthenticationFramework$MockAuthenticationPlugin$MockClientConfigurer@1c1c0c8e
   [junit4]   2> 635592 INFO  (jetty-launcher-506-thread-5) [n:127.0.0.1:44619_solr    ] o.a.s.c.CorePropertiesLocator Looking for core definitions underneath /home/jenkins/workspace/Lucene-Solr-5.x-Linux/solr/build/solr-core/test/J2/temp/solr.cloud.TestAuthenticationFramework_FC43CF849DD0E08-001/tempDir-001/node5/.
   [junit4]   2> 635592 INFO  (jetty-launcher-506-thread-5) [n:127.0.0.1:44619_solr    ] o.a.s.c.CorePropertiesLocator Found 0 core definitions
   [junit4]   2> 635593 INFO  (jetty-launcher-506-thread-5) [n:127.0.0.1:44619_solr    ] o.a.s.s.SolrDispatchFilter user.dir=/home/jenkins/workspace/Lucene-Solr-5.x-Linux/solr/build/solr-core/test/J2
   [junit4]   2> 635593 INFO  (jetty-launcher-506-thread-5) [n:127.0.0.1:44619_solr    ] o.a.s.s.SolrDispatchFilter SolrDispatchFilter.init() done
   [junit4]   2> 635593 INFO  (TEST-TestAuthenticationFramework.testExtraFilters-seed#[FC43CF849DD0E08]) [    ] o.a.s.c.c.SolrZkClient Using default ZkCredentialsProvider
   [junit4]   2> 635593 INFO  (TEST-TestAuthenticationFramework.testExtraFilters-seed#[FC43CF849DD0E08]) [    ] o.a.s.c.c.ConnectionManager Waiting for client to connect to ZooKeeper
   [junit4]   2> 635595 INFO  (zkCallback-528-thread-1) [    ] o.a.s.c.c.ConnectionManager Watcher org.apache.solr.common.cloud.ConnectionManager@2146516 name:ZooKeeperConnection Watcher:127.0.0.1:50375 got event WatchedEvent state:SyncConnected type:None path:null path:null type:None
   [junit4]   2> 635596 INFO  (TEST-TestAuthenticationFramework.testExtraFilters-seed#[FC43CF849DD0E08]) [    ] o.a.s.c.c.ConnectionManager Client is connected to ZooKeeper
   [junit4]   2> 635596 INFO  (TEST-TestAuthenticationFramework.testExtraFilters-seed#[FC43CF849DD0E08]) [    ] o.a.s.c.c.SolrZkClient Using default ZkACLProvider
   [junit4]   2> 635598 INFO  (jetty-launcher-506-thread-5) [    ] o.e.j.s.ServerConnector Stopped ServerConnector@a4b4d4a{HTTP/1.1}{127.0.0.1:0}
   [junit4]   2> 635598 INFO  (jetty-launcher-506-thread-1) [    ] o.e.j.s.ServerConnector Stopped ServerConnector@483de7a8{HTTP/1.1}{127.0.0.1:0}
   [junit4]   2> 635599 INFO  (jetty-launcher-506-thread-3) [    ] o.e.j.s.ServerConnector Stopped ServerConnector@75c3ee65{HTTP/1.1}{127.0.0.1:0}
   [junit4]   2> 635604 INFO  (jetty-launcher-506-thread-1) [    ] o.a.s.c.CoreContainer Shutting down CoreContainer instance=1801878679
   [junit4]   2> 635604 INFO  (jetty-launcher-506-thread-3) [    ] o.a.s.c.CoreContainer Shutting down CoreContainer instance=1818577751
   [junit4]   2> 635604 INFO  (jetty-launcher-506-thread-5) [    ] o.a.s.c.CoreContainer Shutting down CoreContainer instance=1938171965
   [junit4]   2> 635614 INFO  (jetty-launcher-506-thread-4) [    ] o.e.j.s.ServerConnector Stopped ServerConnector@54c44ed8{HTTP/1.1}{127.0.0.1:0}
   [junit4]   2> 635614 INFO  (jetty-launcher-506-thread-2) [    ] o.e.j.s.ServerConnector Stopped ServerConnector@3e14752f{HTTP/1.1}{127.0.0.1:0}
   [junit4]   2> 635614 INFO  (jetty-launcher-506-thread-4) [    ] o.a.s.c.CoreContainer Shutting down CoreContainer instance=1265047574
   [junit4]   2> 635615 INFO  (jetty-launcher-506-thread-2) [    ] o.a.s.c.CoreContainer Shutting down CoreContainer instance=1589533602
   [junit4]   2> 635618 INFO  (jetty-launcher-506-thread-2) [    ] o.a.s.c.Overseer Overseer (id=95176640825458699-127.0.0.1:44619_solr-n_0000000000) closing
   [junit4]   2> 635618 INFO  (zkCallback-525-thread-1-processing-n:127.0.0.1:43205_solr) [n:127.0.0.1:43205_solr    ] o.a.s.c.c.ZkStateReader A live node change: [WatchedEvent state:SyncConnected type:NodeChildrenChanged path:/live_nodes], has occurred - updating... (live nodes size: [5])
   [junit4]   2> 635618 INFO  (zkCallback-527-thread-1-processing-n:127.0.0.1:35253_solr) [n:127.0.0.1:35253_solr    ] o.a.s.c.c.ZkStateReader A live node change: [WatchedEvent state:SyncConnected type:NodeChildrenChanged path:/live_nodes], has occurred - updating... (live nodes size: [5])
   [junit4]   2> 635618 INFO  (zkCallback-526-thread-1-processing-n:127.0.0.1:45063_solr) [n:127.0.0.1:45063_solr    ] o.a.s.c.c.ZkStateReader A live node change: [WatchedEvent state:SyncConnected type:NodeChildrenChanged path:/live_nodes], has occurred - updating... (live nodes size: [5])
   [junit4]   2> 635618 INFO  (zkCallback-524-thread-2-processing-n:127.0.0.1:38344_solr) [n:127.0.0.1:38344_solr    ] o.a.s.c.c.ZkStateReader A live node change: [WatchedEvent state:SyncConnected type:NodeChildrenChanged path:/live_nodes], has occurred - updating... (live nodes size: [5])
   [junit4]   2> 635618 INFO  (OverseerStateUpdate-95176640825458699-127.0.0.1:44619_solr-n_0000000000) [n:127.0.0.1:44619_solr    ] o.a.s.c.Overseer Overseer Loop exiting : 127.0.0.1:44619_solr
   [junit4]   2> 635618 INFO  (zkCallback-523-thread-1-processing-n:127.0.0.1:44619_solr) [n:127.0.0.1:44619_solr    ] o.a.s.c.c.ZkStateReader A live node change: [WatchedEvent state:SyncConnected type:NodeChildrenChanged path:/live_nodes], has occurred - updating... (live nodes size: [5])
   [junit4]   2> 635618 WARN  (zkCallback-527-thread-1-processing-n:127.0.0.1:35253_solr) [n:127.0.0.1:35253_solr    ] o.a.s.c.c.ZkStateReader ZooKeeper watch triggered, but Solr cannot talk to ZK: [KeeperErrorCode = Session expired for /live_nodes]
   [junit4]   2> 635620 INFO  (jetty-launcher-506-thread-3) [    ] o.e.j.s.h.ContextHandler Stopped o.e.j.s.ServletContextHandler@2677ee12{/solr,null,UNAVAILABLE}
   [junit4]   2> 635620 WARN  (NIOServerCxn.Factory:0.0.0.0/0.0.0.0:0) [    ] o.a.z.s.NIOServerCnxn caught end of stream exception
   [junit4]   2> EndOfStreamException: Unable to read additional data from client sessionid 0x15222a68b51000e, likely client has closed socket
   [junit4]   2> 	at org.apache.zookeeper.server.NIOServerCnxn.doIO(NIOServerCnxn.java:228)
   [junit4]   2> 	at org.apache.zookeeper.server.NIOServerCnxnFactory.run(NIOServerCnxnFactory.java:208)
   [junit4]   2> 	at java.lang.Thread.run(Thread.java:745)
   [junit4]   2> 635620 WARN  (zkCallback-525-thread-2-processing-n:127.0.0.1:43205_solr) [n:127.0.0.1:43205_solr    ] o.a.s.c.LeaderElector 
   [junit4]   2> org.apache.zookeeper.KeeperException$SessionExpiredException: KeeperErrorCode = Session expired for /overseer_elect/election
   [junit4]   2> 	at org.apache.zookeeper.KeeperException.create(KeeperException.java:127)
   [junit4]   2> 	at org.apache.zookeeper.KeeperException.create(KeeperException.java:51)
   [junit4]   2> 	at org.apache.zookeeper.ZooKeeper.getChildren(ZooKeeper.java:1472)
   [junit4]   2> 	at org.apache.solr.common.cloud.SolrZkClient$6.execute(SolrZkClient.java:328)
   [junit4]   2> 	at org.apache.solr.common.cloud.SolrZkClient$6.execute(SolrZkClient.java:325)
   [junit4]   2> 	at org.apache.solr.common.cloud.ZkCmdExecutor.retryOperation(ZkCmdExecutor.java:61)
   [junit4]   2> 	at org.apache.solr.common.cloud.SolrZkClient.getChildren(SolrZkClient.java:325)
   [junit4]   2> 	at org.apache.solr.cloud.LeaderElector.checkIfIamLeader(LeaderElector.java:108)
   [junit4]   2> 	at org.apache.solr.cloud.LeaderElector.access$200(LeaderElector.java:59)
   [junit4]   2> 	at org.apache.solr.cloud.LeaderElector$ElectionWatcher.process(LeaderElector.java:389)
   [junit4]   2> 	at org.apache.solr.common.cloud.SolrZkClient$3$1.run(SolrZkClient.java:264)
   [junit4]   2> 	at java.util.concurrent.Executors$RunnableAdapter.call(Executors.java:511)
   [junit4]   2> 	at java.util.concurrent.FutureTask.run(FutureTask.java:266)
   [junit4]   2> 	at org.apache.solr.common.util.ExecutorUtil$MDCAwareThreadPoolExecutor$1.run(ExecutorUtil.java:232)
   [junit4]   2> 	at java.util.concurrent.ThreadPoolExecutor.runWorker(ThreadPoolExecutor.java:1142)
   [junit4]   2> 	at java.util.concurrent.ThreadPoolExecutor$Worker.run(ThreadPoolExecutor.java:617)
   [junit4]   2> 	at java.lang.Thread.run(Thread.java:745)
   [junit4]   2> 635621 WARN  (NIOServerCxn.Factory:0.0.0.0/0.0.0.0:0) [    ] o.a.z.s.NIOServerCnxn caught end of stream exception
   [junit4]   2> EndOfStreamException: Unable to read additional data from client sessionid 0x15222a68b51000c, likely client has closed socket
   [junit4]   2> 	at org.apache.zookeeper.server.NIOServerCnxn.doIO(NIOServerCnxn.java:228)
   [junit4]   2> 	at org.apache.zookeeper.server.NIOServerCnxnFactory.run(NIOServerCnxnFactory.java:208)
   [junit4]   2> 	at java.lang.Thread.run(Thread.java:745)
   [junit4]   2> 637118 WARN  (zkCallback-524-thread-1-processing-n:127.0.0.1:38344_solr) [n:127.0.0.1:38344_solr    ] o.a.s.c.LeaderElector 
   [junit4]   2> org.apache.zookeeper.KeeperException$SessionExpiredException: KeeperErrorCode = Session expired for /overseer_elect/election
   [junit4]   2> 	at org.apache.zookeeper.KeeperException.create(KeeperException.java:127)
   [junit4]   2> 	at org.apache.zookeeper.KeeperException.create(KeeperException.java:51)
   [junit4]   2> 	at org.apache.zookeeper.ZooKeeper.getChildren(ZooKeeper.java:1472)
   [junit4]   2> 	at org.apache.solr.common.cloud.SolrZkClient$6.execute(SolrZkClient.java:328)
   [junit4]   2> 	at org.apache.solr.common.cloud.SolrZkClient$6.execute(SolrZkClient.java:325)
   [junit4]   2> 	at org.apache.solr.common.cloud.ZkCmdExecutor.retryOperation(ZkCmdExecutor.java:61)
   [junit4]   2> 	at org.apache.solr.common.cloud.SolrZkClient.getChildren(SolrZkClient.java:325)
   [junit4]   2> 	at org.apache.solr.cloud.LeaderElector.checkIfIamLeader(LeaderElector.java:108)
   [junit4]   2> 	at org.apache.solr.cloud.LeaderElector.access$200(LeaderElector.java:59)
   [junit4]   2> 	at org.apache.solr.cloud.LeaderElector$ElectionWatcher.process(LeaderElector.java:389)
   [junit4]   2> 	at org.apache.solr.common.cloud.SolrZkClient$3$1.run(SolrZkClient.java:264)
   [junit4]   2> 	at java.util.concurrent.Executors$RunnableAdapter.call(Executors.java:511)
   [junit4]   2> 	at java.util.concurrent.FutureTask.run(FutureTask.java:266)
   [junit4]   2> 	at org.apache.solr.common.util.ExecutorUtil$MDCAwareThreadPoolExecutor$1.run(ExecutorUtil.java:232)
   [junit4]   2> 	at java.util.concurrent.ThreadPoolExecutor.runWorker(ThreadPoolExecutor.java:1142)
   [junit4]   2> 	at java.util.concurrent.ThreadPoolExecutor$Worker.run(ThreadPoolExecutor.java:617)
   [junit4]   2> 	at java.lang.Thread.run(Thread.java:745)
   [junit4]   2> 637118 WARN  (zkCallback-524-thread-2-processing-n:127.0.0.1:38344_solr) [n:127.0.0.1:38344_solr    ] o.a.s.c.c.ZkStateReader ZooKeeper watch triggered, but Solr cannot talk to ZK: [KeeperErrorCode = Session expired for /live_nodes]
   [junit4]   2> 637118 WARN  (zkCallback-523-thread-1-processing-n:127.0.0.1:44619_solr) [n:127.0.0.1:44619_solr    ] o.a.s.c.c.ZkStateReader ZooKeeper watch triggered, but Solr cannot talk to ZK: [KeeperErrorCode = Session expired for /live_nodes]
   [junit4

[...truncated too long message...]

ureTask.run(FutureTask.java:266)
   [junit4]   2> 	at org.apache.solr.common.util.ExecutorUtil$MDCAwareThreadPoolExecutor$1.run(ExecutorUtil.java:232)
   [junit4]   2> 	at java.util.concurrent.ThreadPoolExecutor.runWorker(ThreadPoolExecutor.java:1142)
   [junit4]   2> 	at java.util.concurrent.ThreadPoolExecutor$Worker.run(ThreadPoolExecutor.java:617)
   [junit4]   2> 	at java.lang.Thread.run(Thread.java:745)
   [junit4]   2> 
   [junit4]   2> org.apache.solr.common.util.ObjectReleaseTracker$ObjectTrackerException
   [junit4]   2> 	at org.apache.solr.common.util.ObjectReleaseTracker.track(ObjectReleaseTracker.java:43)
   [junit4]   2> 	at org.apache.solr.core.CachingDirectoryFactory.get(CachingDirectoryFactory.java:352)
   [junit4]   2> 	at org.apache.solr.core.SolrCore.getNewIndexDir(SolrCore.java:295)
   [junit4]   2> 	at org.apache.solr.core.SolrCore.initIndex(SolrCore.java:510)
   [junit4]   2> 	at org.apache.solr.core.SolrCore.<init>(SolrCore.java:762)
   [junit4]   2> 	at org.apache.solr.core.SolrCore.<init>(SolrCore.java:659)
   [junit4]   2> 	at org.apache.solr.core.CoreContainer.create(CoreContainer.java:817)
   [junit4]   2> 	at org.apache.solr.core.CoreContainer.access$000(CoreContainer.java:87)
   [junit4]   2> 	at org.apache.solr.core.CoreContainer$1.call(CoreContainer.java:467)
   [junit4]   2> 	at org.apache.solr.core.CoreContainer$1.call(CoreContainer.java:458)
   [junit4]   2> 	at java.util.concurrent.FutureTask.run(FutureTask.java:266)
   [junit4]   2> 	at org.apache.solr.common.util.ExecutorUtil$MDCAwareThreadPoolExecutor$1.run(ExecutorUtil.java:232)
   [junit4]   2> 	at java.util.concurrent.ThreadPoolExecutor.runWorker(ThreadPoolExecutor.java:1142)
   [junit4]   2> 	at java.util.concurrent.ThreadPoolExecutor$Worker.run(ThreadPoolExecutor.java:617)
   [junit4]   2> 	at java.lang.Thread.run(Thread.java:745)
   [junit4]   2> 
   [junit4]   2> org.apache.solr.common.util.ObjectReleaseTracker$ObjectTrackerException
   [junit4]   2> 	at org.apache.solr.common.util.ObjectReleaseTracker.track(ObjectReleaseTracker.java:43)
   [junit4]   2> 	at org.apache.solr.core.SolrCore.<init>(SolrCore.java:856)
   [junit4]   2> 	at org.apache.solr.core.SolrCore.<init>(SolrCore.java:659)
   [junit4]   2> 	at org.apache.solr.core.CoreContainer.create(CoreContainer.java:817)
   [junit4]   2> 	at org.apache.solr.core.CoreContainer.access$000(CoreContainer.java:87)
   [junit4]   2> 	at org.apache.solr.core.CoreContainer$1.call(CoreContainer.java:467)
   [junit4]   2> 	at org.apache.solr.core.CoreContainer$1.call(CoreContainer.java:458)
   [junit4]   2> 	at java.util.concurrent.FutureTask.run(FutureTask.java:266)
   [junit4]   2> 	at org.apache.solr.common.util.ExecutorUtil$MDCAwareThreadPoolExecutor$1.run(ExecutorUtil.java:232)
   [junit4]   2> 	at java.util.concurrent.ThreadPoolExecutor.runWorker(ThreadPoolExecutor.java:1142)
   [junit4]   2> 	at java.util.concurrent.ThreadPoolExecutor$Worker.run(ThreadPoolExecutor.java:617)
   [junit4]   2> 	at java.lang.Thread.run(Thread.java:745)
   [junit4]   2> 
   [junit4]   2> 1483373 INFO  (Thread-3115) [n:127.0.0.1:37620_c_q%2Fi c:collection1 s:shard1 r:core_node4 x:collection1] o.a.s.c.CachingDirectoryFactory Closing MockDirectoryFactory - 2 directories currently being tracked
   [junit4]   2> 1483373 INFO  (Thread-3115) [n:127.0.0.1:37620_c_q%2Fi c:collection1 s:shard1 r:core_node4 x:collection1] o.a.s.c.CachingDirectoryFactory looking to close /home/jenkins/workspace/Lucene-Solr-5.x-Linux/solr/build/solr-core/test/J2/temp/solr.cloud.MigrateRouteKeyTest_FC43CF849DD0E08-001/shard-4-001/cores/collection1/data [CachedDir<<refCount=0;path=/home/jenkins/workspace/Lucene-Solr-5.x-Linux/solr/build/solr-core/test/J2/temp/solr.cloud.MigrateRouteKeyTest_FC43CF849DD0E08-001/shard-4-001/cores/collection1/data;done=false>>]
   [junit4]   2> 1483373 INFO  (Thread-3115) [n:127.0.0.1:37620_c_q%2Fi c:collection1 s:shard1 r:core_node4 x:collection1] o.a.s.c.CachingDirectoryFactory Closing directory: /home/jenkins/workspace/Lucene-Solr-5.x-Linux/solr/build/solr-core/test/J2/temp/solr.cloud.MigrateRouteKeyTest_FC43CF849DD0E08-001/shard-4-001/cores/collection1/data
   [junit4]   2> 1483373 INFO  (Thread-3115) [n:127.0.0.1:37620_c_q%2Fi c:collection1 s:shard1 r:core_node4 x:collection1] o.a.s.c.CachingDirectoryFactory looking to close /home/jenkins/workspace/Lucene-Solr-5.x-Linux/solr/build/solr-core/test/J2/temp/solr.cloud.MigrateRouteKeyTest_FC43CF849DD0E08-001/shard-4-001/cores/collection1/data/index [CachedDir<<refCount=0;path=/home/jenkins/workspace/Lucene-Solr-5.x-Linux/solr/build/solr-core/test/J2/temp/solr.cloud.MigrateRouteKeyTest_FC43CF849DD0E08-001/shard-4-001/cores/collection1/data/index;done=false>>]
   [junit4]   2> 1483374 INFO  (Thread-3115) [n:127.0.0.1:37620_c_q%2Fi c:collection1 s:shard1 r:core_node4 x:collection1] o.a.s.c.CachingDirectoryFactory Closing directory: /home/jenkins/workspace/Lucene-Solr-5.x-Linux/solr/build/solr-core/test/J2/temp/solr.cloud.MigrateRouteKeyTest_FC43CF849DD0E08-001/shard-4-001/cores/collection1/data/index
   [junit4]   2> Jan 08, 2016 7:25:34 PM com.carrotsearch.randomizedtesting.ThreadLeakControl checkThreadLeaks
   [junit4]   2> WARNING: Will linger awaiting termination of 1 leaked thread(s).
   [junit4]   2> NOTE: test params are: codec=Lucene54, sim=RandomSimilarityProvider(queryNorm=false,coord=no): {}, locale=ru, timezone=Europe/Warsaw
   [junit4]   2> NOTE: Linux 3.19.0-42-generic amd64/Oracle Corporation 1.8.0_66 (64-bit)/cpus=12,threads=1,free=226618952,total=518979584
   [junit4]   2> NOTE: All tests run in this JVM: [DocValuesMultiTest, TestCSVResponseWriter, FieldMutatingUpdateProcessorTest, RegexBoostProcessorTest, SuggesterTest, BasicDistributedZk2Test, TestFieldSortValues, RecoveryZkTest, TestFileDictionaryLookup, PKIAuthenticationIntegrationTest, DocExpirationUpdateProcessorFactoryTest, TestZkChroot, TestTolerantSearch, TestSort, NoCacheHeaderTest, TestFieldTypeCollectionResource, TestReversedWildcardFilterFactory, TestJmxMonitoredMap, TestConfigSetsAPIZkFailure, DistributedDebugComponentTest, DistribDocExpirationUpdateProcessorTest, DirectSolrConnectionTest, HdfsRecoveryZkTest, TestFuzzyAnalyzedSuggestions, TestManagedSchemaFieldResource, TestSolr4Spatial2, SimpleCollectionCreateDeleteTest, TestPerFieldSimilarity, TestOrdValues, TestSuggestSpellingConverter, TestConfigReload, ConcurrentDeleteAndCreateCollectionTest, OverriddenZkACLAndCredentialsProvidersTest, TestConfigSetImmutable, BitVectorTest, TestRestManager, AddSchemaFieldsUpdateProcessorFactoryTest, RemoteQueryErrorTest, TestSortingResponseWriter, CurrencyFieldXmlFileTest, DebugComponentTest, DateMathParserTest, DistributedVersionInfoTest, TestStressRecovery, TestExactStatsCache, TestSearcherReuse, TestRandomForceMergePolicy, UpdateParamsTest, StatsComponentTest, BadIndexSchemaTest, TestXIncludeConfig, TestSearchPerf, TestStressReorder, TestExpandComponent, TestReload, UnloadDistributedZkTest, TestCoreDiscovery, TestRuleBasedAuthorizationPlugin, TestRequestStatusCollectionAPI, BlockCacheTest, CursorMarkTest, FieldAnalysisRequestHandlerTest, ConjunctionSolrSpellCheckerTest, JavabinLoaderTest, TestShardHandlerFactory, TestGroupingSearch, HdfsCollectionsAPIDistributedZkTest, TestTestInjection, TestSchemaVersionResource, TestOverriddenPrefixQueryForCustomFieldType, ShowFileRequestHandlerTest, SliceStateTest, TestSchemaNameResource, DirectUpdateHandlerOptimizeTest, DeleteReplicaTest, TestDefaultStatsCache, TestCollapseQParserPlugin, CachingDirectoryFactoryTest, DistanceUnitsTest, HdfsBasicDistributedZkTest, SolrCoreCheckLockOnStartupTest, TestCharFilters, SampleTest, CircularListTest, RollingRestartTest, TestAuthenticationFramework, PrimitiveFieldTypeTest, TestExtendedDismaxParser, ShardSplitTest, ClusterStateTest, TestElisionMultitermQuery, HighlighterConfigTest, ConfigSetsAPITest, DeleteShardTest, DistribJoinFromCollectionTest, MigrateRouteKeyTest]
   [junit4]   2> NOTE: reproduce with: ant test  -Dtestcase=MigrateRouteKeyTest -Dtests.seed=FC43CF849DD0E08 -Dtests.multiplier=3 -Dtests.slow=true -Dtests.locale=ru -Dtests.timezone=Europe/Warsaw -Dtests.asserts=true -Dtests.file.encoding=ISO-8859-1
   [junit4] ERROR   0.00s J2 | MigrateRouteKeyTest (suite) <<<
   [junit4]    > Throwable #1: java.lang.AssertionError: ObjectTracker found 3 object(s) that were not released!!! [MockDirectoryWrapper, MockDirectoryWrapper, SolrCore]
   [junit4]    > 	at __randomizedtesting.SeedInfo.seed([FC43CF849DD0E08]:0)
   [junit4]    > 	at org.apache.solr.SolrTestCaseJ4.afterClass(SolrTestCaseJ4.java:228)
   [junit4]    > 	at java.lang.Thread.run(Thread.java:745)
   [junit4] Completed [434/563 (4!)] on J2 in 66.59s, 1 test, 1 failure <<< FAILURES!

[...truncated 418 lines...]
BUILD FAILED
/home/jenkins/workspace/Lucene-Solr-5.x-Linux/build.xml:794: The following error occurred while executing this line:
/home/jenkins/workspace/Lucene-Solr-5.x-Linux/build.xml:738: The following error occurred while executing this line:
/home/jenkins/workspace/Lucene-Solr-5.x-Linux/build.xml:59: The following error occurred while executing this line:
/home/jenkins/workspace/Lucene-Solr-5.x-Linux/solr/build.xml:233: The following error occurred while executing this line:
/home/jenkins/workspace/Lucene-Solr-5.x-Linux/solr/common-build.xml:526: The following error occurred while executing this line:
/home/jenkins/workspace/Lucene-Solr-5.x-Linux/lucene/common-build.xml:1444: The following error occurred while executing this line:
/home/jenkins/workspace/Lucene-Solr-5.x-Linux/lucene/common-build.xml:1000: There were test failures: 563 suites (7 ignored), 2236 tests, 1 suite-level error, 1 error, 3 failures, 83 ignored (39 assumptions) [seed: FC43CF849DD0E08]

Total time: 53 minutes 25 seconds
Build step 'Invoke Ant' marked build as failure
Archiving artifacts
[WARNINGS] Skipping publisher since build result is FAILURE
Recording test results
Email was triggered for: Failure - Any
Sending email for trigger: Failure - Any



Mime
View raw message