lucene-dev mailing list archives

Site index · List index
Message view « Date » · « Thread »
Top « Date » · « Thread »
From Policeman Jenkins Server <jenk...@thetaphi.de>
Subject [JENKINS] Lucene-Solr-trunk-Solaris (64bit/jdk1.8.0) - Build # 326 - Failure!
Date Sun, 10 Jan 2016 21:18:44 GMT
Build: http://jenkins.thetaphi.de/job/Lucene-Solr-trunk-Solaris/326/
Java: 64bit/jdk1.8.0 -XX:+UseCompressedOops -XX:+UseG1GC

1 tests failed.
FAILED:  org.apache.solr.cloud.BasicDistributedZkTest.test

Error Message:
IOException occured when talking to server at: http://127.0.0.1:59232/collection1

Stack Trace:
org.apache.solr.client.solrj.SolrServerException: IOException occured when talking to server at: http://127.0.0.1:59232/collection1
	at __randomizedtesting.SeedInfo.seed([6183C483719D3848:E9D7FB59DF6155B0]:0)
	at org.apache.solr.client.solrj.impl.HttpSolrClient.executeMethod(HttpSolrClient.java:588)
	at org.apache.solr.client.solrj.impl.HttpSolrClient.request(HttpSolrClient.java:240)
	at org.apache.solr.client.solrj.impl.HttpSolrClient.request(HttpSolrClient.java:229)
	at org.apache.solr.client.solrj.SolrClient.request(SolrClient.java:1220)
	at org.apache.solr.cloud.BasicDistributedZkTest.testNumberOfCommitsWithCommitAfterAdd(BasicDistributedZkTest.java:727)
	at org.apache.solr.cloud.BasicDistributedZkTest.test(BasicDistributedZkTest.java:362)
	at sun.reflect.NativeMethodAccessorImpl.invoke0(Native Method)
	at sun.reflect.NativeMethodAccessorImpl.invoke(NativeMethodAccessorImpl.java:62)
	at sun.reflect.DelegatingMethodAccessorImpl.invoke(DelegatingMethodAccessorImpl.java:43)
	at java.lang.reflect.Method.invoke(Method.java:497)
	at com.carrotsearch.randomizedtesting.RandomizedRunner.invoke(RandomizedRunner.java:1764)
	at com.carrotsearch.randomizedtesting.RandomizedRunner$8.evaluate(RandomizedRunner.java:871)
	at com.carrotsearch.randomizedtesting.RandomizedRunner$9.evaluate(RandomizedRunner.java:907)
	at com.carrotsearch.randomizedtesting.RandomizedRunner$10.evaluate(RandomizedRunner.java:921)
	at org.apache.solr.BaseDistributedSearchTestCase$ShardsRepeatRule$ShardsFixedStatement.callStatement(BaseDistributedSearchTestCase.java:965)
	at org.apache.solr.BaseDistributedSearchTestCase$ShardsRepeatRule$ShardsStatement.evaluate(BaseDistributedSearchTestCase.java:940)
	at com.carrotsearch.randomizedtesting.rules.SystemPropertiesRestoreRule$1.evaluate(SystemPropertiesRestoreRule.java:57)
	at org.apache.lucene.util.TestRuleSetupTeardownChained$1.evaluate(TestRuleSetupTeardownChained.java:50)
	at org.apache.lucene.util.AbstractBeforeAfterRule$1.evaluate(AbstractBeforeAfterRule.java:46)
	at org.apache.lucene.util.TestRuleThreadAndTestName$1.evaluate(TestRuleThreadAndTestName.java:49)
	at org.apache.lucene.util.TestRuleIgnoreAfterMaxFailures$1.evaluate(TestRuleIgnoreAfterMaxFailures.java:65)
	at org.apache.lucene.util.TestRuleMarkFailure$1.evaluate(TestRuleMarkFailure.java:48)
	at com.carrotsearch.randomizedtesting.rules.StatementAdapter.evaluate(StatementAdapter.java:36)
	at com.carrotsearch.randomizedtesting.ThreadLeakControl$StatementRunner.run(ThreadLeakControl.java:367)
	at com.carrotsearch.randomizedtesting.ThreadLeakControl.forkTimeoutingTask(ThreadLeakControl.java:809)
	at com.carrotsearch.randomizedtesting.ThreadLeakControl$3.evaluate(ThreadLeakControl.java:460)
	at com.carrotsearch.randomizedtesting.RandomizedRunner.runSingleTest(RandomizedRunner.java:880)
	at com.carrotsearch.randomizedtesting.RandomizedRunner$5.evaluate(RandomizedRunner.java:781)
	at com.carrotsearch.randomizedtesting.RandomizedRunner$6.evaluate(RandomizedRunner.java:816)
	at com.carrotsearch.randomizedtesting.RandomizedRunner$7.evaluate(RandomizedRunner.java:827)
	at com.carrotsearch.randomizedtesting.rules.StatementAdapter.evaluate(StatementAdapter.java:36)
	at com.carrotsearch.randomizedtesting.rules.SystemPropertiesRestoreRule$1.evaluate(SystemPropertiesRestoreRule.java:57)
	at org.apache.lucene.util.AbstractBeforeAfterRule$1.evaluate(AbstractBeforeAfterRule.java:46)
	at com.carrotsearch.randomizedtesting.rules.StatementAdapter.evaluate(StatementAdapter.java:36)
	at org.apache.lucene.util.TestRuleStoreClassName$1.evaluate(TestRuleStoreClassName.java:42)
	at com.carrotsearch.randomizedtesting.rules.NoShadowingOrOverridesOnMethodsRule$1.evaluate(NoShadowingOrOverridesOnMethodsRule.java:40)
	at com.carrotsearch.randomizedtesting.rules.NoShadowingOrOverridesOnMethodsRule$1.evaluate(NoShadowingOrOverridesOnMethodsRule.java:40)
	at com.carrotsearch.randomizedtesting.rules.StatementAdapter.evaluate(StatementAdapter.java:36)
	at com.carrotsearch.randomizedtesting.rules.StatementAdapter.evaluate(StatementAdapter.java:36)
	at com.carrotsearch.randomizedtesting.rules.StatementAdapter.evaluate(StatementAdapter.java:36)
	at org.apache.lucene.util.TestRuleAssertionsRequired$1.evaluate(TestRuleAssertionsRequired.java:54)
	at org.apache.lucene.util.TestRuleMarkFailure$1.evaluate(TestRuleMarkFailure.java:48)
	at org.apache.lucene.util.TestRuleIgnoreAfterMaxFailures$1.evaluate(TestRuleIgnoreAfterMaxFailures.java:65)
	at org.apache.lucene.util.TestRuleIgnoreTestSuites$1.evaluate(TestRuleIgnoreTestSuites.java:55)
	at com.carrotsearch.randomizedtesting.rules.StatementAdapter.evaluate(StatementAdapter.java:36)
	at com.carrotsearch.randomizedtesting.ThreadLeakControl$StatementRunner.run(ThreadLeakControl.java:367)
	at java.lang.Thread.run(Thread.java:745)
Caused by: org.apache.http.NoHttpResponseException: 127.0.0.1:59232 failed to respond
	at org.apache.http.impl.conn.DefaultHttpResponseParser.parseHead(DefaultHttpResponseParser.java:143)
	at org.apache.http.impl.conn.DefaultHttpResponseParser.parseHead(DefaultHttpResponseParser.java:57)
	at org.apache.http.impl.io.AbstractMessageParser.parse(AbstractMessageParser.java:261)
	at org.apache.http.impl.AbstractHttpClientConnection.receiveResponseHeader(AbstractHttpClientConnection.java:283)
	at org.apache.http.impl.conn.DefaultClientConnection.receiveResponseHeader(DefaultClientConnection.java:251)
	at org.apache.http.impl.conn.ManagedClientConnectionImpl.receiveResponseHeader(ManagedClientConnectionImpl.java:197)
	at org.apache.http.protocol.HttpRequestExecutor.doReceiveResponse(HttpRequestExecutor.java:272)
	at org.apache.http.protocol.HttpRequestExecutor.execute(HttpRequestExecutor.java:124)
	at org.apache.http.impl.client.DefaultRequestDirector.tryExecute(DefaultRequestDirector.java:685)
	at org.apache.http.impl.client.DefaultRequestDirector.execute(DefaultRequestDirector.java:487)
	at org.apache.http.impl.client.AbstractHttpClient.doExecute(AbstractHttpClient.java:882)
	at org.apache.http.impl.client.CloseableHttpClient.execute(CloseableHttpClient.java:82)
	at org.apache.http.impl.client.CloseableHttpClient.execute(CloseableHttpClient.java:107)
	at org.apache.http.impl.client.CloseableHttpClient.execute(CloseableHttpClient.java:55)
	at org.apache.solr.client.solrj.impl.HttpSolrClient.executeMethod(HttpSolrClient.java:479)
	... 46 more




Build Log:
[...truncated 9490 lines...]
   [junit4] Suite: org.apache.solr.cloud.BasicDistributedZkTest
   [junit4]   2> Creating dataDir: /export/home/jenkins/workspace/Lucene-Solr-trunk-Solaris/solr/build/solr-core/test/J0/temp/solr.cloud.BasicDistributedZkTest_6183C483719D3848-001/init-core-data-001
   [junit4]   2> 72581 INFO  (SUITE-BasicDistributedZkTest-seed#[6183C483719D3848]-worker) [    ] o.a.s.BaseDistributedSearchTestCase Setting hostContext system property: /
   [junit4]   2> 72594 INFO  (TEST-BasicDistributedZkTest.test-seed#[6183C483719D3848]) [    ] o.a.s.c.ZkTestServer STARTING ZK TEST SERVER
   [junit4]   2> 72594 INFO  (Thread-134) [    ] o.a.s.c.ZkTestServer client port:0.0.0.0/0.0.0.0:0
   [junit4]   2> 72594 INFO  (Thread-134) [    ] o.a.s.c.ZkTestServer Starting server
   [junit4]   2> 72695 INFO  (TEST-BasicDistributedZkTest.test-seed#[6183C483719D3848]) [    ] o.a.s.c.ZkTestServer start zk server on port:57868
   [junit4]   2> 72697 INFO  (TEST-BasicDistributedZkTest.test-seed#[6183C483719D3848]) [    ] o.a.s.c.c.SolrZkClient Using default ZkCredentialsProvider
   [junit4]   2> 72697 INFO  (TEST-BasicDistributedZkTest.test-seed#[6183C483719D3848]) [    ] o.a.s.c.c.ConnectionManager Waiting for client to connect to ZooKeeper
   [junit4]   2> 72728 INFO  (zkCallback-65-thread-1) [    ] o.a.s.c.c.ConnectionManager Watcher org.apache.solr.common.cloud.ConnectionManager@a6b8ebc name:ZooKeeperConnection Watcher:127.0.0.1:57868 got event WatchedEvent state:SyncConnected type:None path:null path:null type:None
   [junit4]   2> 72729 INFO  (TEST-BasicDistributedZkTest.test-seed#[6183C483719D3848]) [    ] o.a.s.c.c.ConnectionManager Client is connected to ZooKeeper
   [junit4]   2> 72729 INFO  (TEST-BasicDistributedZkTest.test-seed#[6183C483719D3848]) [    ] o.a.s.c.c.SolrZkClient Using default ZkACLProvider
   [junit4]   2> 72729 INFO  (TEST-BasicDistributedZkTest.test-seed#[6183C483719D3848]) [    ] o.a.s.c.c.SolrZkClient makePath: /solr
   [junit4]   2> 72747 INFO  (TEST-BasicDistributedZkTest.test-seed#[6183C483719D3848]) [    ] o.a.s.c.c.SolrZkClient Using default ZkCredentialsProvider
   [junit4]   2> 72747 INFO  (TEST-BasicDistributedZkTest.test-seed#[6183C483719D3848]) [    ] o.a.s.c.c.ConnectionManager Waiting for client to connect to ZooKeeper
   [junit4]   2> 72760 INFO  (zkCallback-66-thread-1) [    ] o.a.s.c.c.ConnectionManager Watcher org.apache.solr.common.cloud.ConnectionManager@48306db0 name:ZooKeeperConnection Watcher:127.0.0.1:57868/solr got event WatchedEvent state:SyncConnected type:None path:null path:null type:None
   [junit4]   2> 72760 INFO  (TEST-BasicDistributedZkTest.test-seed#[6183C483719D3848]) [    ] o.a.s.c.c.ConnectionManager Client is connected to ZooKeeper
   [junit4]   2> 72760 INFO  (TEST-BasicDistributedZkTest.test-seed#[6183C483719D3848]) [    ] o.a.s.c.c.SolrZkClient Using default ZkACLProvider
   [junit4]   2> 72761 INFO  (TEST-BasicDistributedZkTest.test-seed#[6183C483719D3848]) [    ] o.a.s.c.c.SolrZkClient makePath: /collections/collection1
   [junit4]   2> 72766 INFO  (TEST-BasicDistributedZkTest.test-seed#[6183C483719D3848]) [    ] o.a.s.c.c.SolrZkClient makePath: /collections/collection1/shards
   [junit4]   2> 72771 INFO  (TEST-BasicDistributedZkTest.test-seed#[6183C483719D3848]) [    ] o.a.s.c.c.SolrZkClient makePath: /collections/control_collection
   [junit4]   2> 72775 INFO  (TEST-BasicDistributedZkTest.test-seed#[6183C483719D3848]) [    ] o.a.s.c.c.SolrZkClient makePath: /collections/control_collection/shards
   [junit4]   2> 72777 INFO  (TEST-BasicDistributedZkTest.test-seed#[6183C483719D3848]) [    ] o.a.s.c.AbstractZkTestCase put /export/home/jenkins/workspace/Lucene-Solr-trunk-Solaris/solr/core/src/test-files/solr/collection1/conf/solrconfig-tlog.xml to /configs/conf1/solrconfig.xml
   [junit4]   2> 72781 INFO  (TEST-BasicDistributedZkTest.test-seed#[6183C483719D3848]) [    ] o.a.s.c.c.SolrZkClient makePath: /configs/conf1/solrconfig.xml
   [junit4]   2> 72784 INFO  (TEST-BasicDistributedZkTest.test-seed#[6183C483719D3848]) [    ] o.a.s.c.AbstractZkTestCase put /export/home/jenkins/workspace/Lucene-Solr-trunk-Solaris/solr/core/src/test-files/solr/collection1/conf/schema.xml to /configs/conf1/schema.xml
   [junit4]   2> 72784 INFO  (TEST-BasicDistributedZkTest.test-seed#[6183C483719D3848]) [    ] o.a.s.c.c.SolrZkClient makePath: /configs/conf1/schema.xml
   [junit4]   2> 72787 INFO  (TEST-BasicDistributedZkTest.test-seed#[6183C483719D3848]) [    ] o.a.s.c.AbstractZkTestCase put /export/home/jenkins/workspace/Lucene-Solr-trunk-Solaris/solr/core/src/test-files/solr/collection1/conf/solrconfig.snippet.randomindexconfig.xml to /configs/conf1/solrconfig.snippet.randomindexconfig.xml
   [junit4]   2> 72787 INFO  (TEST-BasicDistributedZkTest.test-seed#[6183C483719D3848]) [    ] o.a.s.c.c.SolrZkClient makePath: /configs/conf1/solrconfig.snippet.randomindexconfig.xml
   [junit4]   2> 72789 INFO  (TEST-BasicDistributedZkTest.test-seed#[6183C483719D3848]) [    ] o.a.s.c.AbstractZkTestCase put /export/home/jenkins/workspace/Lucene-Solr-trunk-Solaris/solr/core/src/test-files/solr/collection1/conf/stopwords.txt to /configs/conf1/stopwords.txt
   [junit4]   2> 72789 INFO  (TEST-BasicDistributedZkTest.test-seed#[6183C483719D3848]) [    ] o.a.s.c.c.SolrZkClient makePath: /configs/conf1/stopwords.txt
   [junit4]   2> 72791 INFO  (TEST-BasicDistributedZkTest.test-seed#[6183C483719D3848]) [    ] o.a.s.c.AbstractZkTestCase put /export/home/jenkins/workspace/Lucene-Solr-trunk-Solaris/solr/core/src/test-files/solr/collection1/conf/protwords.txt to /configs/conf1/protwords.txt
   [junit4]   2> 72791 INFO  (TEST-BasicDistributedZkTest.test-seed#[6183C483719D3848]) [    ] o.a.s.c.c.SolrZkClient makePath: /configs/conf1/protwords.txt
   [junit4]   2> 72793 INFO  (TEST-BasicDistributedZkTest.test-seed#[6183C483719D3848]) [    ] o.a.s.c.AbstractZkTestCase put /export/home/jenkins/workspace/Lucene-Solr-trunk-Solaris/solr/core/src/test-files/solr/collection1/conf/currency.xml to /configs/conf1/currency.xml
   [junit4]   2> 72793 INFO  (TEST-BasicDistributedZkTest.test-seed#[6183C483719D3848]) [    ] o.a.s.c.c.SolrZkClient makePath: /configs/conf1/currency.xml
   [junit4]   2> 72795 INFO  (TEST-BasicDistributedZkTest.test-seed#[6183C483719D3848]) [    ] o.a.s.c.AbstractZkTestCase put /export/home/jenkins/workspace/Lucene-Solr-trunk-Solaris/solr/core/src/test-files/solr/collection1/conf/enumsConfig.xml to /configs/conf1/enumsConfig.xml
   [junit4]   2> 72795 INFO  (TEST-BasicDistributedZkTest.test-seed#[6183C483719D3848]) [    ] o.a.s.c.c.SolrZkClient makePath: /configs/conf1/enumsConfig.xml
   [junit4]   2> 72797 INFO  (TEST-BasicDistributedZkTest.test-seed#[6183C483719D3848]) [    ] o.a.s.c.AbstractZkTestCase put /export/home/jenkins/workspace/Lucene-Solr-trunk-Solaris/solr/core/src/test-files/solr/collection1/conf/open-exchange-rates.json to /configs/conf1/open-exchange-rates.json
   [junit4]   2> 72797 INFO  (TEST-BasicDistributedZkTest.test-seed#[6183C483719D3848]) [    ] o.a.s.c.c.SolrZkClient makePath: /configs/conf1/open-exchange-rates.json
   [junit4]   2> 72799 INFO  (TEST-BasicDistributedZkTest.test-seed#[6183C483719D3848]) [    ] o.a.s.c.AbstractZkTestCase put /export/home/jenkins/workspace/Lucene-Solr-trunk-Solaris/solr/core/src/test-files/solr/collection1/conf/mapping-ISOLatin1Accent.txt to /configs/conf1/mapping-ISOLatin1Accent.txt
   [junit4]   2> 72800 INFO  (TEST-BasicDistributedZkTest.test-seed#[6183C483719D3848]) [    ] o.a.s.c.c.SolrZkClient makePath: /configs/conf1/mapping-ISOLatin1Accent.txt
   [junit4]   2> 72801 INFO  (TEST-BasicDistributedZkTest.test-seed#[6183C483719D3848]) [    ] o.a.s.c.AbstractZkTestCase put /export/home/jenkins/workspace/Lucene-Solr-trunk-Solaris/solr/core/src/test-files/solr/collection1/conf/old_synonyms.txt to /configs/conf1/old_synonyms.txt
   [junit4]   2> 72802 INFO  (TEST-BasicDistributedZkTest.test-seed#[6183C483719D3848]) [    ] o.a.s.c.c.SolrZkClient makePath: /configs/conf1/old_synonyms.txt
   [junit4]   2> 72803 INFO  (TEST-BasicDistributedZkTest.test-seed#[6183C483719D3848]) [    ] o.a.s.c.AbstractZkTestCase put /export/home/jenkins/workspace/Lucene-Solr-trunk-Solaris/solr/core/src/test-files/solr/collection1/conf/synonyms.txt to /configs/conf1/synonyms.txt
   [junit4]   2> 72803 INFO  (TEST-BasicDistributedZkTest.test-seed#[6183C483719D3848]) [    ] o.a.s.c.c.SolrZkClient makePath: /configs/conf1/synonyms.txt
   [junit4]   2> 73664 INFO  (TEST-BasicDistributedZkTest.test-seed#[6183C483719D3848]) [    ] o.a.s.SolrTestCaseJ4 Writing core.properties file to /export/home/jenkins/workspace/Lucene-Solr-trunk-Solaris/solr/build/solr-core/test/J0/temp/solr.cloud.BasicDistributedZkTest_6183C483719D3848-001/control-001/cores/collection1
   [junit4]   2> 73667 INFO  (TEST-BasicDistributedZkTest.test-seed#[6183C483719D3848]) [    ] o.e.j.s.Server jetty-9.2.13.v20150730
   [junit4]   2> 73672 INFO  (TEST-BasicDistributedZkTest.test-seed#[6183C483719D3848]) [    ] o.e.j.s.h.ContextHandler Started o.e.j.s.ServletContextHandler@450ed3e9{/,null,AVAILABLE}
   [junit4]   2> 73679 INFO  (TEST-BasicDistributedZkTest.test-seed#[6183C483719D3848]) [    ] o.e.j.s.ServerConnector Started ServerConnector@77ecfaaf{HTTP/1.1}{127.0.0.1:40027}
   [junit4]   2> 73679 INFO  (TEST-BasicDistributedZkTest.test-seed#[6183C483719D3848]) [    ] o.e.j.s.Server Started @76673ms
   [junit4]   2> 73679 INFO  (TEST-BasicDistributedZkTest.test-seed#[6183C483719D3848]) [    ] o.a.s.c.s.e.JettySolrRunner Jetty properties: {solr.data.dir=/export/home/jenkins/workspace/Lucene-Solr-trunk-Solaris/solr/build/solr-core/test/J0/temp/solr.cloud.BasicDistributedZkTest_6183C483719D3848-001/tempDir-001/control/data, hostContext=/, hostPort=40027, coreRootDirectory=/export/home/jenkins/workspace/Lucene-Solr-trunk-Solaris/solr/build/solr-core/test/J0/../../../../../../../../../../export/home/jenkins/workspace/Lucene-Solr-trunk-Solaris/solr/build/solr-core/test/J0/temp/solr.cloud.BasicDistributedZkTest_6183C483719D3848-001/control-001/cores}
   [junit4]   2> 73680 INFO  (TEST-BasicDistributedZkTest.test-seed#[6183C483719D3848]) [    ] o.a.s.s.SolrDispatchFilter SolrDispatchFilter.init(): sun.misc.Launcher$AppClassLoader@659e0bfd
   [junit4]   2> 73680 INFO  (TEST-BasicDistributedZkTest.test-seed#[6183C483719D3848]) [    ] o.a.s.c.SolrResourceLoader new SolrResourceLoader for directory: '/export/home/jenkins/workspace/Lucene-Solr-trunk-Solaris/solr/build/solr-core/test/J0/temp/solr.cloud.BasicDistributedZkTest_6183C483719D3848-001/control-001'
   [junit4]   2> 73680 INFO  (TEST-BasicDistributedZkTest.test-seed#[6183C483719D3848]) [    ] o.a.s.c.SolrResourceLoader JNDI not configured for solr (NoInitialContextEx)
   [junit4]   2> 73680 INFO  (TEST-BasicDistributedZkTest.test-seed#[6183C483719D3848]) [    ] o.a.s.c.SolrResourceLoader solr home defaulted to 'solr/' (could not find system property or JNDI)
   [junit4]   2> 73680 INFO  (TEST-BasicDistributedZkTest.test-seed#[6183C483719D3848]) [    ] o.a.s.c.c.SolrZkClient Using default ZkCredentialsProvider
   [junit4]   2> 73681 INFO  (TEST-BasicDistributedZkTest.test-seed#[6183C483719D3848]) [    ] o.a.s.c.c.ConnectionManager Waiting for client to connect to ZooKeeper
   [junit4]   2> 73688 INFO  (zkCallback-67-thread-1) [    ] o.a.s.c.c.ConnectionManager Watcher org.apache.solr.common.cloud.ConnectionManager@3c2e8849 name:ZooKeeperConnection Watcher:127.0.0.1:57868/solr got event WatchedEvent state:SyncConnected type:None path:null path:null type:None
   [junit4]   2> 73689 INFO  (TEST-BasicDistributedZkTest.test-seed#[6183C483719D3848]) [    ] o.a.s.c.c.ConnectionManager Client is connected to ZooKeeper
   [junit4]   2> 73689 INFO  (TEST-BasicDistributedZkTest.test-seed#[6183C483719D3848]) [    ] o.a.s.c.c.SolrZkClient Using default ZkACLProvider
   [junit4]   2> 73692 INFO  (TEST-BasicDistributedZkTest.test-seed#[6183C483719D3848]) [    ] o.a.s.s.SolrDispatchFilter Loading solr.xml from SolrHome (not found in ZooKeeper)
   [junit4]   2> 73692 INFO  (TEST-BasicDistributedZkTest.test-seed#[6183C483719D3848]) [    ] o.a.s.c.SolrXmlConfig Loading container configuration from /export/home/jenkins/workspace/Lucene-Solr-trunk-Solaris/solr/build/solr-core/test/J0/temp/solr.cloud.BasicDistributedZkTest_6183C483719D3848-001/control-001/solr.xml
   [junit4]   2> 73699 INFO  (TEST-BasicDistributedZkTest.test-seed#[6183C483719D3848]) [    ] o.a.s.c.CorePropertiesLocator Config-defined core root directory: /export/home/jenkins/workspace/Lucene-Solr-trunk-Solaris/solr/build/solr-core/test/J0/../../../../../../../../../../export/home/jenkins/workspace/Lucene-Solr-trunk-Solaris/solr/build/solr-core/test/J0/temp/solr.cloud.BasicDistributedZkTest_6183C483719D3848-001/control-001/cores
   [junit4]   2> 73699 INFO  (TEST-BasicDistributedZkTest.test-seed#[6183C483719D3848]) [    ] o.a.s.c.CoreContainer New CoreContainer 317096339
   [junit4]   2> 73699 INFO  (TEST-BasicDistributedZkTest.test-seed#[6183C483719D3848]) [    ] o.a.s.c.CoreContainer Loading cores into CoreContainer [instanceDir=/export/home/jenkins/workspace/Lucene-Solr-trunk-Solaris/solr/build/solr-core/test/J0/temp/solr.cloud.BasicDistributedZkTest_6183C483719D3848-001/control-001]
   [junit4]   2> 73699 WARN  (TEST-BasicDistributedZkTest.test-seed#[6183C483719D3848]) [    ] o.a.s.c.CoreContainer Couldn't add files from /export/home/jenkins/workspace/Lucene-Solr-trunk-Solaris/solr/build/solr-core/test/J0/temp/solr.cloud.BasicDistributedZkTest_6183C483719D3848-001/control-001/lib to classpath: /export/home/jenkins/workspace/Lucene-Solr-trunk-Solaris/solr/build/solr-core/test/J0/temp/solr.cloud.BasicDistributedZkTest_6183C483719D3848-001/control-001/lib
   [junit4]   2> 73700 INFO  (TEST-BasicDistributedZkTest.test-seed#[6183C483719D3848]) [    ] o.a.s.h.c.HttpShardHandlerFactory created with socketTimeout : 90000,urlScheme : ,connTimeout : 15000,maxConnectionsPerHost : 20,maxConnections : 10000,corePoolSize : 0,maximumPoolSize : 2147483647,maxThreadIdleTime : 5,sizeOfQueue : -1,fairnessPolicy : false,useRetries : false,
   [junit4]   2> 73701 INFO  (TEST-BasicDistributedZkTest.test-seed#[6183C483719D3848]) [    ] o.a.s.u.UpdateShardHandler Creating UpdateShardHandler HTTP client with params: socketTimeout=340000&connTimeout=45000&retry=true
   [junit4]   2> 73702 INFO  (TEST-BasicDistributedZkTest.test-seed#[6183C483719D3848]) [    ] o.a.s.l.LogWatcher SLF4J impl is org.slf4j.impl.Log4jLoggerFactory
   [junit4]   2> 73702 INFO  (TEST-BasicDistributedZkTest.test-seed#[6183C483719D3848]) [    ] o.a.s.l.LogWatcher Registering Log Listener [Log4j (org.slf4j.impl.Log4jLoggerFactory)]
   [junit4]   2> 73702 INFO  (TEST-BasicDistributedZkTest.test-seed#[6183C483719D3848]) [    ] o.a.s.c.ZkContainer Zookeeper client=127.0.0.1:57868/solr
   [junit4]   2> 73702 INFO  (TEST-BasicDistributedZkTest.test-seed#[6183C483719D3848]) [    ] o.a.s.c.ZkController zkHost includes chroot
   [junit4]   2> 73702 INFO  (TEST-BasicDistributedZkTest.test-seed#[6183C483719D3848]) [    ] o.a.s.c.c.SolrZkClient Using default ZkCredentialsProvider
   [junit4]   2> 73703 INFO  (TEST-BasicDistributedZkTest.test-seed#[6183C483719D3848]) [    ] o.a.s.c.c.ConnectionManager Waiting for client to connect to ZooKeeper
   [junit4]   2> 73707 INFO  (zkCallback-70-thread-1) [    ] o.a.s.c.c.ConnectionManager Watcher org.apache.solr.common.cloud.ConnectionManager@57068c04 name:ZooKeeperConnection Watcher:127.0.0.1:57868 got event WatchedEvent state:SyncConnected type:None path:null path:null type:None
   [junit4]   2> 73709 INFO  (TEST-BasicDistributedZkTest.test-seed#[6183C483719D3848]) [    ] o.a.s.c.c.ConnectionManager Client is connected to ZooKeeper
   [junit4]   2> 73709 INFO  (TEST-BasicDistributedZkTest.test-seed#[6183C483719D3848]) [    ] o.a.s.c.c.SolrZkClient Using default ZkACLProvider
   [junit4]   2> 73714 INFO  (TEST-BasicDistributedZkTest.test-seed#[6183C483719D3848]) [n:127.0.0.1:40027_    ] o.a.s.c.c.ConnectionManager Waiting for client to connect to ZooKeeper
   [junit4]   2> 73719 INFO  (zkCallback-71-thread-1-processing-n:127.0.0.1:40027_) [n:127.0.0.1:40027_    ] o.a.s.c.c.ConnectionManager Watcher org.apache.solr.common.cloud.ConnectionManager@cd8cd8 name:ZooKeeperConnection Watcher:127.0.0.1:57868/solr got event WatchedEvent state:SyncConnected type:None path:null path:null type:None
   [junit4]   2> 73719 INFO  (TEST-BasicDistributedZkTest.test-seed#[6183C483719D3848]) [n:127.0.0.1:40027_    ] o.a.s.c.c.ConnectionManager Client is connected to ZooKeeper
   [junit4]   2> 73722 INFO  (TEST-BasicDistributedZkTest.test-seed#[6183C483719D3848]) [n:127.0.0.1:40027_    ] o.a.s.c.c.SolrZkClient makePath: /overseer/queue
   [junit4]   2> 73725 INFO  (TEST-BasicDistributedZkTest.test-seed#[6183C483719D3848]) [n:127.0.0.1:40027_    ] o.a.s.c.c.SolrZkClient makePath: /overseer/collection-queue-work
   [junit4]   2> 73730 INFO  (TEST-BasicDistributedZkTest.test-seed#[6183C483719D3848]) [n:127.0.0.1:40027_    ] o.a.s.c.c.SolrZkClient makePath: /overseer/collection-map-running
   [junit4]   2> 73732 INFO  (TEST-BasicDistributedZkTest.test-seed#[6183C483719D3848]) [n:127.0.0.1:40027_    ] o.a.s.c.c.SolrZkClient makePath: /overseer/collection-map-completed
   [junit4]   2> 73735 INFO  (TEST-BasicDistributedZkTest.test-seed#[6183C483719D3848]) [n:127.0.0.1:40027_    ] o.a.s.c.c.SolrZkClient makePath: /overseer/collection-map-failure
   [junit4]   2> 73738 INFO  (TEST-BasicDistributedZkTest.test-seed#[6183C483719D3848]) [n:127.0.0.1:40027_    ] o.a.s.c.c.SolrZkClient makePath: /live_nodes
   [junit4]   2> 73741 INFO  (TEST-BasicDistributedZkTest.test-seed#[6183C483719D3848]) [n:127.0.0.1:40027_    ] o.a.s.c.c.SolrZkClient makePath: /aliases.json
   [junit4]   2> 73743 INFO  (TEST-BasicDistributedZkTest.test-seed#[6183C483719D3848]) [n:127.0.0.1:40027_    ] o.a.s.c.c.SolrZkClient makePath: /clusterstate.json
   [junit4]   2> 73745 INFO  (TEST-BasicDistributedZkTest.test-seed#[6183C483719D3848]) [n:127.0.0.1:40027_    ] o.a.s.c.c.SolrZkClient makePath: /security.json
   [junit4]   2> 73747 INFO  (TEST-BasicDistributedZkTest.test-seed#[6183C483719D3848]) [n:127.0.0.1:40027_    ] o.a.s.c.ZkController Register node as live in ZooKeeper:/live_nodes/127.0.0.1:40027_
   [junit4]   2> 73748 INFO  (TEST-BasicDistributedZkTest.test-seed#[6183C483719D3848]) [n:127.0.0.1:40027_    ] o.a.s.c.c.SolrZkClient makePath: /live_nodes/127.0.0.1:40027_
   [junit4]   2> 73750 INFO  (TEST-BasicDistributedZkTest.test-seed#[6183C483719D3848]) [n:127.0.0.1:40027_    ] o.a.s.c.c.SolrZkClient makePath: /overseer_elect
   [junit4]   2> 73752 INFO  (TEST-BasicDistributedZkTest.test-seed#[6183C483719D3848]) [n:127.0.0.1:40027_    ] o.a.s.c.c.SolrZkClient makePath: /overseer_elect/election
   [junit4]   2> 73753 INFO  (TEST-BasicDistributedZkTest.test-seed#[6183C483719D3848]) [n:127.0.0.1:40027_    ] o.a.s.c.Overseer Overseer (id=null) closing
   [junit4]   2> 73754 INFO  (TEST-BasicDistributedZkTest.test-seed#[6183C483719D3848]) [n:127.0.0.1:40027_    ] o.a.s.c.LeaderElector Joined leadership election with path: /overseer_elect/election/95188218916372484-127.0.0.1:40027_-n_0000000000
   [junit4]   2> 73755 INFO  (TEST-BasicDistributedZkTest.test-seed#[6183C483719D3848]) [n:127.0.0.1:40027_    ] o.a.s.c.OverseerElectionContext I am going to be the leader 127.0.0.1:40027_
   [junit4]   2> 73755 INFO  (TEST-BasicDistributedZkTest.test-seed#[6183C483719D3848]) [n:127.0.0.1:40027_    ] o.a.s.c.c.SolrZkClient makePath: /overseer_elect/leader
   [junit4]   2> 73758 INFO  (TEST-BasicDistributedZkTest.test-seed#[6183C483719D3848]) [n:127.0.0.1:40027_    ] o.a.s.c.Overseer Overseer (id=95188218916372484-127.0.0.1:40027_-n_0000000000) starting
   [junit4]   2> 73760 INFO  (TEST-BasicDistributedZkTest.test-seed#[6183C483719D3848]) [n:127.0.0.1:40027_    ] o.a.s.c.c.SolrZkClient makePath: /overseer/queue-work
   [junit4]   2> 73770 INFO  (TEST-BasicDistributedZkTest.test-seed#[6183C483719D3848]) [n:127.0.0.1:40027_    ] o.a.s.c.OverseerAutoReplicaFailoverThread Starting OverseerAutoReplicaFailoverThread autoReplicaFailoverWorkLoopDelay=10000 autoReplicaFailoverWaitAfterExpiration=30000 autoReplicaFailoverBadNodeExpiration=60000
   [junit4]   2> 73771 INFO  (TEST-BasicDistributedZkTest.test-seed#[6183C483719D3848]) [n:127.0.0.1:40027_    ] o.a.s.c.c.ZkStateReader Updating cluster state from ZooKeeper... 
   [junit4]   2> 73774 INFO  (OverseerCollectionConfigSetProcessor-95188218916372484-127.0.0.1:40027_-n_0000000000) [n:127.0.0.1:40027_    ] o.a.s.c.OverseerTaskProcessor Process current queue of overseer operations
   [junit4]   2> 73776 INFO  (OverseerStateUpdate-95188218916372484-127.0.0.1:40027_-n_0000000000) [n:127.0.0.1:40027_    ] o.a.s.c.Overseer Starting to work on the main queue
   [junit4]   2> 73785 INFO  (TEST-BasicDistributedZkTest.test-seed#[6183C483719D3848]) [n:127.0.0.1:40027_    ] o.a.s.c.CoreContainer Security conf doesn't exist. Skipping setup for authorization module.
   [junit4]   2> 73785 INFO  (TEST-BasicDistributedZkTest.test-seed#[6183C483719D3848]) [n:127.0.0.1:40027_    ] o.a.s.c.CoreContainer No authentication plugin used.
   [junit4]   2> 73788 INFO  (TEST-BasicDistributedZkTest.test-seed#[6183C483719D3848]) [n:127.0.0.1:40027_    ] o.a.s.c.CorePropertiesLocator Looking for core definitions underneath /export/home/jenkins/workspace/Lucene-Solr-trunk-Solaris/solr/build/solr-core/test/J0/../../../../../../../../../../export/home/jenkins/workspace/Lucene-Solr-trunk-Solaris/solr/build/solr-core/test/J0/temp/solr.cloud.BasicDistributedZkTest_6183C483719D3848-001/control-001/cores
   [junit4]   2> 73790 INFO  (TEST-BasicDistributedZkTest.test-seed#[6183C483719D3848]) [n:127.0.0.1:40027_    ] o.a.s.c.CoreDescriptor Created CoreDescriptor: {name=collection1, config=solrconfig.xml, transient=false, schema=schema.xml, loadOnStartup=true, configSetProperties=configsetprops.json, collection=control_collection, coreNodeName=, dataDir=data/, shard=}
   [junit4]   2> 73790 INFO  (TEST-BasicDistributedZkTest.test-seed#[6183C483719D3848]) [n:127.0.0.1:40027_    ] o.a.s.c.CorePropertiesLocator Found core collection1 in /export/home/jenkins/workspace/Lucene-Solr-trunk-Solaris/solr/build/solr-core/test/J0/../../../../../../../../../../export/home/jenkins/workspace/Lucene-Solr-trunk-Solaris/solr/build/solr-core/test/J0/temp/solr.cloud.BasicDistributedZkTest_6183C483719D3848-001/control-001/cores/collection1
   [junit4]   2> 73791 INFO  (TEST-BasicDistributedZkTest.test-seed#[6183C483719D3848]) [n:127.0.0.1:40027_    ] o.a.s.c.CorePropertiesLocator Found 1 core definitions
   [junit4]   2> 73794 INFO  (TEST-BasicDistributedZkTest.test-seed#[6183C483719D3848]) [n:127.0.0.1:40027_    ] o.a.s.s.SolrDispatchFilter user.dir=/export/home/jenkins/workspace/Lucene-Solr-trunk-Solaris/solr/build/solr-core/test/J0
   [junit4]   2> 73794 INFO  (TEST-BasicDistributedZkTest.test-seed#[6183C483719D3848]) [n:127.0.0.1:40027_    ] o.a.s.s.SolrDispatchFilter SolrDispatchFilter.init() done
   [junit4]   2> 73797 INFO  (coreLoadExecutor-174-thread-1-processing-n:127.0.0.1:40027_) [n:127.0.0.1:40027_ c:control_collection   x:collection1] o.a.s.c.ZkController publishing state=down
   [junit4]   2> 73798 INFO  (coreLoadExecutor-174-thread-1-processing-n:127.0.0.1:40027_) [n:127.0.0.1:40027_ c:control_collection   x:collection1] o.a.s.c.ZkController numShards not found on descriptor - reading it from system property
   [junit4]   2> 73801 INFO  (OverseerStateUpdate-95188218916372484-127.0.0.1:40027_-n_0000000000) [n:127.0.0.1:40027_    ] o.a.s.c.Overseer processMessage: queueSize: 1, message = {
   [junit4]   2>   "core":"collection1",
   [junit4]   2>   "roles":null,
   [junit4]   2>   "base_url":"http://127.0.0.1:40027",
   [junit4]   2>   "node_name":"127.0.0.1:40027_",
   [junit4]   2>   "numShards":"1",
   [junit4]   2>   "state":"down",
   [junit4]   2>   "shard":null,
   [junit4]   2>   "collection":"control_collection",
   [junit4]   2>   "operation":"state"} current state version: 0
   [junit4]   2> 73801 INFO  (coreLoadExecutor-174-thread-1-processing-n:127.0.0.1:40027_) [n:127.0.0.1:40027_ c:control_collection   x:collection1] o.a.s.c.ZkController look for our core node name
   [junit4]   2> 73802 INFO  (OverseerStateUpdate-95188218916372484-127.0.0.1:40027_-n_0000000000) [n:127.0.0.1:40027_    ] o.a.s.c.o.ReplicaMutator Update state numShards=1 message={
   [junit4]   2>   "core":"collection1",
   [junit4]   2>   "roles":null,
   [junit4]   2>   "base_url":"http://127.0.0.1:40027",
   [junit4]   2>   "node_name":"127.0.0.1:40027_",
   [junit4]   2>   "numShards":"1",
   [junit4]   2>   "state":"down",
   [junit4]   2>   "shard":null,
   [junit4]   2>   "collection":"control_collection",
   [junit4]   2>   "operation":"state"}
   [junit4]   2> 73803 INFO  (OverseerStateUpdate-95188218916372484-127.0.0.1:40027_-n_0000000000) [n:127.0.0.1:40027_    ] o.a.s.c.o.ClusterStateMutator building a new cName: control_collection
   [junit4]   2> 73805 INFO  (OverseerStateUpdate-95188218916372484-127.0.0.1:40027_-n_0000000000) [n:127.0.0.1:40027_    ] o.a.s.c.o.ReplicaMutator Assigning new node to shard shard=shard1
   [junit4]   2> 73809 INFO  (zkCallback-71-thread-1-processing-n:127.0.0.1:40027_) [n:127.0.0.1:40027_    ] o.a.s.c.c.ZkStateReader A cluster state change: [WatchedEvent state:SyncConnected type:NodeDataChanged path:/clusterstate.json], has occurred - updating... (live nodes size: [1])
   [junit4]   2> 74803 INFO  (coreLoadExecutor-174-thread-1-processing-n:127.0.0.1:40027_) [n:127.0.0.1:40027_ c:control_collection   x:collection1] o.a.s.c.ZkController waiting to find shard id in clusterstate for collection1
   [junit4]   2> 74803 INFO  (coreLoadExecutor-174-thread-1-processing-n:127.0.0.1:40027_) [n:127.0.0.1:40027_ c:control_collection   x:collection1] o.a.s.c.ZkController Check for collection zkNode:control_collection
   [junit4]   2> 74804 INFO  (coreLoadExecutor-174-thread-1-processing-n:127.0.0.1:40027_) [n:127.0.0.1:40027_ c:control_collection   x:collection1] o.a.s.c.ZkController Collection zkNode exists
   [junit4]   2> 74804 INFO  (coreLoadExecutor-174-thread-1-processing-n:127.0.0.1:40027_) [n:127.0.0.1:40027_ c:control_collection   x:collection1] o.a.s.c.c.ZkStateReader Load collection config from: [/collections/control_collection]
   [junit4]   2> 74805 INFO  (coreLoadExecutor-174-thread-1-processing-n:127.0.0.1:40027_) [n:127.0.0.1:40027_ c:control_collection   x:collection1] o.a.s.c.c.ZkStateReader path=[/collections/control_collection] [configName]=[conf1] specified config exists in ZooKeeper
   [junit4]   2> 74805 INFO  (coreLoadExecutor-174-thread-1-processing-n:127.0.0.1:40027_) [n:127.0.0.1:40027_ c:control_collection   x:collection1] o.a.s.c.SolrResourceLoader new SolrResourceLoader for directory: '/export/home/jenkins/workspace/Lucene-Solr-trunk-Solaris/solr/build/solr-core/test/J0/temp/solr.cloud.BasicDistributedZkTest_6183C483719D3848-001/control-001/cores/collection1'
   [junit4]   2> 74805 INFO  (coreLoadExecutor-174-thread-1-processing-n:127.0.0.1:40027_) [n:127.0.0.1:40027_ c:control_collection   x:collection1] o.a.s.c.SolrResourceLoader JNDI not configured for solr (NoInitialContextEx)
   [junit4]   2> 74805 INFO  (coreLoadExecutor-174-thread-1-processing-n:127.0.0.1:40027_) [n:127.0.0.1:40027_ c:control_collection   x:collection1] o.a.s.c.SolrResourceLoader solr home defaulted to 'solr/' (could not find system property or JNDI)
   [junit4]   2> 74808 INFO  (coreLoadExecutor-174-thread-1-processing-n:127.0.0.1:40027_) [n:127.0.0.1:40027_ c:control_collection   x:collection1] o.a.s.c.Config loaded config solrconfig.xml with version 0 
   [junit4]   2> 74817 INFO  (coreLoadExecutor-174-thread-1-processing-n:127.0.0.1:40027_) [n:127.0.0.1:40027_ c:control_collection   x:collection1] o.a.s.c.SolrConfig current version of requestparams : -1
   [junit4]   2> 74820 INFO  (coreLoadExecutor-174-thread-1-processing-n:127.0.0.1:40027_) [n:127.0.0.1:40027_ c:control_collection   x:collection1] o.a.s.c.SolrConfig Using Lucene MatchVersion: 6.0.0
   [junit4]   2> 74825 INFO  (coreLoadExecutor-174-thread-1-processing-n:127.0.0.1:40027_) [n:127.0.0.1:40027_ c:control_collection   x:collection1] o.a.s.c.SolrConfig Loaded SolrConfig: solrconfig.xml
   [junit4]   2> 74836 INFO  (coreLoadExecutor-174-thread-1-processing-n:127.0.0.1:40027_) [n:127.0.0.1:40027_ c:control_collection   x:collection1] o.a.s.s.IndexSchema [collection1] Schema name=test
   [junit4]   2> 74914 INFO  (coreLoadExecutor-174-thread-1-processing-n:127.0.0.1:40027_) [n:127.0.0.1:40027_ c:control_collection   x:collection1] o.a.s.s.OpenExchangeRatesOrgProvider Initialized with rates=open-exchange-rates.json, refreshInterval=1440.
   [junit4]   2> 74923 INFO  (coreLoadExecutor-174-thread-1-processing-n:127.0.0.1:40027_) [n:127.0.0.1:40027_ c:control_collection   x:collection1] o.a.s.s.IndexSchema default search field in schema is text
   [junit4]   2> 74924 INFO  (coreLoadExecutor-174-thread-1-processing-n:127.0.0.1:40027_) [n:127.0.0.1:40027_ c:control_collection   x:collection1] o.a.s.s.IndexSchema unique key field: id
   [junit4]   2> 74939 INFO  (coreLoadExecutor-174-thread-1-processing-n:127.0.0.1:40027_) [n:127.0.0.1:40027_ c:control_collection   x:collection1] o.a.s.s.FileExchangeRateProvider Reloading exchange rates from file currency.xml
   [junit4]   2> 74942 INFO  (coreLoadExecutor-174-thread-1-processing-n:127.0.0.1:40027_) [n:127.0.0.1:40027_ c:control_collection   x:collection1] o.a.s.s.FileExchangeRateProvider Reloading exchange rates from file currency.xml
   [junit4]   2> 74946 INFO  (coreLoadExecutor-174-thread-1-processing-n:127.0.0.1:40027_) [n:127.0.0.1:40027_ c:control_collection   x:collection1] o.a.s.s.OpenExchangeRatesOrgProvider Reloading exchange rates from open-exchange-rates.json
   [junit4]   2> 74947 INFO  (coreLoadExecutor-174-thread-1-processing-n:127.0.0.1:40027_) [n:127.0.0.1:40027_ c:control_collection   x:collection1] o.a.s.s.OpenExchangeRatesOrgProvider Reloading exchange rates from open-exchange-rates.json
   [junit4]   2> 74950 INFO  (coreLoadExecutor-174-thread-1-processing-n:127.0.0.1:40027_) [n:127.0.0.1:40027_ c:control_collection   x:collection1] o.a.s.c.ConfigSetProperties Did not find ConfigSet properties, assuming default properties: Can't find resource 'configsetprops.json' in classpath or '/configs/conf1', cwd=/export/home/jenkins/workspace/Lucene-Solr-trunk-Solaris/solr/build/solr-core/test/J0
   [junit4]   2> 74950 INFO  (coreLoadExecutor-174-thread-1-processing-n:127.0.0.1:40027_) [n:127.0.0.1:40027_ c:control_collection   x:collection1] o.a.s.c.CoreContainer Creating SolrCore 'collection1' using configuration from collection control_collection
   [junit4]   2> 74950 INFO  (coreLoadExecutor-174-thread-1-processing-n:127.0.0.1:40027_) [n:127.0.0.1:40027_ c:control_collection s:shard1 r:core_node1 x:collection1] o.a.s.c.SolrCore org.apache.solr.core.MockDirectoryFactory
   [junit4]   2> 74951 INFO  (coreLoadExecutor-174-thread-1-processing-n:127.0.0.1:40027_) [n:127.0.0.1:40027_ c:control_collection s:shard1 r:core_node1 x:collection1] o.a.s.c.SolrCore [[collection1] ] Opening new SolrCore at [/export/home/jenkins/workspace/Lucene-Solr-trunk-Solaris/solr/build/solr-core/test/J0/temp/solr.cloud.BasicDistributedZkTest_6183C483719D3848-001/control-001/cores/collection1], dataDir=[/export/home/jenkins/workspace/Lucene-Solr-trunk-Solaris/solr/build/solr-core/test/J0/../../../../../../../../../../export/home/jenkins/workspace/Lucene-Solr-trunk-Solaris/solr/build/solr-core/test/J0/temp/solr.cloud.BasicDistributedZkTest_6183C483719D3848-001/control-001/cores/collection1/data/]
   [junit4]   2> 74951 INFO  (coreLoadExecutor-174-thread-1-processing-n:127.0.0.1:40027_) [n:127.0.0.1:40027_ c:control_collection s:shard1 r:core_node1 x:collection1] o.a.s.c.JmxMonitoredMap JMX monitoring is enabled. Adding Solr mbeans to JMX Server: com.sun.jmx.mbeanserver.JmxMBeanServer@6b51cad8
   [junit4]   2> 74953 INFO  (coreLoadExecutor-174-thread-1-processing-n:127.0.0.1:40027_) [n:127.0.0.1:40027_ c:control_collection s:shard1 r:core_node1 x:collection1] o.a.s.c.CachingDirectoryFactory return new directory for /export/home/jenkins/workspace/Lucene-Solr-trunk-Solaris/solr/build/solr-core/test/J0/../../../../../../../../../../export/home/jenkins/workspace/Lucene-Solr-trunk-Solaris/solr/build/solr-core/test/J0/temp/solr.cloud.BasicDistributedZkTest_6183C483719D3848-001/control-001/cores/collection1/data
   [junit4]   2> 74953 INFO  (coreLoadExecutor-174-thread-1-processing-n:127.0.0.1:40027_) [n:127.0.0.1:40027_ c:control_collection s:shard1 r:core_node1 x:collection1] o.a.s.c.SolrCore New index directory detected: old=null new=/export/home/jenkins/workspace/Lucene-Solr-trunk-Solaris/solr/build/solr-core/test/J0/../../../../../../../../../../export/home/jenkins/workspace/Lucene-Solr-trunk-Solaris/solr/build/solr-core/test/J0/temp/solr.cloud.BasicDistributedZkTest_6183C483719D3848-001/control-001/cores/collection1/data/index/
   [junit4]   2> 74953 WARN  (coreLoadExecutor-174-thread-1-processing-n:127.0.0.1:40027_) [n:127.0.0.1:40027_ c:control_collection s:shard1 r:core_node1 x:collection1] o.a.s.c.SolrCore [collection1] Solr index directory '/export/home/jenkins/workspace/Lucene-Solr-trunk-Solaris/solr/build/solr-core/test/J0/../../../../../../../../../../export/home/jenkins/workspace/Lucene-Solr-trunk-Solaris/solr/build/solr-core/test/J0/temp/solr.cloud.BasicDistributedZkTest_6183C483719D3848-001/control-001/cores/collection1/data/index' doesn't exist. Creating new index...
   [junit4]   2> 74953 INFO  (coreLoadExecutor-174-thread-1-processing-n:127.0.0.1:40027_) [n:127.0.0.1:40027_ c:control_collection s:shard1 r:core_node1 x:collection1] o.a.s.c.CachingDirectoryFactory return new directory for /export/home/jenkins/workspace/Lucene-Solr-trunk-Solaris/solr/build/solr-core/test/J0/../../../../../../../../../../export/home/jenkins/workspace/Lucene-Solr-trunk-Solaris/solr/build/solr-core/test/J0/temp/solr.cloud.BasicDistributedZkTest_6183C483719D3848-001/control-001/cores/collection1/data/index
   [junit4]   2> 74954 INFO  (coreLoadExecutor-174-thread-1-processing-n:127.0.0.1:40027_) [n:127.0.0.1:40027_ c:control_collection s:shard1 r:core_node1 x:collection1] o.a.s.u.RandomMergePolicy RandomMergePolicy wrapping class org.apache.lucene.index.TieredMergePolicy: [TieredMergePolicy: maxMergeAtOnce=35, maxMergeAtOnceExplicit=15, maxMergedSegmentMB=16.6279296875, floorSegmentMB=0.9111328125, forceMergeDeletesPctAllowed=16.160878900642775, segmentsPerTier=34.0, maxCFSSegmentSizeMB=8.796093022207999E12, noCFSRatio=1.0
   [junit4]   2> 74955 INFO  (coreLoadExecutor-174-thread-1-processing-n:127.0.0.1:40027_) [n:127.0.0.1:40027_ c:control_collection s:shard1 r:core_node1 x:collection1] o.a.s.c.SolrDeletionPolicy SolrDeletionPolicy.onCommit: commits: num=1
   [junit4]   2> 	commit{dir=MockDirectoryWrapper(RAMDirectory@1d787347 lockFactory=org.apache.lucene.store.SingleInstanceLockFactory@1bc61343),segFN=segments_1,generation=1}
   [junit4]   2> 74955 INFO  (coreLoadExecutor-174-thread-1-processing-n:127.0.0.1:40027_) [n:127.0.0.1:40027_ c:control_collection s:shard1 r:core_node1 x:collection1] o.a.s.c.SolrDeletionPolicy newest commit generation = 1
   [junit4]   2> 74956 INFO  (OldIndexDirectoryCleanupThreadForCore-collection1) [n:127.0.0.1:40027_ c:control_collection s:shard1 r:core_node1 x:collection1] o.a.s.c.SolrCore Looking for old index directories to cleanup for core collection1 in /export/home/jenkins/workspace/Lucene-Solr-trunk-Solaris/solr/build/solr-core/test/J0/../../../../../../../../../../export/home/jenkins/workspace/Lucene-Solr-trunk-Solaris/solr/build/solr-core/test/J0/temp/solr.cloud.BasicDistributedZkTest_6183C483719D3848-001/control-001/cores/collection1/data/
   [junit4]   2> 74957 WARN  (OldIndexDirectoryCleanupThreadForCore-collection1) [n:127.0.0.1:40027_ c:control_collection s:shard1 r:core_node1 x:collection1] o.a.s.c.DirectoryFactory /export/home/jenkins/workspace/Lucene-Solr-trunk-Solaris/solr/build/solr-core/test/J0/../../../../../../../../../../export/home/jenkins/workspace/Lucene-Solr-trunk-Solaris/solr/build/solr-core/test/J0/temp/solr.cloud.BasicDistributedZkTest_6183C483719D3848-001/control-001/cores/collection1/data/ does not point to a valid data directory; skipping clean-up of old index directories.
   [junit4]   2> 74962 INFO  (coreLoadExecutor-174-thread-1-processing-n:127.0.0.1:40027_) [n:127.0.0.1:40027_ c:control_collection s:shard1 r:core_node1 x:collection1] o.a.s.u.p.UpdateRequestProcessorChain creating updateRequestProcessorChain "nodistrib"
   [junit4]   2> 74962 INFO  (coreLoadExecutor-174-thread-1-processing-n:127.0.0.1:40027_) [n:127.0.0.1:40027_ c:control_collection s:shard1 r:core_node1 x:collection1] o.a.s.u.p.UpdateRequestProcessorChain creating updateRequestProcessorChain "dedupe"
   [junit4]   2> 74962 INFO  (coreLoadExecutor-174-thread-1-processing-n:127.0.0.1:40027_) [n:127.0.0.1:40027_ c:control_collection s:shard1 r:core_node1 x:collection1] o.a.s.u.p.UpdateRequestProcessorChain inserting DistributedUpdateProcessorFactory into updateRequestProcessorChain "dedupe"
   [junit4]   2> 74962 INFO  (coreLoadExecutor-174-thread-1-processing-n:127.0.0.1:40027_) [n:127.0.0.1:40027_ c:control_collection s:shard1 r:core_node1 x:collection1] o.a.s.u.p.UpdateRequestProcessorChain creating updateRequestProcessorChain "stored_sig"
   [junit4]   2> 74962 INFO  (coreLoadExecutor-174-thread-1-processing-n:127.0.0.1:40027_) [n:127.0.0.1:40027_ c:control_collection s:shard1 r:core_node1 x:collection1] o.a.s.u.p.UpdateRequestProcessorChain inserting DistributedUpdateProcessorFactory into updateRequestProcessorChain "stored_sig"
   [junit4]   2> 74963 INFO  (coreLoadExecutor-174-thread-1-processing-n:127.0.0.1:40027_) [n:127.0.0.1:40027_ c:control_collection s:shard1 r:core_node1 x:collection1] o.a.s.u.p.UpdateRequestProcessorChain creating updateRequestProcessorChain "distrib-dup-test-chain-explicit"
   [junit4]   2> 74963 INFO  (coreLoadExecutor-174-thread-1-processing-n:127.0.0.1:40027_) [n:127.0.0.1:40027_ c:control_collection s:shard1 r:core_node1 x:collection1] o.a.s.u.p.UpdateRequestProcessorChain creating updateRequestProcessorChain "distrib-dup-test-chain-implicit"
   [junit4]   2> 74963 INFO  (coreLoadExecutor-174-thread-1-processing-n:127.0.0.1:40027_) [n:127.0.0.1:40027_ c:control_collection s:shard1 r:core_node1 x:collection1] o.a.s.u.p.UpdateRequestProcessorChain inserting DistributedUpdateProcessorFactory into updateRequestProcessorChain "distrib-dup-test-chain-implicit"
   [junit4]   2> 74963 INFO  (coreLoadExecutor-174-thread-1-processing-n:127.0.0.1:40027_) [n:127.0.0.1:40027_ c:control_collection s:shard1 r:core_node1 x:collection1] o.a.s.c.SolrCore no updateRequestProcessorChain defined as default, creating implicit default
   [junit4]   2> 74963 WARN  (coreLoadExecutor-174-thread-1-processing-n:127.0.0.1:40027_) [n:127.0.0.1:40027_ c:control_collection s:shard1 r:core_node1 x:collection1] o.a.s.c.RequestHandlers INVALID paramSet a in requestHandler {type = requestHandler,name = /dump,class = DumpRequestHandler,args = {defaults={a=A,b=B}}}
   [junit4]   2> 74966 INFO  (coreLoadExecutor-174-thread-1-processing-n:127.0.0.1:40027_) [n:127.0.0.1:40027_ c:control_collection s:shard1 r:core_node1 x:collection1] o.a.s.h.l.XMLLoader xsltCacheLifetimeSeconds=60
   [junit4]   2> 74968 INFO  (coreLoadExecutor-174-thread-1-processing-n:127.0.0.1:40027_) [n:127.0.0.1:40027_ c:control_collection s:shard1 r:core_node1 x:collection1] o.a.s.h.l.XMLLoader xsltCacheLifetimeSeconds=60
   [junit4]   2> 74970 INFO  (coreLoadExecutor-174-thread-1-processing-n:127.0.0.1:40027_) [n:127.0.0.1:40027_ c:control_collection s:shard1 r:core_node1 x:collection1] o.a.s.h.l.XMLLoader xsltCacheLifetimeSeconds=60
   [junit4]   2> 74971 INFO  (coreLoadExecutor-174-thread-1-processing-n:127.0.0.1:40027_) [n:127.0.0.1:40027_ c:control_collection s:shard1 r:core_node1 x:collection1] o.a.s.h.l.XMLLoader xsltCacheLifetimeSeconds=60
   [junit4]   2> 74976 INFO  (coreLoadExecutor-174-thread-1-processing-n:127.0.0.1:40027_) [n:127.0.0.1:40027_ c:control_collection s:shard1 r:core_node1 x:collection1] o.a.s.c.RequestHandlers Registered paths: /admin/mbeans,standard,/dump,/update/csv,/sql,/update/json/docs,/admin/luke,/export,/admin/segments,/get,/admin/system,/replication,/admin/properties,/config,/stream,/schema,/admin/plugins,/admin/logging,/update/json,/admin/threads,/admin/ping,/update,/admin/file
   [junit4]   2> 74977 INFO  (coreLoadExecutor-174-thread-1-processing-n:127.0.0.1:40027_) [n:127.0.0.1:40027_ c:control_collection s:shard1 r:core_node1 x:collection1] o.a.s.c.SolrCore Using default statsCache cache: org.apache.solr.search.stats.LocalStatsCache
   [junit4]   2> 74979 INFO  (coreLoadExecutor-174-thread-1-processing-n:127.0.0.1:40027_) [n:127.0.0.1:40027_ c:control_collection s:shard1 r:core_node1 x:collection1] o.a.s.u.UpdateHandler Using UpdateLog implementation: org.apache.solr.update.UpdateLog
   [junit4]   2> 74979 INFO  (coreLoadExecutor-174-thread-1-processing-n:127.0.0.1:40027_) [n:127.0.0.1:40027_ c:control_collection s:shard1 r:core_node1 x:collection1] o.a.s.u.UpdateLog Initializing UpdateLog: dataDir= defaultSyncLevel=FLUSH numRecordsToKeep=100 maxNumLogsToKeep=10 numVersionBuckets=65536
   [junit4]   2> 74980 INFO  (coreLoadExecutor-174-thread-1-processing-n:127.0.0.1:40027_) [n:127.0.0.1:40027_ c:control_collection s:shard1 r:core_node1 x:collection1] o.a.s.u.CommitTracker Hard AutoCommit: disabled
   [junit4]   2> 74980 INFO  (coreLoadExecutor-174-thread-1-processing-n:127.0.0.1:40027_) [n:127.0.0.1:40027_ c:control_collection s:shard1 r:core_node1 x:collection1] o.a.s.u.CommitTracker Soft AutoCommit: disabled
   [junit4]   2> 74981 INFO  (coreLoadExecutor-174-thread-1-processing-n:127.0.0.1:40027_) [n:127.0.0.1:40027_ c:control_collection s:shard1 r:core_node1 x:collection1] o.a.s.u.RandomMergePolicy RandomMergePolicy wrapping class org.apache.lucene.index.LogDocMergePolicy: [LogDocMergePolicy: minMergeSize=1000, mergeFactor=36, maxMergeSize=9223372036854775807, maxMergeSizeForForcedMerge=9223372036854775807, calibrateSizeByDeletes=true, maxMergeDocs=2147483647, maxCFSSegmentSizeMB=8.796093022207999E12, noCFSRatio=0.44886640992076254]
   [junit4]   2> 74982 INFO  (coreLoadExecutor-174-thread-1-processing-n:127.0.0.1:40027_) [n:127.0.0.1:40027_ c:control_collection s:shard1 r:core_node1 x:collection1] o.a.s.c.SolrDeletionPolicy SolrDeletionPolicy.onInit: commits: num=1
   [junit4]   2> 	commit{dir=MockDirectoryWrapper(RAMDirectory@1d787347 lockFactory=org.apache.lucene.store.SingleInstanceLockFactory@1bc61343),segFN=segments_1,generation=1}
   [junit4]   2> 74982 INFO  (coreLoadExecutor-174-thread-1-processing-n:127.0.0.1:40027_) [n:127.0.0.1:40027_ c:control_collection s:shard1 r:core_node1 x:collection1] o.a.s.c.SolrDeletionPolicy newest commit generation = 1
   [junit4]   2> 74982 INFO  (coreLoadExecutor-174-thread-1-processing-n:127.0.0.1:40027_) [n:127.0.0.1:40027_ c:control_collection s:shard1 r:core_node1 x:collection1] o.a.s.s.SolrIndexSearcher Opening [Searcher@5295f061[collection1] main]
   [junit4]   2> 74982 INFO  (coreLoadExecutor-174-thread-1-processing-n:127.0.0.1:40027_) [n:127.0.0.1:40027_ c:control_collection s:shard1 r:core_node1 x:collection1] o.a.s.c.c.ZkStateReader Load collection config from: [/collections/control_collection]
   [junit4]   2> 74984 INFO  (coreLoadExecutor-174-thread-1-processing-n:127.0.0.1:40027_) [n:127.0.0.1:40027_ c:control_collection s:shard1 r:core_node1 x:collection1] o.a.s.c.c.ZkStateReader path=[/collections/control_collection] [configName]=[conf1] specified config exists in ZooKeeper
   [junit4]   2> 74984 INFO  (coreLoadExecutor-174-thread-1-processing-n:127.0.0.1:40027_) [n:127.0.0.1:40027_ c:control_collection s:shard1 r:core_node1 x:collection1] o.a.s.r.ManagedResourceStorage Setting up ZooKeeper-based storage for the RestManager with znodeBase: /configs/conf1
   [junit4]   2> 74985 INFO  (coreLoadExecutor-174-thread-1-processing-n:127.0.0.1:40027_) [n:127.0.0.1:40027_ c:control_collection s:shard1 r:core_node1 x:collection1] o.a.s.r.ManagedResourceStorage Configured ZooKeeperStorageIO with znodeBase: /configs/conf1
   [junit4]   2> 74985 INFO  (coreLoadExecutor-174-thread-1-processing-n:127.0.0.1:40027_) [n:127.0.0.1:40027_ c:control_collection s:shard1 r:core_node1 x:collection1] o.a.s.r.RestManager Initializing RestManager with initArgs: {}
   [junit4]   2> 74985 INFO  (coreLoadExecutor-174-thread-1-processing-n:127.0.0.1:40027_) [n:127.0.0.1:40027_ c:control_collection s:shard1 r:core_node1 x:collection1] o.a.s.r.ManagedResourceStorage Reading _rest_managed.json using ZooKeeperStorageIO:path=/configs/conf1
   [junit4]   2> 74986 INFO  (coreLoadExecutor-174-thread-1-processing-n:127.0.0.1:40027_) [n:127.0.0.1:40027_ c:control_collection s:shard1 r:core_node1 x:collection1] o.a.s.r.ManagedResourceStorage No data found for znode /configs/conf1/_rest_managed.json
   [junit4]   2> 74986 INFO  (coreLoadExecutor-174-thread-1-processing-n:127.0.0.1:40027_) [n:127.0.0.1:40027_ c:control_collection s:shard1 r:core_node1 x:collection1] o.a.s.r.ManagedResourceStorage Loaded null at path _rest_managed.json using ZooKeeperStorageIO:path=/configs/conf1
   [junit4]   2> 74987 INFO  (coreLoadExecutor-174-thread-1-processing-n:127.0.0.1:40027_) [n:127.0.0.1:40027_ c:control_collection s:shard1 r:core_node1 x:collection1] o.a.s.r.RestManager Initializing 0 registered ManagedResources
   [junit4]   2> 74987 INFO  (coreLoadExecutor-174-thread-1-processing-n:127.0.0.1:40027_) [n:127.0.0.1:40027_ c:control_collection s:shard1 r:core_node1 x:collection1] o.a.s.h.ReplicationHandler Commits will be reserved for  10000
   [junit4]   2> 74987 INFO  (searcherExecutor-175-thread-1-processing-n:127.0.0.1:40027_ x:collection1 s:shard1 c:control_collection r:core_node1) [n:127.0.0.1:40027_ c:control_collection s:shard1 r:core_node1 x:collection1] o.a.s.c.SolrCore [collection1] Registered new searcher Searcher@5295f061[collection1] main{ExitableDirectoryReader(UninvertingDirectoryReader())}
   [junit4]   2> 74988 INFO  (coreLoadExecutor-174-thread-1-processing-n:127.0.0.1:40027_) [n:127.0.0.1:40027_ c:control_collection s:shard1 r:core_node1 x:collection1] o.a.s.u.UpdateLog Looking up max value of version field to seed version buckets
   [junit4]   2> 74988 INFO  (coreLoadExecutor-174-thread-1-processing-n:127.0.0.1:40027_) [n:127.0.0.1:40027_ c:control_collection s:shard1 r:core_node1 x:collection1] o.a.s.u.VersionInfo Refreshing highest value of _version_ for 65536 version buckets from index
   [junit4]   2> 74988 INFO  (coreLoadExecutor-174-thread-1-processing-n:127.0.0.1:40027_) [n:127.0.0.1:40027_ c:control_collection s:shard1 r:core_node1 x:collection1] o.a.s.u.VersionInfo No terms found for _version_, cannot seed version bucket highest value from index
   [junit4]   2> 74988 INFO  (coreLoadExecutor-174-thread-1-processing-n:127.0.0.1:40027_) [n:127.0.0.1:40027_ c:control_collection s:shard1 r:core_node1 x:collection1] o.a.s.u.UpdateLog Could not find max version in index or recent updates, using new clock 1523011505170153472
   [junit4]   2> 74990 INFO  (coreLoadExecutor-174-thread-1-processing-n:127.0.0.1:40027_) [n:127.0.0.1:40027_ c:control_collection s:shard1 r:core_node1 x:collection1] o.a.s.u.UpdateLog Took 2.0ms to seed version buckets with highest version 1523011505170153472
   [junit4]   2> 74990 INFO  (coreLoadExecutor-174-thread-1-processing-n:127.0.0.1:40027_) [n:127.0.0.1:40027_ c:control_collection s:shard1 r:core_node1 x:collection1] o.a.s.c.ZkController watch zkdir /configs/conf1
   [junit4]   2> 74991 INFO  (coreLoadExecutor-174-thread-1-processing-n:127.0.0.1:40027_) [n:127.0.0.1:40027_ c:control_collection s:shard1 r:core_node1 x:collection1] o.a.s.c.CoreContainer registering core: collection1
   [junit4]   2> 74993 INFO  (coreZkRegister-168-thread-1-processing-n:127.0.0.1:40027_ x:collection1 s:shard1 c:control_collection r:core_node1) [n:127.0.0.1:40027_ c:control_collection s:shard1 r:core_node1 x:collection1] o.a.s.c.ZkController Register replica - core:collection1 address:http://127.0.0.1:40027 collection:control_collection shard:shard1
   [junit4]   2> 74995 INFO  (coreZkRegister-168-thread-1-processing-n:127.0.0.1:40027_ x:collection1 s:shard1 c:control_collection r:core_node1) [n:127.0.0.1:40027_ c:control_collection s:shard1 r:core_node1 x:collection1] o.a.s.c.c.SolrZkClient makePath: /collections/control_collection/leader_elect/shard1/election
   [junit4]   2> 75003 INFO  (coreZkRegister-168-thread-1-processing-n:127.0.0.1:40027_ x:collection1 s:shard1 c:control_collection r:core_node1) [n:127.0.0.1:40027_ c:control_collection s:shard1 r:core_node1 x:collection1] o.a.s.c.LeaderElector Joined leadership election with path: /collections/control_collection/leader_elect/shard1/election/95188218916372484-core_node1-n_0000000000
   [junit4]   2> 75004 INFO  (coreZkRegister-168-thread-1-processing-n:127.0.0.1:40027_ x:collection1 s:shard1 c:control_collection r:core_node1) [n:127.0.0.1:40027_ c:control_collection s:shard1 r:core_node1 x:collection1] o.a.s.c.ShardLeaderElectionContext Running the leader process for shard=shard1 and weAreReplacement=false and leaderVoteWait=10000
   [junit4]   2> 75008 INFO  (coreZkRegister-168-thread-1-processing-n:127.0.0.1:40027_ x:collection1 s:shard1 c:control_collection r:core_node1) [n:127.0.0.1:40027_ c:control_collection s:shard1 r:core_node1 x:collection1] o.a.s.c.ShardLeaderElectionContext Enough replicas found to continue.
   [junit4]   2> 75008 INFO  (coreZkRegister-168-thread-1-processing-n:127.0.0.1:40027_ x:collection1 s:shard1 c:control_collection r:core_node1) [n:127.0.0.1:40027_ c:control_collection s:shard1 r:core_node1 x:collection1] o.a.s.c.ShardLeaderElectionContext I may be the new leader - try and sync
   [junit4]   2> 75009 INFO  (coreZkRegister-168-thread-1-processing-n:127.0.0.1:40027_ x:collection1 s:shard1 c:control_collection r:core_node1) [n:127.0.0.1:40027_ c:control_collection s:shard1 r:core_node1 x:collection1] o.a.s.c.SyncStrategy Sync replicas to http://127.0.0.1:40027/collection1/
   [junit4]   2> 75009 INFO  (coreZkRegister-168-thread-1-processing-n:127.0.0.1:40027_ x:collection1 s:shard1 c:control_collection r:core_node1) [n:127.0.0.1:40027_ c:control_collection s:shard1 r:core_node1 x:collection1] o.a.s.c.SyncStrategy Sync Success - now sync replicas to me
   [junit4]   2> 75009 INFO  (coreZkRegister-168-thread-1-processing-n:127.0.0.1:40027_ x:collection1 s:shard1 c:control_collection r:core_node1) [n:127.0.0.1:40027_ c:control_collection s:shard1 r:core_node1 x:collection1] o.a.s.c.SyncStrategy http://127.0.0.1:40027/collection1/ has no replicas
   [junit4]   2> 75009 INFO  (OverseerStateUpdate-95188218916372484-127.0.0.1:40027_-n_0000000000) [n:127.0.0.1:40027_    ] o.a.s.c.Overseer processMessage: queueSize: 1, message = {
   [junit4]   2>   "operation":"leader",
   [junit4]   2>   "shard":"shard1",
   [junit4]   2>   "collection":"control_collection"} current state version: 1
   [junit4]   2> 75010 INFO  (coreZkRegister-168-thread-1-processing-n:127.0.0.1:40027_ x:collection1 s:shard1 c:control_collection r:core_node1) [n:127.0.0.1:40027_ c:control_collection s:shard1 r:core_node1 x:collection1] o.a.s.c.c.SolrZkClient makePath: /collections/control_collection/leaders/shard1
   [junit4]   2> 75015 INFO  (coreZkRegister-168-thread-1-processing-n:127.0.0.1:40027_ x:collection1 s:shard1 c:control_collection r:core_node1) [n:127.0.0.1:40027_ c:control_collection s:shard1 r:core_node1 x:collection1] o.a.s.c.ShardLeaderElectionContextBase Creating leader registration node
   [junit4]   2> 75019 INFO  (coreZkRegister-168-thread-1-processing-n:127.0.0.1:40027_ x:collection1 s:shard1 c:control_collection r:core_node1) [n:127.0.0.1:40027_ c:control_collection s:shard1 r:core_node1 x:collection1] o.a.s.c.ShardLeaderElectionContext I am the new leader: http://127.0.0.1:40027/collection1/ shard1
   [junit4]   2> 75021 INFO  (OverseerStateUpdate-95188218916372484-127.0.0.1:40027_-n_0000000000) [n:127.0.0.1:40027_    ] o.a.s.c.Overseer processMessage: queueSize: 1, message = {
   [junit4]   2>   "operation":"leader",
   [junit4]   2>   "shard":"shard1",
   [junit4]   2>   "collection":"control_collection",
   [junit4]   2>   "base_url":"http://127.0.0.1:40027",
   [junit4]   2>   "core":"collection1",
   [junit4]   2>   "state":"active"} current state version: 1
   [junit4]   2> 75125 INFO  (zkCallback-71-thread-1-processing-n:127.0.0.1:40027_) [n:127.0.0.1:40027_    ] o.a.s.c.c.ZkStateReader A cluster state change: [WatchedEvent state:SyncConnected type:NodeDataChanged path:/clusterstate.json], has occurred - updating... (live nodes size: [1])
   [junit4]   2> 75171 INFO  (coreZkRegister-168-thread-1-processing-n:127.0.0.1:40027_ x:collection1 s:shard1 c:control_collection r:core_node1) [n:127.0.0.1:40027_ c:control_collection s:shard1 r:core_node1 x:collection1] o.a.s.c.ZkController We are http://127.0.0.1:40027/collection1/ and leader is http://127.0.0.1:40027/collection1/
   [junit4]   2> 75171 INFO  (coreZkRegister-168-thread-1-processing-n:127.0.0.1:40027_ x:collection1 s:shard1 c:control_collection r:core_node1) [n:127.0.0.1:40027_ c:control_collection s:shard1 r:core_node1 x:collection1] o.a.s.c.ZkController No LogReplay needed for core=collection1 baseURL=http://127.0.0.1:40027
   [junit4]   2> 75171 INFO  (coreZkRegister-168-thread-1-processing-n:127.0.0.1:40027_ x:collection1 s:shard1 c:control_collection r:core_node1) [n:127.0.0.1:40027_ c:control_collection s:shard1 r:core_node1 x:collection1] o.a.s.c.ZkController I am the leader, no recovery necessary
   [junit4]   2> 75171 INFO  (coreZkRegister-168-thread-1-processing-n:127.0.0.1:40027_ x:collection1 s:shard1 c:control_collection r:core_node1) [n:127.0.0.1:40027_ c:control_collection s:shard1 r:core_node1 x:collection1] o.a.s.c.ZkController publishing state=active
   [junit4]   2> 75171 INFO  (coreZkRegister-168-thread-1-processing-n:127.0.0.1:40027_ x:collection1 s:shard1 c:control_collection r:core_node1) [n:127.0.0.1:40027_ c:control_collection s:shard1 r:core_node1 x:collection1] o.a.s.c.ZkController numShards not found on descriptor - reading it from system property
   [junit4]   2> 75175 INFO  (OverseerStateUpdate-95188218916372484-127.0.0.1:40027_-n_0000000000) [n:127.0.0.1:40027_    ] o.a.s.c.Overseer processMessage: queueSize: 1, message = {
   [junit4]   2>   "core":"collection1",
   [junit4]   2>   "core_node_name":"core_node1",
   [junit4]   2>   "roles":null,
   [junit4]   2>   "base_url":"http://127.0.0.1:40027",
   [junit4]   2>   "node_name":"127.0.0.1:40027_",
   [junit4]   2>   "numShards":"1",
   [junit4]   2>   "state":"active",
   [junit4]   2>   "shard":"shard1",
   [junit4]   2>   "collection":"control_collection",
   [junit4]   2>   "operation":"state"} current state version: 2
   [junit4]   2> 75176 INFO  (OverseerStateUpdate-95188218916372484-127.0.0.1:40027_-n_0000000000) [n:127.0.0.1:40027_    ] o.a.s.c.o.ReplicaMutator Update state numShards=1 message={
   [junit4]   2>   "core":"collection1",
   [junit4]   2>   "core_node_name":"core_node1",
   [junit4]   2>   "roles":null,
   [junit4]   2>   "base_url":"http://127.0.0.1:40027",
   [junit4]   2>   "node_name":"127.0.0.1:40027_",
   [junit4]   2>   "numShards":"1",
   [junit4]   2>   "state":"active",
   [junit4]   2>   "shard":"shard1",
   [junit4]   2>   "collection":"control_collection",
   [junit4]   2>   "operation":"state"}
   [junit4]   2> 75280 INFO  (zkCallback-71-thread-1-processing-n:127.0.0.1:40027_) [n:127.0.0.1:40027_    ] o.a.s.c.c.ZkStateReader A cluster state change: [WatchedEvent state:SyncConnected type:NodeDataChanged path:/clusterstate.json], has occurred - updating... (live nodes size: [1])
   [junit4]   2> 75300 INFO  (TEST-BasicDistributedZkTest.test-seed#[6183C483719D3848]) [    ] o.a.s.c.c.SolrZkClient Using default ZkCredentialsProvider
   [junit4]   2> 75300 INFO  (TEST-BasicDistributedZkTest.test-seed#[6183C483719D3848]) [    ] o.a.s.c.c.ConnectionManager Waiting for client to connect to ZooKeeper
   [junit4]   2> 75307 INFO  (zkCallback-73-thread-1) [    ] o.a.s.c.c.ConnectionManager Watcher org.apache.solr.common.cloud.ConnectionManager@1acbd2b3 name:ZooKeeperConnection Watcher:127.0.0.1:57868/solr got event WatchedEvent state:SyncConnected type:None path:null path:null type:None
   [junit4]   2> 75307 INFO  (TEST-BasicDistributedZkTest.test-seed#[6183C483719D3848]) [    ] o.a.s.c.c.ConnectionManager Client is connected to ZooKeeper
   [junit4]   2> 75307 INFO  (TEST-BasicDistributedZkTest.test-seed#[6183C483719D3848]) [    ] o.a.s.c.c.SolrZkClient Using default ZkACLProvider
   [junit4]   2> 75307 INFO  (TEST-BasicDistributedZkTest.test-seed#[6183C483719D3848]) [    ] o.a.s.c.c.ZkStateReader Updating cluster state from ZooKeeper... 
   [junit4]   2> 75316 INFO  (TEST-BasicDistributedZkTest.test-seed#[6183C483719D3848]) [    ] o.a.s.c.ChaosMonkey monkey: init - expire sessions:false cause connection loss:false
   [junit4]   2> 75316 INFO  (TEST-BasicDistributedZkTest.test-seed#[6183C483719D3848]) [    ] o.a.s.c.AbstractFullDistribZkTestBase Creating collection1 with stateFormat=2
   [junit4]   2> 75316 INFO  (TEST-BasicDistributedZkTest.test-seed#[6183C483719D3848]) [    ] o.a.s.c.c.SolrZkClient Using default ZkCredentialsProvider
   [junit4]   2> 75317 INFO  (TEST-BasicDistributedZkTest.test-seed#[6183C483719D3848]) [    ] o.a.s.c.c.ConnectionManager Waiting for client to connect to ZooKeeper
   [junit4]   2> 75326 INFO  (zkCallback-74-thread-1) [    ] o.a.s.c.c.ConnectionManager Watcher org.apache.solr.common.cloud.ConnectionManager@2e5f1098 name:ZooKeeperConnection Watcher:127.0.0.1:57868/solr got event WatchedEvent state:SyncConnected type:None path:null path:null type:None
   [junit4]   2> 75327 INFO  (TEST-BasicDistributedZkTest.test-seed#[6183C483719D3848]) [    ] o.a.s.c.c.ConnectionManager Client is connected to ZooKeeper
   [junit4]   2> 75327 INFO  (TEST-BasicDistributedZkTest.test-seed#[6183C483719D3848]) [    ] o.a.s.c.c.SolrZkClient Using default ZkACLProvider
   [junit4]   2> 75333 INFO  (OverseerStateUpdate-95188218916372484-127.0.0.1:40027_-n_0000000000) [n:127.0.0.1:40027_    ] o.a.s.c.Overseer processMessage: queueSize: 1, message = {
   [junit4]   2>   "operation":"create",
   [junit4]   2>   "name":"collection1",
   [junit4]   2>   "numShards":"2",
   [junit4]   2>   "stateFormat":"2"} current state version: 3
   [junit4]   2> 75333 INFO  (OverseerStateUpdate-95188218916372484-127.0.0.1:40027_-n_0000000000) [n:127.0.0.1:40027_    ] o.a.s.c.o.ClusterStateMutator building a new cName: collection1
   [junit4]   2> 75436 INFO  (OverseerStateUpdate-95188218916372484-127.0.0.1:40027_-n_0000000000) [n:127.0.0.1:40027_    ] o.a.s.c.o.ZkStateWriter going to create_collection /collections/collection1/state.json
   [junit4]   2> 75495 INFO  (TEST-BasicDistributedZkTest.test-seed#[6183C483719D3848]) [    ] o.a.s.SolrTestCaseJ4 Writing core.properties file to /export/home/jenkins/workspace/Lucene-Solr-trunk-Solaris/solr/build/solr-core/test/J0/temp/solr.cloud.BasicDistributedZkTest_6183C483719D3848-001/shard-1-001/cores/collection1
   [junit4]   2> 75497 INFO  (TEST-BasicDistributedZkTest.test-seed#[6183C483719D3848]) [    ] o.a.s.c.AbstractFullDistribZkTestBase create jetty 1 in directory /export/home/jenkins/workspace/Lucene-Solr-trunk-Solaris/solr/build/solr-core/test/J0/temp/solr.cloud.BasicDistributedZkTest_6183C483719D3848-001/shard-1-001
   [junit4]   2> 75497 INFO  (TEST-BasicDistributedZkTest.test-seed#[6183C483719D3848]) [    ] o.e.j.s.Server jetty-9.2.13.v20150730
   [junit4]   2> 75505 INFO  (TEST-BasicDistributedZkTest.test-seed#[6183C483719D3848]) [    ] o.e.j.s.h.ContextHandler Started o.e.j.s.ServletContextHandler@69f6956e{/,null,AVAILABLE}
   [junit4]   2> 75505 INFO  (TEST-BasicDistributedZkTest.test-seed#[6183C483719D3848]) [    ] o.e.j.s.ServerConnector Started ServerConnector@1543c05f{HTTP/1.1}{127.0.0.1:59232}
   [junit4]   2> 75506 INFO  (TEST-BasicDistributedZkTest.test-seed#[6183C483719D3848]) [    ] o.e.j.s.Server Started @78500ms
   [junit4]   2> 75506 INFO  (TEST-BasicDistributedZkTest.test-seed#[6183C483719D3848]) [    ] o.a.s.c.s.e.JettySolrRunner Jetty properties: {solr.data.dir=/export/home/jenkins/workspace/Lucene-Solr-trunk-Solaris/solr/build/solr-core/test/J0/temp/solr.cloud.BasicDistributedZkTest_6183C483719D3848-001/tempDir-001/jetty1, solrconfig=solrconfig.xml, hostContext=/, hostPort=59232, coreRootDirectory=/export/home/jenkins/workspace/Lucene-Solr-trunk-Solaris/solr/build/solr-core/test/J0/temp/solr.cloud.BasicDistributedZkTest_6183C483719D3848-001/shard-1-001/cores}
   [junit4]   2> 75506 INFO  (TEST-BasicDistributedZkTest.test-seed#[6183C483719D3848]) [    ] o.a.s.s.SolrDispatchFilter SolrDispatchFilter.init(): sun.misc.Launcher$AppClassLoader@659e0bfd
   [junit4]   2> 75506 INFO  (TEST-BasicDistributedZkTest.test-seed#[6183C483719D3848]) [    ] o.a.s.c.SolrResourceLoader new SolrResourceLoader for directory: '/export/home/jenkins/workspace/Lucene-Solr-trunk-Solaris/solr/build/solr-core/test/J0/temp/solr.cloud.BasicDistributedZkTest_6183C483719D3848-001/shard-1-001'
   [junit4]   2> 75506 INFO  (TEST-BasicDistributedZkTest.test-seed#[6183C483719D3848]) [    ] o.a.s.c.SolrResourceLoader JNDI not configured for solr (NoInitialContextEx)
   [junit4]   2> 75506 INFO  (TEST-BasicDistributedZkTest.test-seed#[6183C483719D3848]) [    ] o.a.s.c.SolrResourceLoader solr home defaulted to 'solr/' (could not find system property or JNDI)
   [junit4]   2> 75507 INFO  (TEST-BasicDistributedZkTest.test-seed#[6183C483719D3848]) [    ] o.a.s.c.c.SolrZkClient Using default ZkCredentialsProvider
   [junit4]   2> 75508 INFO  (TEST-BasicDistributedZkTest.test-seed#[6183C483719D3848]) [    ] o.a.s.c.c.ConnectionManager Waiting for client to connect to ZooKeeper
   [junit4]   2> 75516 INFO  (zkCallback-75-thread-1) [    ] o.a.s.c.c.ConnectionManager Watcher org.apache.solr.common.cloud.ConnectionManager@28191dde name:ZooKeeperConnection Watcher:127.0.0.1:57868/solr got event WatchedEvent state:SyncConnected type:None path:null path:null type:None
   [junit4]   2> 75517 INFO  (TEST-BasicDistributedZkTest.test-seed#[6183C483719D3848]) [    ] o.a.s.c.c.ConnectionManager Client is connected to ZooKeeper
   [junit4]   2> 75517 INFO  (TEST-BasicDistributedZkTest.test-seed#[6183C483719D3848]) [    ] o.a.s.c.c.SolrZkClient Using default ZkACLProvider
   [junit4]   2> 75520 INFO  (TEST-BasicDistributedZkTest.test-seed#[6183C483719D3848]) [    ] o.a.s.s.SolrDispatchFilter Loading solr.xml from SolrHome (not found in ZooKeeper)
   [junit4]   2> 75520 INFO  (TEST-BasicDistributedZkTest.test-seed#[6183C483719D3848]) [    ] o.a.s.c.SolrXmlConfig Loading container configuration from /export/home/jenkins/workspace/Lucene-Solr-trunk-Solaris/solr/build/solr-core/test/J0/temp/solr.cloud.BasicDistributedZkTest_6183C483719D3848-001/shard-1-001/solr.xml
   [junit4]   2> 75528 INFO  (TEST-BasicDistributedZkTest.test-seed#[6183C483719D3848]) [    ] o.a.s.c.CorePropertiesLocator Config-defined core root directory: /export/home/jenkins/workspace/Lucene-Solr-trunk-Solaris/solr/build/solr-core/test/J0/temp/solr.cloud.BasicDistributedZkTest_6183C483719D3848-001/shard-1-001/cores
   [junit4]   2> 75528 INFO  (TEST-BasicDistributedZkTest.test-seed#[6183C483719D3848]) [    ] o.a.s.c.CoreContainer New CoreContainer 302361313
   [junit4]   2> 75528 INFO  (TEST-BasicDistributedZkTest.test-seed#[6183C483719D3848]) [    ] o.a.s.c.CoreContainer Loading cores into CoreContainer [instanceDir=/export/home/jenkins/workspace/Lucene-Solr-trunk-Solaris/solr/build/solr-core/test/J0/temp/solr.cloud.BasicDistributedZkTest_6183C483719D3848-001/shard-1-001]
   [junit4]   2> 75528 WARN  (TEST-BasicDistributedZkTest.test-seed#[6183C483719D3848]) [    ] o.a.s.c.CoreContainer Couldn't add files from /export/home/jenkins/workspace/Lucene-Solr-trunk-Solaris/solr/build/solr-core/test/J0/temp/solr.cloud.BasicDistributedZkTest_6183C483719D3848-001/shard-1-001/lib to classpath: /export/home/jenkins/workspace/Lucene-Solr-trunk-Solaris/solr/build/solr-core/test/J0/temp/solr.cloud.BasicDistributedZkTest_6183C483719D3848-001/shard-1-001/lib
   [junit4]   2> 75528 INFO  (TEST-BasicDistributedZkTest.test-seed#[6183C483719D3848]) [    ] o.a.s.h.c.HttpShardHandlerFactory created with socketTimeout : 90000,urlScheme : ,connTimeout : 15000,maxConnectionsPerHost : 20,maxConnections : 10000,corePoolSize : 0,maximumPoolSize : 2147483647,maxThreadIdleTime : 5,sizeOfQueue : -1,fairnessPolicy : false,useRetries : false,
   [junit4]   2> 75529 INFO  (TEST-BasicDistributedZkTest.test-seed#[6183C483719D3848]) [    ] o.a.s.u.UpdateShardHandler Creating UpdateShardHandler HTTP client with params: socketTimeout=340000&connTimeout=45000&retry=true
   [junit4]   2> 75530 INFO  (TEST-BasicDistributedZkTest.test-seed#[6183C483719D3848]) [    ] o.a.s.l.LogWatcher SLF4J impl is org.slf4j.impl.Log4jLoggerFactory
   [junit4]   2> 75530 INFO  (TEST-BasicDistributedZkTest.test-seed#[6183C483719D3848]) [    ] o.a.s.l.LogWatcher Registering Log Listener [Log4j (org.slf4j.impl.Log4jLoggerFactory)]
   [junit4]   2> 75530 INFO  (TEST-BasicDistributedZkTest.test-seed#[6183C483719D3848]) [    ] o.a.s.c.ZkContainer Zookeeper client=127.0.0.1:57868/solr
   [junit4]   2> 75530 INFO  (TEST-BasicDistributedZkTest.test-seed#[6183C483719D3848]) [    ] o.a.s.c.ZkController zkHost includes chroot
   [junit4]   2> 75530 INFO  (TEST-BasicDistributedZkTest.test-seed#[6183C483719D3848]) [    ] o.a.s.c.c.SolrZkClient Using default ZkCredentialsProvider
   [junit4]   2> 75531 INFO  (TEST-BasicDistributedZkTest.test-seed#[6183C483719D3848]) [    ] o.a.s.c.c.ConnectionManager Waiting for client to connect to ZooKeeper
   [junit4]   2> 75536 INFO  (zkCallback-78-thread-1) [    ] o.a.s.c.c.ConnectionManager Watcher org.apache.solr.common.cloud.ConnectionManager@2a85e882 name:ZooKeeperConnection Watcher:127.0.0.1:57868 got event WatchedEvent state:SyncConnected type:None path:null path:null type:None
   [junit4]   2> 75537 INFO  (TEST-BasicDistributedZkTest.test-seed#[6183C483719D3848]) [    ] o.a.s.c.c.ConnectionManager Client is connected to ZooKeeper
   [junit4]   2> 75537 INFO  (TEST-BasicDistributedZkTest.test-seed#[6183C483719D3848]) [    ] o.a.s.c.c.SolrZkClient Using default ZkACLProvider
   [junit4]   2> 75540 INFO  (TEST-BasicDistributedZkTest.test-seed#[6183C483719D3848]) [n:127.0.0.1:59232_    ] o.a.s.c.c.ConnectionManager Waiting for client to connect to ZooKeeper
   [junit4]   2> 75547 INFO  (zkCallback-79-thread-1-processing-n:127.0.0.1:59232_) [n:127.0.0.1:59232_    ] o.a.s.c.c.ConnectionManager Watcher org.apache.solr.common.cloud.ConnectionManager@4484bc65 name:ZooKeeperConnection Watcher:127.0.0.1:57868/solr got event WatchedEvent state:SyncConnected type:None path:null path:null type:None
   [junit4]   2> 75547 INFO  (TEST-BasicDistributedZkTest.test-seed#[6183C483719D3848]) [n:127.0.0.1:59232_    ] o.a.s.c.c.ConnectionManager Client is connected to ZooKeeper
   [junit4]   2> 75563 INFO  (TEST-BasicDistributedZkTest.test-seed#[6183C483719D3848]) [n:127.0.0.1:59232_    ] o.a.s.c.c.ZkStateReader Updating cluster state from ZooKeeper... 
   [junit4]   2> 76580 INFO  (TEST-BasicDistributedZkTest.test-seed#[6183C483719D3848]) [n:127.0.0.1:59232_    ] o.a.s.c.ZkController Register node as live in ZooKeeper:/live_nodes/127.0.0.1:59232_
   [junit4]   2> 76581 INFO  (TEST-BasicDistributedZkTest.test-seed#[6183C483719D3848]) [n:127.0.0.1:59232_    ] o.a.s.c.c.SolrZkClient makePath: /live_nodes/127.0.0.1:59232_
   [junit4]   2> 76583 INFO  (zkCallback-71-thread-1-processing-n:127.0.0.1:40027_) [n:127.0.0.1:40027_    ] o.a.s.c.c.ZkStateReader A live node change: [WatchedEvent state:SyncConnected type:NodeChildrenChanged path:/live_nodes], has occurred - updating... (live nodes size: [1])
   [junit4]   2> 76584 INFO  (zkCallback-73-thread-1) [    ] o.a.s.c.c.ZkStateReader A live node change: [WatchedEvent state:SyncConnected type:NodeChildrenChanged path:/live_nodes], has occurred - updating... (live nodes size: [1])
   [junit4]   2> 76584 INFO  (zkCallback-79-thread-1-processing-n:127.0.0.1:59232_) [n:127.0.0.1:59232_    ] o.a.s.c.c.ZkStateReader A live node change: [WatchedEvent state:SyncConnected type:NodeChildrenChanged path:/live_nodes], has occurred - updating... (live nodes size: [1])
   [junit4]   2> 76587 INFO  (TEST-BasicDistributedZkTest.test-seed#[6183C483719D3848]) [n:127.0.0.1:59232_    ] o.a.s.c.Overseer Overseer (id=null) closing
   [junit4]   2> 76588 INFO  (TEST-BasicDistributedZkTest.test-seed#[6183C483719D3848]) [n:127.0.0.1:59232_    ] o.a.s.c.LeaderElector Joined leadership election with path: /overseer_elect/election/95188218916372489-127.0.0.1:59232_-n_0000000001
   [junit4]   2> 76589 INFO  (TEST-BasicDistributedZkTest.test-seed#[6183C483719D3848]) [n:127.0.0.1:59232_    ] o.a.s.c.LeaderElector Watching path /overseer_elect/election/95188218916372484-127.0.0.1:40027_-n_0000000000 to know if I could be the leader
   [junit4]   2> 76601 INFO  (TEST-BasicDistributedZkTest.test-seed#[6183C483719D3848]) [n:127.0.0.1:59232_    ] o.a.s.c.CoreContainer Security conf doesn't exist. Skipping setup for authorization module.
   [junit4]   2> 76602 INFO  (TEST-BasicDistributedZkTest.test-seed#[6183C483719D3848]) [n:127.0.0.1:59232_    ] o.a.s.c.CoreContainer No authentication plugin used.
   [junit4]   2> 76603 INFO  (TEST-BasicDistributedZkTest.test-seed#[6183C483719D3848]) [n:127.0.0.1:59232_    ] o.a.s.c.CorePropertiesLocator Looking for core definitions underneath /export/home/jenkins/workspace/Lucene-Solr-trunk-Solaris/solr/build/solr-core/test/J0/temp/solr.cloud.BasicDistributedZkTest_6183C483719D3848-001/shard-1-001/cores
   [junit4]   2> 76604 INFO  (TEST-BasicDistributedZkTest.test-seed#[6183C483719D3848]) [n:127.0.0.1:59232_    ] o.a.s.c.CoreDescriptor Created CoreDescriptor: {name=collection1, config=solrconfig.xml, transient=false, schema=schema.xml, loadOnStartup=true, configSetProperties=configsetprops.json, collection=collection1, coreNodeName=, dataDir=data/, shard=}
   [junit4]   2> 76604 INFO  (TEST-BasicDistributedZkTest.test-seed#[6183C483719D3848]) [n:127.0.0.1:59232_    ] o.a.s.c.CorePropertiesLocator Found core collection1 in /export/home/jenkins/workspace/Lucene-Solr-trunk-Solaris/solr/build/solr-core/test/J0/temp/solr.cloud.BasicDistributedZkTest_6183C483719D3848-001/shard-1-001/cores/collection1
   [junit4]   2> 76605 INFO  (TEST-BasicDistributedZkTest.test-seed#[6183C483719D3848]) [n:127.0.0.1:59232_    ] o.a.s.c.CorePropertiesLocator Found 1 core definitions
   [junit4]   2> 76610 INFO  (TEST-BasicDistributedZkTest.test-seed#[6183C483719D3848]) [n:127.0.0.1:59232_    ] o.a.s.s.SolrDispatchFilter user.dir=/export/home/jenkins/workspace/Lucene-Solr-trunk-Solaris/solr/build/solr-core/test/J0
   [junit4]   2> 76610 INFO  (TEST-BasicDistributedZkTest.test-seed#[6183C483719D3848]) [n:127.0.0.1:59232_    ] o.a.s.s.SolrDispatchFilter SolrDispatchFilter.init() done
   [junit4]   2> 76613 INFO  (coreLoadExecutor-185-thread-1-processing-n:127.0.0.1:59232_) [n:127.0.0.1:59232_ c:collection1   x:collection1] o.a.s.c.ZkController publishing state=down
   [junit4]   2> 76613 INFO  (coreLoadExecutor-185-thread-1-processing-n:127.0.0.1:59232_) [n:127.0.0.1:59232_ c:collection1   x:collection1] o.a.s.c.ZkController numShards not found on descriptor - reading it from system property
   [junit4]   2> 76616 INFO  (coreLoadExecutor-185-thread-1-processing-n:127.0.0.1:59232_) [n:127.0.0.1:59232_ c:collection1   x:collection1] o.a.s.c.ZkController Registering watch for collection collection1
   [junit4]   2> 76616 INFO  (coreLoadExecutor-185-thread-1-processing-n:127.0.0.1:59232_) [n:127.0.0.1:59232_ c:collection1   x:collection1] o.a.s.c.c.ZkStateReader addZkWatch [collection1]
   [junit4]   2> 76617 INFO  (coreLoadExecutor-185-thread-1-processing-n:127.0.0.1:59232_) [n:127.0.0.1:59232_ c:collection1   x:collection1] o.a.s.c.c.ZkStateReader Add data for [collection1] ver [0]
   [junit4]   2> 76618 INFO  (coreLoadExecutor-185-thread-1-processing-n:127.0.0.1:59232_) [n:127.0.0.1:59232_ c:collection1   x:collection1] o.a.s.c.ZkController look for our core node name
   [junit4]   2> 76620 INFO  (OverseerStateUpdate-95188218916372484-127.0.0.1:40027_-n_0000000000) [n:127.0.0.1:40027_    ] o.a.s.c.Overseer processMessage: queueSize: 1, message = {
   [junit4]   2>   "core":"collection1",
   [junit4]   2>   "roles":null,
   [junit4]   2>   "base_url":"http://127.0.0.1:59232",
   [junit4]   2>   "node_name":"127.0.0.1:59232_",
   [junit4]   2>   "numShards":"2",
   [junit4]   2>   "state":"down",
   [junit4]   2>   "shard":null,
   [junit4]   2>   "collection":"collection1",
   [junit4]   2>   "operation":"state"} current state version: 3
   [junit4]   2> 76621 INFO  (OverseerStateUpdate-95188218916372484-127.0.0.1:40027_-n_0000000000) [n:127.0.0.1:40027_    ] o.a.s.c.o.ReplicaMutator Update state numShards=2 message={
   [junit4]   2>   "core":"collection1",
   [junit4]   2>   "roles":null,
   [junit4]   2>   "base_url":"http://127.0.0.1:59232",
   [junit4]   2>   "node_name":"127.0.0.1:59232_",
   [junit4]   2>   "numShards":"2",
   [junit4]   2>   "state":"down",
   [junit4]   2>   "shard":null,
   [junit4]   2>   "collection":"collection1",
   [junit4]   2>   "operation":"state"}
   [junit4]   2> 76621 INFO  (OverseerStateUpdate-95188218916372484-127.0.0.1:40027_-n_0000000000) [n:127.0.0.1:40027_    ] o.a.s.c.o.ReplicaMutator Collection already exists with numShards=2
   [junit4]   2> 76621 INFO  (OverseerStateUpdate-95188218916372484-127.0.0.1:40027_-n_0000000000) [n:127.0.0.1:40027_    ] o.a.s.c.o.ReplicaMutator Assigning new node to shard shard=shard2
   [junit4]   2> 76730 INFO  (OverseerStateUpdate-95188218916372484-127.0.0.1:40027_-n_0000000000) [n:127.0.0.1:40027_    ] o.a.s.c.o.ZkStateWriter going to update_collection /collections/collection1/state.json version: 0
   [junit4]   2> 76732 INFO  (zkCallback-79-thread-1-processing-n:127.0.0.1:59232_) [n:127.0.0.1:59232_    ] o.a.s.c.c.ZkStateReader A cluster state change: [WatchedEvent state:SyncConnected type:NodeDataChanged path:/collections/collection1/state.json] for collection [collection1] has occurred - updating... (live nodes size: [2])
   [junit4]   2> 76736 INFO  (zkCallback-79-thread-1-processing-n:127.0.0.1:59232_) [n:127.0.0.1:59232_    ] o.a.s.c.c.ZkStateReader Updating data for [collection1] from [0] to [1]
   [junit4]   2> 77619 INFO  (coreLoadExecutor-185-thread-1-processing-n:127.0.0.1:59232_) [n:127.0.0.1:59232_ c:collection1   x:collection1] o.a.s.c.ZkController waiting to find shard id in clusterstate for collection1
   [junit4]   2> 77619 INFO  (coreLoadExecutor-185-thread-1-processing-n:127.0.0.1:59232_) [n:127.0.0.1:59232_ c:collection1   x:collection1] o.a.s.c.ZkController Check for collection zkNode:collection1
   [junit4]   2> 77620 INFO  (coreLoadExecutor-185-thread-1-processing-n:127.0.0.1:59232_) [n:127.0.0.1:59232_ c:collection1   x:collection1] o.a.s.c.ZkController Collection zkNode exists
   [junit4]   2> 77620 INFO  (coreLoadExecutor-185-thread-1-processing-n:127.0.0.1:59232_) [n:127.0.0.1:59232_ c:collection1   x:collection1] o.a.s.c.c.ZkStateReader Load collection config from: [/collections/collection1]
   [junit4]   2> 77621 INFO  (coreLoadExecutor-185-thread-1-processing-n:127.0.0.1:59232_) [n:127.0.0.1:59232_ c:collection1   x:collection1] o.a.s.c.c.ZkStateReader path=[/collections/collection1] [configName]=[conf1] specified config exists in ZooKeeper
   [junit4]   2> 77621 INFO  (coreLoadExecutor-185-thread-1-processing-n:127.0.0.1:59232_) [n:127.0.0.1:59232_ c:collection1   x:collection1] o.a.s.c.SolrResourceLoader new SolrResourceLoader for directory: '/export/home/jenkins/workspace/Lucene-Solr-trunk-Solaris/solr/build/solr-core/test/J0/temp/solr.cloud.BasicDistributedZkTest_6183C483719D3848-001/shard-1-001/cores/collection1'
   [junit4]   2> 77621 INFO  (coreLoadExecutor-185-thread-1-processing-n:127.0.0.1:59232_) [n:127.0.0.1:59232_ c:collection1   x:collection1] o.a.s.c.SolrResourceLoader JNDI not configured for solr (NoInitialContextEx)
   [junit4]   2> 77621 INFO  (coreLoadExecutor-185-thread-1-processing-n:127.0.0.1:59232_) [n:127.0.0.1:59232_ c:collection1   x:collection1] o.a.s.c.SolrResourceLoader solr home defaulted to 'solr/' (could not find system property or JNDI)
   [junit4]   2> 77624 INFO  (coreLoadExecutor-185-thread-1-processing-n:127.0.0.1:59232_) [n:127.0.0.1:59232_ c:collection1   x:collection1] o.a.s.c.Config loaded config solrconfig.xml with version 0 
   [junit4]   2> 77631 INFO  (coreLoadExecutor-185-thread-1-processing-n:127.0.0.1:59232_) [n:127.0.0.1:59232_ c:collection1   x:collection1] o.a.s.c.SolrConfig current version of requestparams : -1
   [junit4]   2> 77634 INFO  (coreLoadExecutor-185-thread-1-processing-n:127.0.0.1:59232_) [n:127.0.0.1:59232_ c:collection1   x:collection1] o.a.s.c.SolrConfig Using Lucene MatchVersion: 6.0.0
   [junit4]   2> 77639 INFO  (coreLoadExecutor-185-thread-1-processing-n:127.0.0.1:59232_) [n:127.0.0.1:59232_ c:collection1   x:collection1] o.a.s.c.SolrConfig Loaded SolrConfig: solrconfig.xml
   [junit4]   2> 77647 INFO  (coreLoadExecutor-185-thread-1-processing-n:127.0.0.1:59232_) [n:127.0.0.1:59232_ c:collection1   x:collection1] o.a.s.s.IndexSchema [collection1] Schema name=test
   [junit4]   2> 77730 INFO  (coreLoadExecutor-185-thread-1-processing-n:127.0.0.1:59232_) [n:127.0.0.1:59232_ c:collection1   x:collection1] o.a.s.s.OpenExchangeRatesOrgProvider Initialized with rates=open-exchange-rates.json, refreshInterval=1440.
   [junit4]   2> 77737 INFO  (coreLoadExecutor-185-thread-1-processing-n:127.0.0.1:59232_) [n:127.0.0.1:59232_ c:collection1   x:collection1] o.a.s.s.IndexSchema default search field in schema is text
   [junit4]   2> 77738 INFO  (coreLoadExecutor-185-thread-1-processing-n:127.0.0.1:59232_) [n:127.0.0.1:59232_ c:collection1   x:collection1] o.a.s.s.IndexSchema unique key field: id
   [junit4]   2> 77751 INFO  (coreLoadExecutor-185-thread-1-processing-n:127.0.0.1:59232_) [n:127.0.0.1:59232_ c:collection1   x:collection1] o.a.s.s.FileExchangeRateProvider Reloading exchange rates from file currency.xml
   [junit4]   2> 77755 INFO  (coreLoadExecutor-185-thread-1-processing-n:127.0.0.1:59232_) [n:127.0.0.1:59232_ c:collection1   x:collection1] o.a.s.s.FileExchangeRateProvider Reloading exchange rates from file currency.xml
   [junit4]   2> 77758 INFO  (coreLoadExecutor-185-thread-1-processing-n:127.0.0.1:59232_) [n:127.0.0.1:59232_ c:collection1   x:collection1] o.a.s.s.OpenExchangeRatesOrgProvider Reloading exchange rates from open-exchange-rates.json
   [junit4]   2> 77759 INFO  (coreLoadExecutor-185-thread-1-processing-n:127.0.0.1:59232_) [n:127.0.0.1:59232_ c:collection1   x:collection1] o.a.s.s.OpenExchangeRatesOrgProvider Reloading exchange rates from open-exchange-rates.json
   [junit4]   2> 77761 INFO  (coreLoadExecutor-185-thread-1-processing-n:127.0.0.1:59232_) [n:127.0.0.1:59232_ c:collection1   x:collection1] o.a.s.c.ConfigSetProperties Did not find ConfigSet properties, assuming default properties: Can't find resource 'configsetprops.json' in classpath or '/configs/conf1', cwd=/export/home/jenkins/workspace/Lucene-Solr-trunk-Solaris/solr/build/solr-core/test/J0
   [junit4]   2> 77761 INFO  (coreLoadExecutor-185-thread-1-processing-n:127.0.0.1:59232_) [n:127.0.0.1:59232_ c:collection1   x:collection1] o.a.s.c.CoreContainer Creating SolrCore 'collection1' using configuration from collection collection1
   [junit4]   2> 77761 INFO  (coreLoadExecutor-185-thread-1-processing-n:127.0.0.1:59232_) [n:127.0.0.1:59232_ c:collection1 s:shard2 r:core_node1 x:collection1] o.a.s.c.SolrCore org.apache.solr.core.MockDirectoryFactory
   [junit4]   2> 77761 INFO  (coreLoadExecutor-185-thread-1-processing-n:127.0.0.1:59232_) [n:127.0.0.1:59232_ c:collection1 s:shard2 r:core_node1 x:collection1] o.a.s.c.SolrCore [[collection1] ] Opening new SolrCore at [/export/home/jenkins/workspace/Lucene-Solr-trunk-Solaris/solr/build/solr-core/test/J0/temp/solr.cloud.BasicDistributedZkTest_6183C483719D3848-001/shard-1-001/cores/collection1], dataDir=[/export/home/jenkins/workspace/Lucene-Solr-trunk-Solaris/solr/build/solr-core/test/J0/temp/solr.cloud.BasicDistributedZkTest_6183C483719D3848-001/shard-1-001/cores/collection1/data/]
   [junit4]   2> 77762 INFO  (coreLoadExecutor-185-thread-1-processing-n:127.0.0.1:59232_) [n:127.0.0.1:59232_ c:collection1 s:shard2 r:core_node1 x:collection1] o.a.s.c.JmxMonitoredMap JMX monitoring is enabled. Adding Solr mbeans to JMX Server: com.sun.jmx.mbeanserver.JmxMBeanServer@6b51cad8
   [junit4]   2> 77762 INFO  (coreLoadExecutor-185-thread-1-processing-n:127.0.0.1:59232_) [n:127.0.0.1:59232_ c:collection1 s:shard2 r:core_node1 x:collection1] o.a.s.c.CachingDirectoryFactory return new directory for /export/home/jenkins/workspace/Lucene-Solr-trunk-Solaris/solr/build/solr-core/test/J0/temp/solr.cloud.BasicDistributedZkTest_6183C483719D3848-001/shard-1-001/cores/collection1/data
   [junit4]   2> 77762 INFO  (coreLoadExecutor-185-thread-1-processing-n:127.0.0.1:59232_) [n:127.0.0.1:59232_ c:collection1 s:shard2 r:core_node1 x:collection1] o.a.s.c.SolrCore New index directory detected: old=null new=/export/home/jenkins/workspace/Lucene-Solr-trunk-Solaris/solr/build/solr-core/test/J0/temp/solr.cloud.BasicDistributedZkTest_6183C483719D3848-001/shard-1-001/cores/collection1/data/index/
   [junit4]   2> 77762 WARN  (coreLoadExecutor-185-thread-1-processing-n:127.0.0.1:59232_) [n:127.0.0.1:59232_ c:collection1 s:shard2 r:core_node1 x:collection1] o.a.s.c.SolrCore [collection1] Solr index directory '/export/home/jenkins/workspace/Lucene-Solr-trunk-Solaris/solr/build/solr-core/test/J0/temp/solr.cloud.BasicDistributedZkTest_6183C483719D3848-001/shard-1-001/cores/collection1/data/index' doesn't exist. Creating new index...
   [junit4]   2> 77763 INFO  (coreLoadExecutor-185-thread-1-processing-n:127.0.0.1:59232_) [n:127.0.0.1:59232_ c:collection1 s:shard2 r:core_node1 x:collection1] o.a.s.c.CachingDirectoryFactory return new directory for /export/home/jenkins/workspace/Lucene-Solr-trunk-Solaris/solr/build/solr-core/test/J0/temp/solr.cloud.BasicDistributedZkTest_6183C483719D3848-001/shard-1-001/cores/collection1/data/index
   [junit4]   2> 77763 INFO  (coreLoadExecutor-185-thread-1-processing-n:127.0.0.1:59232_) [n:127.0.0.1:59232_ c:collection1 s:shard2 r:core_node1 x:collection1] o.a.s.u.RandomMergePolicy RandomMergePolicy wrapping class org.apache.lucene.index.TieredMergePolicy: [TieredMergePolicy: maxMergeAtOnce=35, maxMergeAtOnceExplicit=15, maxMergedSegmentMB=16.6279296875, floorSegmentMB=0.9111328125, forceMergeDeletesPctAllowed=16.160878900642775, segmentsPerTier=34.0, maxCFSSegmentSizeMB=8.796093022207999E12, noCFSRatio=1.0
   [junit4]   2> 77763 INFO  (coreLoadExecutor-185-thread-1-processing-n:127.0.0.1:59232_) [n:127.0

[...truncated too long message...]

looking to close /export/home/jenkins/workspace/Lucene-Solr-trunk-Solaris/solr/build/solr-core/test/J0/temp/solr.cloud.BasicDistributedZkTest_6183C483719D3848-001/collection2-004/index [CachedDir<<refCount=0;path=/export/home/jenkins/workspace/Lucene-Solr-trunk-Solaris/solr/build/solr-core/test/J0/temp/solr.cloud.BasicDistributedZkTest_6183C483719D3848-001/collection2-004/index;done=false>>]
   [junit4]   2> 150635 INFO  (zkCallback-95-thread-1-processing-n:127.0.0.1:44902_) [n:127.0.0.1:44902_ c:collection2 s:shard1 r:core_node4 x:collection2] o.a.s.c.CachingDirectoryFactory Closing directory: /export/home/jenkins/workspace/Lucene-Solr-trunk-Solaris/solr/build/solr-core/test/J0/temp/solr.cloud.BasicDistributedZkTest_6183C483719D3848-001/collection2-004/index
   [junit4]   2> 150659 INFO  (TEST-BasicDistributedZkTest.test-seed#[6183C483719D3848]) [    ] o.e.j.s.ServerConnector Stopped ServerConnector@3b85b57a{HTTP/1.1}{127.0.0.1:0}
   [junit4]   2> 150659 INFO  (TEST-BasicDistributedZkTest.test-seed#[6183C483719D3848]) [    ] o.e.j.s.h.ContextHandler Stopped o.e.j.s.ServletContextHandler@28f0d72e{/,null,UNAVAILABLE}
   [junit4]   2> 150668 INFO  (TEST-BasicDistributedZkTest.test-seed#[6183C483719D3848]) [n:127.0.0.1:44902_ c:collection3 s:shard1 r:core_node4 x:collection3] o.a.s.c.ZkTestServer connecting to 127.0.0.1:57868 57868
   [junit4]   2> 151807 WARN  (NIOServerCxn.Factory:0.0.0.0/0.0.0.0:0) [    ] o.a.z.s.NIOServerCnxnFactory Ignoring unexpected runtime exception
   [junit4]   2> java.nio.channels.CancelledKeyException
   [junit4]   2> 	at sun.nio.ch.SelectionKeyImpl.ensureValid(SelectionKeyImpl.java:73)
   [junit4]   2> 	at sun.nio.ch.SelectionKeyImpl.readyOps(SelectionKeyImpl.java:87)
   [junit4]   2> 	at org.apache.zookeeper.server.NIOServerCnxnFactory.run(NIOServerCnxnFactory.java:187)
   [junit4]   2> 	at java.lang.Thread.run(Thread.java:745)
   [junit4]   2> 151808 INFO  (Thread-134) [    ] o.a.s.c.ZkTestServer connecting to 127.0.0.1:57868 57868
   [junit4]   2> 151810 WARN  (Thread-134) [    ] o.a.s.c.ZkTestServer Watch limit violations: 
   [junit4]   2> Maximum concurrent create/delete watches above limit:
   [junit4]   2> 
   [junit4]   2> 	7	/solr/aliases.json
   [junit4]   2> 	5	/solr/security.json
   [junit4]   2> 	5	/solr/configs/conf1
   [junit4]   2> 
   [junit4]   2> Maximum concurrent data watches above limit:
   [junit4]   2> 
   [junit4]   2> 	7	/solr/clusterstate.json
   [junit4]   2> 	4	/solr/collections/collection1/state.json
   [junit4]   2> 
   [junit4]   2> Maximum concurrent children watches above limit:
   [junit4]   2> 
   [junit4]   2> 	7	/solr/live_nodes
   [junit4]   2> 	7	/solr/collections
   [junit4]   2> 	4	/solr/overseer/queue
   [junit4]   2> 	4	/solr/overseer/collection-queue-work
   [junit4]   2> 	2	/solr/overseer/queue-work
   [junit4]   2> 
   [junit4]   2> NOTE: reproduce with: ant test  -Dtestcase=BasicDistributedZkTest -Dtests.method=test -Dtests.seed=6183C483719D3848 -Dtests.slow=true -Dtests.locale=sk_SK -Dtests.timezone=America/Grand_Turk -Dtests.asserts=true -Dtests.file.encoding=UTF-8
   [junit4] ERROR   79.2s J0 | BasicDistributedZkTest.test <<<
   [junit4]    > Throwable #1: org.apache.solr.client.solrj.SolrServerException: IOException occured when talking to server at: http://127.0.0.1:59232/collection1
   [junit4]    > 	at __randomizedtesting.SeedInfo.seed([6183C483719D3848:E9D7FB59DF6155B0]:0)
   [junit4]    > 	at org.apache.solr.client.solrj.impl.HttpSolrClient.executeMethod(HttpSolrClient.java:588)
   [junit4]    > 	at org.apache.solr.client.solrj.impl.HttpSolrClient.request(HttpSolrClient.java:240)
   [junit4]    > 	at org.apache.solr.client.solrj.impl.HttpSolrClient.request(HttpSolrClient.java:229)
   [junit4]    > 	at org.apache.solr.client.solrj.SolrClient.request(SolrClient.java:1220)
   [junit4]    > 	at org.apache.solr.cloud.BasicDistributedZkTest.testNumberOfCommitsWithCommitAfterAdd(BasicDistributedZkTest.java:727)
   [junit4]    > 	at org.apache.solr.cloud.BasicDistributedZkTest.test(BasicDistributedZkTest.java:362)
   [junit4]    > 	at org.apache.solr.BaseDistributedSearchTestCase$ShardsRepeatRule$ShardsFixedStatement.callStatement(BaseDistributedSearchTestCase.java:965)
   [junit4]    > 	at org.apache.solr.BaseDistributedSearchTestCase$ShardsRepeatRule$ShardsStatement.evaluate(BaseDistributedSearchTestCase.java:940)
   [junit4]    > 	at java.lang.Thread.run(Thread.java:745)
   [junit4]    > Caused by: org.apache.http.NoHttpResponseException: 127.0.0.1:59232 failed to respond
   [junit4]    > 	at org.apache.http.impl.conn.DefaultHttpResponseParser.parseHead(DefaultHttpResponseParser.java:143)
   [junit4]    > 	at org.apache.http.impl.conn.DefaultHttpResponseParser.parseHead(DefaultHttpResponseParser.java:57)
   [junit4]    > 	at org.apache.http.impl.io.AbstractMessageParser.parse(AbstractMessageParser.java:261)
   [junit4]    > 	at org.apache.http.impl.AbstractHttpClientConnection.receiveResponseHeader(AbstractHttpClientConnection.java:283)
   [junit4]    > 	at org.apache.http.impl.conn.DefaultClientConnection.receiveResponseHeader(DefaultClientConnection.java:251)
   [junit4]    > 	at org.apache.http.impl.conn.ManagedClientConnectionImpl.receiveResponseHeader(ManagedClientConnectionImpl.java:197)
   [junit4]    > 	at org.apache.http.protocol.HttpRequestExecutor.doReceiveResponse(HttpRequestExecutor.java:272)
   [junit4]    > 	at org.apache.http.protocol.HttpRequestExecutor.execute(HttpRequestExecutor.java:124)
   [junit4]    > 	at org.apache.http.impl.client.DefaultRequestDirector.tryExecute(DefaultRequestDirector.java:685)
   [junit4]    > 	at org.apache.http.impl.client.DefaultRequestDirector.execute(DefaultRequestDirector.java:487)
   [junit4]    > 	at org.apache.http.impl.client.AbstractHttpClient.doExecute(AbstractHttpClient.java:882)
   [junit4]    > 	at org.apache.http.impl.client.CloseableHttpClient.execute(CloseableHttpClient.java:82)
   [junit4]    > 	at org.apache.http.impl.client.CloseableHttpClient.execute(CloseableHttpClient.java:107)
   [junit4]    > 	at org.apache.http.impl.client.CloseableHttpClient.execute(CloseableHttpClient.java:55)
   [junit4]    > 	at org.apache.solr.client.solrj.impl.HttpSolrClient.executeMethod(HttpSolrClient.java:479)
   [junit4]    > 	... 46 more
   [junit4]   2> 151814 INFO  (SUITE-BasicDistributedZkTest-seed#[6183C483719D3848]-worker) [n:127.0.0.1:44902_ c:collection3 s:shard1 r:core_node4 x:collection3] o.a.s.SolrTestCaseJ4 ###deleteCore
   [junit4]   2> NOTE: leaving temporary files on disk at: /export/home/jenkins/workspace/Lucene-Solr-trunk-Solaris/solr/build/solr-core/test/J0/temp/solr.cloud.BasicDistributedZkTest_6183C483719D3848-001
   [junit4]   2> NOTE: test params are: codec=Asserting(Lucene60): {other_tl1=Lucene50(blocksize=128), range_facet_l_dv=PostingsFormat(name=Memory doPackFST= false), SubjectTerms_mfacet=Lucene50(blocksize=128), n_l1=Lucene50(blocksize=128), multiDefault=PostingsFormat(name=MockRandom), intDefault=Lucene50(blocksize=128), n_td1=PostingsFormat(name=MockRandom), n_d1=Lucene50(blocksize=128), range_facet_l=Lucene50(blocksize=128), n_f1=PostingsFormat(name=MockRandom), n_tl1=PostingsFormat(name=MockRandom), oddField_s=BlockTreeOrds(blocksize=128), n_tf1=Lucene50(blocksize=128), a_t=Lucene50(blocksize=128), id=PostingsFormat(name=Memory doPackFST= false), text=BlockTreeOrds(blocksize=128), timestamp=Lucene50(blocksize=128), foo_i=PostingsFormat(name=MockRandom), val_i=PostingsFormat(name=Memory doPackFST= false), n_dt1=PostingsFormat(name=MockRandom), a_i1=Lucene50(blocksize=128), n_ti1=PostingsFormat(name=Memory doPackFST= false), rnd_b=PostingsFormat(name=Memory doPackFST= false), _version_=Lucene50(blocksize=128), foo_b=BlockTreeOrds(blocksize=128), n_tdt1=Lucene50(blocksize=128), foo_d=PostingsFormat(name=Memory doPackFST= false), range_facet_i_dv=Lucene50(blocksize=128), foo_f=BlockTreeOrds(blocksize=128)}, docValues:{range_facet_l_dv=DocValuesFormat(name=Direct), range_facet_i_dv=DocValuesFormat(name=Lucene54), timestamp=DocValuesFormat(name=Lucene54)}, sim=ClassicSimilarity, locale=sk_SK, timezone=America/Grand_Turk
   [junit4]   2> NOTE: SunOS 5.11 amd64/Oracle Corporation 1.8.0_66 (64-bit)/cpus=3,threads=1,free=219463304,total=456130560
   [junit4]   2> NOTE: All tests run in this JVM: [TestLMDirichletSimilarityFactory, HardAutoCommitTest, XsltUpdateRequestHandlerTest, BasicAuthIntegrationTest, TestOrdValues, TestFileDictionaryLookup, CdcrReplicationDistributedZkTest, TestPhraseSuggestions, TestHighFrequencyDictionaryFactory, TestCollapseQParserPlugin, BasicDistributedZkTest]
   [junit4] Completed [19/575 (1!)] on J0 in 79.35s, 1 test, 1 error <<< FAILURES!

[...truncated 1802 lines...]
BUILD FAILED
/export/home/jenkins/workspace/Lucene-Solr-trunk-Solaris/build.xml:784: The following error occurred while executing this line:
/export/home/jenkins/workspace/Lucene-Solr-trunk-Solaris/build.xml:728: The following error occurred while executing this line:
/export/home/jenkins/workspace/Lucene-Solr-trunk-Solaris/build.xml:59: The following error occurred while executing this line:
/export/home/jenkins/workspace/Lucene-Solr-trunk-Solaris/solr/build.xml:233: The following error occurred while executing this line:
/export/home/jenkins/workspace/Lucene-Solr-trunk-Solaris/solr/common-build.xml:516: The following error occurred while executing this line:
/export/home/jenkins/workspace/Lucene-Solr-trunk-Solaris/lucene/common-build.xml:1424: The following error occurred while executing this line:
/export/home/jenkins/workspace/Lucene-Solr-trunk-Solaris/lucene/common-build.xml:981: There were test failures: 575 suites (8 ignored), 2290 tests, 1 error, 85 ignored (70 assumptions) [seed: 6183C483719D3848]

Total time: 78 minutes 42 seconds
Build step 'Invoke Ant' marked build as failure
Archiving artifacts
[WARNINGS] Skipping publisher since build result is FAILURE
Recording test results
Email was triggered for: Failure - Any
Sending email for trigger: Failure - Any



Mime
View raw message