lucene-dev mailing list archives

Site index · List index
Message view « Date » · « Thread »
Top « Date » · « Thread »
From Apache Jenkins Server <jenk...@builds.apache.org>
Subject [JENKINS] Lucene-Solr-NightlyTests-5.4 - Build # 15 - Failure
Date Tue, 12 Jan 2016 17:55:10 GMT
Build: https://builds.apache.org/job/Lucene-Solr-NightlyTests-5.4/15/

1 tests failed.
FAILED:  org.apache.solr.cloud.hdfs.HdfsCollectionsAPIDistributedZkTest.test

Error Message:
Captured an uncaught exception in thread: Thread[id=19207, name=collection3, state=RUNNABLE, group=TGRP-HdfsCollectionsAPIDistributedZkTest]

Stack Trace:
com.carrotsearch.randomizedtesting.UncaughtExceptionError: Captured an uncaught exception in thread: Thread[id=19207, name=collection3, state=RUNNABLE, group=TGRP-HdfsCollectionsAPIDistributedZkTest]
Caused by: org.apache.solr.client.solrj.impl.HttpSolrClient$RemoteSolrException: Error from server at http://127.0.0.1:58240: collection already exists: awholynewstresscollection_collection3_6
	at __randomizedtesting.SeedInfo.seed([612A6D5B531C9E3A]:0)
	at org.apache.solr.client.solrj.impl.HttpSolrClient.executeMethod(HttpSolrClient.java:575)
	at org.apache.solr.client.solrj.impl.HttpSolrClient.request(HttpSolrClient.java:241)
	at org.apache.solr.client.solrj.impl.HttpSolrClient.request(HttpSolrClient.java:230)
	at org.apache.solr.client.solrj.impl.LBHttpSolrClient.doRequest(LBHttpSolrClient.java:372)
	at org.apache.solr.client.solrj.impl.LBHttpSolrClient.request(LBHttpSolrClient.java:325)
	at org.apache.solr.client.solrj.impl.CloudSolrClient.sendRequest(CloudSolrClient.java:1100)
	at org.apache.solr.client.solrj.impl.CloudSolrClient.requestWithRetryOnStaleState(CloudSolrClient.java:871)
	at org.apache.solr.client.solrj.impl.CloudSolrClient.request(CloudSolrClient.java:807)
	at org.apache.solr.client.solrj.SolrClient.request(SolrClient.java:1220)
	at org.apache.solr.cloud.AbstractFullDistribZkTestBase.createCollection(AbstractFullDistribZkTestBase.java:1574)
	at org.apache.solr.cloud.AbstractFullDistribZkTestBase.createCollection(AbstractFullDistribZkTestBase.java:1595)
	at org.apache.solr.cloud.CollectionsAPIDistributedZkTest$1CollectionThread.run(CollectionsAPIDistributedZkTest.java:881)




Build Log:
[...truncated 21921 lines...]
   [junit4] Suite: org.apache.solr.cloud.hdfs.HdfsCollectionsAPIDistributedZkTest
   [junit4]   2> Creating dataDir: /x1/jenkins/jenkins-slave/workspace/Lucene-Solr-NightlyTests-5.4/solr/build/solr-core/test/J2/temp/solr.cloud.hdfs.HdfsCollectionsAPIDistributedZkTest_612A6D5B531C9E3A-001/init-core-data-001
   [junit4]   2> 1783414 INFO  (SUITE-HdfsCollectionsAPIDistributedZkTest-seed#[612A6D5B531C9E3A]-worker) [    ] o.a.s.SolrTestCaseJ4 Randomized ssl (false) and clientAuth (true)
   [junit4]   2> 1783414 INFO  (SUITE-HdfsCollectionsAPIDistributedZkTest-seed#[612A6D5B531C9E3A]-worker) [    ] o.a.s.BaseDistributedSearchTestCase Setting hostContext system property: /
   [junit4]   1> Formatting using clusterid: testClusterID
   [junit4]   2> 1783454 WARN  (SUITE-HdfsCollectionsAPIDistributedZkTest-seed#[612A6D5B531C9E3A]-worker) [    ] o.a.h.m.i.MetricsConfig Cannot locate configuration: tried hadoop-metrics2-namenode.properties,hadoop-metrics2.properties
   [junit4]   2> 1783465 WARN  (SUITE-HdfsCollectionsAPIDistributedZkTest-seed#[612A6D5B531C9E3A]-worker) [    ] o.a.h.h.HttpRequestLog Jetty request log can only be enabled using Log4j
   [junit4]   2> 1783469 INFO  (SUITE-HdfsCollectionsAPIDistributedZkTest-seed#[612A6D5B531C9E3A]-worker) [    ] o.m.log jetty-6.1.26
   [junit4]   2> 1783482 INFO  (SUITE-HdfsCollectionsAPIDistributedZkTest-seed#[612A6D5B531C9E3A]-worker) [    ] o.m.log Extract jar:file:/x1/jenkins/.ivy2/cache/org.apache.hadoop/hadoop-hdfs/tests/hadoop-hdfs-2.6.0-tests.jar!/webapps/hdfs to ./temp/Jetty_localhost_36299_hdfs____.bdi953/webapp
   [junit4]   2> 1783602 INFO  (SUITE-HdfsCollectionsAPIDistributedZkTest-seed#[612A6D5B531C9E3A]-worker) [    ] o.m.log NO JSP Support for /, did not find org.apache.jasper.servlet.JspServlet
   [junit4]   2> 1783811 INFO  (SUITE-HdfsCollectionsAPIDistributedZkTest-seed#[612A6D5B531C9E3A]-worker) [    ] o.m.log Started HttpServer2$SelectChannelConnectorWithSafeStartup@localhost:36299
   [junit4]   2> 1783897 WARN  (SUITE-HdfsCollectionsAPIDistributedZkTest-seed#[612A6D5B531C9E3A]-worker) [    ] o.a.h.h.HttpRequestLog Jetty request log can only be enabled using Log4j
   [junit4]   2> 1783899 INFO  (SUITE-HdfsCollectionsAPIDistributedZkTest-seed#[612A6D5B531C9E3A]-worker) [    ] o.m.log jetty-6.1.26
   [junit4]   2> 1783913 INFO  (SUITE-HdfsCollectionsAPIDistributedZkTest-seed#[612A6D5B531C9E3A]-worker) [    ] o.m.log Extract jar:file:/x1/jenkins/.ivy2/cache/org.apache.hadoop/hadoop-hdfs/tests/hadoop-hdfs-2.6.0-tests.jar!/webapps/datanode to ./temp/Jetty_localhost_43938_datanode____68h3vq/webapp
   [junit4]   2> 1784035 INFO  (SUITE-HdfsCollectionsAPIDistributedZkTest-seed#[612A6D5B531C9E3A]-worker) [    ] o.m.log NO JSP Support for /, did not find org.apache.jasper.servlet.JspServlet
   [junit4]   2> 1784269 INFO  (SUITE-HdfsCollectionsAPIDistributedZkTest-seed#[612A6D5B531C9E3A]-worker) [    ] o.m.log Started HttpServer2$SelectChannelConnectorWithSafeStartup@localhost:43938
   [junit4]   2> 1784326 WARN  (SUITE-HdfsCollectionsAPIDistributedZkTest-seed#[612A6D5B531C9E3A]-worker) [    ] o.a.h.h.HttpRequestLog Jetty request log can only be enabled using Log4j
   [junit4]   2> 1784328 INFO  (SUITE-HdfsCollectionsAPIDistributedZkTest-seed#[612A6D5B531C9E3A]-worker) [    ] o.m.log jetty-6.1.26
   [junit4]   2> 1784346 INFO  (SUITE-HdfsCollectionsAPIDistributedZkTest-seed#[612A6D5B531C9E3A]-worker) [    ] o.m.log Extract jar:file:/x1/jenkins/.ivy2/cache/org.apache.hadoop/hadoop-hdfs/tests/hadoop-hdfs-2.6.0-tests.jar!/webapps/datanode to ./temp/Jetty_localhost_56495_datanode____.ex5vgq/webapp
   [junit4]   2> 1784377 INFO  (IPC Server handler 2 on 45332) [    ] BlockStateChange BLOCK* processReport: from storage DS-60881357-1bc8-4d99-b529-6cdccf704abc node DatanodeRegistration(127.0.0.1, datanodeUuid=21cead16-4b36-4157-ba9e-8b5cabd11650, infoPort=43938, ipcPort=38800, storageInfo=lv=-56;cid=testClusterID;nsid=709503098;c=0), blocks: 0, hasStaleStorages: true, processing time: 1 msecs
   [junit4]   2> 1784377 INFO  (IPC Server handler 2 on 45332) [    ] BlockStateChange BLOCK* processReport: from storage DS-cec57444-4f09-4ba6-8c0d-8da234f43b1d node DatanodeRegistration(127.0.0.1, datanodeUuid=21cead16-4b36-4157-ba9e-8b5cabd11650, infoPort=43938, ipcPort=38800, storageInfo=lv=-56;cid=testClusterID;nsid=709503098;c=0), blocks: 0, hasStaleStorages: false, processing time: 0 msecs
   [junit4]   2> 1784479 INFO  (SUITE-HdfsCollectionsAPIDistributedZkTest-seed#[612A6D5B531C9E3A]-worker) [    ] o.m.log NO JSP Support for /, did not find org.apache.jasper.servlet.JspServlet
   [junit4]   2> 1784699 INFO  (SUITE-HdfsCollectionsAPIDistributedZkTest-seed#[612A6D5B531C9E3A]-worker) [    ] o.m.log Started HttpServer2$SelectChannelConnectorWithSafeStartup@localhost:56495
   [junit4]   2> 1784787 INFO  (IPC Server handler 9 on 45332) [    ] BlockStateChange BLOCK* processReport: from storage DS-f2d6815f-e5e0-4815-a958-5aa96c1ec9d4 node DatanodeRegistration(127.0.0.1, datanodeUuid=2090ed37-6237-435d-a530-38dd576aaa99, infoPort=56495, ipcPort=53688, storageInfo=lv=-56;cid=testClusterID;nsid=709503098;c=0), blocks: 0, hasStaleStorages: true, processing time: 1 msecs
   [junit4]   2> 1784787 INFO  (IPC Server handler 9 on 45332) [    ] BlockStateChange BLOCK* processReport: from storage DS-d28ea00b-f698-4d9c-9549-0525eae120df node DatanodeRegistration(127.0.0.1, datanodeUuid=2090ed37-6237-435d-a530-38dd576aaa99, infoPort=56495, ipcPort=53688, storageInfo=lv=-56;cid=testClusterID;nsid=709503098;c=0), blocks: 0, hasStaleStorages: false, processing time: 0 msecs
   [junit4]   2> 1784891 INFO  (TEST-HdfsCollectionsAPIDistributedZkTest.test-seed#[612A6D5B531C9E3A]) [    ] o.a.s.c.ZkTestServer STARTING ZK TEST SERVER
   [junit4]   2> 1784892 INFO  (Thread-10095) [    ] o.a.s.c.ZkTestServer client port:0.0.0.0/0.0.0.0:0
   [junit4]   2> 1784892 INFO  (Thread-10095) [    ] o.a.s.c.ZkTestServer Starting server
   [junit4]   2> 1784992 INFO  (TEST-HdfsCollectionsAPIDistributedZkTest.test-seed#[612A6D5B531C9E3A]) [    ] o.a.s.c.ZkTestServer start zk server on port:40105
   [junit4]   2> 1784992 INFO  (TEST-HdfsCollectionsAPIDistributedZkTest.test-seed#[612A6D5B531C9E3A]) [    ] o.a.s.c.c.SolrZkClient Using default ZkCredentialsProvider
   [junit4]   2> 1784993 INFO  (TEST-HdfsCollectionsAPIDistributedZkTest.test-seed#[612A6D5B531C9E3A]) [    ] o.a.s.c.c.ConnectionManager Waiting for client to connect to ZooKeeper
   [junit4]   2> 1784996 INFO  (zkCallback-1987-thread-1) [    ] o.a.s.c.c.ConnectionManager Watcher org.apache.solr.common.cloud.ConnectionManager@1d4c40cf name:ZooKeeperConnection Watcher:127.0.0.1:40105 got event WatchedEvent state:SyncConnected type:None path:null path:null type:None
   [junit4]   2> 1784996 INFO  (TEST-HdfsCollectionsAPIDistributedZkTest.test-seed#[612A6D5B531C9E3A]) [    ] o.a.s.c.c.ConnectionManager Client is connected to ZooKeeper
   [junit4]   2> 1784996 INFO  (TEST-HdfsCollectionsAPIDistributedZkTest.test-seed#[612A6D5B531C9E3A]) [    ] o.a.s.c.c.SolrZkClient Using default ZkACLProvider
   [junit4]   2> 1784996 INFO  (TEST-HdfsCollectionsAPIDistributedZkTest.test-seed#[612A6D5B531C9E3A]) [    ] o.a.s.c.c.SolrZkClient makePath: /solr
   [junit4]   2> 1784999 INFO  (TEST-HdfsCollectionsAPIDistributedZkTest.test-seed#[612A6D5B531C9E3A]) [    ] o.a.s.c.c.SolrZkClient Using default ZkCredentialsProvider
   [junit4]   2> 1785000 INFO  (TEST-HdfsCollectionsAPIDistributedZkTest.test-seed#[612A6D5B531C9E3A]) [    ] o.a.s.c.c.ConnectionManager Waiting for client to connect to ZooKeeper
   [junit4]   2> 1785001 INFO  (zkCallback-1988-thread-1) [    ] o.a.s.c.c.ConnectionManager Watcher org.apache.solr.common.cloud.ConnectionManager@245a551c name:ZooKeeperConnection Watcher:127.0.0.1:40105/solr got event WatchedEvent state:SyncConnected type:None path:null path:null type:None
   [junit4]   2> 1785001 INFO  (TEST-HdfsCollectionsAPIDistributedZkTest.test-seed#[612A6D5B531C9E3A]) [    ] o.a.s.c.c.ConnectionManager Client is connected to ZooKeeper
   [junit4]   2> 1785002 INFO  (TEST-HdfsCollectionsAPIDistributedZkTest.test-seed#[612A6D5B531C9E3A]) [    ] o.a.s.c.c.SolrZkClient Using default ZkACLProvider
   [junit4]   2> 1785002 INFO  (TEST-HdfsCollectionsAPIDistributedZkTest.test-seed#[612A6D5B531C9E3A]) [    ] o.a.s.c.c.SolrZkClient makePath: /collections/collection1
   [junit4]   2> 1785004 INFO  (TEST-HdfsCollectionsAPIDistributedZkTest.test-seed#[612A6D5B531C9E3A]) [    ] o.a.s.c.c.SolrZkClient makePath: /collections/collection1/shards
   [junit4]   2> 1785005 INFO  (TEST-HdfsCollectionsAPIDistributedZkTest.test-seed#[612A6D5B531C9E3A]) [    ] o.a.s.c.c.SolrZkClient makePath: /collections/control_collection
   [junit4]   2> 1785007 INFO  (TEST-HdfsCollectionsAPIDistributedZkTest.test-seed#[612A6D5B531C9E3A]) [    ] o.a.s.c.c.SolrZkClient makePath: /collections/control_collection/shards
   [junit4]   2> 1785009 INFO  (TEST-HdfsCollectionsAPIDistributedZkTest.test-seed#[612A6D5B531C9E3A]) [    ] o.a.s.c.AbstractZkTestCase put /x1/jenkins/jenkins-slave/workspace/Lucene-Solr-NightlyTests-5.4/solr/core/src/test-files/solr/collection1/conf/solrconfig-tlog.xml to /configs/conf1/solrconfig.xml
   [junit4]   2> 1785009 INFO  (TEST-HdfsCollectionsAPIDistributedZkTest.test-seed#[612A6D5B531C9E3A]) [    ] o.a.s.c.c.SolrZkClient makePath: /configs/conf1/solrconfig.xml
   [junit4]   2> 1785012 INFO  (TEST-HdfsCollectionsAPIDistributedZkTest.test-seed#[612A6D5B531C9E3A]) [    ] o.a.s.c.AbstractZkTestCase put /x1/jenkins/jenkins-slave/workspace/Lucene-Solr-NightlyTests-5.4/solr/core/src/test-files/solr/collection1/conf/schema.xml to /configs/conf1/schema.xml
   [junit4]   2> 1785012 INFO  (TEST-HdfsCollectionsAPIDistributedZkTest.test-seed#[612A6D5B531C9E3A]) [    ] o.a.s.c.c.SolrZkClient makePath: /configs/conf1/schema.xml
   [junit4]   2> 1785014 INFO  (TEST-HdfsCollectionsAPIDistributedZkTest.test-seed#[612A6D5B531C9E3A]) [    ] o.a.s.c.AbstractZkTestCase put /x1/jenkins/jenkins-slave/workspace/Lucene-Solr-NightlyTests-5.4/solr/core/src/test-files/solr/collection1/conf/solrconfig.snippet.randomindexconfig.xml to /configs/conf1/solrconfig.snippet.randomindexconfig.xml
   [junit4]   2> 1785014 INFO  (TEST-HdfsCollectionsAPIDistributedZkTest.test-seed#[612A6D5B531C9E3A]) [    ] o.a.s.c.c.SolrZkClient makePath: /configs/conf1/solrconfig.snippet.randomindexconfig.xml
   [junit4]   2> 1785015 INFO  (TEST-HdfsCollectionsAPIDistributedZkTest.test-seed#[612A6D5B531C9E3A]) [    ] o.a.s.c.AbstractZkTestCase put /x1/jenkins/jenkins-slave/workspace/Lucene-Solr-NightlyTests-5.4/solr/core/src/test-files/solr/collection1/conf/stopwords.txt to /configs/conf1/stopwords.txt
   [junit4]   2> 1785016 INFO  (TEST-HdfsCollectionsAPIDistributedZkTest.test-seed#[612A6D5B531C9E3A]) [    ] o.a.s.c.c.SolrZkClient makePath: /configs/conf1/stopwords.txt
   [junit4]   2> 1785017 INFO  (TEST-HdfsCollectionsAPIDistributedZkTest.test-seed#[612A6D5B531C9E3A]) [    ] o.a.s.c.AbstractZkTestCase put /x1/jenkins/jenkins-slave/workspace/Lucene-Solr-NightlyTests-5.4/solr/core/src/test-files/solr/collection1/conf/protwords.txt to /configs/conf1/protwords.txt
   [junit4]   2> 1785017 INFO  (TEST-HdfsCollectionsAPIDistributedZkTest.test-seed#[612A6D5B531C9E3A]) [    ] o.a.s.c.c.SolrZkClient makePath: /configs/conf1/protwords.txt
   [junit4]   2> 1785019 INFO  (TEST-HdfsCollectionsAPIDistributedZkTest.test-seed#[612A6D5B531C9E3A]) [    ] o.a.s.c.AbstractZkTestCase put /x1/jenkins/jenkins-slave/workspace/Lucene-Solr-NightlyTests-5.4/solr/core/src/test-files/solr/collection1/conf/currency.xml to /configs/conf1/currency.xml
   [junit4]   2> 1785019 INFO  (TEST-HdfsCollectionsAPIDistributedZkTest.test-seed#[612A6D5B531C9E3A]) [    ] o.a.s.c.c.SolrZkClient makePath: /configs/conf1/currency.xml
   [junit4]   2> 1785020 INFO  (TEST-HdfsCollectionsAPIDistributedZkTest.test-seed#[612A6D5B531C9E3A]) [    ] o.a.s.c.AbstractZkTestCase put /x1/jenkins/jenkins-slave/workspace/Lucene-Solr-NightlyTests-5.4/solr/core/src/test-files/solr/collection1/conf/enumsConfig.xml to /configs/conf1/enumsConfig.xml
   [junit4]   2> 1785021 INFO  (TEST-HdfsCollectionsAPIDistributedZkTest.test-seed#[612A6D5B531C9E3A]) [    ] o.a.s.c.c.SolrZkClient makePath: /configs/conf1/enumsConfig.xml
   [junit4]   2> 1785022 INFO  (TEST-HdfsCollectionsAPIDistributedZkTest.test-seed#[612A6D5B531C9E3A]) [    ] o.a.s.c.AbstractZkTestCase put /x1/jenkins/jenkins-slave/workspace/Lucene-Solr-NightlyTests-5.4/solr/core/src/test-files/solr/collection1/conf/open-exchange-rates.json to /configs/conf1/open-exchange-rates.json
   [junit4]   2> 1785022 INFO  (TEST-HdfsCollectionsAPIDistributedZkTest.test-seed#[612A6D5B531C9E3A]) [    ] o.a.s.c.c.SolrZkClient makePath: /configs/conf1/open-exchange-rates.json
   [junit4]   2> 1785024 INFO  (TEST-HdfsCollectionsAPIDistributedZkTest.test-seed#[612A6D5B531C9E3A]) [    ] o.a.s.c.AbstractZkTestCase put /x1/jenkins/jenkins-slave/workspace/Lucene-Solr-NightlyTests-5.4/solr/core/src/test-files/solr/collection1/conf/mapping-ISOLatin1Accent.txt to /configs/conf1/mapping-ISOLatin1Accent.txt
   [junit4]   2> 1785024 INFO  (TEST-HdfsCollectionsAPIDistributedZkTest.test-seed#[612A6D5B531C9E3A]) [    ] o.a.s.c.c.SolrZkClient makePath: /configs/conf1/mapping-ISOLatin1Accent.txt
   [junit4]   2> 1785025 INFO  (TEST-HdfsCollectionsAPIDistributedZkTest.test-seed#[612A6D5B531C9E3A]) [    ] o.a.s.c.AbstractZkTestCase put /x1/jenkins/jenkins-slave/workspace/Lucene-Solr-NightlyTests-5.4/solr/core/src/test-files/solr/collection1/conf/old_synonyms.txt to /configs/conf1/old_synonyms.txt
   [junit4]   2> 1785026 INFO  (TEST-HdfsCollectionsAPIDistributedZkTest.test-seed#[612A6D5B531C9E3A]) [    ] o.a.s.c.c.SolrZkClient makePath: /configs/conf1/old_synonyms.txt
   [junit4]   2> 1785027 INFO  (TEST-HdfsCollectionsAPIDistributedZkTest.test-seed#[612A6D5B531C9E3A]) [    ] o.a.s.c.AbstractZkTestCase put /x1/jenkins/jenkins-slave/workspace/Lucene-Solr-NightlyTests-5.4/solr/core/src/test-files/solr/collection1/conf/synonyms.txt to /configs/conf1/synonyms.txt
   [junit4]   2> 1785027 INFO  (TEST-HdfsCollectionsAPIDistributedZkTest.test-seed#[612A6D5B531C9E3A]) [    ] o.a.s.c.c.SolrZkClient makePath: /configs/conf1/synonyms.txt
   [junit4]   2> 1785029 INFO  (TEST-HdfsCollectionsAPIDistributedZkTest.test-seed#[612A6D5B531C9E3A]) [    ] o.a.s.c.c.SolrZkClient Using default ZkCredentialsProvider
   [junit4]   2> 1785030 INFO  (TEST-HdfsCollectionsAPIDistributedZkTest.test-seed#[612A6D5B531C9E3A]) [    ] o.a.s.c.c.ConnectionManager Waiting for client to connect to ZooKeeper
   [junit4]   2> 1785032 INFO  (zkCallback-1989-thread-1) [    ] o.a.s.c.c.ConnectionManager Watcher org.apache.solr.common.cloud.ConnectionManager@5cc3c0b1 name:ZooKeeperConnection Watcher:127.0.0.1:40105 got event WatchedEvent state:SyncConnected type:None path:null path:null type:None
   [junit4]   2> 1785032 INFO  (TEST-HdfsCollectionsAPIDistributedZkTest.test-seed#[612A6D5B531C9E3A]) [    ] o.a.s.c.c.ConnectionManager Client is connected to ZooKeeper
   [junit4]   2> 1785033 INFO  (TEST-HdfsCollectionsAPIDistributedZkTest.test-seed#[612A6D5B531C9E3A]) [    ] o.a.s.c.c.SolrZkClient Using default ZkACLProvider
   [junit4]   2> 1785033 INFO  (TEST-HdfsCollectionsAPIDistributedZkTest.test-seed#[612A6D5B531C9E3A]) [    ] o.a.s.c.c.SolrZkClient makePath: /solr
   [junit4]   2> 1785035 INFO  (TEST-HdfsCollectionsAPIDistributedZkTest.test-seed#[612A6D5B531C9E3A]) [    ] o.a.s.c.c.SolrZkClient Using default ZkCredentialsProvider
   [junit4]   2> 1785035 INFO  (TEST-HdfsCollectionsAPIDistributedZkTest.test-seed#[612A6D5B531C9E3A]) [    ] o.a.s.c.c.ConnectionManager Waiting for client to connect to ZooKeeper
   [junit4]   2> 1785037 INFO  (zkCallback-1990-thread-1) [    ] o.a.s.c.c.ConnectionManager Watcher org.apache.solr.common.cloud.ConnectionManager@15fc620a name:ZooKeeperConnection Watcher:127.0.0.1:40105/solr got event WatchedEvent state:SyncConnected type:None path:null path:null type:None
   [junit4]   2> 1785037 INFO  (TEST-HdfsCollectionsAPIDistributedZkTest.test-seed#[612A6D5B531C9E3A]) [    ] o.a.s.c.c.ConnectionManager Client is connected to ZooKeeper
   [junit4]   2> 1785037 INFO  (TEST-HdfsCollectionsAPIDistributedZkTest.test-seed#[612A6D5B531C9E3A]) [    ] o.a.s.c.c.SolrZkClient Using default ZkACLProvider
   [junit4]   2> 1785037 INFO  (TEST-HdfsCollectionsAPIDistributedZkTest.test-seed#[612A6D5B531C9E3A]) [    ] o.a.s.c.AbstractZkTestCase put /x1/jenkins/jenkins-slave/workspace/Lucene-Solr-NightlyTests-5.4/solr/core/src/test-files/solr/collection1/conf/solrconfig-tlog.xml to /configs/conf2/solrconfig.xml
   [junit4]   2> 1785038 INFO  (TEST-HdfsCollectionsAPIDistributedZkTest.test-seed#[612A6D5B531C9E3A]) [    ] o.a.s.c.c.SolrZkClient makePath: /configs/conf2/solrconfig.xml
   [junit4]   2> 1785040 INFO  (TEST-HdfsCollectionsAPIDistributedZkTest.test-seed#[612A6D5B531C9E3A]) [    ] o.a.s.c.AbstractZkTestCase put /x1/jenkins/jenkins-slave/workspace/Lucene-Solr-NightlyTests-5.4/solr/core/src/test-files/solr/collection1/conf/schema.xml to /configs/conf2/schema.xml
   [junit4]   2> 1785040 INFO  (TEST-HdfsCollectionsAPIDistributedZkTest.test-seed#[612A6D5B531C9E3A]) [    ] o.a.s.c.c.SolrZkClient makePath: /configs/conf2/schema.xml
   [junit4]   2> 1785042 INFO  (TEST-HdfsCollectionsAPIDistributedZkTest.test-seed#[612A6D5B531C9E3A]) [    ] o.a.s.c.AbstractZkTestCase put /x1/jenkins/jenkins-slave/workspace/Lucene-Solr-NightlyTests-5.4/solr/core/src/test-files/solr/collection1/conf/enumsConfig.xml to /configs/conf2/enumsConfig.xml
   [junit4]   2> 1785042 INFO  (TEST-HdfsCollectionsAPIDistributedZkTest.test-seed#[612A6D5B531C9E3A]) [    ] o.a.s.c.c.SolrZkClient makePath: /configs/conf2/enumsConfig.xml
   [junit4]   2> 1785043 INFO  (TEST-HdfsCollectionsAPIDistributedZkTest.test-seed#[612A6D5B531C9E3A]) [    ] o.a.s.c.AbstractZkTestCase put /x1/jenkins/jenkins-slave/workspace/Lucene-Solr-NightlyTests-5.4/solr/core/src/test-files/solr/collection1/conf/solrconfig.snippet.randomindexconfig.xml to /configs/conf2/solrconfig.snippet.randomindexconfig.xml
   [junit4]   2> 1785044 INFO  (TEST-HdfsCollectionsAPIDistributedZkTest.test-seed#[612A6D5B531C9E3A]) [    ] o.a.s.c.c.SolrZkClient makePath: /configs/conf2/solrconfig.snippet.randomindexconfig.xml
   [junit4]   2> 1785045 INFO  (TEST-HdfsCollectionsAPIDistributedZkTest.test-seed#[612A6D5B531C9E3A]) [    ] o.a.s.c.AbstractZkTestCase put /x1/jenkins/jenkins-slave/workspace/Lucene-Solr-NightlyTests-5.4/solr/core/src/test-files/solr/collection1/conf/stopwords.txt to /configs/conf2/stopwords.txt
   [junit4]   2> 1785045 INFO  (TEST-HdfsCollectionsAPIDistributedZkTest.test-seed#[612A6D5B531C9E3A]) [    ] o.a.s.c.c.SolrZkClient makePath: /configs/conf2/stopwords.txt
   [junit4]   2> 1785047 INFO  (TEST-HdfsCollectionsAPIDistributedZkTest.test-seed#[612A6D5B531C9E3A]) [    ] o.a.s.c.AbstractZkTestCase put /x1/jenkins/jenkins-slave/workspace/Lucene-Solr-NightlyTests-5.4/solr/core/src/test-files/solr/collection1/conf/protwords.txt to /configs/conf2/protwords.txt
   [junit4]   2> 1785047 INFO  (TEST-HdfsCollectionsAPIDistributedZkTest.test-seed#[612A6D5B531C9E3A]) [    ] o.a.s.c.c.SolrZkClient makePath: /configs/conf2/protwords.txt
   [junit4]   2> 1785048 INFO  (TEST-HdfsCollectionsAPIDistributedZkTest.test-seed#[612A6D5B531C9E3A]) [    ] o.a.s.c.AbstractZkTestCase put /x1/jenkins/jenkins-slave/workspace/Lucene-Solr-NightlyTests-5.4/solr/core/src/test-files/solr/collection1/conf/currency.xml to /configs/conf2/currency.xml
   [junit4]   2> 1785048 INFO  (TEST-HdfsCollectionsAPIDistributedZkTest.test-seed#[612A6D5B531C9E3A]) [    ] o.a.s.c.c.SolrZkClient makePath: /configs/conf2/currency.xml
   [junit4]   2> 1785050 INFO  (TEST-HdfsCollectionsAPIDistributedZkTest.test-seed#[612A6D5B531C9E3A]) [    ] o.a.s.c.AbstractZkTestCase put /x1/jenkins/jenkins-slave/workspace/Lucene-Solr-NightlyTests-5.4/solr/core/src/test-files/solr/collection1/conf/open-exchange-rates.json to /configs/conf2/open-exchange-rates.json
   [junit4]   2> 1785050 INFO  (TEST-HdfsCollectionsAPIDistributedZkTest.test-seed#[612A6D5B531C9E3A]) [    ] o.a.s.c.c.SolrZkClient makePath: /configs/conf2/open-exchange-rates.json
   [junit4]   2> 1785051 INFO  (TEST-HdfsCollectionsAPIDistributedZkTest.test-seed#[612A6D5B531C9E3A]) [    ] o.a.s.c.AbstractZkTestCase put /x1/jenkins/jenkins-slave/workspace/Lucene-Solr-NightlyTests-5.4/solr/core/src/test-files/solr/collection1/conf/mapping-ISOLatin1Accent.txt to /configs/conf2/mapping-ISOLatin1Accent.txt
   [junit4]   2> 1785052 INFO  (TEST-HdfsCollectionsAPIDistributedZkTest.test-seed#[612A6D5B531C9E3A]) [    ] o.a.s.c.c.SolrZkClient makePath: /configs/conf2/mapping-ISOLatin1Accent.txt
   [junit4]   2> 1785053 INFO  (TEST-HdfsCollectionsAPIDistributedZkTest.test-seed#[612A6D5B531C9E3A]) [    ] o.a.s.c.AbstractZkTestCase put /x1/jenkins/jenkins-slave/workspace/Lucene-Solr-NightlyTests-5.4/solr/core/src/test-files/solr/collection1/conf/old_synonyms.txt to /configs/conf2/old_synonyms.txt
   [junit4]   2> 1785053 INFO  (TEST-HdfsCollectionsAPIDistributedZkTest.test-seed#[612A6D5B531C9E3A]) [    ] o.a.s.c.c.SolrZkClient makePath: /configs/conf2/old_synonyms.txt
   [junit4]   2> 1785055 INFO  (TEST-HdfsCollectionsAPIDistributedZkTest.test-seed#[612A6D5B531C9E3A]) [    ] o.a.s.c.AbstractZkTestCase put /x1/jenkins/jenkins-slave/workspace/Lucene-Solr-NightlyTests-5.4/solr/core/src/test-files/solr/collection1/conf/synonyms.txt to /configs/conf2/synonyms.txt
   [junit4]   2> 1785055 INFO  (TEST-HdfsCollectionsAPIDistributedZkTest.test-seed#[612A6D5B531C9E3A]) [    ] o.a.s.c.c.SolrZkClient makePath: /configs/conf2/synonyms.txt
   [junit4]   2> 1785056 INFO  (TEST-HdfsCollectionsAPIDistributedZkTest.test-seed#[612A6D5B531C9E3A]) [    ] o.a.s.c.AbstractZkTestCase put /x1/jenkins/jenkins-slave/workspace/Lucene-Solr-NightlyTests-5.4/solr/core/src/test-files/solr/collection1/conf/elevate.xml to /configs/conf2/elevate.xml
   [junit4]   2> 1785057 INFO  (TEST-HdfsCollectionsAPIDistributedZkTest.test-seed#[612A6D5B531C9E3A]) [    ] o.a.s.c.c.SolrZkClient makePath: /configs/conf2/elevate.xml
   [junit4]   2> 1785140 INFO  (TEST-HdfsCollectionsAPIDistributedZkTest.test-seed#[612A6D5B531C9E3A]) [    ] o.a.s.SolrTestCaseJ4 Writing core.properties file to /x1/jenkins/jenkins-slave/workspace/Lucene-Solr-NightlyTests-5.4/solr/build/solr-core/test/J2/temp/solr.cloud.hdfs.HdfsCollectionsAPIDistributedZkTest_612A6D5B531C9E3A-001/control-001/cores/collection1
   [junit4]   2> 1785142 INFO  (TEST-HdfsCollectionsAPIDistributedZkTest.test-seed#[612A6D5B531C9E3A]) [    ] o.e.j.s.Server jetty-9.2.13.v20150730
   [junit4]   2> 1785144 INFO  (TEST-HdfsCollectionsAPIDistributedZkTest.test-seed#[612A6D5B531C9E3A]) [    ] o.e.j.s.h.ContextHandler Started o.e.j.s.ServletContextHandler@6ba39159{/,null,AVAILABLE}
   [junit4]   2> 1785144 INFO  (TEST-HdfsCollectionsAPIDistributedZkTest.test-seed#[612A6D5B531C9E3A]) [    ] o.e.j.s.ServerConnector Started ServerConnector@27897fc{HTTP/1.1}{127.0.0.1:55412}
   [junit4]   2> 1785145 INFO  (TEST-HdfsCollectionsAPIDistributedZkTest.test-seed#[612A6D5B531C9E3A]) [    ] o.e.j.s.Server Started @1787828ms
   [junit4]   2> 1785145 INFO  (TEST-HdfsCollectionsAPIDistributedZkTest.test-seed#[612A6D5B531C9E3A]) [    ] o.a.s.c.s.e.JettySolrRunner Jetty properties: {hostContext=/, coreRootDirectory=/x1/jenkins/jenkins-slave/workspace/Lucene-Solr-NightlyTests-5.4/solr/build/solr-core/test/J2/temp/solr.cloud.hdfs.HdfsCollectionsAPIDistributedZkTest_612A6D5B531C9E3A-001/control-001/cores, hostPort=55412, solr.data.dir=hdfs://localhost:45332/hdfs__localhost_45332__x1_jenkins_jenkins-slave_workspace_Lucene-Solr-NightlyTests-5.4_solr_build_solr-core_test_J2_temp_solr.cloud.hdfs.HdfsCollectionsAPIDistributedZkTest_612A6D5B531C9E3A-001_tempDir-002_control_data}
   [junit4]   2> 1785145 INFO  (TEST-HdfsCollectionsAPIDistributedZkTest.test-seed#[612A6D5B531C9E3A]) [    ] o.a.s.s.SolrDispatchFilter SolrDispatchFilter.init(): sun.misc.Launcher$AppClassLoader@7b3cb2c6
   [junit4]   2> 1785145 INFO  (TEST-HdfsCollectionsAPIDistributedZkTest.test-seed#[612A6D5B531C9E3A]) [    ] o.a.s.c.SolrResourceLoader new SolrResourceLoader for directory: '/x1/jenkins/jenkins-slave/workspace/Lucene-Solr-NightlyTests-5.4/solr/build/solr-core/test/J2/temp/solr.cloud.hdfs.HdfsCollectionsAPIDistributedZkTest_612A6D5B531C9E3A-001/control-001'
   [junit4]   2> 1785145 INFO  (TEST-HdfsCollectionsAPIDistributedZkTest.test-seed#[612A6D5B531C9E3A]) [    ] o.a.s.c.SolrResourceLoader JNDI not configured for solr (NoInitialContextEx)
   [junit4]   2> 1785145 INFO  (TEST-HdfsCollectionsAPIDistributedZkTest.test-seed#[612A6D5B531C9E3A]) [    ] o.a.s.c.SolrResourceLoader solr home defaulted to 'solr/' (could not find system property or JNDI)
   [junit4]   2> 1785145 INFO  (TEST-HdfsCollectionsAPIDistributedZkTest.test-seed#[612A6D5B531C9E3A]) [    ] o.a.s.c.c.SolrZkClient Using default ZkCredentialsProvider
   [junit4]   2> 1785146 INFO  (TEST-HdfsCollectionsAPIDistributedZkTest.test-seed#[612A6D5B531C9E3A]) [    ] o.a.s.c.c.ConnectionManager Waiting for client to connect to ZooKeeper
   [junit4]   2> 1785148 INFO  (zkCallback-1991-thread-1) [    ] o.a.s.c.c.ConnectionManager Watcher org.apache.solr.common.cloud.ConnectionManager@66e09f36 name:ZooKeeperConnection Watcher:127.0.0.1:40105/solr got event WatchedEvent state:SyncConnected type:None path:null path:null type:None
   [junit4]   2> 1785148 INFO  (TEST-HdfsCollectionsAPIDistributedZkTest.test-seed#[612A6D5B531C9E3A]) [    ] o.a.s.c.c.ConnectionManager Client is connected to ZooKeeper
   [junit4]   2> 1785148 INFO  (TEST-HdfsCollectionsAPIDistributedZkTest.test-seed#[612A6D5B531C9E3A]) [    ] o.a.s.c.c.SolrZkClient Using default ZkACLProvider
   [junit4]   2> 1785149 INFO  (TEST-HdfsCollectionsAPIDistributedZkTest.test-seed#[612A6D5B531C9E3A]) [    ] o.a.s.s.SolrDispatchFilter Loading solr.xml from SolrHome (not found in ZooKeeper)
   [junit4]   2> 1785149 INFO  (TEST-HdfsCollectionsAPIDistributedZkTest.test-seed#[612A6D5B531C9E3A]) [    ] o.a.s.c.SolrXmlConfig Loading container configuration from /x1/jenkins/jenkins-slave/workspace/Lucene-Solr-NightlyTests-5.4/solr/build/solr-core/test/J2/temp/solr.cloud.hdfs.HdfsCollectionsAPIDistributedZkTest_612A6D5B531C9E3A-001/control-001/solr.xml
   [junit4]   2> 1785163 INFO  (TEST-HdfsCollectionsAPIDistributedZkTest.test-seed#[612A6D5B531C9E3A]) [    ] o.a.s.c.CorePropertiesLocator Config-defined core root directory: /x1/jenkins/jenkins-slave/workspace/Lucene-Solr-NightlyTests-5.4/solr/build/solr-core/test/J2/temp/solr.cloud.hdfs.HdfsCollectionsAPIDistributedZkTest_612A6D5B531C9E3A-001/control-001/cores
   [junit4]   2> 1785163 INFO  (TEST-HdfsCollectionsAPIDistributedZkTest.test-seed#[612A6D5B531C9E3A]) [    ] o.a.s.c.CoreContainer New CoreContainer 226308382
   [junit4]   2> 1785163 INFO  (TEST-HdfsCollectionsAPIDistributedZkTest.test-seed#[612A6D5B531C9E3A]) [    ] o.a.s.c.CoreContainer Loading cores into CoreContainer [instanceDir=/x1/jenkins/jenkins-slave/workspace/Lucene-Solr-NightlyTests-5.4/solr/build/solr-core/test/J2/temp/solr.cloud.hdfs.HdfsCollectionsAPIDistributedZkTest_612A6D5B531C9E3A-001/control-001]
   [junit4]   2> 1785164 WARN  (TEST-HdfsCollectionsAPIDistributedZkTest.test-seed#[612A6D5B531C9E3A]) [    ] o.a.s.c.CoreContainer Couldn't add files from /x1/jenkins/jenkins-slave/workspace/Lucene-Solr-NightlyTests-5.4/solr/build/solr-core/test/J2/temp/solr.cloud.hdfs.HdfsCollectionsAPIDistributedZkTest_612A6D5B531C9E3A-001/control-001/lib to classpath: /x1/jenkins/jenkins-slave/workspace/Lucene-Solr-NightlyTests-5.4/solr/build/solr-core/test/J2/temp/solr.cloud.hdfs.HdfsCollectionsAPIDistributedZkTest_612A6D5B531C9E3A-001/control-001/lib
   [junit4]   2> 1785164 INFO  (TEST-HdfsCollectionsAPIDistributedZkTest.test-seed#[612A6D5B531C9E3A]) [    ] o.a.s.h.c.HttpShardHandlerFactory created with socketTimeout : 90000,urlScheme : ,connTimeout : 15000,maxConnectionsPerHost : 20,maxConnections : 10000,corePoolSize : 0,maximumPoolSize : 2147483647,maxThreadIdleTime : 5,sizeOfQueue : -1,fairnessPolicy : false,useRetries : false,
   [junit4]   2> 1785165 INFO  (TEST-HdfsCollectionsAPIDistributedZkTest.test-seed#[612A6D5B531C9E3A]) [    ] o.a.s.u.UpdateShardHandler Creating UpdateShardHandler HTTP client with params: socketTimeout=340000&connTimeout=45000&retry=true
   [junit4]   2> 1785166 INFO  (TEST-HdfsCollectionsAPIDistributedZkTest.test-seed#[612A6D5B531C9E3A]) [    ] o.a.s.l.LogWatcher SLF4J impl is org.slf4j.impl.Log4jLoggerFactory
   [junit4]   2> 1785166 INFO  (TEST-HdfsCollectionsAPIDistributedZkTest.test-seed#[612A6D5B531C9E3A]) [    ] o.a.s.l.LogWatcher Registering Log Listener [Log4j (org.slf4j.impl.Log4jLoggerFactory)]
   [junit4]   2> 1785166 INFO  (TEST-HdfsCollectionsAPIDistributedZkTest.test-seed#[612A6D5B531C9E3A]) [    ] o.a.s.c.ZkContainer Zookeeper client=127.0.0.1:40105/solr
   [junit4]   2> 1785166 INFO  (TEST-HdfsCollectionsAPIDistributedZkTest.test-seed#[612A6D5B531C9E3A]) [    ] o.a.s.c.ZkController zkHost includes chroot
   [junit4]   2> 1785166 INFO  (TEST-HdfsCollectionsAPIDistributedZkTest.test-seed#[612A6D5B531C9E3A]) [    ] o.a.s.c.c.SolrZkClient Using default ZkCredentialsProvider
   [junit4]   2> 1785166 INFO  (TEST-HdfsCollectionsAPIDistributedZkTest.test-seed#[612A6D5B531C9E3A]) [    ] o.a.s.c.c.ConnectionManager Waiting for client to connect to ZooKeeper
   [junit4]   2> 1785168 INFO  (zkCallback-1993-thread-1) [    ] o.a.s.c.c.ConnectionManager Watcher org.apache.solr.common.cloud.ConnectionManager@5971395b name:ZooKeeperConnection Watcher:127.0.0.1:40105 got event WatchedEvent state:SyncConnected type:None path:null path:null type:None
   [junit4]   2> 1785168 INFO  (TEST-HdfsCollectionsAPIDistributedZkTest.test-seed#[612A6D5B531C9E3A]) [    ] o.a.s.c.c.ConnectionManager Client is connected to ZooKeeper
   [junit4]   2> 1785168 INFO  (TEST-HdfsCollectionsAPIDistributedZkTest.test-seed#[612A6D5B531C9E3A]) [    ] o.a.s.c.c.SolrZkClient Using default ZkACLProvider
   [junit4]   2> 1785170 INFO  (TEST-HdfsCollectionsAPIDistributedZkTest.test-seed#[612A6D5B531C9E3A]) [n:127.0.0.1:55412_    ] o.a.s.c.c.ConnectionManager Waiting for client to connect to ZooKeeper
   [junit4]   2> 1785171 INFO  (zkCallback-1994-thread-1-processing-n:127.0.0.1:55412_) [n:127.0.0.1:55412_    ] o.a.s.c.c.ConnectionManager Watcher org.apache.solr.common.cloud.ConnectionManager@2e55907d name:ZooKeeperConnection Watcher:127.0.0.1:40105/solr got event WatchedEvent state:SyncConnected type:None path:null path:null type:None
   [junit4]   2> 1785171 INFO  (TEST-HdfsCollectionsAPIDistributedZkTest.test-seed#[612A6D5B531C9E3A]) [n:127.0.0.1:55412_    ] o.a.s.c.c.ConnectionManager Client is connected to ZooKeeper
   [junit4]   2> 1785172 INFO  (TEST-HdfsCollectionsAPIDistributedZkTest.test-seed#[612A6D5B531C9E3A]) [n:127.0.0.1:55412_    ] o.a.s.c.c.SolrZkClient makePath: /overseer/queue
   [junit4]   2> 1785174 INFO  (TEST-HdfsCollectionsAPIDistributedZkTest.test-seed#[612A6D5B531C9E3A]) [n:127.0.0.1:55412_    ] o.a.s.c.c.SolrZkClient makePath: /overseer/collection-queue-work
   [junit4]   2> 1785177 INFO  (TEST-HdfsCollectionsAPIDistributedZkTest.test-seed#[612A6D5B531C9E3A]) [n:127.0.0.1:55412_    ] o.a.s.c.c.SolrZkClient makePath: /overseer/collection-map-running
   [junit4]   2> 1785178 INFO  (TEST-HdfsCollectionsAPIDistributedZkTest.test-seed#[612A6D5B531C9E3A]) [n:127.0.0.1:55412_    ] o.a.s.c.c.SolrZkClient makePath: /overseer/collection-map-completed
   [junit4]   2> 1785180 INFO  (TEST-HdfsCollectionsAPIDistributedZkTest.test-seed#[612A6D5B531C9E3A]) [n:127.0.0.1:55412_    ] o.a.s.c.c.SolrZkClient makePath: /overseer/collection-map-failure
   [junit4]   2> 1785182 INFO  (TEST-HdfsCollectionsAPIDistributedZkTest.test-seed#[612A6D5B531C9E3A]) [n:127.0.0.1:55412_    ] o.a.s.c.c.SolrZkClient makePath: /live_nodes
   [junit4]   2> 1785183 INFO  (TEST-HdfsCollectionsAPIDistributedZkTest.test-seed#[612A6D5B531C9E3A]) [n:127.0.0.1:55412_    ] o.a.s.c.c.SolrZkClient makePath: /aliases.json
   [junit4]   2> 1785184 INFO  (TEST-HdfsCollectionsAPIDistributedZkTest.test-seed#[612A6D5B531C9E3A]) [n:127.0.0.1:55412_    ] o.a.s.c.c.SolrZkClient makePath: /clusterstate.json
   [junit4]   2> 1785186 INFO  (TEST-HdfsCollectionsAPIDistributedZkTest.test-seed#[612A6D5B531C9E3A]) [n:127.0.0.1:55412_    ] o.a.s.c.c.SolrZkClient makePath: /security.json
   [junit4]   2> 1785187 INFO  (TEST-HdfsCollectionsAPIDistributedZkTest.test-seed#[612A6D5B531C9E3A]) [n:127.0.0.1:55412_    ] o.a.s.c.ZkController Register node as live in ZooKeeper:/live_nodes/127.0.0.1:55412_
   [junit4]   2> 1785187 INFO  (TEST-HdfsCollectionsAPIDistributedZkTest.test-seed#[612A6D5B531C9E3A]) [n:127.0.0.1:55412_    ] o.a.s.c.c.SolrZkClient makePath: /live_nodes/127.0.0.1:55412_
   [junit4]   2> 1785189 INFO  (TEST-HdfsCollectionsAPIDistributedZkTest.test-seed#[612A6D5B531C9E3A]) [n:127.0.0.1:55412_    ] o.a.s.c.c.SolrZkClient makePath: /overseer_elect
   [junit4]   2> 1785190 INFO  (TEST-HdfsCollectionsAPIDistributedZkTest.test-seed#[612A6D5B531C9E3A]) [n:127.0.0.1:55412_    ] o.a.s.c.c.SolrZkClient makePath: /overseer_elect/election
   [junit4]   2> 1785191 INFO  (TEST-HdfsCollectionsAPIDistributedZkTest.test-seed#[612A6D5B531C9E3A]) [n:127.0.0.1:55412_    ] o.a.s.c.Overseer Overseer (id=null) closing
   [junit4]   2> 1785191 INFO  (TEST-HdfsCollectionsAPIDistributedZkTest.test-seed#[612A6D5B531C9E3A]) [n:127.0.0.1:55412_    ] o.a.s.c.LeaderElector Joined leadership election with path: /overseer_elect/election/95198806994386950-127.0.0.1:55412_-n_0000000000
   [junit4]   2> 1785192 INFO  (TEST-HdfsCollectionsAPIDistributedZkTest.test-seed#[612A6D5B531C9E3A]) [n:127.0.0.1:55412_    ] o.a.s.c.OverseerElectionContext I am going to be the leader 127.0.0.1:55412_
   [junit4]   2> 1785192 INFO  (TEST-HdfsCollectionsAPIDistributedZkTest.test-seed#[612A6D5B531C9E3A]) [n:127.0.0.1:55412_    ] o.a.s.c.c.SolrZkClient makePath: /overseer_elect/leader
   [junit4]   2> 1785193 INFO  (TEST-HdfsCollectionsAPIDistributedZkTest.test-seed#[612A6D5B531C9E3A]) [n:127.0.0.1:55412_    ] o.a.s.c.Overseer Overseer (id=95198806994386950-127.0.0.1:55412_-n_0000000000) starting
   [junit4]   2> 1785195 INFO  (TEST-HdfsCollectionsAPIDistributedZkTest.test-seed#[612A6D5B531C9E3A]) [n:127.0.0.1:55412_    ] o.a.s.c.c.SolrZkClient makePath: /overseer/queue-work
   [junit4]   2> 1785201 INFO  (TEST-HdfsCollectionsAPIDistributedZkTest.test-seed#[612A6D5B531C9E3A]) [n:127.0.0.1:55412_    ] o.a.s.c.OverseerAutoReplicaFailoverThread Starting OverseerAutoReplicaFailoverThread autoReplicaFailoverWorkLoopDelay=10000 autoReplicaFailoverWaitAfterExpiration=10000 autoReplicaFailoverBadNodeExpiration=60000
   [junit4]   2> 1785202 INFO  (OverseerCollectionConfigSetProcessor-95198806994386950-127.0.0.1:55412_-n_0000000000) [n:127.0.0.1:55412_    ] o.a.s.c.OverseerTaskProcessor Process current queue of overseer operations
   [junit4]   2> 1785202 INFO  (OverseerStateUpdate-95198806994386950-127.0.0.1:55412_-n_0000000000) [n:127.0.0.1:55412_    ] o.a.s.c.Overseer Starting to work on the main queue
   [junit4]   2> 1785202 INFO  (TEST-HdfsCollectionsAPIDistributedZkTest.test-seed#[612A6D5B531C9E3A]) [n:127.0.0.1:55412_    ] o.a.s.c.c.ZkStateReader Updating cluster state from ZooKeeper... 
   [junit4]   2> 1785222 INFO  (TEST-HdfsCollectionsAPIDistributedZkTest.test-seed#[612A6D5B531C9E3A]) [n:127.0.0.1:55412_    ] o.a.s.c.CoreContainer Security conf doesn't exist. Skipping setup for authorization module.
   [junit4]   2> 1785222 INFO  (TEST-HdfsCollectionsAPIDistributedZkTest.test-seed#[612A6D5B531C9E3A]) [n:127.0.0.1:55412_    ] o.a.s.c.CoreContainer No authentication plugin used.
   [junit4]   2> 1785223 INFO  (TEST-HdfsCollectionsAPIDistributedZkTest.test-seed#[612A6D5B531C9E3A]) [n:127.0.0.1:55412_    ] o.a.s.c.CorePropertiesLocator Looking for core definitions underneath /x1/jenkins/jenkins-slave/workspace/Lucene-Solr-NightlyTests-5.4/solr/build/solr-core/test/J2/temp/solr.cloud.hdfs.HdfsCollectionsAPIDistributedZkTest_612A6D5B531C9E3A-001/control-001/cores
   [junit4]   2> 1785224 INFO  (TEST-HdfsCollectionsAPIDistributedZkTest.test-seed#[612A6D5B531C9E3A]) [n:127.0.0.1:55412_    ] o.a.s.c.CoreDescriptor Created CoreDescriptor: {shard=, absoluteInstDir=/x1/jenkins/jenkins-slave/workspace/Lucene-Solr-NightlyTests-5.4/solr/build/solr-core/test/J2/temp/solr.cloud.hdfs.HdfsCollectionsAPIDistributedZkTest_612A6D5B531C9E3A-001/control-001/cores/collection1/, instanceDir=/x1/jenkins/jenkins-slave/workspace/Lucene-Solr-NightlyTests-5.4/solr/build/solr-core/test/J2/temp/solr.cloud.hdfs.HdfsCollectionsAPIDistributedZkTest_612A6D5B531C9E3A-001/control-001/cores/collection1, transient=false, name=collection1, schema=schema.xml, config=solrconfig.xml, coreNodeName=, dataDir=data/, loadOnStartup=true, configSetProperties=configsetprops.json, collection=control_collection}
   [junit4]   2> 1785224 INFO  (TEST-HdfsCollectionsAPIDistributedZkTest.test-seed#[612A6D5B531C9E3A]) [n:127.0.0.1:55412_    ] o.a.s.c.CorePropertiesLocator Found core collection1 in /x1/jenkins/jenkins-slave/workspace/Lucene-Solr-NightlyTests-5.4/solr/build/solr-core/test/J2/temp/solr.cloud.hdfs.HdfsCollectionsAPIDistributedZkTest_612A6D5B531C9E3A-001/control-001/cores/collection1/
   [junit4]   2> 1785224 INFO  (TEST-HdfsCollectionsAPIDistributedZkTest.test-seed#[612A6D5B531C9E3A]) [n:127.0.0.1:55412_    ] o.a.s.c.CorePropertiesLocator Found 1 core definitions
   [junit4]   2> 1785225 INFO  (coreLoadExecutor-4256-thread-1-processing-n:127.0.0.1:55412_) [n:127.0.0.1:55412_ c:control_collection   x:collection1] o.a.s.c.ZkController publishing state=down
   [junit4]   2> 1785226 INFO  (coreLoadExecutor-4256-thread-1-processing-n:127.0.0.1:55412_) [n:127.0.0.1:55412_ c:control_collection   x:collection1] o.a.s.c.ZkController numShards not found on descriptor - reading it from system property
   [junit4]   2> 1785226 INFO  (TEST-HdfsCollectionsAPIDistributedZkTest.test-seed#[612A6D5B531C9E3A]) [n:127.0.0.1:55412_    ] o.a.s.s.SolrDispatchFilter user.dir=/x1/jenkins/jenkins-slave/workspace/Lucene-Solr-NightlyTests-5.4/solr/build/solr-core/test/J2
   [junit4]   2> 1785226 INFO  (TEST-HdfsCollectionsAPIDistributedZkTest.test-seed#[612A6D5B531C9E3A]) [n:127.0.0.1:55412_    ] o.a.s.s.SolrDispatchFilter SolrDispatchFilter.init() done
   [junit4]   2> 1785228 INFO  (OverseerStateUpdate-95198806994386950-127.0.0.1:55412_-n_0000000000) [n:127.0.0.1:55412_    ] o.a.s.c.Overseer processMessage: queueSize: 1, message = {
   [junit4]   2>   "state":"down",
   [junit4]   2>   "roles":null,
   [junit4]   2>   "operation":"state",
   [junit4]   2>   "base_url":"http://127.0.0.1:55412",
   [junit4]   2>   "collection":"control_collection",
   [junit4]   2>   "numShards":"1",
   [junit4]   2>   "core":"collection1",
   [junit4]   2>   "node_name":"127.0.0.1:55412_",
   [junit4]   2>   "shard":null} current state version: 0
   [junit4]   2> 1785228 INFO  (coreLoadExecutor-4256-thread-1-processing-n:127.0.0.1:55412_) [n:127.0.0.1:55412_ c:control_collection   x:collection1] o.a.s.c.ZkController look for our core node name
   [junit4]   2> 1785228 INFO  (OverseerStateUpdate-95198806994386950-127.0.0.1:55412_-n_0000000000) [n:127.0.0.1:55412_    ] o.a.s.c.o.ReplicaMutator Update state numShards=1 message={
   [junit4]   2>   "state":"down",
   [junit4]   2>   "roles":null,
   [junit4]   2>   "operation":"state",
   [junit4]   2>   "base_url":"http://127.0.0.1:55412",
   [junit4]   2>   "collection":"control_collection",
   [junit4]   2>   "numShards":"1",
   [junit4]   2>   "core":"collection1",
   [junit4]   2>   "node_name":"127.0.0.1:55412_",
   [junit4]   2>   "shard":null}
   [junit4]   2> 1785228 INFO  (OverseerStateUpdate-95198806994386950-127.0.0.1:55412_-n_0000000000) [n:127.0.0.1:55412_    ] o.a.s.c.o.ClusterStateMutator building a new cName: control_collection
   [junit4]   2> 1785229 INFO  (OverseerStateUpdate-95198806994386950-127.0.0.1:55412_-n_0000000000) [n:127.0.0.1:55412_    ] o.a.s.c.o.ReplicaMutator Assigning new node to shard shard=shard1
   [junit4]   2> 1785230 INFO  (zkCallback-1994-thread-1-processing-n:127.0.0.1:55412_) [n:127.0.0.1:55412_    ] o.a.s.c.c.ZkStateReader A cluster state change: WatchedEvent state:SyncConnected type:NodeDataChanged path:/clusterstate.json, has occurred - updating... (live nodes size: 1)
   [junit4]   2> 1786228 INFO  (coreLoadExecutor-4256-thread-1-processing-n:127.0.0.1:55412_) [n:127.0.0.1:55412_ c:control_collection   x:collection1] o.a.s.c.ZkController waiting to find shard id in clusterstate for collection1
   [junit4]   2> 1786228 INFO  (coreLoadExecutor-4256-thread-1-processing-n:127.0.0.1:55412_) [n:127.0.0.1:55412_ c:control_collection   x:collection1] o.a.s.c.ZkController Check for collection zkNode:control_collection
   [junit4]   2> 1786229 INFO  (coreLoadExecutor-4256-thread-1-processing-n:127.0.0.1:55412_) [n:127.0.0.1:55412_ c:control_collection   x:collection1] o.a.s.c.ZkController Collection zkNode exists
   [junit4]   2> 1786229 INFO  (coreLoadExecutor-4256-thread-1-processing-n:127.0.0.1:55412_) [n:127.0.0.1:55412_ c:control_collection   x:collection1] o.a.s.c.c.ZkStateReader Load collection config from:/collections/control_collection
   [junit4]   2> 1786229 INFO  (coreLoadExecutor-4256-thread-1-processing-n:127.0.0.1:55412_) [n:127.0.0.1:55412_ c:control_collection   x:collection1] o.a.s.c.c.ZkStateReader path=/collections/control_collection configName=conf1 specified config exists in ZooKeeper
   [junit4]   2> 1786230 INFO  (coreLoadExecutor-4256-thread-1-processing-n:127.0.0.1:55412_) [n:127.0.0.1:55412_ c:control_collection   x:collection1] o.a.s.c.SolrResourceLoader new SolrResourceLoader for directory: '/x1/jenkins/jenkins-slave/workspace/Lucene-Solr-NightlyTests-5.4/solr/build/solr-core/test/J2/temp/solr.cloud.hdfs.HdfsCollectionsAPIDistributedZkTest_612A6D5B531C9E3A-001/control-001/cores/collection1'
   [junit4]   2> 1786230 INFO  (coreLoadExecutor-4256-thread-1-processing-n:127.0.0.1:55412_) [n:127.0.0.1:55412_ c:control_collection   x:collection1] o.a.s.c.SolrResourceLoader JNDI not configured for solr (NoInitialContextEx)
   [junit4]   2> 1786230 INFO  (coreLoadExecutor-4256-thread-1-processing-n:127.0.0.1:55412_) [n:127.0.0.1:55412_ c:control_collection   x:collection1] o.a.s.c.SolrResourceLoader solr home defaulted to 'solr/' (could not find system property or JNDI)
   [junit4]   2> 1786231 INFO  (coreLoadExecutor-4256-thread-1-processing-n:127.0.0.1:55412_) [n:127.0.0.1:55412_ c:control_collection   x:collection1] o.a.s.c.Config loaded config solrconfig.xml with version 0 
   [junit4]   2> 1786237 INFO  (coreLoadExecutor-4256-thread-1-processing-n:127.0.0.1:55412_) [n:127.0.0.1:55412_ c:control_collection   x:collection1] o.a.s.c.SolrConfig current version of requestparams : -1
   [junit4]   2> 1786261 INFO  (coreLoadExecutor-4256-thread-1-processing-n:127.0.0.1:55412_) [n:127.0.0.1:55412_ c:control_collection   x:collection1] o.a.s.c.SolrConfig Using Lucene MatchVersion: 5.4.0
   [junit4]   2> 1786319 INFO  (coreLoadExecutor-4256-thread-1-processing-n:127.0.0.1:55412_) [n:127.0.0.1:55412_ c:control_collection   x:collection1] o.a.s.c.SolrConfig Loaded SolrConfig: solrconfig.xml
   [junit4]   2> 1786327 INFO  (coreLoadExecutor-4256-thread-1-processing-n:127.0.0.1:55412_) [n:127.0.0.1:55412_ c:control_collection   x:collection1] o.a.s.s.IndexSchema [collection1] Schema name=test
   [junit4]   2> 1786592 INFO  (coreLoadExecutor-4256-thread-1-processing-n:127.0.0.1:55412_) [n:127.0.0.1:55412_ c:control_collection   x:collection1] o.a.s.s.OpenExchangeRatesOrgProvider Initialized with rates=open-exchange-rates.json, refreshInterval=1440.
   [junit4]   2> 1786600 INFO  (coreLoadExecutor-4256-thread-1-processing-n:127.0.0.1:55412_) [n:127.0.0.1:55412_ c:control_collection   x:collection1] o.a.s.s.IndexSchema default search field in schema is text
   [junit4]   2> 1786602 INFO  (coreLoadExecutor-4256-thread-1-processing-n:127.0.0.1:55412_) [n:127.0.0.1:55412_ c:control_collection   x:collection1] o.a.s.s.IndexSchema unique key field: id
   [junit4]   2> 1786611 INFO  (coreLoadExecutor-4256-thread-1-processing-n:127.0.0.1:55412_) [n:127.0.0.1:55412_ c:control_collection   x:collection1] o.a.s.s.FileExchangeRateProvider Reloading exchange rates from file currency.xml
   [junit4]   2> 1786614 INFO  (coreLoadExecutor-4256-thread-1-processing-n:127.0.0.1:55412_) [n:127.0.0.1:55412_ c:control_collection   x:collection1] o.a.s.s.FileExchangeRateProvider Reloading exchange rates from file currency.xml
   [junit4]   2> 1786617 INFO  (coreLoadExecutor-4256-thread-1-processing-n:127.0.0.1:55412_) [n:127.0.0.1:55412_ c:control_collection   x:collection1] o.a.s.s.OpenExchangeRatesOrgProvider Reloading exchange rates from open-exchange-rates.json
   [junit4]   2> 1786618 WARN  (coreLoadExecutor-4256-thread-1-processing-n:127.0.0.1:55412_) [n:127.0.0.1:55412_ c:control_collection   x:collection1] o.a.s.s.OpenExchangeRatesOrgProvider Unknown key IMPORTANT NOTE
   [junit4]   2> 1786618 WARN  (coreLoadExecutor-4256-thread-1-processing-n:127.0.0.1:55412_) [n:127.0.0.1:55412_ c:control_collection   x:collection1] o.a.s.s.OpenExchangeRatesOrgProvider Expected key, got STRING
   [junit4]   2> 1786618 INFO  (coreLoadExecutor-4256-thread-1-processing-n:127.0.0.1:55412_) [n:127.0.0.1:55412_ c:control_collection   x:collection1] o.a.s.s.OpenExchangeRatesOrgProvider Reloading exchange rates from open-exchange-rates.json
   [junit4]   2> 1786619 WARN  (coreLoadExecutor-4256-thread-1-processing-n:127.0.0.1:55412_) [n:127.0.0.1:55412_ c:control_collection   x:collection1] o.a.s.s.OpenExchangeRatesOrgProvider Unknown key IMPORTANT NOTE
   [junit4]   2> 1786619 WARN  (coreLoadExecutor-4256-thread-1-processing-n:127.0.0.1:55412_) [n:127.0.0.1:55412_ c:control_collection   x:collection1] o.a.s.s.OpenExchangeRatesOrgProvider Expected key, got STRING
   [junit4]   2> 1786620 INFO  (coreLoadExecutor-4256-thread-1-processing-n:127.0.0.1:55412_) [n:127.0.0.1:55412_ c:control_collection   x:collection1] o.a.s.c.ConfigSetProperties Did not find ConfigSet properties, assuming default properties: Can't find resource 'configsetprops.json' in classpath or '/configs/conf1', cwd=/x1/jenkins/jenkins-slave/workspace/Lucene-Solr-NightlyTests-5.4/solr/build/solr-core/test/J2
   [junit4]   2> 1786620 INFO  (coreLoadExecutor-4256-thread-1-processing-n:127.0.0.1:55412_) [n:127.0.0.1:55412_ c:control_collection   x:collection1] o.a.s.c.CoreContainer Creating SolrCore 'collection1' using configuration from collection control_collection
   [junit4]   2> 1786621 INFO  (coreLoadExecutor-4256-thread-1-processing-n:127.0.0.1:55412_) [n:127.0.0.1:55412_ c:control_collection s:shard1 r:core_node1 x:collection1] o.a.s.c.SolrCore org.apache.solr.core.HdfsDirectoryFactory
   [junit4]   2> 1786621 INFO  (coreLoadExecutor-4256-thread-1-processing-n:127.0.0.1:55412_) [n:127.0.0.1:55412_ c:control_collection s:shard1 r:core_node1 x:collection1] o.a.s.c.HdfsDirectoryFactory solr.hdfs.home=hdfs://localhost:45332/solr_hdfs_home
   [junit4]   2> 1786621 INFO  (coreLoadExecutor-4256-thread-1-processing-n:127.0.0.1:55412_) [n:127.0.0.1:55412_ c:control_collection s:shard1 r:core_node1 x:collection1] o.a.s.c.HdfsDirectoryFactory Solr Kerberos Authentication disabled
   [junit4]   2> 1786621 INFO  (coreLoadExecutor-4256-thread-1-processing-n:127.0.0.1:55412_) [n:127.0.0.1:55412_ c:control_collection s:shard1 r:core_node1 x:collection1] o.a.s.c.SolrCore [[collection1] ] Opening new SolrCore at [/x1/jenkins/jenkins-slave/workspace/Lucene-Solr-NightlyTests-5.4/solr/build/solr-core/test/J2/temp/solr.cloud.hdfs.HdfsCollectionsAPIDistributedZkTest_612A6D5B531C9E3A-001/control-001/cores/collection1], dataDir=[null]
   [junit4]   2> 1786621 INFO  (coreLoadExecutor-4256-thread-1-processing-n:127.0.0.1:55412_) [n:127.0.0.1:55412_ c:control_collection s:shard1 r:core_node1 x:collection1] o.a.s.c.JmxMonitoredMap JMX monitoring is enabled. Adding Solr mbeans to JMX Server: com.sun.jmx.mbeanserver.JmxMBeanServer@74fe99bf
   [junit4]   2> 1786621 INFO  (coreLoadExecutor-4256-thread-1-processing-n:127.0.0.1:55412_) [n:127.0.0.1:55412_ c:control_collection s:shard1 r:core_node1 x:collection1] o.a.s.c.HdfsDirectoryFactory creating directory factory for path hdfs://localhost:45332/solr_hdfs_home/control_collection/core_node1/data
   [junit4]   2> 1786644 INFO  (coreLoadExecutor-4256-thread-1-processing-n:127.0.0.1:55412_) [n:127.0.0.1:55412_ c:control_collection s:shard1 r:core_node1 x:collection1] o.a.s.c.CachingDirectoryFactory return new directory for hdfs://localhost:45332/solr_hdfs_home/control_collection/core_node1/data
   [junit4]   2> 1786649 INFO  (coreLoadExecutor-4256-thread-1-processing-n:127.0.0.1:55412_) [n:127.0.0.1:55412_ c:control_collection s:shard1 r:core_node1 x:collection1] o.a.s.c.SolrCore New index directory detected: old=null new=hdfs://localhost:45332/solr_hdfs_home/control_collection/core_node1/data/index/
   [junit4]   2> 1786660 WARN  (coreLoadExecutor-4256-thread-1-processing-n:127.0.0.1:55412_) [n:127.0.0.1:55412_ c:control_collection s:shard1 r:core_node1 x:collection1] o.a.s.c.SolrCore [collection1] Solr index directory 'hdfs:/localhost:45332/solr_hdfs_home/control_collection/core_node1/data/index' doesn't exist. Creating new index...
   [junit4]   2> 1786660 INFO  (coreLoadExecutor-4256-thread-1-processing-n:127.0.0.1:55412_) [n:127.0.0.1:55412_ c:control_collection s:shard1 r:core_node1 x:collection1] o.a.s.c.HdfsDirectoryFactory creating directory factory for path hdfs://localhost:45332/solr_hdfs_home/control_collection/core_node1/data/index
   [junit4]   2> 1786674 INFO  (coreLoadExecutor-4256-thread-1-processing-n:127.0.0.1:55412_) [n:127.0.0.1:55412_ c:control_collection s:shard1 r:core_node1 x:collection1] o.a.s.c.CachingDirectoryFactory return new directory for hdfs://localhost:45332/solr_hdfs_home/control_collection/core_node1/data/index
   [junit4]   2> 1786675 INFO  (coreLoadExecutor-4256-thread-1-processing-n:127.0.0.1:55412_) [n:127.0.0.1:55412_ c:control_collection s:shard1 r:core_node1 x:collection1] o.a.s.u.RandomMergePolicy RandomMergePolicy wrapping class org.apache.lucene.index.AlcoholicMergePolicy: [AlcoholicMergePolicy: minMergeSize=0, mergeFactor=10, maxMergeSize=783206675, maxMergeSizeForForcedMerge=9223372036854775807, calibrateSizeByDeletes=true, maxMergeDocs=2147483647, maxCFSSegmentSizeMB=8.796093022207999E12, noCFSRatio=0.1]
   [junit4]   2> 1786698 INFO  (IPC Server handler 8 on 45332) [    ] BlockStateChange BLOCK* addStoredBlock: blockMap updated: 127.0.0.1:40001 is added to blk_1073741825_1001{blockUCState=UNDER_CONSTRUCTION, primaryNodeIndex=-1, replicas=[ReplicaUnderConstruction[[DISK]DS-f2d6815f-e5e0-4815-a958-5aa96c1ec9d4:NORMAL:127.0.0.1:48667|RBW], ReplicaUnderConstruction[[DISK]DS-cec57444-4f09-4ba6-8c0d-8da234f43b1d:NORMAL:127.0.0.1:40001|RBW]]} size 0
   [junit4]   2> 1786700 INFO  (IPC Server handler 0 on 45332) [    ] BlockStateChange BLOCK* addStoredBlock: blockMap updated: 127.0.0.1:48667 is added to blk_1073741825_1001{blockUCState=UNDER_CONSTRUCTION, primaryNodeIndex=-1, replicas=[ReplicaUnderConstruction[[DISK]DS-cec57444-4f09-4ba6-8c0d-8da234f43b1d:NORMAL:127.0.0.1:40001|RBW], ReplicaUnderConstruction[[DISK]DS-d28ea00b-f698-4d9c-9549-0525eae120df:NORMAL:127.0.0.1:48667|FINALIZED]]} size 0
   [junit4]   2> 1786703 INFO  (coreLoadExecutor-4256-thread-1-processing-n:127.0.0.1:55412_) [n:127.0.0.1:55412_ c:control_collection s:shard1 r:core_node1 x:collection1] o.a.s.c.SolrDeletionPolicy SolrDeletionPolicy.onCommit: commits: num=1
   [junit4]   2> 	commit{dir=NRTCachingDirectory(HdfsDirectory@b76d75ba lockFactory=org.apache.lucene.store.SingleInstanceLockFactory@680c7b91; maxCacheMB=192.0 maxMergeSizeMB=16.0),segFN=segments_1,generation=1}
   [junit4]   2> 1786703 INFO  (coreLoadExecutor-4256-thread-1-processing-n:127.0.0.1:55412_) [n:127.0.0.1:55412_ c:control_collection s:shard1 r:core_node1 x:collection1] o.a.s.c.SolrDeletionPolicy newest commit generation = 1
   [junit4]   2> 1786705 INFO  (OldIndexDirectoryCleanupThreadForCore-collection1) [n:127.0.0.1:55412_ c:control_collection s:shard1 r:core_node1 x:collection1] o.a.s.c.SolrCore Looking for old index directories to cleanup for core collection1 in hdfs://localhost:45332/solr_hdfs_home/control_collection/core_node1/data/
   [junit4]   2> 1786709 INFO  (coreLoadExecutor-4256-thread-1-processing-n:127.0.0.1:55412_) [n:127.0.0.1:55412_ c:control_collection s:shard1 r:core_node1 x:collection1] o.a.s.u.p.UpdateRequestProcessorChain creating updateRequestProcessorChain "nodistrib"
   [junit4]   2> 1786709 INFO  (coreLoadExecutor-4256-thread-1-processing-n:127.0.0.1:55412_) [n:127.0.0.1:55412_ c:control_collection s:shard1 r:core_node1 x:collection1] o.a.s.u.p.UpdateRequestProcessorChain creating updateRequestProcessorChain "dedupe"
   [junit4]   2> 1786709 INFO  (coreLoadExecutor-4256-thread-1-processing-n:127.0.0.1:55412_) [n:127.0.0.1:55412_ c:control_collection s:shard1 r:core_node1 x:collection1] o.a.s.u.p.UpdateRequestProcessorChain inserting DistributedUpdateProcessorFactory into updateRequestProcessorChain "dedupe"
   [junit4]   2> 1786709 INFO  (coreLoadExecutor-4256-thread-1-processing-n:127.0.0.1:55412_) [n:127.0.0.1:55412_ c:control_collection s:shard1 r:core_node1 x:collection1] o.a.s.u.p.UpdateRequestProcessorChain creating updateRequestProcessorChain "stored_sig"
   [junit4]   2> 1786709 INFO  (coreLoadExecutor-4256-thread-1-processing-n:127.0.0.1:55412_) [n:127.0.0.1:55412_ c:control_collection s:shard1 r:core_node1 x:collection1] o.a.s.u.p.UpdateRequestProcessorChain inserting DistributedUpdateProcessorFactory into updateRequestProcessorChain "stored_sig"
   [junit4]   2> 1786709 INFO  (coreLoadExecutor-4256-thread-1-processing-n:127.0.0.1:55412_) [n:127.0.0.1:55412_ c:control_collection s:shard1 r:core_node1 x:collection1] o.a.s.u.p.UpdateRequestProcessorChain creating updateRequestProcessorChain "distrib-dup-test-chain-explicit"
   [junit4]   2> 1786710 INFO  (coreLoadExecutor-4256-thread-1-processing-n:127.0.0.1:55412_) [n:127.0.0.1:55412_ c:control_collection s:shard1 r:core_node1 x:collection1] o.a.s.u.p.UpdateRequestProcessorChain creating updateRequestProcessorChain "distrib-dup-test-chain-implicit"
   [junit4]   2> 1786710 INFO  (coreLoadExecutor-4256-thread-1-processing-n:127.0.0.1:55412_) [n:127.0.0.1:55412_ c:control_collection s:shard1 r:core_node1 x:collection1] o.a.s.u.p.UpdateRequestProcessorChain inserting DistributedUpdateProcessorFactory into updateRequestProcessorChain "distrib-dup-test-chain-implicit"
   [junit4]   2> 1786710 INFO  (coreLoadExecutor-4256-thread-1-processing-n:127.0.0.1:55412_) [n:127.0.0.1:55412_ c:control_collection s:shard1 r:core_node1 x:collection1] o.a.s.c.SolrCore no updateRequestProcessorChain defined as default, creating implicit default
   [junit4]   2> 1786710 WARN  (coreLoadExecutor-4256-thread-1-processing-n:127.0.0.1:55412_) [n:127.0.0.1:55412_ c:control_collection s:shard1 r:core_node1 x:collection1] o.a.s.c.RequestHandlers INVALID paramSet a in requestHandler {type = requestHandler,name = /dump,class = DumpRequestHandler,args = {defaults={a=A,b=B}}}
   [junit4]   2> 1786713 INFO  (coreLoadExecutor-4256-thread-1-processing-n:127.0.0.1:55412_) [n:127.0.0.1:55412_ c:control_collection s:shard1 r:core_node1 x:collection1] o.a.s.h.l.XMLLoader xsltCacheLifetimeSeconds=60
   [junit4]   2> 1786732 INFO  (coreLoadExecutor-4256-thread-1-processing-n:127.0.0.1:55412_) [n:127.0.0.1:55412_ c:control_collection s:shard1 r:core_node1 x:collection1] o.a.s.h.l.XMLLoader xsltCacheLifetimeSeconds=60
   [junit4]   2> 1786734 INFO  (coreLoadExecutor-4256-thread-1-processing-n:127.0.0.1:55412_) [n:127.0.0.1:55412_ c:control_collection s:shard1 r:core_node1 x:collection1] o.a.s.h.l.XMLLoader xsltCacheLifetimeSeconds=60
   [junit4]   2> 1786735 INFO  (coreLoadExecutor-4256-thread-1-processing-n:127.0.0.1:55412_) [n:127.0.0.1:55412_ c:control_collection s:shard1 r:core_node1 x:collection1] o.a.s.h.l.XMLLoader xsltCacheLifetimeSeconds=60
   [junit4]   2> 1786740 INFO  (coreLoadExecutor-4256-thread-1-processing-n:127.0.0.1:55412_) [n:127.0.0.1:55412_ c:control_collection s:shard1 r:core_node1 x:collection1] o.a.s.c.RequestHandlers Registered paths: /admin/ping,/schema,/admin/system,/update/csv,/replication,/get,/update/json/docs,/admin/luke,/config,/admin/mbeans,/dump,/admin/file,/admin/plugins,/admin/segments,/admin/threads,/update,standard,/admin/properties,/admin/logging,/update/json
   [junit4]   2> 1786743 INFO  (coreLoadExecutor-4256-thread-1-processing-n:127.0.0.1:55412_) [n:127.0.0.1:55412_ c:control_collection s:shard1 r:core_node1 x:collection1] o.a.s.c.SolrCore Using default statsCache cache: org.apache.solr.search.stats.LocalStatsCache
   [junit4]   2> 1786743 INFO  (coreLoadExecutor-4256-thread-1-processing-n:127.0.0.1:55412_) [n:127.0.0.1:55412_ c:control_collection s:shard1 r:core_node1 x:collection1] o.a.s.u.UpdateHandler Using UpdateLog implementation: org.apache.solr.update.HdfsUpdateLog
   [junit4]   2> 1786743 INFO  (coreLoadExecutor-4256-thread-1-processing-n:127.0.0.1:55412_) [n:127.0.0.1:55412_ c:control_collection s:shard1 r:core_node1 x:collection1] o.a.s.u.HdfsUpdateLog Initializing HdfsUpdateLog: dataDir= defaultSyncLevel=FLUSH numRecordsToKeep=100 maxNumLogsToKeep=10 tlogDfsReplication=2
   [junit4]   2> 1786755 INFO  (coreLoadExecutor-4256-thread-1-processing-n:127.0.0.1:55412_) [n:127.0.0.1:55412_ c:control_collection s:shard1 r:core_node1 x:collection1] o.a.s.u.CommitTracker Hard AutoCommit: disabled
   [junit4]   2> 1786755 INFO  (coreLoadExecutor-4256-thread-1-processing-n:127.0.0.1:55412_) [n:127.0.0.1:55412_ c:control_collection s:shard1 r:core_node1 x:collection1] o.a.s.u.CommitTracker Soft AutoCommit: disabled
   [junit4]   2> 1786757 INFO  (coreLoadExecutor-4256-thread-1-processing-n:127.0.0.1:55412_) [n:127.0.0.1:55412_ c:control_collection s:shard1 r:core_node1 x:collection1] o.a.s.u.RandomMergePolicy RandomMergePolicy wrapping class org.apache.lucene.index.TieredMergePolicy: [TieredMergePolicy: maxMergeAtOnce=40, maxMergeAtOnceExplicit=43, maxMergedSegmentMB=2.134765625, floorSegmentMB=1.7802734375, forceMergeDeletesPctAllowed=7.520985014126548, segmentsPerTier=13.0, maxCFSSegmentSizeMB=8.796093022207999E12, noCFSRatio=0.0
   [junit4]   2> 1786765 INFO  (coreLoadExecutor-4256-thread-1-processing-n:127.0.0.1:55412_) [n:127.0.0.1:55412_ c:control_collection s:shard1 r:core_node1 x:collection1] o.a.s.c.SolrDeletionPolicy SolrDeletionPolicy.onInit: commits: num=1
   [junit4]   2> 	commit{dir=NRTCachingDirectory(HdfsDirectory@b76d75ba lockFactory=org.apache.lucene.store.SingleInstanceLockFactory@680c7b91; maxCacheMB=192.0 maxMergeSizeMB=16.0),segFN=segments_1,generation=1}
   [junit4]   2> 1786765 INFO  (coreLoadExecutor-4256-thread-1-processing-n:127.0.0.1:55412_) [n:127.0.0.1:55412_ c:control_collection s:shard1 r:core_node1 x:collection1] o.a.s.c.SolrDeletionPolicy newest commit generation = 1
   [junit4]   2> 1786765 INFO  (coreLoadExecutor-4256-thread-1-processing-n:127.0.0.1:55412_) [n:127.0.0.1:55412_ c:control_collection s:shard1 r:core_node1 x:collection1] o.a.s.s.SolrIndexSearcher Opening Searcher@730fa7cf[collection1] main
   [junit4]   2> 1786766 INFO  (coreLoadExecutor-4256-thread-1-processing-n:127.0.0.1:55412_) [n:127.0.0.1:55412_ c:control_collection s:shard1 r:core_node1 x:collection1] o.a.s.c.c.ZkStateReader Load collection config from:/collections/control_collection
   [junit4]   2> 1786767 INFO  (coreLoadExecutor-4256-thread-1-processing-n:127.0.0.1:55412_) [n:127.0.0.1:55412_ c:control_collection s:shard1 r:core_node1 x:collection1] o.a.s.c.c.ZkStateReader path=/collections/control_collection configName=conf1 specified config exists in ZooKeeper
   [junit4]   2> 1786767 INFO  (coreLoadExecutor-4256-thread-1-processing-n:127.0.0.1:55412_) [n:127.0.0.1:55412_ c:control_collection s:shard1 r:core_node1 x:collection1] o.a.s.r.ManagedResourceStorage Setting up ZooKeeper-based storage for the RestManager with znodeBase: /configs/conf1
   [junit4]   2> 1786767 INFO  (coreLoadExecutor-4256-thread-1-processing-n:127.0.0.1:55412_) [n:127.0.0.1:55412_ c:control_collection s:shard1 r:core_node1 x:collection1] o.a.s.r.ManagedResourceStorage Configured ZooKeeperStorageIO with znodeBase: /configs/conf1
   [junit4]   2> 1786768 INFO  (coreLoadExecutor-4256-thread-1-processing-n:127.0.0.1:55412_) [n:127.0.0.1:55412_ c:control_collection s:shard1 r:core_node1 x:collection1] o.a.s.r.RestManager Initializing RestManager with initArgs: {}
   [junit4]   2> 1786768 INFO  (coreLoadExecutor-4256-thread-1-processing-n:127.0.0.1:55412_) [n:127.0.0.1:55412_ c:control_collection s:shard1 r:core_node1 x:collection1] o.a.s.r.ManagedResourceStorage Reading _rest_managed.json using ZooKeeperStorageIO:path=/configs/conf1
   [junit4]   2> 1786768 INFO  (coreLoadExecutor-4256-thread-1-processing-n:127.0.0.1:55412_) [n:127.0.0.1:55412_ c:control_collection s:shard1 r:core_node1 x:collection1] o.a.s.r.ManagedResourceStorage No data found for znode /configs/conf1/_rest_managed.json
   [junit4]   2> 1786768 INFO  (coreLoadExecutor-4256-thread-1-processing-n:127.0.0.1:55412_) [n:127.0.0.1:55412_ c:control_collection s:shard1 r:core_node1 x:collection1] o.a.s.r.ManagedResourceStorage Loaded null at path _rest_managed.json using ZooKeeperStorageIO:path=/configs/conf1
   [junit4]   2> 1786768 INFO  (coreLoadExecutor-4256-thread-1-processing-n:127.0.0.1:55412_) [n:127.0.0.1:55412_ c:control_collection s:shard1 r:core_node1 x:collection1] o.a.s.r.RestManager Initializing 0 registered ManagedResources
   [junit4]   2> 1786768 INFO  (coreLoadExecutor-4256-thread-1-processing-n:127.0.0.1:55412_) [n:127.0.0.1:55412_ c:control_collection s:shard1 r:core_node1 x:collection1] o.a.s.h.ReplicationHandler Commits will be reserved for  10000
   [junit4]   2> 1786769 INFO  (searcherExecutor-4257-thread-1-processing-r:core_node1 c:control_collection x:collection1 n:127.0.0.1:55412_ s:shard1) [n:127.0.0.1:55412_ c:control_collection s:shard1 r:core_node1 x:collection1] o.a.s.c.SolrCore [collection1] Registered new searcher Searcher@730fa7cf[collection1] main{ExitableDirectoryReader(UninvertingDirectoryReader())}
   [junit4]   2> 1786769 INFO  (coreLoadExecutor-4256-thread-1-processing-n:127.0.0.1:55412_) [n:127.0.0.1:55412_ c:control_collection s:shard1 r:core_node1 x:collection1] o.a.s.u.UpdateLog Looking up max value of version field to seed version buckets
   [junit4]   2> 1786770 INFO  (coreLoadExecutor-4256-thread-1-processing-n:127.0.0.1:55412_) [n:127.0.0.1:55412_ c:control_collection s:shard1 r:core_node1 x:collection1] o.a.s.u.VersionInfo Refreshing highest value of _version_ for 256 version buckets from index
   [junit4]   2> 1786770 INFO  (coreLoadExecutor-4256-thread-1-processing-n:127.0.0.1:55412_) [n:127.0.0.1:55412_ c:control_collection s:shard1 r:core_node1 x:collection1] o.a.s.u.VersionInfo No terms found for _version_, cannot seed version bucket highest value from index
   [junit4]   2> 1786770 INFO  (coreLoadExecutor-4256-thread-1-processing-n:127.0.0.1:55412_) [n:127.0.0.1:55412_ c:control_collection s:shard1 r:core_node1 x:collection1] o.a.s.u.UpdateLog Could not find max version in index or recent updates, using new clock 1523180913878368256
   [junit4]   2> 1786770 INFO  (coreLoadExecutor-4256-thread-1-processing-n:127.0.0.1:55412_) [n:127.0.0.1:55412_ c:control_collection s:shard1 r:core_node1 x:collection1] o.a.s.u.UpdateLog Took 0.0ms to seed version buckets with highest version 1523180913878368256
   [junit4]   2> 1786770 INFO  (coreLoadExecutor-4256-thread-1-processing-n:127.0.0.1:55412_) [n:127.0.0.1:55412_ c:control_collection s:shard1 r:core_node1 x:collection1] o.a.s.c.ZkController watch zkdir /configs/conf1
   [junit4]   2> 1786770 INFO  (coreLoadExecutor-4256-thread-1-processing-n:127.0.0.1:55412_) [n:127.0.0.1:55412_ c:control_collection s:shard1 r:core_node1 x:collection1] o.a.s.c.CoreContainer registering core: collection1
   [junit4]   2> 1786771 INFO  (coreZkRegister-4250-thread-1-processing-r:core_node1 c:control_collection x:collection1 n:127.0.0.1:55412_ s:shard1) [n:127.0.0.1:55412_ c:control_collection s:shard1 r:core_node1 x:collection1] o.a.s.c.ZkController Register replica - core:collection1 address:http://127.0.0.1:55412 collection:control_collection shard:shard1
   [junit4]   2> 1786772 INFO  (coreZkRegister-4250-thread-1-processing-r:core_node1 c:control_collection x:collection1 n:127.0.0.1:55412_ s:shard1) [n:127.0.0.1:55412_ c:control_collection s:shard1 r:core_node1 x:collection1] o.a.s.c.c.SolrZkClient makePath: /collections/control_collection/leader_elect/shard1/election
   [junit4]   2> 1786776 INFO  (coreZkRegister-4250-thread-1-processing-r:core_node1 c:control_collection x:collection1 n:127.0.0.1:55412_ s:shard1) [n:127.0.0.1:55412_ c:control_collection s:shard1 r:core_node1 x:collection1] o.a.s.c.LeaderElector Joined leadership election with path: /collections/control_collection/leader_elect/shard1/election/95198806994386950-core_node1-n_0000000000
   [junit4]   2> 1786776 INFO  (coreZkRegister-4250-thread-1-processing-r:core_node1 c:control_collection x:collection1 n:127.0.0.1:55412_ s:shard1) [n:127.0.0.1:55412_ c:control_collection s:shard1 r:core_node1 x:collection1] o.a.s.c.ShardLeaderElectionContext Running the leader process for shard shard1
   [junit4]   2> 1786778 INFO  (coreZkRegister-4250-thread-1-processing-r:core_node1 c:control_collection x:collection1 n:127.0.0.1:55412_ s:shard1) [n:127.0.0.1:55412_ c:control_collection s:shard1 r:core_node1 x:collection1] o.a.s.c.ShardLeaderElectionContext Enough replicas found to continue.
   [junit4]   2> 1786778 INFO  (coreZkRegister-4250-thread-1-processing-r:core_node1 c:control_collection x:collection1 n:127.0.0.1:55412_ s:shard1) [n:127.0.0.1:55412_ c:control_collection s:shard1 r:core_node1 x:collection1] o.a.s.c.ShardLeaderElectionContext I may be the new leader - try and sync
   [junit4]   2> 1786778 INFO  (OverseerStateUpdate-95198806994386950-127.0.0.1:55412_-n_0000000000) [n:127.0.0.1:55412_    ] o.a.s.c.Overseer processMessage: queueSize: 1, message = {
   [junit4]   2>   "operation":"leader",
   [junit4]   2>   "shard":"shard1",
   [junit4]   2>   "collection":"control_collection"} current state version: 1
   [junit4]   2> 1786778 INFO  (coreZkRegister-4250-thread-1-processing-r:core_node1 c:control_collection x:collection1 n:127.0.0.1:55412_ s:shard1) [n:127.0.0.1:55412_ c:control_collection s:shard1 r:core_node1 x:collection1] o.a.s.c.SyncStrategy Sync replicas to http://127.0.0.1:55412/collection1/
   [junit4]   2> 1786778 INFO  (coreZkRegister-4250-thread-1-processing-r:core_node1 c:control_collection x:collection1 n:127.0.0.1:55412_ s:shard1) [n:127.0.0.1:55412_ c:control_collection s:shard1 r:core_node1 x:collection1] o.a.s.c.SyncStrategy Sync Success - now sync replicas to me
   [junit4]   2> 1786779 INFO  (coreZkRegister-4250-thread-1-processing-r:core_node1 c:control_collection x:collection1 n:127.0.0.1:55412_ s:shard1) [n:127.0.0.1:55412_ c:control_collection s:shard1 r:core_node1 x:collection1] o.a.s.c.SyncStrategy http://127.0.0.1:55412/collection1/ has no replicas
   [junit4]   2> 1786779 INFO  (zkCallback-1994-thread-1-processing-n:127.0.0.1:55412_) [n:127.0.0.1:55412_    ] o.a.s.c.c.ZkStateReader A cluster state change: WatchedEvent state:SyncConnected type:NodeDataChanged path:/clusterstate.json, has occurred - updating... (live nodes size: 1)
   [junit4]   2> 1786780 INFO  (coreZkRegister-4250-thread-1-processing-r:core_node1 c:control_collection x:collection1 n:127.0.0.1:55412_ s:shard1) [n:127.0.0.1:55412_ c:control_collection s:shard1 r:core_node1 x:collection1] o.a.s.c.c.SolrZkClient makePath: /collections/control_collection/leaders/shard1
   [junit4]   2> 1786783 INFO  (coreZkRegister-4250-thread-1-processing-r:core_node1 c:control_collection x:collection1 n:127.0.0.1:55412_ s:shard1) [n:127.0.0.1:55412_ c:control_collection s:shard1 r:core_node1 x:collection1] o.a.s.c.ShardLeaderElectionContextBase Creating leader registration node
   [junit4]   2> 1786785 INFO  (coreZkRegister-4250-thread-1-processing-r:core_node1 c:control_collection x:collection1 n:127.0.0.1:55412_ s:shard1) [n:127.0.0.1:55412_ c:control_collection s:shard1 r:core_node1 x:collection1] o.a.s.c.ShardLeaderElectionContext I am the new leader: http://127.0.0.1:55412/collection1/ shard1
   [junit4]   2> 1786785 INFO  (OverseerStateUpdate-95198806994386950-127.0.0.1:55412_-n_0000000000) [n:127.0.0.1:55412_    ] o.a.s.c.Overseer processMessage: queueSize: 1, message = {
   [junit4]   2>   "operation":"leader",
   [junit4]   2>   "shard":"shard1",
   [junit4]   2>   "collection":"control_collection",
   [junit4]   2>   "base_url":"http://127.0.0.1:55412",
   [junit4]   2>   "core":"collection1",
   [junit4]   2>   "state":"active"} current state version: 2
   [junit4]   2> 1786888 INFO  (zkCallback-1994-thread-1-processing-n:127.0.0.1:55412_) [n:127.0.0.1:55412_    ] o.a.s.c.c.ZkStateReader A cluster state change: WatchedEvent state:SyncConnected type:NodeDataChanged path:/clusterstate.json, has occurred - updating... (live nodes size: 1)
   [junit4]   2> 1786936 INFO  (coreZkRegister-4250-thread-1-processing-r:core_node1 c:control_collection x:collection1 n:127.0.0.1:55412_ s:shard1) [n:127.0.0.1:55412_ c:control_collection s:shard1 r:core_node1 x:collection1] o.a.s.c.ZkController We are http://127.0.0.1:55412/collection1/ and leader is http://127.0.0.1:55412/collection1/
   [junit4]   2> 1786936 INFO  (coreZkRegister-4250-thread-1-processing-r:core_node1 c:control_collection x:collection1 n:127.0.0.1:55412_ s:shard1) [n:127.0.0.1:55412_ c:control_collection s:shard1 r:core_node1 x:collection1] o.a.s.c.ZkController No LogReplay needed for core=collection1 baseURL=http://127.0.0.1:55412
   [junit4]   2> 1786936 INFO  (coreZkRegister-4250-thread-1-processing-r:core_node1 c:control_collection x:collection1 n:127.0.0.1:55412_ s:shard1) [n:127.0.0.1:55412_ c:control_collection s:shard1 r:core_node1 x:collection1] o.a.s.c.ZkController I am the leader, no recovery necessary
   [junit4]   2> 1786936 INFO  (coreZkRegister-4250-thread-1-processing-r:core_node1 c:control_collection x:collection1 n:127.0.0.1:55412_ s:shard1) [n:127.0.0.1:55412_ c:control_collection s:shard1 r:core_node1 x:collection1] o.a.s.c.ZkController publishing state=active
   [junit4]   2> 1786936 INFO  (coreZkRegister-4250-thread-1-processing-r:core_node1 c:control_collection x:collection1 n:127.0.0.1:55412_ s:shard1) [n:127.0.0.1:55412_ c:control_collection s:shard1 r:core_node1 x:collection1] o.a.s.c.ZkController numShards not found on descriptor - reading it from system property
   [junit4]   2> 1786938 INFO  (OverseerStateUpdate-95198806994386950-127.0.0.1:55412_-n_0000000000) [n:127.0.0.1:55412_    ] o.a.s.c.Overseer processMessage: queueSize: 1, message = {
   [junit4]   2>   "state":"active",
   [junit4]   2>   "roles":null,
   [junit4]   2>   "operation":"state",
   [junit4]   2>   "base_url":"http://127.0.0.1:55412",
   [junit4]   2>   "collection":"control_collection",
   [junit4]   2>   "numShards":"1",
   [junit4]   2>   "core":"collection1",
   [junit4]   2>   "core_node_name":"core_node1",
   [junit4]   2>   "node_name":"127.0.0.1:55412_",
   [junit4]   2>   "shard":"shard1"} current state version: 3
   [junit4]   2> 1786939 INFO  (OverseerStateUpdate-95198806994386950-127.0.0.1:55412_-n_0000000000) [n:127.0.0.1:55412_    ] o.a.s.c.o.ReplicaMutator Update state numShards=1 message={
   [junit4]   2>   "state":"active",
   [junit4]   2>   "roles":null,
   [junit4]   2>   "operation":"state",
   [junit4]   2>   "base_url":"http://127.0.0.1:55412",
   [junit4]   2>   "collection":"control_collection",
   [junit4]   2>   "numShards":"1",
   [junit4]   2>   "core":"collection1",
   [junit4]   2>   "core_node_name":"core_node1",
   [junit4]   2>   "node_name":"127.0.0.1:55412_",
   [junit4]   2>   "shard":"shard1"}
   [junit4]   2> 1787041 INFO  (zkCallback-1994-thread-1-processing-n:127.0.0.1:55412_) [n:127.0.0.1:55412_    ] o.a.s.c.c.ZkStateReader A cluster state change: WatchedEvent state:SyncConnected type:NodeDataChanged path:/clusterstate.json, has occurred - updating... (live nodes size: 1)
   [junit4]   2> 1787233 INFO  (TEST-HdfsCollectionsAPIDistributedZkTest.test-seed#[612A6D5B531C9E3A]) [    ] o.a.s.c.c.SolrZkClient Using default ZkCredentialsProvider
   [junit4]   2> 1787234 INFO  (TEST-HdfsCollectionsAPIDistributedZkTest.test-seed#[612A6D5B531C9E3A]) [    ] o.a.s.c.c.ConnectionManager Waiting for client to connect to ZooKeeper
   [junit4]   2> 1787236 INFO  (zkCallback-1996-thread-1) [    ] o.a.s.c.c.ConnectionManager Watcher org.apache.solr.common.cloud.ConnectionManager@45313f7d name:ZooKeeperConnection Watcher:127.0.0.1:40105/solr got event WatchedEvent state:SyncConnected type:None path:null path:null type:None
   [junit4]   2> 1787236 INFO  (TEST-HdfsCollectionsAPIDistributedZkTest.test-seed#[612A6D5B531C9E3A]) [    ] o.a.s.c.c.ConnectionManager Client is connected to ZooKeeper
   [junit4]   2> 1787237 INFO  (TEST-HdfsCollectionsAPIDistributedZkTest.test-seed#[612A6D5B531C9E3A]) [    ] o.a.s.c.c.SolrZkClient Using default ZkACLProvider
   [junit4]   2> 1787237 INFO  (TEST-HdfsCollectionsAPIDistributedZkTest.test-seed#[612A6D5B531C9E3A]) [    ] o.a.s.c.c.ZkStateReader Updating cluster state from ZooKeeper... 
   [junit4]   2> 1787239 INFO  (TEST-HdfsCollectionsAPIDistributedZkTest.test-seed#[612A6D5B531C9E3A]) [    ] o.a.s.c.ChaosMonkey monkey: init - expire sessions:false cause connection loss:false
   [junit4]   2> 1787334 INFO  (TEST-HdfsCollectionsAPIDistributedZkTest.test-seed#[612A6D5B531C9E3A]) [    ] o.a.s.SolrTestCaseJ4 Writing core.properties file to /x1/jenkins/jenkins-slave/workspace/Lucene-Solr-NightlyTests-5.4/solr/build/solr-core/test/J2/temp/solr.cloud.hdfs.HdfsCollectionsAPIDistributedZkTest_612A6D5B531C9E3A-001/shard-1-001/cores/collection1
   [junit4]   2> 1787335 INFO  (TEST-HdfsCollectionsAPIDistributedZkTest.test-seed#[612A6D5B531C9E3A]) [    ] o.a.s.c.AbstractFullDistribZkTestBase create jetty 1 in directory /x1/jenkins/jenkins-slave/workspace/Lucene-Solr-NightlyTests-5.4/solr/build/solr-core/test/J2/temp/solr.cloud.hdfs.HdfsCollectionsAPIDistributedZkTest_612A6D5B531C9E3A-001/shard-1-001
   [junit4]   2> 1787336 INFO  (TEST-HdfsCollectionsAPIDistributedZkTest.test-seed#[612A6D5B531C9E3A]) [    ] o.e.j.s.Server jetty-9.2.13.v20150730
   [junit4]   2> 1787340 INFO  (TEST-HdfsCollectionsAPIDistributedZkTest.test-seed#[612A6D5B531C9E3A]) [    ] o.e.j.s.h.ContextHandler Started o.e.j.s.ServletContextHandler@5b8cc251{/,null,AVAILABLE}
   [junit4]   2> 1787341 INFO  (TEST-HdfsCollectionsAPIDistributedZkTest.test-seed#[612A6D5B531C9E3A]) [    ] o.e.j.s.ServerConnector Started ServerConnector@1f4a1a08{HTTP/1.1}{127.0.0.1:45692}
   [junit4]   2> 1787341 INFO  (TEST-HdfsCollectionsAPIDistributedZkTest.test-seed#[612A6D5B531C9E3A]) [    ] o.e.j.s.Server Started @1790024ms
   [junit4]   2> 1787341 INFO  (TEST-HdfsCollectionsAPIDistributedZkTest.test-seed#[612A6D5B531C9E3A]) [    ] o.a.s.c.s.e.JettySolrRunner Jetty properties: {coreRootDirectory=/x1/jenkins/jenkins-slave/workspace/Lucene-Solr-NightlyTests-5.4/solr/build/solr-core/test/J2/temp/solr.cloud.hdfs.HdfsCollectionsAPIDistributedZkTest_612A6D5B531C9E3A-001/shard-1-001/cores, hostPort=45692, solr.data.dir=hdfs://localhost:45332/hdfs__localhost_45332__x1_jenkins_jenkins-slave_workspace_Lucene-Solr-NightlyTests-5.4_solr_build_solr-core_test_J2_temp_solr.cloud.hdfs.HdfsCollectionsAPIDistributedZkTest_612A6D5B531C9E3A-001_tempDir-002_jetty1, hostContext=/, solrconfig=solrconfig.xml}
   [junit4]   2> 1787342 INFO  (TEST-HdfsCollectionsAPIDistributedZkTest.test-seed#[612A6D5B531C9E3A]) [    ] o.a.s.s.SolrDispatchFilter SolrDispatchFilter.init(): sun.misc.Launcher$AppClassLoader@7b3cb2c6
   [junit4]   2> 1787342 INFO  (TEST-HdfsCollectionsAPIDistributedZkTest.test-seed#[612A6D5B531C9E3A]) [    ] o.a.s.c.SolrResourceLoader new SolrResourceLoader for directory: '/x1/jenkins/jenkins-slave/workspace/Lucene-Solr-NightlyTests-5.4/solr/build/solr-core/test/J2/temp/solr.cloud.hdfs.HdfsCollectionsAPIDistributedZkTest_612A6D5B531C9E3A-001/shard-1-001'
   [junit4]   2> 1787342 INFO  (TEST-HdfsCollectionsAPIDistributedZkTest.test-seed#[612A6D5B531C9E3A]) [    ] o.a.s.c.SolrResourceLoader JNDI not configured for solr (NoInitialContextEx)
   [junit4]   2> 1787342 INFO  (TEST-HdfsCollectionsAPIDistributedZkTest.test-seed#[612A6D5B531C9E3A]) [    ] o.a.s.c.SolrResourceLoader solr home defaulted to 'solr/' (could not find system property or JNDI)
   [junit4]   2> 1787343 INFO  (TEST-HdfsCollectionsAPIDistributedZkTest.test-seed#[612A6D5B531C9E3A]) [    ] o.a.s.c.c.SolrZkClient Using default ZkCredentialsProvider
   [junit4]   2> 1787343 INFO  (TEST-HdfsCollectionsAPIDistributedZkTest.test-seed#[612A6D5B531C9E3A]) [    ] o.a.s.c.c.ConnectionManager Waiting for client to connect to ZooKeeper
   [junit4]   2> 1787346 INFO  (zkCallback-1997-thread-1) [    ] o.a.s.c.c.ConnectionManager Watcher org.apache.solr.common.cloud.ConnectionManager@2024c026 name:ZooKeeperConnection Watcher:127.0.0.1:40105/solr got event WatchedEvent state:SyncConnected type:None path:null path:null type:None
   [junit4]   2> 1787346 INFO  (TEST-HdfsCollectionsAPIDistributedZkTest.test-seed#[612A6D5B531C9E3A]) [    ] o.a.s.c.c.ConnectionManager Client is connected to ZooKeeper
   [junit4]   2> 1787347 INFO  (TEST-HdfsCollectionsAPIDistributedZkTest.test-seed#[612A6D5B531C9E3A]) [    ] o.a.s.c.c.SolrZkClient Using default ZkACLProvider
   [junit4]   2> 1787348 INFO  (TEST-HdfsCollectionsAPIDistributedZkTest.test-seed#[612A6D5B531C9E3A]) [    ] o.a.s.s.SolrDispatchFilter Loading solr.xml from SolrHome (not found in ZooKeeper)
   [junit4]   2> 1787348 INFO  (TEST-HdfsCollectionsAPIDistributedZkTest.test-seed#[612A6D5B531C9E3A]) [    ] o.a.s.c.SolrXmlConfig Loading container configuration from /x1/jenkins/jenkins-slave/workspace/Lucene-Solr-NightlyTests-5.4/solr/build/solr-core/test/J2/temp/solr.cloud.hdfs.HdfsCollectionsAPIDistributedZkTest_612A6D5B531C9E3A-001/shard-1-001/solr.xml
   [junit4]   2> 1787362 INFO  (TEST-HdfsCollectionsAPIDistributedZkTest.test-seed#[612A6D5B531C9E3A]) [    ] o.a.s.c.CorePropertiesLocator Config-defined core root directory: /x1/jenkins/jenkins-slave/workspace/Lucene-Solr-NightlyTests-5.4/solr/build/solr-core/test/J2/temp/solr.cloud.hdfs.HdfsCollectionsAPIDistributedZkTest_612A6D5B531C9E3A-001/shard-1-001/cores
   [junit4]   2> 1787362 INFO  (TEST-HdfsCollectionsAPIDistributedZkTest.test-seed#[612A6D5B531C9E3A]) [    ] o.a.s.c.CoreContainer New CoreContainer 945216114
   [junit4]   2> 1787362 INFO  (TEST-HdfsCollectionsAPIDistributedZkTest.test-seed#[612A6D5B531C9E3A]) [    ] o.a.s.c.CoreContainer Loading cores into CoreContainer [instanceDir=/x1/jenkins/jenkins-slave/workspace/Lucene-Solr-NightlyTests-5.4/solr/build/solr-core/test/J2/temp/solr.cloud.hdfs.HdfsCollectionsAPIDistributedZkTest_612A6D5B531C9E3A-001/shard-1-001]
   [junit4]   2> 1787362 WARN  (TEST-HdfsCollectionsAPIDistributedZkTest.test-seed#[612A6D5B531C9E3A]) [    ] o.a.s.c.CoreContainer Couldn't add files from /x1/jenkins/jenkins-slave/workspace/Lucene-Solr-NightlyTests-5.4/solr/build/solr-core/test/J2/temp/solr.cloud.hdfs.HdfsCollectionsAPIDistributedZkTest_612A6D5B531C9E3A-001/shard-1-001/lib to classpath: /x1/jenkins/jenkins-slave/workspace/Lucene-Solr-NightlyTests-5.4/solr/build/solr-core/test/J2/temp/solr.cloud.hdfs.HdfsCollectionsAPIDistributedZkTest_612A6D5B531C9E3A-001/shard-1-001/lib
   [junit4]   2> 1787363 INFO  (TEST-HdfsCollectionsAPIDistributedZkTest.test-seed#[612A6D5B531C9E3A]) [    ] o.a.s.h.c.HttpShardHandlerFactory created with socketTimeout : 90000,urlScheme : ,connTimeout : 15000,maxConnectionsPerHost : 20,maxConnections : 10000,corePoolSize : 0,maximumPoolSize : 2147483647,maxThreadIdleTime : 5,sizeOfQueue : -1,fairnessPolicy : false,useRetries : false,
   [junit4]   2> 1787364 INFO  (TEST-HdfsCollectionsAPIDistributedZkTest.test-seed#[612A6D5B531C9E3A]) [    ] o.a.s.u.UpdateShardHandler Creating UpdateShardHandler HTTP client with params: socketTimeout=340000&connTimeout=45000&retry=true
   [junit4]   2> 1787364 INFO  (TEST-HdfsCollectionsAPIDistributedZkTest.test-seed#[612A6D5B531C9E3A]) [    ] o.a.s.l.LogWatcher SLF4J impl is org.slf4j.impl.Log4jLoggerFactory
   [junit4]   2> 1787364 INFO  (TEST-HdfsCollectionsAPIDistributedZkTest.test-seed#[612A6D5B531C9E3A]) [    ] o.a.s.l.LogWatcher Registering Log Listener [Log4j (org.slf4j.impl.Log4jLoggerFactory)]
   [junit4]   2> 1787364 INFO  (TEST-HdfsCollectionsAPIDistributedZkTest.test-seed#[612A6D5B531C9E3A]) [    ] o.a.s.c.ZkContainer Zookeeper client=127.0.0.1:40105/solr
   [junit4]   2> 1787365 INFO  (TEST-HdfsCollectionsAPIDistributedZkTest.test-seed#[612A6D5B531C9E3A]) [    ] o.a.s.c.ZkController zkHost includes chroot
   [junit4]   2> 1787365 INFO  (TEST-HdfsCollectionsAPIDistributedZkTest.test-seed#[612A6D5B531C9E3A]) [    ] o.a.s.c.c.SolrZkClient Using default ZkCredentialsProvider
   [junit4]   2> 1787374 INFO  (TEST-HdfsCollectionsAPIDistributedZkTest.test-seed#[612A6D5B531C9E3A]) [    ] o.a.s.c.c.ConnectionManager Waiting for client to connect to ZooKeeper
   [junit4]   2> 1787374 INFO  (zkCallback-1999-thread-1) [    ] o.a.s.c.c.ConnectionManager Watcher org.apache.solr.common.cloud.ConnectionManager@2a26dd64 name:ZooKeeperConnection Watcher:127.0.0.1:40105 got event WatchedEvent state:SyncConnected type:None path:null path:null type:None
   [junit4]   2> 1787375 INFO  (TEST-HdfsCollectionsAPIDistributedZkTest.test-seed#[612A6D5B531C9E3A]) [    ] o.a.s.c.c.ConnectionManager Client is connected to ZooKeeper
   [junit4]   2> 1787375 INFO  (TEST-HdfsCollectionsAPIDistributedZkTest.test-seed#[612A6D5B531C9E3A]) [    ] o.a.s.c.c.SolrZkClient Using default ZkACLProvider
   [junit4]   2> 1787382 INFO  (TEST-HdfsCollectionsAPIDistributedZkTest.test-seed#[612A6D5B531C9E3A]) [n:127.0.0.1:45692_    ] o.a.s.c.c.ConnectionManager Waiting for client to connect to ZooKeeper
   [junit4]   2> 1787382 INFO  (zkCallback-2000-thread-1-processing-n:127.0.0.1:45692_) [n:127.0.0.1:45692_    ] o.a.s.c.c.ConnectionManager Watcher org.apache.solr.common.cloud.ConnectionManager@5a43a63e name:ZooKeeperConnection Watcher:127.0.0.1:40105/solr got event WatchedEvent state:SyncConnected type:None path:null path:null type:None
   [junit4]   2> 1787382 INFO  (TEST-HdfsCollectionsAPIDistributedZkTest.test-seed#[612A6D5B531C9E3A]) [n:127.0.0.1:45692_    ] o.a.s.c.c.ConnectionManager Client is connected to ZooKeeper
   [junit4]   2> 1787388 INFO  (TEST-HdfsCollectionsAPIDistributedZkTest.test-seed#[612A6D5B531C9E3A]) [n:127.0.0.1:45692_    ] o.a.s.c.c.ZkStateReader Updating cluster state from ZooKeeper... 
   [junit4]   2> 1788394 INFO  (TEST-HdfsCollectionsAPIDistributedZkTest.test-seed#[612A6D5B531C9E3A]) [n:127.0.0.1:45692_    ] o.a.s.c.ZkController Register node as live in ZooKeeper:/live_nodes/127.0.0.1:45692_
   [junit4]   2> 1788395 INFO  (TEST-HdfsCollectionsAPIDistributedZkTest.test-seed#[612A6D5B531C9E3A]) [n:127.0.0.1:45692_    ] o.a.s.c.c.SolrZkClient makePath: /live_nodes/127.0.0.1:45692_
   [junit4]   2> 1788396 INFO  (zkCallback-1994-thread-1-processing-n:127.0.0.1:55412_) [n:127.0.0.1:55412_    ] o.a.s.c.c.ZkStateReader A live node change: WatchedEvent state:SyncConnected type:NodeChildrenChanged path:/live_nodes, has occurred - updating... (live nodes size: 1)
   [junit4]   2> 1788396 INFO  (zkCallback-2000-thread-1-processing-n:127.0.0.1:45692_) [n:127.0.0.1:45692_    ] o.a.s.c.c.ZkStateReader A live node change: WatchedEvent state:SyncConnected type:NodeChildrenChanged path:/live_nodes, has occurred - updating... (live nodes size: 1)
   [junit4]   2> 1788396 INFO  (zkCallback-1996-thread-1) [    ] o.a.s.c.c.ZkStateReader A live node change: WatchedEvent state:SyncConnected type:NodeChildrenChanged path:/live_nodes, has occurred - updating... (live nodes size: 1)
   [junit4]   2> 1788398 INFO  (TEST-HdfsCollectionsAPIDistributedZkTest.test-seed#[612A6D5B531C9E3A]) [n:127.0.0.1:45692_    ] o.a.s.c.Overseer Overseer (id=null) closing
   [junit4]   2> 1788399 INFO  (TEST-HdfsCollectionsAPIDistributedZkTest.test-seed#[612A6D5B531C9E3A]) [n:127.0.0.1:45692_    ] o.a.s.c.LeaderElector Joined leadership election with path: /overseer_elect/election/95198806994386954-127.0.0.1:45692_-n_0000000001
   [junit4]   2> 1788400 INFO  (TEST-HdfsCollectionsAPIDistributedZkTest.test-seed#[612A6D5B531C9E3A]) [n:127.0.0.1:45692_    ] o.a.s.c.LeaderElector Watching path /overseer_elect/election/95198806994386950-127.0.0.1:55412_-n_0000000000 to know if I could be the leader
   [junit4]   2> 1788410 INFO  (TEST-HdfsCollectionsAPIDistributedZkTest.test-seed#[612A6D5B531C9E3A]) [n:127.0.0.1:45692_    ] o.a.s.c.CoreContainer Security conf doesn't exist. Skipping setup for authorization module.
   [junit4]   2> 1788410 INFO  (TEST-HdfsCollectionsAPIDistributedZkTest.test-seed#[612A6D5B531C9E3A]) [n:127.0.0.1:45692_    ] o.a.s.c.CoreContainer No authentication plugin used.
   [junit4]   2> 1788411 INFO  (TEST-HdfsCollectionsAPIDistributedZkTest.test-seed#[612A6D5B531C9E3A]) [n:127.0.0.1:45692_    ] o.a.s.c.CorePropertiesLocator Looking for core definitions underneath /x1/jenkins/jenkins-slave/workspace/Lucene-Solr-NightlyTests-5.4/solr/build/solr-core/test/J2/temp/solr.cloud.hdfs.HdfsCollectionsAPIDistributedZkTest_612A6D5B531C9E3A-001/shard-1-001/cores
   [junit4]   2> 1788413 INFO  (TEST-HdfsCollectionsAPIDistributedZkTest.test-seed#[612A6D5B531C9E3A]) [n:127.0.0.1:45692_    ] o.a.s.c.CoreDescriptor Created CoreDescriptor: {dataDir=data/, configSetProperties=configsetprops.json, schema=schema.xml, instanceDir=/x1/jenkins/jenkins-slave/workspace/Lucene-Solr-NightlyTests-5.4/solr/build/solr-core/test/J2/temp/solr.cloud.hdfs.HdfsCollectionsAPIDistributedZkTest_612A6D5B531C9E3A-001/shard-1-001/cores/collection1, shard=, absoluteInstDir=/x1/jenkins/jenkins-slave/workspace/Lucene-Solr-NightlyTests-5.4/solr/build/solr-core/test/J2/temp/solr.cloud.hdfs.HdfsCollectionsAPIDistributedZkTest_612A6D5B531C9E3A-001/shard-1-001/cores/collection1/, collection=collection1, name=collection1, config=solrconfig.xml, loadOnStartup=true, coreNodeName=, transient=false}
   [junit4]   2> 1788413 INFO  (TEST-HdfsCollectionsAPIDistributedZkTest.test-seed#[612A6D5B531C9E3A]) [n:127.0.0.1:45692_    ] o.a.s.c.CorePropertiesLocator Found core collection1 in /x1/jenkins/jenkins-slave/workspace/Lucene-Solr-NightlyTests-5.4/solr/build/solr-core/test/J2/temp/solr.cloud.hdfs.HdfsCollectionsAPIDistributedZkTest_612A6D5B531C9E3A-001/shard-1-001/cores/collection1/
   [junit4]   2> 1788413 INFO  (TEST-HdfsCollectionsAPIDistributedZkTest.test-seed#[612A6D5B531C9E3A]) [n:127.0.0.1:45692_    ] o.a.s.c.CorePropertiesLocator Found 1 core definitions
   [junit4]   2> 1788414 INFO  (coreLoadExecutor-4267-thread-1-processing-n:127.0.0.1:45692_) [n:127.0.0.1:45692_ c:collection1   x:collection1] o.a.s.c.ZkController publishing state=down
   [junit4]   2> 1788414 INFO  (TEST-HdfsCollectionsAPIDistributedZkTest.test-seed#[612A6D5B531C9E3A]) [n:127.0.0.1:45692_    ] o.a.s.s.SolrDispatchFilter user.dir=/x1/jenkins/jenkins-slave/workspace/Lucene-Solr-NightlyTests-5.4/solr/build/solr-core/test/J2
   [junit4]   2> 1788415 INFO  (TEST-HdfsCollectionsAPIDistributedZkTest.test-seed#[612A6D5B531C9E3A]) [n:127.0.0.1:45692_    ] o.a.s.s.SolrDispatchFilter SolrDispatchFilter.init() done
   [junit4]   2> 1788414 INFO  (coreLoadExecutor-4267-thread-1-processing-n:127.0.0.1:45692_) [n:127.0.0.1:45692_ c:collection1   x:collection1] o.a.s.c.ZkController numShards not found on descriptor - reading it from system property
   [

[...truncated too long message...]

/test-lib/apacheds-interceptors-admin-2.0.0-M15.jar:/x1/jenkins/jenkins-slave/workspace/Lucene-Solr-NightlyTests-5.4/solr/core/test-lib/apacheds-interceptors-authn-2.0.0-M15.jar:/x1/jenkins/jenkins-slave/workspace/Lucene-Solr-NightlyTests-5.4/solr/core/test-lib/apacheds-interceptors-authz-2.0.0-M15.jar:/x1/jenkins/jenkins-slave/workspace/Lucene-Solr-NightlyTests-5.4/solr/core/test-lib/apacheds-interceptors-changelog-2.0.0-M15.jar:/x1/jenkins/jenkins-slave/workspace/Lucene-Solr-NightlyTests-5.4/solr/core/test-lib/apacheds-interceptors-collective-2.0.0-M15.jar:/x1/jenkins/jenkins-slave/workspace/Lucene-Solr-NightlyTests-5.4/solr/core/test-lib/apacheds-interceptors-event-2.0.0-M15.jar:/x1/jenkins/jenkins-slave/workspace/Lucene-Solr-NightlyTests-5.4/solr/core/test-lib/apacheds-interceptors-exception-2.0.0-M15.jar:/x1/jenkins/jenkins-slave/workspace/Lucene-Solr-NightlyTests-5.4/solr/core/test-lib/apacheds-interceptors-journal-2.0.0-M15.jar:/x1/jenkins/jenkins-slave/workspace/Lucene-Solr-NightlyTests-5.4/solr/core/test-lib/apacheds-interceptors-normalization-2.0.0-M15.jar:/x1/jenkins/jenkins-slave/workspace/Lucene-Solr-NightlyTests-5.4/solr/core/test-lib/apacheds-interceptors-operational-2.0.0-M15.jar:/x1/jenkins/jenkins-slave/workspace/Lucene-Solr-NightlyTests-5.4/solr/core/test-lib/apacheds-interceptors-referral-2.0.0-M15.jar:/x1/jenkins/jenkins-slave/workspace/Lucene-Solr-NightlyTests-5.4/solr/core/test-lib/apacheds-interceptors-schema-2.0.0-M15.jar:/x1/jenkins/jenkins-slave/workspace/Lucene-Solr-NightlyTests-5.4/solr/core/test-lib/apacheds-interceptors-subtree-2.0.0-M15.jar:/x1/jenkins/jenkins-slave/workspace/Lucene-Solr-NightlyTests-5.4/solr/core/test-lib/apacheds-interceptors-trigger-2.0.0-M15.jar:/x1/jenkins/jenkins-slave/workspace/Lucene-Solr-NightlyTests-5.4/solr/core/test-lib/apacheds-jdbm-partition-2.0.0-M15.jar:/x1/jenkins/jenkins-slave/workspace/Lucene-Solr-NightlyTests-5.4/solr/core/test-lib/apacheds-jdbm1-2.0.0-M2.jar:/x1/jenkins/jenkins-slave/workspace/Lucene-Solr-NightlyTests-5.4/solr/core/test-lib/apacheds-kerberos-codec-2.0.0-M15.jar:/x1/jenkins/jenkins-slave/workspace/Lucene-Solr-NightlyTests-5.4/solr/core/test-lib/apacheds-ldif-partition-2.0.0-M15.jar:/x1/jenkins/jenkins-slave/workspace/Lucene-Solr-NightlyTests-5.4/solr/core/test-lib/apacheds-mavibot-partition-2.0.0-M15.jar:/x1/jenkins/jenkins-slave/workspace/Lucene-Solr-NightlyTests-5.4/solr/core/test-lib/apacheds-protocol-kerberos-2.0.0-M15.jar:/x1/jenkins/jenkins-slave/workspace/Lucene-Solr-NightlyTests-5.4/solr/core/test-lib/apacheds-protocol-ldap-2.0.0-M15.jar:/x1/jenkins/jenkins-slave/workspace/Lucene-Solr-NightlyTests-5.4/solr/core/test-lib/apacheds-protocol-shared-2.0.0-M15.jar:/x1/jenkins/jenkins-slave/workspace/Lucene-Solr-NightlyTests-5.4/solr/core/test-lib/apacheds-xdbm-partition-2.0.0-M15.jar:/x1/jenkins/jenkins-slave/workspace/Lucene-Solr-NightlyTests-5.4/solr/core/test-lib/api-all-1.0.0-M20.jar:/x1/jenkins/jenkins-slave/workspace/Lucene-Solr-NightlyTests-5.4/solr/core/test-lib/bcprov-jdk15-1.45.jar:/x1/jenkins/jenkins-slave/workspace/Lucene-Solr-NightlyTests-5.4/solr/core/test-lib/cglib-nodep-2.2.jar:/x1/jenkins/jenkins-slave/workspace/Lucene-Solr-NightlyTests-5.4/solr/core/test-lib/commons-collections-3.2.2.jar:/x1/jenkins/jenkins-slave/workspace/Lucene-Solr-NightlyTests-5.4/solr/core/test-lib/commons-math3-3.4.1.jar:/x1/jenkins/jenkins-slave/workspace/Lucene-Solr-NightlyTests-5.4/solr/core/test-lib/easymock-3.0.jar:/x1/jenkins/jenkins-slave/workspace/Lucene-Solr-NightlyTests-5.4/solr/core/test-lib/ehcache-core-2.4.4.jar:/x1/jenkins/jenkins-slave/workspace/Lucene-Solr-NightlyTests-5.4/solr/core/test-lib/hadoop-common-2.6.0-tests.jar:/x1/jenkins/jenkins-slave/workspace/Lucene-Solr-NightlyTests-5.4/solr/core/test-lib/hadoop-hdfs-2.6.0-tests.jar:/x1/jenkins/jenkins-slave/workspace/Lucene-Solr-NightlyTests-5.4/solr/core/test-lib/hadoop-minikdc-2.6.0.jar:/x1/jenkins/jenkins-slave/workspace/Lucene-Solr-NightlyTests-5.4/solr/core/test-lib/jackson-annotations-2.5.4.jar:/x1/jenkins/jenkins-slave/workspace/Lucene-Solr-NightlyTests-5.4/solr/core/test-lib/jackson-databind-2.5.4.jar:/x1/jenkins/jenkins-slave/workspace/Lucene-Solr-NightlyTests-5.4/solr/core/test-lib/jersey-core-1.9.jar:/x1/jenkins/jenkins-slave/workspace/Lucene-Solr-NightlyTests-5.4/solr/core/test-lib/jersey-server-1.9.jar:/x1/jenkins/jenkins-slave/workspace/Lucene-Solr-NightlyTests-5.4/solr/core/test-lib/jetty-6.1.26.jar:/x1/jenkins/jenkins-slave/workspace/Lucene-Solr-NightlyTests-5.4/solr/core/test-lib/jetty-util-6.1.26.jar:/x1/jenkins/jenkins-slave/workspace/Lucene-Solr-NightlyTests-5.4/solr/core/test-lib/mina-core-2.0.0-M5.jar:/x1/jenkins/jenkins-slave/workspace/Lucene-Solr-NightlyTests-5.4/solr/core/test-lib/objenesis-1.2.jar:/x1/jenkins/jenkins-slave/workspace/Lucene-Solr-NightlyTests-5.4/lucene/build/analysis/icu/lucene-analyzers-icu-5.4.0-SNAPSHOT.jar:/x1/jenkins/jenkins-slave/workspace/Lucene-Solr-NightlyTests-5.4/solr/build/contrib/solr-analysis-extras/classes/java:/x1/jenkins/jenkins-slave/workspace/Lucene-Solr-NightlyTests-5.4/solr/contrib/analysis-extras/lib/icu4j-54.1.jar:/home/jenkins/jenkins-slave/tools/hudson.tasks.Ant_AntInstallation/ant-1.8.2/lib/ant-launcher.jar:/x1/jenkins/.ant/lib/ivy-2.3.0.jar:/home/jenkins/jenkins-slave/tools/hudson.tasks.Ant_AntInstallation/ant-1.8.2/lib/ant-antlr.jar:/home/jenkins/jenkins-slave/tools/hudson.tasks.Ant_AntInstallation/ant-1.8.2/lib/ant-apache-regexp.jar:/home/jenkins/jenkins-slave/tools/hudson.tasks.Ant_AntInstallation/ant-1.8.2/lib/ant-apache-resolver.jar:/home/jenkins/jenkins-slave/tools/hudson.tasks.Ant_AntInstallation/ant-1.8.2/lib/ant-commons-net.jar:/home/jenkins/jenkins-slave/tools/hudson.tasks.Ant_AntInstallation/ant-1.8.2/lib/ant-jmf.jar:/home/jenkins/jenkins-slave/tools/hudson.tasks.Ant_AntInstallation/ant-1.8.2/lib/ant-apache-oro.jar:/home/jenkins/jenkins-slave/tools/hudson.tasks.Ant_AntInstallation/ant-1.8.2/lib/ant-apache-xalan2.jar:/home/jenkins/jenkins-slave/tools/hudson.tasks.Ant_AntInstallation/ant-1.8.2/lib/ant-commons-logging.jar:/home/jenkins/jenkins-slave/tools/hudson.tasks.Ant_AntInstallation/ant-1.8.2/lib/ant-jsch.jar:/home/jenkins/jenkins-slave/tools/hudson.tasks.Ant_AntInstallation/ant-1.8.2/lib/ant-junit4.jar:/home/jenkins/jenkins-slave/tools/hudson.tasks.Ant_AntInstallation/ant-1.8.2/lib/ant-javamail.jar:/home/jenkins/jenkins-slave/tools/hudson.tasks.Ant_AntInstallation/ant-1.8.2/lib/ant-jai.jar:/home/jenkins/jenkins-slave/tools/hudson.tasks.Ant_AntInstallation/ant-1.8.2/lib/ant-jdepend.jar:/home/jenkins/jenkins-slave/tools/hudson.tasks.Ant_AntInstallation/ant-1.8.2/lib/ant-junit.jar:/home/jenkins/jenkins-slave/tools/hudson.tasks.Ant_AntInstallation/ant-1.8.2/lib/ant-apache-bsf.jar:/home/jenkins/jenkins-slave/tools/hudson.tasks.Ant_AntInstallation/ant-1.8.2/lib/ant-swing.jar:/home/jenkins/jenkins-slave/tools/hudson.tasks.Ant_AntInstallation/ant-1.8.2/lib/ant.jar:/home/jenkins/jenkins-slave/tools/hudson.tasks.Ant_AntInstallation/ant-1.8.2/lib/ant-netrexx.jar:/home/jenkins/jenkins-slave/tools/hudson.tasks.Ant_AntInstallation/ant-1.8.2/lib/ant-apache-bcel.jar:/home/jenkins/jenkins-slave/tools/hudson.tasks.Ant_AntInstallation/ant-1.8.2/lib/ant-testutil.jar:/home/jenkins/jenkins-slave/tools/hudson.tasks.Ant_AntInstallation/ant-1.8.2/lib/ant-apache-log4j.jar:/x1/jenkins/jenkins-slave/tools/hudson.model.JDK/latest1.7/lib/tools.jar:/x1/jenkins/.ivy2/cache/com.carrotsearch.randomizedtesting/junit4-ant/jars/junit4-ant-2.3.1.jar com.carrotsearch.ant.tasks.junit4.slave.SlaveMainSafe -eventsfile /x1/jenkins/jenkins-slave/workspace/Lucene-Solr-NightlyTests-5.4/solr/build/solr-core/test/temp/junit4-J1-20160112_163847_244.events @/x1/jenkins/jenkins-slave/workspace/Lucene-Solr-NightlyTests-5.4/solr/build/solr-core/test/temp/junit4-J1-20160112_163847_244.suites -stdin
   [junit4] ERROR: JVM J1 ended with an exception: Quit event not received from the forked process? This may indicate JVM crash or runner bugs.
   [junit4] 	at com.carrotsearch.ant.tasks.junit4.JUnit4.executeSlave(JUnit4.java:1503)
   [junit4] 	at com.carrotsearch.ant.tasks.junit4.JUnit4.access$000(JUnit4.java:130)
   [junit4] 	at com.carrotsearch.ant.tasks.junit4.JUnit4$2.call(JUnit4.java:963)
   [junit4] 	at com.carrotsearch.ant.tasks.junit4.JUnit4$2.call(JUnit4.java:960)
   [junit4] 	at java.util.concurrent.FutureTask.run(FutureTask.java:262)
   [junit4] 	at java.util.concurrent.ThreadPoolExecutor.runWorker(ThreadPoolExecutor.java:1145)
   [junit4] 	at java.util.concurrent.ThreadPoolExecutor$Worker.run(ThreadPoolExecutor.java:615)
   [junit4] 	at java.lang.Thread.run(Thread.java:745)

BUILD FAILED
/x1/jenkins/jenkins-slave/workspace/Lucene-Solr-NightlyTests-5.4/build.xml:799: The following error occurred while executing this line:
/x1/jenkins/jenkins-slave/workspace/Lucene-Solr-NightlyTests-5.4/build.xml:736: The following error occurred while executing this line:
/x1/jenkins/jenkins-slave/workspace/Lucene-Solr-NightlyTests-5.4/build.xml:59: The following error occurred while executing this line:
/x1/jenkins/jenkins-slave/workspace/Lucene-Solr-NightlyTests-5.4/solr/build.xml:233: The following error occurred while executing this line:
/x1/jenkins/jenkins-slave/workspace/Lucene-Solr-NightlyTests-5.4/solr/common-build.xml:526: The following error occurred while executing this line:
/x1/jenkins/jenkins-slave/workspace/Lucene-Solr-NightlyTests-5.4/lucene/common-build.xml:1452: The following error occurred while executing this line:
/x1/jenkins/jenkins-slave/workspace/Lucene-Solr-NightlyTests-5.4/lucene/common-build.xml:1006: At least one slave process threw an exception, first: Quit event not received from the forked process? This may indicate JVM crash or runner bugs.

Total time: 224 minutes 9 seconds
Build step 'Invoke Ant' marked build as failure
Archiving artifacts
No prior successful build to compare, so performing full copy of artifacts
Recording test results
Email was triggered for: Failure - Any
Sending email for trigger: Failure - Any



Mime
View raw message