lucene-dev mailing list archives

Site index · List index
Message view « Date » · « Thread »
Top « Date » · « Thread »
From Apache Jenkins Server <jenk...@builds.apache.org>
Subject [JENKINS] Lucene-Solr-Tests-5.x-Java7 - Build # 3917 - Failure
Date Mon, 11 Jan 2016 07:11:25 GMT
Build: https://builds.apache.org/job/Lucene-Solr-Tests-5.x-Java7/3917/

3 tests failed.
FAILED:  org.apache.solr.cloud.CollectionsAPIDistributedZkTest.test

Error Message:
Error from server at https://127.0.0.1:53099/awholynewcollection_0: non ok status: 500, message:Server Error

Stack Trace:
org.apache.solr.client.solrj.impl.HttpSolrClient$RemoteSolrException: Error from server at https://127.0.0.1:53099/awholynewcollection_0: non ok status: 500, message:Server Error
	at __randomizedtesting.SeedInfo.seed([DE7C8A873249D256:5628B55D9CB5BFAE]:0)
	at org.apache.solr.client.solrj.impl.HttpSolrClient.executeMethod(HttpSolrClient.java:508)
	at org.apache.solr.client.solrj.impl.HttpSolrClient.request(HttpSolrClient.java:241)
	at org.apache.solr.client.solrj.impl.HttpSolrClient.request(HttpSolrClient.java:230)
	at org.apache.solr.client.solrj.SolrRequest.process(SolrRequest.java:150)
	at org.apache.solr.client.solrj.SolrClient.query(SolrClient.java:943)
	at org.apache.solr.client.solrj.SolrClient.query(SolrClient.java:958)
	at org.apache.solr.cloud.AbstractFullDistribZkTestBase.waitForNon403or404or503(AbstractFullDistribZkTestBase.java:1754)
	at org.apache.solr.cloud.CollectionsAPIDistributedZkTest.testCollectionsAPI(CollectionsAPIDistributedZkTest.java:658)
	at org.apache.solr.cloud.CollectionsAPIDistributedZkTest.test(CollectionsAPIDistributedZkTest.java:160)
	at sun.reflect.NativeMethodAccessorImpl.invoke0(Native Method)
	at sun.reflect.NativeMethodAccessorImpl.invoke(NativeMethodAccessorImpl.java:57)
	at sun.reflect.DelegatingMethodAccessorImpl.invoke(DelegatingMethodAccessorImpl.java:43)
	at java.lang.reflect.Method.invoke(Method.java:606)
	at com.carrotsearch.randomizedtesting.RandomizedRunner.invoke(RandomizedRunner.java:1764)
	at com.carrotsearch.randomizedtesting.RandomizedRunner$8.evaluate(RandomizedRunner.java:871)
	at com.carrotsearch.randomizedtesting.RandomizedRunner$9.evaluate(RandomizedRunner.java:907)
	at com.carrotsearch.randomizedtesting.RandomizedRunner$10.evaluate(RandomizedRunner.java:921)
	at org.apache.solr.BaseDistributedSearchTestCase$ShardsRepeatRule$ShardsFixedStatement.callStatement(BaseDistributedSearchTestCase.java:965)
	at org.apache.solr.BaseDistributedSearchTestCase$ShardsRepeatRule$ShardsStatement.evaluate(BaseDistributedSearchTestCase.java:940)
	at com.carrotsearch.randomizedtesting.rules.SystemPropertiesRestoreRule$1.evaluate(SystemPropertiesRestoreRule.java:57)
	at org.apache.lucene.util.TestRuleSetupTeardownChained$1.evaluate(TestRuleSetupTeardownChained.java:50)
	at org.apache.lucene.util.AbstractBeforeAfterRule$1.evaluate(AbstractBeforeAfterRule.java:46)
	at org.apache.lucene.util.TestRuleThreadAndTestName$1.evaluate(TestRuleThreadAndTestName.java:49)
	at org.apache.lucene.util.TestRuleIgnoreAfterMaxFailures$1.evaluate(TestRuleIgnoreAfterMaxFailures.java:65)
	at org.apache.lucene.util.TestRuleMarkFailure$1.evaluate(TestRuleMarkFailure.java:48)
	at com.carrotsearch.randomizedtesting.rules.StatementAdapter.evaluate(StatementAdapter.java:36)
	at com.carrotsearch.randomizedtesting.ThreadLeakControl$StatementRunner.run(ThreadLeakControl.java:367)
	at com.carrotsearch.randomizedtesting.ThreadLeakControl.forkTimeoutingTask(ThreadLeakControl.java:809)
	at com.carrotsearch.randomizedtesting.ThreadLeakControl$3.evaluate(ThreadLeakControl.java:460)
	at com.carrotsearch.randomizedtesting.RandomizedRunner.runSingleTest(RandomizedRunner.java:880)
	at com.carrotsearch.randomizedtesting.RandomizedRunner$5.evaluate(RandomizedRunner.java:781)
	at com.carrotsearch.randomizedtesting.RandomizedRunner$6.evaluate(RandomizedRunner.java:816)
	at com.carrotsearch.randomizedtesting.RandomizedRunner$7.evaluate(RandomizedRunner.java:827)
	at com.carrotsearch.randomizedtesting.rules.StatementAdapter.evaluate(StatementAdapter.java:36)
	at com.carrotsearch.randomizedtesting.rules.SystemPropertiesRestoreRule$1.evaluate(SystemPropertiesRestoreRule.java:57)
	at org.apache.lucene.util.AbstractBeforeAfterRule$1.evaluate(AbstractBeforeAfterRule.java:46)
	at com.carrotsearch.randomizedtesting.rules.StatementAdapter.evaluate(StatementAdapter.java:36)
	at org.apache.lucene.util.TestRuleStoreClassName$1.evaluate(TestRuleStoreClassName.java:42)
	at com.carrotsearch.randomizedtesting.rules.NoShadowingOrOverridesOnMethodsRule$1.evaluate(NoShadowingOrOverridesOnMethodsRule.java:40)
	at com.carrotsearch.randomizedtesting.rules.NoShadowingOrOverridesOnMethodsRule$1.evaluate(NoShadowingOrOverridesOnMethodsRule.java:40)
	at com.carrotsearch.randomizedtesting.rules.StatementAdapter.evaluate(StatementAdapter.java:36)
	at com.carrotsearch.randomizedtesting.rules.StatementAdapter.evaluate(StatementAdapter.java:36)
	at com.carrotsearch.randomizedtesting.rules.StatementAdapter.evaluate(StatementAdapter.java:36)
	at org.apache.lucene.util.TestRuleAssertionsRequired$1.evaluate(TestRuleAssertionsRequired.java:54)
	at org.apache.lucene.util.TestRuleMarkFailure$1.evaluate(TestRuleMarkFailure.java:48)
	at org.apache.lucene.util.TestRuleIgnoreAfterMaxFailures$1.evaluate(TestRuleIgnoreAfterMaxFailures.java:65)
	at org.apache.lucene.util.TestRuleIgnoreTestSuites$1.evaluate(TestRuleIgnoreTestSuites.java:55)
	at com.carrotsearch.randomizedtesting.rules.StatementAdapter.evaluate(StatementAdapter.java:36)
	at com.carrotsearch.randomizedtesting.ThreadLeakControl$StatementRunner.run(ThreadLeakControl.java:367)
	at java.lang.Thread.run(Thread.java:745)


FAILED:  junit.framework.TestSuite.org.apache.solr.cloud.CollectionsAPIDistributedZkTest

Error Message:
5 threads leaked from SUITE scope at org.apache.solr.cloud.CollectionsAPIDistributedZkTest:     1) Thread[id=6922, name=zkCallback-720-thread-2, state=TIMED_WAITING, group=TGRP-CollectionsAPIDistributedZkTest]         at sun.misc.Unsafe.park(Native Method)         at java.util.concurrent.locks.LockSupport.parkNanos(LockSupport.java:226)         at java.util.concurrent.SynchronousQueue$TransferStack.awaitFulfill(SynchronousQueue.java:460)         at java.util.concurrent.SynchronousQueue$TransferStack.transfer(SynchronousQueue.java:359)         at java.util.concurrent.SynchronousQueue.poll(SynchronousQueue.java:942)         at java.util.concurrent.ThreadPoolExecutor.getTask(ThreadPoolExecutor.java:1068)         at java.util.concurrent.ThreadPoolExecutor.runWorker(ThreadPoolExecutor.java:1130)         at java.util.concurrent.ThreadPoolExecutor$Worker.run(ThreadPoolExecutor.java:615)         at java.lang.Thread.run(Thread.java:745)    2) Thread[id=6312, name=TEST-CollectionsAPIDistributedZkTest.test-seed#[DE7C8A873249D256]-EventThread, state=WAITING, group=TGRP-CollectionsAPIDistributedZkTest]         at sun.misc.Unsafe.park(Native Method)         at java.util.concurrent.locks.LockSupport.park(LockSupport.java:186)         at java.util.concurrent.locks.AbstractQueuedSynchronizer$ConditionObject.await(AbstractQueuedSynchronizer.java:2043)         at java.util.concurrent.LinkedBlockingQueue.take(LinkedBlockingQueue.java:442)         at org.apache.zookeeper.ClientCnxn$EventThread.run(ClientCnxn.java:494)    3) Thread[id=6313, name=zkCallback-720-thread-1, state=TIMED_WAITING, group=TGRP-CollectionsAPIDistributedZkTest]         at sun.misc.Unsafe.park(Native Method)         at java.util.concurrent.locks.LockSupport.parkNanos(LockSupport.java:226)         at java.util.concurrent.SynchronousQueue$TransferStack.awaitFulfill(SynchronousQueue.java:460)         at java.util.concurrent.SynchronousQueue$TransferStack.transfer(SynchronousQueue.java:359)         at java.util.concurrent.SynchronousQueue.poll(SynchronousQueue.java:942)         at java.util.concurrent.ThreadPoolExecutor.getTask(ThreadPoolExecutor.java:1068)         at java.util.concurrent.ThreadPoolExecutor.runWorker(ThreadPoolExecutor.java:1130)         at java.util.concurrent.ThreadPoolExecutor$Worker.run(ThreadPoolExecutor.java:615)         at java.lang.Thread.run(Thread.java:745)    4) Thread[id=6923, name=zkCallback-720-thread-3, state=TIMED_WAITING, group=TGRP-CollectionsAPIDistributedZkTest]         at sun.misc.Unsafe.park(Native Method)         at java.util.concurrent.locks.LockSupport.parkNanos(LockSupport.java:226)         at java.util.concurrent.SynchronousQueue$TransferStack.awaitFulfill(SynchronousQueue.java:460)         at java.util.concurrent.SynchronousQueue$TransferStack.transfer(SynchronousQueue.java:359)         at java.util.concurrent.SynchronousQueue.poll(SynchronousQueue.java:942)         at java.util.concurrent.ThreadPoolExecutor.getTask(ThreadPoolExecutor.java:1068)         at java.util.concurrent.ThreadPoolExecutor.runWorker(ThreadPoolExecutor.java:1130)         at java.util.concurrent.ThreadPoolExecutor$Worker.run(ThreadPoolExecutor.java:615)         at java.lang.Thread.run(Thread.java:745)    5) Thread[id=6311, name=TEST-CollectionsAPIDistributedZkTest.test-seed#[DE7C8A873249D256]-SendThread(127.0.0.1:45744), state=TIMED_WAITING, group=TGRP-CollectionsAPIDistributedZkTest]         at java.lang.Thread.sleep(Native Method)         at org.apache.zookeeper.ClientCnxn$SendThread.run(ClientCnxn.java:994)

Stack Trace:
com.carrotsearch.randomizedtesting.ThreadLeakError: 5 threads leaked from SUITE scope at org.apache.solr.cloud.CollectionsAPIDistributedZkTest: 
   1) Thread[id=6922, name=zkCallback-720-thread-2, state=TIMED_WAITING, group=TGRP-CollectionsAPIDistributedZkTest]
        at sun.misc.Unsafe.park(Native Method)
        at java.util.concurrent.locks.LockSupport.parkNanos(LockSupport.java:226)
        at java.util.concurrent.SynchronousQueue$TransferStack.awaitFulfill(SynchronousQueue.java:460)
        at java.util.concurrent.SynchronousQueue$TransferStack.transfer(SynchronousQueue.java:359)
        at java.util.concurrent.SynchronousQueue.poll(SynchronousQueue.java:942)
        at java.util.concurrent.ThreadPoolExecutor.getTask(ThreadPoolExecutor.java:1068)
        at java.util.concurrent.ThreadPoolExecutor.runWorker(ThreadPoolExecutor.java:1130)
        at java.util.concurrent.ThreadPoolExecutor$Worker.run(ThreadPoolExecutor.java:615)
        at java.lang.Thread.run(Thread.java:745)
   2) Thread[id=6312, name=TEST-CollectionsAPIDistributedZkTest.test-seed#[DE7C8A873249D256]-EventThread, state=WAITING, group=TGRP-CollectionsAPIDistributedZkTest]
        at sun.misc.Unsafe.park(Native Method)
        at java.util.concurrent.locks.LockSupport.park(LockSupport.java:186)
        at java.util.concurrent.locks.AbstractQueuedSynchronizer$ConditionObject.await(AbstractQueuedSynchronizer.java:2043)
        at java.util.concurrent.LinkedBlockingQueue.take(LinkedBlockingQueue.java:442)
        at org.apache.zookeeper.ClientCnxn$EventThread.run(ClientCnxn.java:494)
   3) Thread[id=6313, name=zkCallback-720-thread-1, state=TIMED_WAITING, group=TGRP-CollectionsAPIDistributedZkTest]
        at sun.misc.Unsafe.park(Native Method)
        at java.util.concurrent.locks.LockSupport.parkNanos(LockSupport.java:226)
        at java.util.concurrent.SynchronousQueue$TransferStack.awaitFulfill(SynchronousQueue.java:460)
        at java.util.concurrent.SynchronousQueue$TransferStack.transfer(SynchronousQueue.java:359)
        at java.util.concurrent.SynchronousQueue.poll(SynchronousQueue.java:942)
        at java.util.concurrent.ThreadPoolExecutor.getTask(ThreadPoolExecutor.java:1068)
        at java.util.concurrent.ThreadPoolExecutor.runWorker(ThreadPoolExecutor.java:1130)
        at java.util.concurrent.ThreadPoolExecutor$Worker.run(ThreadPoolExecutor.java:615)
        at java.lang.Thread.run(Thread.java:745)
   4) Thread[id=6923, name=zkCallback-720-thread-3, state=TIMED_WAITING, group=TGRP-CollectionsAPIDistributedZkTest]
        at sun.misc.Unsafe.park(Native Method)
        at java.util.concurrent.locks.LockSupport.parkNanos(LockSupport.java:226)
        at java.util.concurrent.SynchronousQueue$TransferStack.awaitFulfill(SynchronousQueue.java:460)
        at java.util.concurrent.SynchronousQueue$TransferStack.transfer(SynchronousQueue.java:359)
        at java.util.concurrent.SynchronousQueue.poll(SynchronousQueue.java:942)
        at java.util.concurrent.ThreadPoolExecutor.getTask(ThreadPoolExecutor.java:1068)
        at java.util.concurrent.ThreadPoolExecutor.runWorker(ThreadPoolExecutor.java:1130)
        at java.util.concurrent.ThreadPoolExecutor$Worker.run(ThreadPoolExecutor.java:615)
        at java.lang.Thread.run(Thread.java:745)
   5) Thread[id=6311, name=TEST-CollectionsAPIDistributedZkTest.test-seed#[DE7C8A873249D256]-SendThread(127.0.0.1:45744), state=TIMED_WAITING, group=TGRP-CollectionsAPIDistributedZkTest]
        at java.lang.Thread.sleep(Native Method)
        at org.apache.zookeeper.ClientCnxn$SendThread.run(ClientCnxn.java:994)
	at __randomizedtesting.SeedInfo.seed([DE7C8A873249D256]:0)


FAILED:  junit.framework.TestSuite.org.apache.solr.cloud.CollectionsAPIDistributedZkTest

Error Message:
There are still zombie threads that couldn't be terminated:    1) Thread[id=6313, name=zkCallback-720-thread-1, state=TIMED_WAITING, group=TGRP-CollectionsAPIDistributedZkTest]         at sun.misc.Unsafe.park(Native Method)         at java.util.concurrent.locks.LockSupport.parkNanos(LockSupport.java:226)         at java.util.concurrent.SynchronousQueue$TransferStack.awaitFulfill(SynchronousQueue.java:460)         at java.util.concurrent.SynchronousQueue$TransferStack.transfer(SynchronousQueue.java:359)         at java.util.concurrent.SynchronousQueue.poll(SynchronousQueue.java:942)         at java.util.concurrent.ThreadPoolExecutor.getTask(ThreadPoolExecutor.java:1068)         at java.util.concurrent.ThreadPoolExecutor.runWorker(ThreadPoolExecutor.java:1130)         at java.util.concurrent.ThreadPoolExecutor$Worker.run(ThreadPoolExecutor.java:615)         at java.lang.Thread.run(Thread.java:745)    2) Thread[id=6923, name=zkCallback-720-thread-3, state=TIMED_WAITING, group=TGRP-CollectionsAPIDistributedZkTest]         at sun.misc.Unsafe.park(Native Method)         at java.util.concurrent.locks.LockSupport.parkNanos(LockSupport.java:226)         at java.util.concurrent.SynchronousQueue$TransferStack.awaitFulfill(SynchronousQueue.java:460)         at java.util.concurrent.SynchronousQueue$TransferStack.transfer(SynchronousQueue.java:359)         at java.util.concurrent.SynchronousQueue.poll(SynchronousQueue.java:942)         at java.util.concurrent.ThreadPoolExecutor.getTask(ThreadPoolExecutor.java:1068)         at java.util.concurrent.ThreadPoolExecutor.runWorker(ThreadPoolExecutor.java:1130)         at java.util.concurrent.ThreadPoolExecutor$Worker.run(ThreadPoolExecutor.java:615)         at java.lang.Thread.run(Thread.java:745)    3) Thread[id=6311, name=TEST-CollectionsAPIDistributedZkTest.test-seed#[DE7C8A873249D256]-SendThread(127.0.0.1:45744), state=TIMED_WAITING, group=TGRP-CollectionsAPIDistributedZkTest]         at java.lang.Thread.sleep(Native Method)         at org.apache.zookeeper.client.StaticHostProvider.next(StaticHostProvider.java:101)         at org.apache.zookeeper.ClientCnxn$SendThread.startConnect(ClientCnxn.java:940)         at org.apache.zookeeper.ClientCnxn$SendThread.run(ClientCnxn.java:1003)    4) Thread[id=6922, name=zkCallback-720-thread-2, state=TIMED_WAITING, group=TGRP-CollectionsAPIDistributedZkTest]         at sun.misc.Unsafe.park(Native Method)         at java.util.concurrent.locks.LockSupport.parkNanos(LockSupport.java:226)         at java.util.concurrent.SynchronousQueue$TransferStack.awaitFulfill(SynchronousQueue.java:460)         at java.util.concurrent.SynchronousQueue$TransferStack.transfer(SynchronousQueue.java:359)         at java.util.concurrent.SynchronousQueue.poll(SynchronousQueue.java:942)         at java.util.concurrent.ThreadPoolExecutor.getTask(ThreadPoolExecutor.java:1068)         at java.util.concurrent.ThreadPoolExecutor.runWorker(ThreadPoolExecutor.java:1130)         at java.util.concurrent.ThreadPoolExecutor$Worker.run(ThreadPoolExecutor.java:615)         at java.lang.Thread.run(Thread.java:745)

Stack Trace:
com.carrotsearch.randomizedtesting.ThreadLeakError: There are still zombie threads that couldn't be terminated:
   1) Thread[id=6313, name=zkCallback-720-thread-1, state=TIMED_WAITING, group=TGRP-CollectionsAPIDistributedZkTest]
        at sun.misc.Unsafe.park(Native Method)
        at java.util.concurrent.locks.LockSupport.parkNanos(LockSupport.java:226)
        at java.util.concurrent.SynchronousQueue$TransferStack.awaitFulfill(SynchronousQueue.java:460)
        at java.util.concurrent.SynchronousQueue$TransferStack.transfer(SynchronousQueue.java:359)
        at java.util.concurrent.SynchronousQueue.poll(SynchronousQueue.java:942)
        at java.util.concurrent.ThreadPoolExecutor.getTask(ThreadPoolExecutor.java:1068)
        at java.util.concurrent.ThreadPoolExecutor.runWorker(ThreadPoolExecutor.java:1130)
        at java.util.concurrent.ThreadPoolExecutor$Worker.run(ThreadPoolExecutor.java:615)
        at java.lang.Thread.run(Thread.java:745)
   2) Thread[id=6923, name=zkCallback-720-thread-3, state=TIMED_WAITING, group=TGRP-CollectionsAPIDistributedZkTest]
        at sun.misc.Unsafe.park(Native Method)
        at java.util.concurrent.locks.LockSupport.parkNanos(LockSupport.java:226)
        at java.util.concurrent.SynchronousQueue$TransferStack.awaitFulfill(SynchronousQueue.java:460)
        at java.util.concurrent.SynchronousQueue$TransferStack.transfer(SynchronousQueue.java:359)
        at java.util.concurrent.SynchronousQueue.poll(SynchronousQueue.java:942)
        at java.util.concurrent.ThreadPoolExecutor.getTask(ThreadPoolExecutor.java:1068)
        at java.util.concurrent.ThreadPoolExecutor.runWorker(ThreadPoolExecutor.java:1130)
        at java.util.concurrent.ThreadPoolExecutor$Worker.run(ThreadPoolExecutor.java:615)
        at java.lang.Thread.run(Thread.java:745)
   3) Thread[id=6311, name=TEST-CollectionsAPIDistributedZkTest.test-seed#[DE7C8A873249D256]-SendThread(127.0.0.1:45744), state=TIMED_WAITING, group=TGRP-CollectionsAPIDistributedZkTest]
        at java.lang.Thread.sleep(Native Method)
        at org.apache.zookeeper.client.StaticHostProvider.next(StaticHostProvider.java:101)
        at org.apache.zookeeper.ClientCnxn$SendThread.startConnect(ClientCnxn.java:940)
        at org.apache.zookeeper.ClientCnxn$SendThread.run(ClientCnxn.java:1003)
   4) Thread[id=6922, name=zkCallback-720-thread-2, state=TIMED_WAITING, group=TGRP-CollectionsAPIDistributedZkTest]
        at sun.misc.Unsafe.park(Native Method)
        at java.util.concurrent.locks.LockSupport.parkNanos(LockSupport.java:226)
        at java.util.concurrent.SynchronousQueue$TransferStack.awaitFulfill(SynchronousQueue.java:460)
        at java.util.concurrent.SynchronousQueue$TransferStack.transfer(SynchronousQueue.java:359)
        at java.util.concurrent.SynchronousQueue.poll(SynchronousQueue.java:942)
        at java.util.concurrent.ThreadPoolExecutor.getTask(ThreadPoolExecutor.java:1068)
        at java.util.concurrent.ThreadPoolExecutor.runWorker(ThreadPoolExecutor.java:1130)
        at java.util.concurrent.ThreadPoolExecutor$Worker.run(ThreadPoolExecutor.java:615)
        at java.lang.Thread.run(Thread.java:745)
	at __randomizedtesting.SeedInfo.seed([DE7C8A873249D256]:0)




Build Log:
[...truncated 10637 lines...]
   [junit4] Suite: org.apache.solr.cloud.CollectionsAPIDistributedZkTest
   [junit4]   2> Creating dataDir: /x1/jenkins/jenkins-slave/workspace/Lucene-Solr-Tests-5.x-Java7/solr/build/solr-core/test/J1/temp/solr.cloud.CollectionsAPIDistributedZkTest_DE7C8A873249D256-001/init-core-data-001
   [junit4]   2> 1057033 INFO  (SUITE-CollectionsAPIDistributedZkTest-seed#[DE7C8A873249D256]-worker) [    ] o.a.s.SolrTestCaseJ4 Randomized ssl (true) and clientAuth (false)
   [junit4]   2> 1057033 INFO  (SUITE-CollectionsAPIDistributedZkTest-seed#[DE7C8A873249D256]-worker) [    ] o.a.s.BaseDistributedSearchTestCase Setting hostContext system property: /
   [junit4]   2> 1057037 INFO  (TEST-CollectionsAPIDistributedZkTest.test-seed#[DE7C8A873249D256]) [    ] o.a.s.c.ZkTestServer STARTING ZK TEST SERVER
   [junit4]   2> 1057038 INFO  (Thread-2300) [    ] o.a.s.c.ZkTestServer client port:0.0.0.0/0.0.0.0:0
   [junit4]   2> 1057038 INFO  (Thread-2300) [    ] o.a.s.c.ZkTestServer Starting server
   [junit4]   2> 1057138 INFO  (TEST-CollectionsAPIDistributedZkTest.test-seed#[DE7C8A873249D256]) [    ] o.a.s.c.ZkTestServer start zk server on port:45744
   [junit4]   2> 1057138 INFO  (TEST-CollectionsAPIDistributedZkTest.test-seed#[DE7C8A873249D256]) [    ] o.a.s.c.c.SolrZkClient Using default ZkCredentialsProvider
   [junit4]   2> 1057138 INFO  (TEST-CollectionsAPIDistributedZkTest.test-seed#[DE7C8A873249D256]) [    ] o.a.s.c.c.ConnectionManager Waiting for client to connect to ZooKeeper
   [junit4]   2> 1057143 INFO  (zkCallback-687-thread-1) [    ] o.a.s.c.c.ConnectionManager Watcher org.apache.solr.common.cloud.ConnectionManager@4352931c name:ZooKeeperConnection Watcher:127.0.0.1:45744 got event WatchedEvent state:SyncConnected type:None path:null path:null type:None
   [junit4]   2> 1057143 INFO  (TEST-CollectionsAPIDistributedZkTest.test-seed#[DE7C8A873249D256]) [    ] o.a.s.c.c.ConnectionManager Client is connected to ZooKeeper
   [junit4]   2> 1057144 INFO  (TEST-CollectionsAPIDistributedZkTest.test-seed#[DE7C8A873249D256]) [    ] o.a.s.c.c.SolrZkClient Using default ZkACLProvider
   [junit4]   2> 1057144 INFO  (TEST-CollectionsAPIDistributedZkTest.test-seed#[DE7C8A873249D256]) [    ] o.a.s.c.c.SolrZkClient makePath: /solr
   [junit4]   2> 1057146 INFO  (TEST-CollectionsAPIDistributedZkTest.test-seed#[DE7C8A873249D256]) [    ] o.a.s.c.c.SolrZkClient Using default ZkCredentialsProvider
   [junit4]   2> 1057151 INFO  (TEST-CollectionsAPIDistributedZkTest.test-seed#[DE7C8A873249D256]) [    ] o.a.s.c.c.ConnectionManager Waiting for client to connect to ZooKeeper
   [junit4]   2> 1057151 INFO  (zkCallback-688-thread-1) [    ] o.a.s.c.c.ConnectionManager Watcher org.apache.solr.common.cloud.ConnectionManager@2e96f917 name:ZooKeeperConnection Watcher:127.0.0.1:45744/solr got event WatchedEvent state:SyncConnected type:None path:null path:null type:None
   [junit4]   2> 1057151 INFO  (TEST-CollectionsAPIDistributedZkTest.test-seed#[DE7C8A873249D256]) [    ] o.a.s.c.c.ConnectionManager Client is connected to ZooKeeper
   [junit4]   2> 1057151 INFO  (TEST-CollectionsAPIDistributedZkTest.test-seed#[DE7C8A873249D256]) [    ] o.a.s.c.c.SolrZkClient Using default ZkACLProvider
   [junit4]   2> 1057151 INFO  (TEST-CollectionsAPIDistributedZkTest.test-seed#[DE7C8A873249D256]) [    ] o.a.s.c.c.SolrZkClient makePath: /collections/collection1
   [junit4]   2> 1057153 INFO  (TEST-CollectionsAPIDistributedZkTest.test-seed#[DE7C8A873249D256]) [    ] o.a.s.c.c.SolrZkClient makePath: /collections/collection1/shards
   [junit4]   2> 1057155 INFO  (TEST-CollectionsAPIDistributedZkTest.test-seed#[DE7C8A873249D256]) [    ] o.a.s.c.c.SolrZkClient makePath: /collections/control_collection
   [junit4]   2> 1057156 INFO  (TEST-CollectionsAPIDistributedZkTest.test-seed#[DE7C8A873249D256]) [    ] o.a.s.c.c.SolrZkClient makePath: /collections/control_collection/shards
   [junit4]   2> 1057158 INFO  (TEST-CollectionsAPIDistributedZkTest.test-seed#[DE7C8A873249D256]) [    ] o.a.s.c.AbstractZkTestCase put /x1/jenkins/jenkins-slave/workspace/Lucene-Solr-Tests-5.x-Java7/solr/core/src/test-files/solr/collection1/conf/solrconfig-tlog.xml to /configs/conf1/solrconfig.xml
   [junit4]   2> 1057158 INFO  (TEST-CollectionsAPIDistributedZkTest.test-seed#[DE7C8A873249D256]) [    ] o.a.s.c.c.SolrZkClient makePath: /configs/conf1/solrconfig.xml
   [junit4]   2> 1057161 INFO  (TEST-CollectionsAPIDistributedZkTest.test-seed#[DE7C8A873249D256]) [    ] o.a.s.c.AbstractZkTestCase put /x1/jenkins/jenkins-slave/workspace/Lucene-Solr-Tests-5.x-Java7/solr/core/src/test-files/solr/collection1/conf/schema.xml to /configs/conf1/schema.xml
   [junit4]   2> 1057161 INFO  (TEST-CollectionsAPIDistributedZkTest.test-seed#[DE7C8A873249D256]) [    ] o.a.s.c.c.SolrZkClient makePath: /configs/conf1/schema.xml
   [junit4]   2> 1057163 INFO  (TEST-CollectionsAPIDistributedZkTest.test-seed#[DE7C8A873249D256]) [    ] o.a.s.c.AbstractZkTestCase put /x1/jenkins/jenkins-slave/workspace/Lucene-Solr-Tests-5.x-Java7/solr/core/src/test-files/solr/collection1/conf/solrconfig.snippet.randomindexconfig.xml to /configs/conf1/solrconfig.snippet.randomindexconfig.xml
   [junit4]   2> 1057163 INFO  (TEST-CollectionsAPIDistributedZkTest.test-seed#[DE7C8A873249D256]) [    ] o.a.s.c.c.SolrZkClient makePath: /configs/conf1/solrconfig.snippet.randomindexconfig.xml
   [junit4]   2> 1057165 INFO  (TEST-CollectionsAPIDistributedZkTest.test-seed#[DE7C8A873249D256]) [    ] o.a.s.c.AbstractZkTestCase put /x1/jenkins/jenkins-slave/workspace/Lucene-Solr-Tests-5.x-Java7/solr/core/src/test-files/solr/collection1/conf/stopwords.txt to /configs/conf1/stopwords.txt
   [junit4]   2> 1057165 INFO  (TEST-CollectionsAPIDistributedZkTest.test-seed#[DE7C8A873249D256]) [    ] o.a.s.c.c.SolrZkClient makePath: /configs/conf1/stopwords.txt
   [junit4]   2> 1057167 INFO  (TEST-CollectionsAPIDistributedZkTest.test-seed#[DE7C8A873249D256]) [    ] o.a.s.c.AbstractZkTestCase put /x1/jenkins/jenkins-slave/workspace/Lucene-Solr-Tests-5.x-Java7/solr/core/src/test-files/solr/collection1/conf/protwords.txt to /configs/conf1/protwords.txt
   [junit4]   2> 1057167 INFO  (TEST-CollectionsAPIDistributedZkTest.test-seed#[DE7C8A873249D256]) [    ] o.a.s.c.c.SolrZkClient makePath: /configs/conf1/protwords.txt
   [junit4]   2> 1057169 INFO  (TEST-CollectionsAPIDistributedZkTest.test-seed#[DE7C8A873249D256]) [    ] o.a.s.c.AbstractZkTestCase put /x1/jenkins/jenkins-slave/workspace/Lucene-Solr-Tests-5.x-Java7/solr/core/src/test-files/solr/collection1/conf/currency.xml to /configs/conf1/currency.xml
   [junit4]   2> 1057169 INFO  (TEST-CollectionsAPIDistributedZkTest.test-seed#[DE7C8A873249D256]) [    ] o.a.s.c.c.SolrZkClient makePath: /configs/conf1/currency.xml
   [junit4]   2> 1057171 INFO  (TEST-CollectionsAPIDistributedZkTest.test-seed#[DE7C8A873249D256]) [    ] o.a.s.c.AbstractZkTestCase put /x1/jenkins/jenkins-slave/workspace/Lucene-Solr-Tests-5.x-Java7/solr/core/src/test-files/solr/collection1/conf/enumsConfig.xml to /configs/conf1/enumsConfig.xml
   [junit4]   2> 1057171 INFO  (TEST-CollectionsAPIDistributedZkTest.test-seed#[DE7C8A873249D256]) [    ] o.a.s.c.c.SolrZkClient makePath: /configs/conf1/enumsConfig.xml
   [junit4]   2> 1057173 INFO  (TEST-CollectionsAPIDistributedZkTest.test-seed#[DE7C8A873249D256]) [    ] o.a.s.c.AbstractZkTestCase put /x1/jenkins/jenkins-slave/workspace/Lucene-Solr-Tests-5.x-Java7/solr/core/src/test-files/solr/collection1/conf/open-exchange-rates.json to /configs/conf1/open-exchange-rates.json
   [junit4]   2> 1057173 INFO  (TEST-CollectionsAPIDistributedZkTest.test-seed#[DE7C8A873249D256]) [    ] o.a.s.c.c.SolrZkClient makePath: /configs/conf1/open-exchange-rates.json
   [junit4]   2> 1057175 INFO  (TEST-CollectionsAPIDistributedZkTest.test-seed#[DE7C8A873249D256]) [    ] o.a.s.c.AbstractZkTestCase put /x1/jenkins/jenkins-slave/workspace/Lucene-Solr-Tests-5.x-Java7/solr/core/src/test-files/solr/collection1/conf/mapping-ISOLatin1Accent.txt to /configs/conf1/mapping-ISOLatin1Accent.txt
   [junit4]   2> 1057175 INFO  (TEST-CollectionsAPIDistributedZkTest.test-seed#[DE7C8A873249D256]) [    ] o.a.s.c.c.SolrZkClient makePath: /configs/conf1/mapping-ISOLatin1Accent.txt
   [junit4]   2> 1057176 INFO  (TEST-CollectionsAPIDistributedZkTest.test-seed#[DE7C8A873249D256]) [    ] o.a.s.c.AbstractZkTestCase put /x1/jenkins/jenkins-slave/workspace/Lucene-Solr-Tests-5.x-Java7/solr/core/src/test-files/solr/collection1/conf/old_synonyms.txt to /configs/conf1/old_synonyms.txt
   [junit4]   2> 1057176 INFO  (TEST-CollectionsAPIDistributedZkTest.test-seed#[DE7C8A873249D256]) [    ] o.a.s.c.c.SolrZkClient makePath: /configs/conf1/old_synonyms.txt
   [junit4]   2> 1057178 INFO  (TEST-CollectionsAPIDistributedZkTest.test-seed#[DE7C8A873249D256]) [    ] o.a.s.c.AbstractZkTestCase put /x1/jenkins/jenkins-slave/workspace/Lucene-Solr-Tests-5.x-Java7/solr/core/src/test-files/solr/collection1/conf/synonyms.txt to /configs/conf1/synonyms.txt
   [junit4]   2> 1057178 INFO  (TEST-CollectionsAPIDistributedZkTest.test-seed#[DE7C8A873249D256]) [    ] o.a.s.c.c.SolrZkClient makePath: /configs/conf1/synonyms.txt
   [junit4]   2> 1057181 INFO  (TEST-CollectionsAPIDistributedZkTest.test-seed#[DE7C8A873249D256]) [    ] o.a.s.c.c.SolrZkClient Using default ZkCredentialsProvider
   [junit4]   2> 1057182 INFO  (TEST-CollectionsAPIDistributedZkTest.test-seed#[DE7C8A873249D256]) [    ] o.a.s.c.c.ConnectionManager Waiting for client to connect to ZooKeeper
   [junit4]   2> 1057183 INFO  (zkCallback-689-thread-1) [    ] o.a.s.c.c.ConnectionManager Watcher org.apache.solr.common.cloud.ConnectionManager@4225bd4c name:ZooKeeperConnection Watcher:127.0.0.1:45744/solr got event WatchedEvent state:SyncConnected type:None path:null path:null type:None
   [junit4]   2> 1057183 INFO  (TEST-CollectionsAPIDistributedZkTest.test-seed#[DE7C8A873249D256]) [    ] o.a.s.c.c.ConnectionManager Client is connected to ZooKeeper
   [junit4]   2> 1057183 INFO  (TEST-CollectionsAPIDistributedZkTest.test-seed#[DE7C8A873249D256]) [    ] o.a.s.c.c.SolrZkClient Using default ZkACLProvider
   [junit4]   2> 1057483 INFO  (TEST-CollectionsAPIDistributedZkTest.test-seed#[DE7C8A873249D256]) [    ] o.a.s.SolrTestCaseJ4 Writing core.properties file to /x1/jenkins/jenkins-slave/workspace/Lucene-Solr-Tests-5.x-Java7/solr/build/solr-core/test/J1/temp/solr.cloud.CollectionsAPIDistributedZkTest_DE7C8A873249D256-001/control-001/cores/collection1
   [junit4]   2> 1057484 INFO  (TEST-CollectionsAPIDistributedZkTest.test-seed#[DE7C8A873249D256]) [    ] o.e.j.s.Server jetty-9.2.13.v20150730
   [junit4]   2> 1057486 INFO  (TEST-CollectionsAPIDistributedZkTest.test-seed#[DE7C8A873249D256]) [    ] o.e.j.s.h.ContextHandler Started o.e.j.s.ServletContextHandler@2a3d51a3{/,null,AVAILABLE}
   [junit4]   2> 1057491 INFO  (TEST-CollectionsAPIDistributedZkTest.test-seed#[DE7C8A873249D256]) [    ] o.e.j.s.ServerConnector Started ServerConnector@1c09249f{SSL-http/1.1}{127.0.0.1:53099}
   [junit4]   2> 1057492 INFO  (TEST-CollectionsAPIDistributedZkTest.test-seed#[DE7C8A873249D256]) [    ] o.e.j.s.Server Started @1060380ms
   [junit4]   2> 1057492 INFO  (TEST-CollectionsAPIDistributedZkTest.test-seed#[DE7C8A873249D256]) [    ] o.a.s.c.s.e.JettySolrRunner Jetty properties: {hostPort=53099, coreRootDirectory=/x1/jenkins/jenkins-slave/workspace/Lucene-Solr-Tests-5.x-Java7/solr/build/solr-core/test/J1/temp/solr.cloud.CollectionsAPIDistributedZkTest_DE7C8A873249D256-001/control-001/cores, hostContext=/, solr.data.dir=/x1/jenkins/jenkins-slave/workspace/Lucene-Solr-Tests-5.x-Java7/solr/build/solr-core/test/J1/temp/solr.cloud.CollectionsAPIDistributedZkTest_DE7C8A873249D256-001/tempDir-001/control/data}
   [junit4]   2> 1057492 INFO  (TEST-CollectionsAPIDistributedZkTest.test-seed#[DE7C8A873249D256]) [    ] o.a.s.s.SolrDispatchFilter SolrDispatchFilter.init(): sun.misc.Launcher$AppClassLoader@3827de24
   [junit4]   2> 1057492 INFO  (TEST-CollectionsAPIDistributedZkTest.test-seed#[DE7C8A873249D256]) [    ] o.a.s.c.SolrResourceLoader new SolrResourceLoader for directory: '/x1/jenkins/jenkins-slave/workspace/Lucene-Solr-Tests-5.x-Java7/solr/build/solr-core/test/J1/temp/solr.cloud.CollectionsAPIDistributedZkTest_DE7C8A873249D256-001/control-001'
   [junit4]   2> 1057492 INFO  (TEST-CollectionsAPIDistributedZkTest.test-seed#[DE7C8A873249D256]) [    ] o.a.s.c.SolrResourceLoader JNDI not configured for solr (NoInitialContextEx)
   [junit4]   2> 1057492 INFO  (TEST-CollectionsAPIDistributedZkTest.test-seed#[DE7C8A873249D256]) [    ] o.a.s.c.SolrResourceLoader solr home defaulted to 'solr/' (could not find system property or JNDI)
   [junit4]   2> 1057492 INFO  (TEST-CollectionsAPIDistributedZkTest.test-seed#[DE7C8A873249D256]) [    ] o.a.s.c.c.SolrZkClient Using default ZkCredentialsProvider
   [junit4]   2> 1057493 INFO  (TEST-CollectionsAPIDistributedZkTest.test-seed#[DE7C8A873249D256]) [    ] o.a.s.c.c.ConnectionManager Waiting for client to connect to ZooKeeper
   [junit4]   2> 1057494 INFO  (zkCallback-690-thread-1) [    ] o.a.s.c.c.ConnectionManager Watcher org.apache.solr.common.cloud.ConnectionManager@2727a63 name:ZooKeeperConnection Watcher:127.0.0.1:45744/solr got event WatchedEvent state:SyncConnected type:None path:null path:null type:None
   [junit4]   2> 1057495 INFO  (TEST-CollectionsAPIDistributedZkTest.test-seed#[DE7C8A873249D256]) [    ] o.a.s.c.c.ConnectionManager Client is connected to ZooKeeper
   [junit4]   2> 1057495 INFO  (TEST-CollectionsAPIDistributedZkTest.test-seed#[DE7C8A873249D256]) [    ] o.a.s.c.c.SolrZkClient Using default ZkACLProvider
   [junit4]   2> 1057496 INFO  (TEST-CollectionsAPIDistributedZkTest.test-seed#[DE7C8A873249D256]) [    ] o.a.s.s.SolrDispatchFilter Loading solr.xml from SolrHome (not found in ZooKeeper)
   [junit4]   2> 1057496 INFO  (TEST-CollectionsAPIDistributedZkTest.test-seed#[DE7C8A873249D256]) [    ] o.a.s.c.SolrXmlConfig Loading container configuration from /x1/jenkins/jenkins-slave/workspace/Lucene-Solr-Tests-5.x-Java7/solr/build/solr-core/test/J1/temp/solr.cloud.CollectionsAPIDistributedZkTest_DE7C8A873249D256-001/control-001/solr.xml
   [junit4]   2> 1057510 INFO  (TEST-CollectionsAPIDistributedZkTest.test-seed#[DE7C8A873249D256]) [    ] o.a.s.c.CorePropertiesLocator Config-defined core root directory: /x1/jenkins/jenkins-slave/workspace/Lucene-Solr-Tests-5.x-Java7/solr/build/solr-core/test/J1/temp/solr.cloud.CollectionsAPIDistributedZkTest_DE7C8A873249D256-001/control-001/cores
   [junit4]   2> 1057510 INFO  (TEST-CollectionsAPIDistributedZkTest.test-seed#[DE7C8A873249D256]) [    ] o.a.s.c.CoreContainer New CoreContainer 1944796679
   [junit4]   2> 1057510 INFO  (TEST-CollectionsAPIDistributedZkTest.test-seed#[DE7C8A873249D256]) [    ] o.a.s.c.CoreContainer Loading cores into CoreContainer [instanceDir=/x1/jenkins/jenkins-slave/workspace/Lucene-Solr-Tests-5.x-Java7/solr/build/solr-core/test/J1/temp/solr.cloud.CollectionsAPIDistributedZkTest_DE7C8A873249D256-001/control-001]
   [junit4]   2> 1057511 WARN  (TEST-CollectionsAPIDistributedZkTest.test-seed#[DE7C8A873249D256]) [    ] o.a.s.c.CoreContainer Couldn't add files from /x1/jenkins/jenkins-slave/workspace/Lucene-Solr-Tests-5.x-Java7/solr/build/solr-core/test/J1/temp/solr.cloud.CollectionsAPIDistributedZkTest_DE7C8A873249D256-001/control-001/lib to classpath: /x1/jenkins/jenkins-slave/workspace/Lucene-Solr-Tests-5.x-Java7/solr/build/solr-core/test/J1/temp/solr.cloud.CollectionsAPIDistributedZkTest_DE7C8A873249D256-001/control-001/lib
   [junit4]   2> 1057511 INFO  (TEST-CollectionsAPIDistributedZkTest.test-seed#[DE7C8A873249D256]) [    ] o.a.s.h.c.HttpShardHandlerFactory created with socketTimeout : 90000,urlScheme : ,connTimeout : 15000,maxConnectionsPerHost : 20,maxConnections : 10000,corePoolSize : 0,maximumPoolSize : 2147483647,maxThreadIdleTime : 5,sizeOfQueue : -1,fairnessPolicy : false,useRetries : false,
   [junit4]   2> 1057513 INFO  (TEST-CollectionsAPIDistributedZkTest.test-seed#[DE7C8A873249D256]) [    ] o.a.s.u.UpdateShardHandler Creating UpdateShardHandler HTTP client with params: socketTimeout=340000&connTimeout=45000&retry=true
   [junit4]   2> 1057515 INFO  (TEST-CollectionsAPIDistributedZkTest.test-seed#[DE7C8A873249D256]) [    ] o.a.s.l.LogWatcher SLF4J impl is org.slf4j.impl.Log4jLoggerFactory
   [junit4]   2> 1057515 INFO  (TEST-CollectionsAPIDistributedZkTest.test-seed#[DE7C8A873249D256]) [    ] o.a.s.l.LogWatcher Registering Log Listener [Log4j (org.slf4j.impl.Log4jLoggerFactory)]
   [junit4]   2> 1057515 INFO  (TEST-CollectionsAPIDistributedZkTest.test-seed#[DE7C8A873249D256]) [    ] o.a.s.c.ZkContainer Zookeeper client=127.0.0.1:45744/solr
   [junit4]   2> 1057515 INFO  (TEST-CollectionsAPIDistributedZkTest.test-seed#[DE7C8A873249D256]) [    ] o.a.s.c.ZkController zkHost includes chroot
   [junit4]   2> 1057515 INFO  (TEST-CollectionsAPIDistributedZkTest.test-seed#[DE7C8A873249D256]) [    ] o.a.s.c.c.SolrZkClient Using default ZkCredentialsProvider
   [junit4]   2> 1057517 INFO  (TEST-CollectionsAPIDistributedZkTest.test-seed#[DE7C8A873249D256]) [    ] o.a.s.c.c.ConnectionManager Waiting for client to connect to ZooKeeper
   [junit4]   2> 1057520 INFO  (zkCallback-692-thread-1) [    ] o.a.s.c.c.ConnectionManager Watcher org.apache.solr.common.cloud.ConnectionManager@4581e88d name:ZooKeeperConnection Watcher:127.0.0.1:45744 got event WatchedEvent state:SyncConnected type:None path:null path:null type:None
   [junit4]   2> 1057520 INFO  (TEST-CollectionsAPIDistributedZkTest.test-seed#[DE7C8A873249D256]) [    ] o.a.s.c.c.ConnectionManager Client is connected to ZooKeeper
   [junit4]   2> 1057522 INFO  (TEST-CollectionsAPIDistributedZkTest.test-seed#[DE7C8A873249D256]) [    ] o.a.s.c.c.SolrZkClient Using default ZkACLProvider
   [junit4]   2> 1057528 INFO  (TEST-CollectionsAPIDistributedZkTest.test-seed#[DE7C8A873249D256]) [n:127.0.0.1:53099_    ] o.a.s.c.c.ConnectionManager Waiting for client to connect to ZooKeeper
   [junit4]   2> 1057529 INFO  (zkCallback-693-thread-1-processing-n:127.0.0.1:53099_) [n:127.0.0.1:53099_    ] o.a.s.c.c.ConnectionManager Watcher org.apache.solr.common.cloud.ConnectionManager@3c603626 name:ZooKeeperConnection Watcher:127.0.0.1:45744/solr got event WatchedEvent state:SyncConnected type:None path:null path:null type:None
   [junit4]   2> 1057529 INFO  (TEST-CollectionsAPIDistributedZkTest.test-seed#[DE7C8A873249D256]) [n:127.0.0.1:53099_    ] o.a.s.c.c.ConnectionManager Client is connected to ZooKeeper
   [junit4]   2> 1057530 INFO  (TEST-CollectionsAPIDistributedZkTest.test-seed#[DE7C8A873249D256]) [n:127.0.0.1:53099_    ] o.a.s.c.c.SolrZkClient makePath: /overseer/queue
   [junit4]   2> 1057532 INFO  (TEST-CollectionsAPIDistributedZkTest.test-seed#[DE7C8A873249D256]) [n:127.0.0.1:53099_    ] o.a.s.c.c.SolrZkClient makePath: /overseer/collection-queue-work
   [junit4]   2> 1057534 INFO  (TEST-CollectionsAPIDistributedZkTest.test-seed#[DE7C8A873249D256]) [n:127.0.0.1:53099_    ] o.a.s.c.c.SolrZkClient makePath: /overseer/collection-map-running
   [junit4]   2> 1057536 INFO  (TEST-CollectionsAPIDistributedZkTest.test-seed#[DE7C8A873249D256]) [n:127.0.0.1:53099_    ] o.a.s.c.c.SolrZkClient makePath: /overseer/collection-map-completed
   [junit4]   2> 1057538 INFO  (TEST-CollectionsAPIDistributedZkTest.test-seed#[DE7C8A873249D256]) [n:127.0.0.1:53099_    ] o.a.s.c.c.SolrZkClient makePath: /overseer/collection-map-failure
   [junit4]   2> 1057540 INFO  (TEST-CollectionsAPIDistributedZkTest.test-seed#[DE7C8A873249D256]) [n:127.0.0.1:53099_    ] o.a.s.c.c.SolrZkClient makePath: /live_nodes
   [junit4]   2> 1057541 INFO  (TEST-CollectionsAPIDistributedZkTest.test-seed#[DE7C8A873249D256]) [n:127.0.0.1:53099_    ] o.a.s.c.c.SolrZkClient makePath: /aliases.json
   [junit4]   2> 1057542 INFO  (TEST-CollectionsAPIDistributedZkTest.test-seed#[DE7C8A873249D256]) [n:127.0.0.1:53099_    ] o.a.s.c.c.SolrZkClient makePath: /clusterstate.json
   [junit4]   2> 1057543 INFO  (TEST-CollectionsAPIDistributedZkTest.test-seed#[DE7C8A873249D256]) [n:127.0.0.1:53099_    ] o.a.s.c.c.SolrZkClient makePath: /security.json
   [junit4]   2> 1057544 INFO  (TEST-CollectionsAPIDistributedZkTest.test-seed#[DE7C8A873249D256]) [n:127.0.0.1:53099_    ] o.a.s.c.ZkController Register node as live in ZooKeeper:/live_nodes/127.0.0.1:53099_
   [junit4]   2> 1057544 INFO  (TEST-CollectionsAPIDistributedZkTest.test-seed#[DE7C8A873249D256]) [n:127.0.0.1:53099_    ] o.a.s.c.c.SolrZkClient makePath: /live_nodes/127.0.0.1:53099_
   [junit4]   2> 1057546 INFO  (TEST-CollectionsAPIDistributedZkTest.test-seed#[DE7C8A873249D256]) [n:127.0.0.1:53099_    ] o.a.s.c.c.SolrZkClient makePath: /overseer_elect
   [junit4]   2> 1057547 INFO  (TEST-CollectionsAPIDistributedZkTest.test-seed#[DE7C8A873249D256]) [n:127.0.0.1:53099_    ] o.a.s.c.c.SolrZkClient makePath: /overseer_elect/election
   [junit4]   2> 1057548 INFO  (TEST-CollectionsAPIDistributedZkTest.test-seed#[DE7C8A873249D256]) [n:127.0.0.1:53099_    ] o.a.s.c.Overseer Overseer (id=null) closing
   [junit4]   2> 1057548 INFO  (TEST-CollectionsAPIDistributedZkTest.test-seed#[DE7C8A873249D256]) [n:127.0.0.1:53099_    ] o.a.s.c.LeaderElector Joined leadership election with path: /overseer_elect/election/95190777287278597-127.0.0.1:53099_-n_0000000000
   [junit4]   2> 1057548 INFO  (TEST-CollectionsAPIDistributedZkTest.test-seed#[DE7C8A873249D256]) [n:127.0.0.1:53099_    ] o.a.s.c.OverseerElectionContext I am going to be the leader 127.0.0.1:53099_
   [junit4]   2> 1057548 INFO  (TEST-CollectionsAPIDistributedZkTest.test-seed#[DE7C8A873249D256]) [n:127.0.0.1:53099_    ] o.a.s.c.c.SolrZkClient makePath: /overseer_elect/leader
   [junit4]   2> 1057549 INFO  (TEST-CollectionsAPIDistributedZkTest.test-seed#[DE7C8A873249D256]) [n:127.0.0.1:53099_    ] o.a.s.c.Overseer Overseer (id=95190777287278597-127.0.0.1:53099_-n_0000000000) starting
   [junit4]   2> 1057551 INFO  (TEST-CollectionsAPIDistributedZkTest.test-seed#[DE7C8A873249D256]) [n:127.0.0.1:53099_    ] o.a.s.c.c.SolrZkClient makePath: /overseer/queue-work
   [junit4]   2> 1057556 INFO  (TEST-CollectionsAPIDistributedZkTest.test-seed#[DE7C8A873249D256]) [n:127.0.0.1:53099_    ] o.a.s.c.OverseerAutoReplicaFailoverThread Starting OverseerAutoReplicaFailoverThread autoReplicaFailoverWorkLoopDelay=10000 autoReplicaFailoverWaitAfterExpiration=10000 autoReplicaFailoverBadNodeExpiration=60000
   [junit4]   2> 1057556 INFO  (OverseerCollectionConfigSetProcessor-95190777287278597-127.0.0.1:53099_-n_0000000000) [n:127.0.0.1:53099_    ] o.a.s.c.OverseerTaskProcessor Process current queue of overseer operations
   [junit4]   2> 1057556 INFO  (TEST-CollectionsAPIDistributedZkTest.test-seed#[DE7C8A873249D256]) [n:127.0.0.1:53099_    ] o.a.s.c.c.ZkStateReader Updating cluster state from ZooKeeper... 
   [junit4]   2> 1057556 INFO  (OverseerStateUpdate-95190777287278597-127.0.0.1:53099_-n_0000000000) [n:127.0.0.1:53099_    ] o.a.s.c.Overseer Starting to work on the main queue
   [junit4]   2> 1057576 INFO  (TEST-CollectionsAPIDistributedZkTest.test-seed#[DE7C8A873249D256]) [n:127.0.0.1:53099_    ] o.a.s.c.CoreContainer Security conf doesn't exist. Skipping setup for authorization module.
   [junit4]   2> 1057576 INFO  (TEST-CollectionsAPIDistributedZkTest.test-seed#[DE7C8A873249D256]) [n:127.0.0.1:53099_    ] o.a.s.c.CoreContainer No authentication plugin used.
   [junit4]   2> 1057577 INFO  (TEST-CollectionsAPIDistributedZkTest.test-seed#[DE7C8A873249D256]) [n:127.0.0.1:53099_    ] o.a.s.c.CorePropertiesLocator Looking for core definitions underneath /x1/jenkins/jenkins-slave/workspace/Lucene-Solr-Tests-5.x-Java7/solr/build/solr-core/test/J1/temp/solr.cloud.CollectionsAPIDistributedZkTest_DE7C8A873249D256-001/control-001/cores
   [junit4]   2> 1057578 INFO  (TEST-CollectionsAPIDistributedZkTest.test-seed#[DE7C8A873249D256]) [n:127.0.0.1:53099_    ] o.a.s.c.CoreDescriptor Created CoreDescriptor: {configSetProperties=configsetprops.json, transient=false, name=collection1, config=solrconfig.xml, shard=, dataDir=data/, collection=control_collection, schema=schema.xml, coreNodeName=, loadOnStartup=true}
   [junit4]   2> 1057578 INFO  (TEST-CollectionsAPIDistributedZkTest.test-seed#[DE7C8A873249D256]) [n:127.0.0.1:53099_    ] o.a.s.c.CorePropertiesLocator Found core collection1 in /x1/jenkins/jenkins-slave/workspace/Lucene-Solr-Tests-5.x-Java7/solr/build/solr-core/test/J1/temp/solr.cloud.CollectionsAPIDistributedZkTest_DE7C8A873249D256-001/control-001/cores/collection1
   [junit4]   2> 1057578 INFO  (TEST-CollectionsAPIDistributedZkTest.test-seed#[DE7C8A873249D256]) [n:127.0.0.1:53099_    ] o.a.s.c.CorePropertiesLocator Found 1 core definitions
   [junit4]   2> 1057580 INFO  (TEST-CollectionsAPIDistributedZkTest.test-seed#[DE7C8A873249D256]) [n:127.0.0.1:53099_    ] o.a.s.s.SolrDispatchFilter user.dir=/x1/jenkins/jenkins-slave/workspace/Lucene-Solr-Tests-5.x-Java7/solr/build/solr-core/test/J1
   [junit4]   2> 1057580 INFO  (TEST-CollectionsAPIDistributedZkTest.test-seed#[DE7C8A873249D256]) [n:127.0.0.1:53099_    ] o.a.s.s.SolrDispatchFilter SolrDispatchFilter.init() done
   [junit4]   2> 1057580 INFO  (coreLoadExecutor-2541-thread-1-processing-n:127.0.0.1:53099_) [n:127.0.0.1:53099_ c:control_collection   x:collection1] o.a.s.c.ZkController publishing state=down
   [junit4]   2> 1057580 INFO  (coreLoadExecutor-2541-thread-1-processing-n:127.0.0.1:53099_) [n:127.0.0.1:53099_ c:control_collection   x:collection1] o.a.s.c.ZkController numShards not found on descriptor - reading it from system property
   [junit4]   2> 1057582 INFO  (OverseerStateUpdate-95190777287278597-127.0.0.1:53099_-n_0000000000) [n:127.0.0.1:53099_    ] o.a.s.c.Overseer processMessage: queueSize: 1, message = {
   [junit4]   2>   "collection":"control_collection",
   [junit4]   2>   "core":"collection1",
   [junit4]   2>   "numShards":"1",
   [junit4]   2>   "operation":"state",
   [junit4]   2>   "base_url":"https://127.0.0.1:53099",
   [junit4]   2>   "node_name":"127.0.0.1:53099_",
   [junit4]   2>   "state":"down",
   [junit4]   2>   "shard":null,
   [junit4]   2>   "roles":null} current state version: 0
   [junit4]   2> 1057582 INFO  (coreLoadExecutor-2541-thread-1-processing-n:127.0.0.1:53099_) [n:127.0.0.1:53099_ c:control_collection   x:collection1] o.a.s.c.ZkController look for our core node name
   [junit4]   2> 1057583 INFO  (OverseerStateUpdate-95190777287278597-127.0.0.1:53099_-n_0000000000) [n:127.0.0.1:53099_    ] o.a.s.c.o.ReplicaMutator Update state numShards=1 message={
   [junit4]   2>   "collection":"control_collection",
   [junit4]   2>   "core":"collection1",
   [junit4]   2>   "numShards":"1",
   [junit4]   2>   "operation":"state",
   [junit4]   2>   "base_url":"https://127.0.0.1:53099",
   [junit4]   2>   "node_name":"127.0.0.1:53099_",
   [junit4]   2>   "state":"down",
   [junit4]   2>   "shard":null,
   [junit4]   2>   "roles":null}
   [junit4]   2> 1057583 INFO  (OverseerStateUpdate-95190777287278597-127.0.0.1:53099_-n_0000000000) [n:127.0.0.1:53099_    ] o.a.s.c.o.ClusterStateMutator building a new cName: control_collection
   [junit4]   2> 1057584 INFO  (OverseerStateUpdate-95190777287278597-127.0.0.1:53099_-n_0000000000) [n:127.0.0.1:53099_    ] o.a.s.c.o.ReplicaMutator Assigning new node to shard shard=shard1
   [junit4]   2> 1057585 INFO  (zkCallback-693-thread-1-processing-n:127.0.0.1:53099_) [n:127.0.0.1:53099_    ] o.a.s.c.c.ZkStateReader A cluster state change: [WatchedEvent state:SyncConnected type:NodeDataChanged path:/clusterstate.json], has occurred - updating... (live nodes size: [1])
   [junit4]   2> 1058583 INFO  (coreLoadExecutor-2541-thread-1-processing-n:127.0.0.1:53099_) [n:127.0.0.1:53099_ c:control_collection   x:collection1] o.a.s.c.ZkController waiting to find shard id in clusterstate for collection1
   [junit4]   2> 1058583 INFO  (coreLoadExecutor-2541-thread-1-processing-n:127.0.0.1:53099_) [n:127.0.0.1:53099_ c:control_collection   x:collection1] o.a.s.c.ZkController Check for collection zkNode:control_collection
   [junit4]   2> 1058583 INFO  (coreLoadExecutor-2541-thread-1-processing-n:127.0.0.1:53099_) [n:127.0.0.1:53099_ c:control_collection   x:collection1] o.a.s.c.ZkController Collection zkNode exists
   [junit4]   2> 1058583 INFO  (coreLoadExecutor-2541-thread-1-processing-n:127.0.0.1:53099_) [n:127.0.0.1:53099_ c:control_collection   x:collection1] o.a.s.c.c.ZkStateReader Load collection config from: [/collections/control_collection]
   [junit4]   2> 1058584 INFO  (coreLoadExecutor-2541-thread-1-processing-n:127.0.0.1:53099_) [n:127.0.0.1:53099_ c:control_collection   x:collection1] o.a.s.c.c.ZkStateReader path=[/collections/control_collection] [configName]=[conf1] specified config exists in ZooKeeper
   [junit4]   2> 1058584 INFO  (coreLoadExecutor-2541-thread-1-processing-n:127.0.0.1:53099_) [n:127.0.0.1:53099_ c:control_collection   x:collection1] o.a.s.c.SolrResourceLoader new SolrResourceLoader for directory: '/x1/jenkins/jenkins-slave/workspace/Lucene-Solr-Tests-5.x-Java7/solr/build/solr-core/test/J1/temp/solr.cloud.CollectionsAPIDistributedZkTest_DE7C8A873249D256-001/control-001/cores/collection1'
   [junit4]   2> 1058584 INFO  (coreLoadExecutor-2541-thread-1-processing-n:127.0.0.1:53099_) [n:127.0.0.1:53099_ c:control_collection   x:collection1] o.a.s.c.SolrResourceLoader JNDI not configured for solr (NoInitialContextEx)
   [junit4]   2> 1058584 INFO  (coreLoadExecutor-2541-thread-1-processing-n:127.0.0.1:53099_) [n:127.0.0.1:53099_ c:control_collection   x:collection1] o.a.s.c.SolrResourceLoader solr home defaulted to 'solr/' (could not find system property or JNDI)
   [junit4]   2> 1058586 INFO  (coreLoadExecutor-2541-thread-1-processing-n:127.0.0.1:53099_) [n:127.0.0.1:53099_ c:control_collection   x:collection1] o.a.s.c.Config loaded config solrconfig.xml with version 0 
   [junit4]   2> 1058593 INFO  (coreLoadExecutor-2541-thread-1-processing-n:127.0.0.1:53099_) [n:127.0.0.1:53099_ c:control_collection   x:collection1] o.a.s.c.SolrConfig current version of requestparams : -1
   [junit4]   2> 1058607 INFO  (coreLoadExecutor-2541-thread-1-processing-n:127.0.0.1:53099_) [n:127.0.0.1:53099_ c:control_collection   x:collection1] o.a.s.c.SolrConfig Using Lucene MatchVersion: 5.5.0
   [junit4]   2> 1058652 INFO  (coreLoadExecutor-2541-thread-1-processing-n:127.0.0.1:53099_) [n:127.0.0.1:53099_ c:control_collection   x:collection1] o.a.s.c.SolrConfig Loaded SolrConfig: solrconfig.xml
   [junit4]   2> 1058663 INFO  (coreLoadExecutor-2541-thread-1-processing-n:127.0.0.1:53099_) [n:127.0.0.1:53099_ c:control_collection   x:collection1] o.a.s.s.IndexSchema [collection1] Schema name=test
   [junit4]   2> 1058918 INFO  (coreLoadExecutor-2541-thread-1-processing-n:127.0.0.1:53099_) [n:127.0.0.1:53099_ c:control_collection   x:collection1] o.a.s.s.OpenExchangeRatesOrgProvider Initialized with rates=open-exchange-rates.json, refreshInterval=1440.
   [junit4]   2> 1058926 INFO  (coreLoadExecutor-2541-thread-1-processing-n:127.0.0.1:53099_) [n:127.0.0.1:53099_ c:control_collection   x:collection1] o.a.s.s.IndexSchema default search field in schema is text
   [junit4]   2> 1058928 INFO  (coreLoadExecutor-2541-thread-1-processing-n:127.0.0.1:53099_) [n:127.0.0.1:53099_ c:control_collection   x:collection1] o.a.s.s.IndexSchema unique key field: id
   [junit4]   2> 1058937 INFO  (coreLoadExecutor-2541-thread-1-processing-n:127.0.0.1:53099_) [n:127.0.0.1:53099_ c:control_collection   x:collection1] o.a.s.s.FileExchangeRateProvider Reloading exchange rates from file currency.xml
   [junit4]   2> 1058940 INFO  (coreLoadExecutor-2541-thread-1-processing-n:127.0.0.1:53099_) [n:127.0.0.1:53099_ c:control_collection   x:collection1] o.a.s.s.FileExchangeRateProvider Reloading exchange rates from file currency.xml
   [junit4]   2> 1058943 INFO  (coreLoadExecutor-2541-thread-1-processing-n:127.0.0.1:53099_) [n:127.0.0.1:53099_ c:control_collection   x:collection1] o.a.s.s.OpenExchangeRatesOrgProvider Reloading exchange rates from open-exchange-rates.json
   [junit4]   2> 1058944 INFO  (coreLoadExecutor-2541-thread-1-processing-n:127.0.0.1:53099_) [n:127.0.0.1:53099_ c:control_collection   x:collection1] o.a.s.s.OpenExchangeRatesOrgProvider Reloading exchange rates from open-exchange-rates.json
   [junit4]   2> 1058946 INFO  (coreLoadExecutor-2541-thread-1-processing-n:127.0.0.1:53099_) [n:127.0.0.1:53099_ c:control_collection   x:collection1] o.a.s.c.ConfigSetProperties Did not find ConfigSet properties, assuming default properties: Can't find resource 'configsetprops.json' in classpath or '/configs/conf1', cwd=/x1/jenkins/jenkins-slave/workspace/Lucene-Solr-Tests-5.x-Java7/solr/build/solr-core/test/J1
   [junit4]   2> 1058946 INFO  (coreLoadExecutor-2541-thread-1-processing-n:127.0.0.1:53099_) [n:127.0.0.1:53099_ c:control_collection   x:collection1] o.a.s.c.CoreContainer Creating SolrCore 'collection1' using configuration from collection control_collection
   [junit4]   2> 1058946 INFO  (coreLoadExecutor-2541-thread-1-processing-n:127.0.0.1:53099_) [n:127.0.0.1:53099_ c:control_collection s:shard1 r:core_node1 x:collection1] o.a.s.c.SolrCore org.apache.solr.core.MockDirectoryFactory
   [junit4]   2> 1058947 INFO  (coreLoadExecutor-2541-thread-1-processing-n:127.0.0.1:53099_) [n:127.0.0.1:53099_ c:control_collection s:shard1 r:core_node1 x:collection1] o.a.s.c.SolrCore [[collection1] ] Opening new SolrCore at [/x1/jenkins/jenkins-slave/workspace/Lucene-Solr-Tests-5.x-Java7/solr/build/solr-core/test/J1/temp/solr.cloud.CollectionsAPIDistributedZkTest_DE7C8A873249D256-001/control-001/cores/collection1], dataDir=[/x1/jenkins/jenkins-slave/workspace/Lucene-Solr-Tests-5.x-Java7/solr/build/solr-core/test/J1/temp/solr.cloud.CollectionsAPIDistributedZkTest_DE7C8A873249D256-001/control-001/cores/collection1/data/]
   [junit4]   2> 1058947 INFO  (coreLoadExecutor-2541-thread-1-processing-n:127.0.0.1:53099_) [n:127.0.0.1:53099_ c:control_collection s:shard1 r:core_node1 x:collection1] o.a.s.c.JmxMonitoredMap JMX monitoring is enabled. Adding Solr mbeans to JMX Server: com.sun.jmx.mbeanserver.JmxMBeanServer@65694763
   [junit4]   2> 1058947 INFO  (coreLoadExecutor-2541-thread-1-processing-n:127.0.0.1:53099_) [n:127.0.0.1:53099_ c:control_collection s:shard1 r:core_node1 x:collection1] o.a.s.c.CachingDirectoryFactory return new directory for /x1/jenkins/jenkins-slave/workspace/Lucene-Solr-Tests-5.x-Java7/solr/build/solr-core/test/J1/temp/solr.cloud.CollectionsAPIDistributedZkTest_DE7C8A873249D256-001/control-001/cores/collection1/data
   [junit4]   2> 1058948 INFO  (coreLoadExecutor-2541-thread-1-processing-n:127.0.0.1:53099_) [n:127.0.0.1:53099_ c:control_collection s:shard1 r:core_node1 x:collection1] o.a.s.c.SolrCore New index directory detected: old=null new=/x1/jenkins/jenkins-slave/workspace/Lucene-Solr-Tests-5.x-Java7/solr/build/solr-core/test/J1/temp/solr.cloud.CollectionsAPIDistributedZkTest_DE7C8A873249D256-001/control-001/cores/collection1/data/index/
   [junit4]   2> 1058948 WARN  (coreLoadExecutor-2541-thread-1-processing-n:127.0.0.1:53099_) [n:127.0.0.1:53099_ c:control_collection s:shard1 r:core_node1 x:collection1] o.a.s.c.SolrCore [collection1] Solr index directory '/x1/jenkins/jenkins-slave/workspace/Lucene-Solr-Tests-5.x-Java7/solr/build/solr-core/test/J1/temp/solr.cloud.CollectionsAPIDistributedZkTest_DE7C8A873249D256-001/control-001/cores/collection1/data/index' doesn't exist. Creating new index...
   [junit4]   2> 1058948 INFO  (coreLoadExecutor-2541-thread-1-processing-n:127.0.0.1:53099_) [n:127.0.0.1:53099_ c:control_collection s:shard1 r:core_node1 x:collection1] o.a.s.c.CachingDirectoryFactory return new directory for /x1/jenkins/jenkins-slave/workspace/Lucene-Solr-Tests-5.x-Java7/solr/build/solr-core/test/J1/temp/solr.cloud.CollectionsAPIDistributedZkTest_DE7C8A873249D256-001/control-001/cores/collection1/data/index
   [junit4]   2> 1058948 INFO  (coreLoadExecutor-2541-thread-1-processing-n:127.0.0.1:53099_) [n:127.0.0.1:53099_ c:control_collection s:shard1 r:core_node1 x:collection1] o.a.s.u.RandomMergePolicy RandomMergePolicy wrapping class org.apache.lucene.index.TieredMergePolicy: [TieredMergePolicy: maxMergeAtOnce=14, maxMergeAtOnceExplicit=41, maxMergedSegmentMB=18.1474609375, floorSegmentMB=1.703125, forceMergeDeletesPctAllowed=7.873922225840802, segmentsPerTier=42.0, maxCFSSegmentSizeMB=8.796093022207999E12, noCFSRatio=1.0
   [junit4]   2> 1058949 INFO  (coreLoadExecutor-2541-thread-1-processing-n:127.0.0.1:53099_) [n:127.0.0.1:53099_ c:control_collection s:shard1 r:core_node1 x:collection1] o.a.s.c.SolrDeletionPolicy SolrDeletionPolicy.onCommit: commits: num=1
   [junit4]   2> 	commit{dir=MockDirectoryWrapper(RAMDirectory@56daa7cf lockFactory=org.apache.lucene.store.SingleInstanceLockFactory@2d3f3395),segFN=segments_1,generation=1}
   [junit4]   2> 1058949 INFO  (coreLoadExecutor-2541-thread-1-processing-n:127.0.0.1:53099_) [n:127.0.0.1:53099_ c:control_collection s:shard1 r:core_node1 x:collection1] o.a.s.c.SolrDeletionPolicy newest commit generation = 1
   [junit4]   2> 1058949 INFO  (OldIndexDirectoryCleanupThreadForCore-collection1) [n:127.0.0.1:53099_ c:control_collection s:shard1 r:core_node1 x:collection1] o.a.s.c.SolrCore Looking for old index directories to cleanup for core collection1 in /x1/jenkins/jenkins-slave/workspace/Lucene-Solr-Tests-5.x-Java7/solr/build/solr-core/test/J1/temp/solr.cloud.CollectionsAPIDistributedZkTest_DE7C8A873249D256-001/control-001/cores/collection1/data/
   [junit4]   2> 1058949 WARN  (OldIndexDirectoryCleanupThreadForCore-collection1) [n:127.0.0.1:53099_ c:control_collection s:shard1 r:core_node1 x:collection1] o.a.s.c.DirectoryFactory /x1/jenkins/jenkins-slave/workspace/Lucene-Solr-Tests-5.x-Java7/solr/build/solr-core/test/J1/temp/solr.cloud.CollectionsAPIDistributedZkTest_DE7C8A873249D256-001/control-001/cores/collection1/data/ does not point to a valid data directory; skipping clean-up of old index directories.
   [junit4]   2> 1058953 INFO  (coreLoadExecutor-2541-thread-1-processing-n:127.0.0.1:53099_) [n:127.0.0.1:53099_ c:control_collection s:shard1 r:core_node1 x:collection1] o.a.s.u.p.UpdateRequestProcessorChain creating updateRequestProcessorChain "nodistrib"
   [junit4]   2> 1058953 INFO  (coreLoadExecutor-2541-thread-1-processing-n:127.0.0.1:53099_) [n:127.0.0.1:53099_ c:control_collection s:shard1 r:core_node1 x:collection1] o.a.s.u.p.UpdateRequestProcessorChain creating updateRequestProcessorChain "dedupe"
   [junit4]   2> 1058953 INFO  (coreLoadExecutor-2541-thread-1-processing-n:127.0.0.1:53099_) [n:127.0.0.1:53099_ c:control_collection s:shard1 r:core_node1 x:collection1] o.a.s.u.p.UpdateRequestProcessorChain inserting DistributedUpdateProcessorFactory into updateRequestProcessorChain "dedupe"
   [junit4]   2> 1058953 INFO  (coreLoadExecutor-2541-thread-1-processing-n:127.0.0.1:53099_) [n:127.0.0.1:53099_ c:control_collection s:shard1 r:core_node1 x:collection1] o.a.s.u.p.UpdateRequestProcessorChain creating updateRequestProcessorChain "stored_sig"
   [junit4]   2> 1058954 INFO  (coreLoadExecutor-2541-thread-1-processing-n:127.0.0.1:53099_) [n:127.0.0.1:53099_ c:control_collection s:shard1 r:core_node1 x:collection1] o.a.s.u.p.UpdateRequestProcessorChain inserting DistributedUpdateProcessorFactory into updateRequestProcessorChain "stored_sig"
   [junit4]   2> 1058954 INFO  (coreLoadExecutor-2541-thread-1-processing-n:127.0.0.1:53099_) [n:127.0.0.1:53099_ c:control_collection s:shard1 r:core_node1 x:collection1] o.a.s.u.p.UpdateRequestProcessorChain creating updateRequestProcessorChain "distrib-dup-test-chain-explicit"
   [junit4]   2> 1058954 INFO  (coreLoadExecutor-2541-thread-1-processing-n:127.0.0.1:53099_) [n:127.0.0.1:53099_ c:control_collection s:shard1 r:core_node1 x:collection1] o.a.s.u.p.UpdateRequestProcessorChain creating updateRequestProcessorChain "distrib-dup-test-chain-implicit"
   [junit4]   2> 1058954 INFO  (coreLoadExecutor-2541-thread-1-processing-n:127.0.0.1:53099_) [n:127.0.0.1:53099_ c:control_collection s:shard1 r:core_node1 x:collection1] o.a.s.u.p.UpdateRequestProcessorChain inserting DistributedUpdateProcessorFactory into updateRequestProcessorChain "distrib-dup-test-chain-implicit"
   [junit4]   2> 1058954 INFO  (coreLoadExecutor-2541-thread-1-processing-n:127.0.0.1:53099_) [n:127.0.0.1:53099_ c:control_collection s:shard1 r:core_node1 x:collection1] o.a.s.c.SolrCore no updateRequestProcessorChain defined as default, creating implicit default
   [junit4]   2> 1058954 WARN  (coreLoadExecutor-2541-thread-1-processing-n:127.0.0.1:53099_) [n:127.0.0.1:53099_ c:control_collection s:shard1 r:core_node1 x:collection1] o.a.s.c.RequestHandlers INVALID paramSet a in requestHandler {type = requestHandler,name = /dump,class = DumpRequestHandler,args = {defaults={a=A,b=B}}}
   [junit4]   2> 1058957 INFO  (coreLoadExecutor-2541-thread-1-processing-n:127.0.0.1:53099_) [n:127.0.0.1:53099_ c:control_collection s:shard1 r:core_node1 x:collection1] o.a.s.h.l.XMLLoader xsltCacheLifetimeSeconds=60
   [junit4]   2> 1058958 INFO  (coreLoadExecutor-2541-thread-1-processing-n:127.0.0.1:53099_) [n:127.0.0.1:53099_ c:control_collection s:shard1 r:core_node1 x:collection1] o.a.s.h.l.XMLLoader xsltCacheLifetimeSeconds=60
   [junit4]   2> 1058960 INFO  (coreLoadExecutor-2541-thread-1-processing-n:127.0.0.1:53099_) [n:127.0.0.1:53099_ c:control_collection s:shard1 r:core_node1 x:collection1] o.a.s.h.l.XMLLoader xsltCacheLifetimeSeconds=60
   [junit4]   2> 1058961 INFO  (coreLoadExecutor-2541-thread-1-processing-n:127.0.0.1:53099_) [n:127.0.0.1:53099_ c:control_collection s:shard1 r:core_node1 x:collection1] o.a.s.h.l.XMLLoader xsltCacheLifetimeSeconds=60
   [junit4]   2> 1058965 INFO  (coreLoadExecutor-2541-thread-1-processing-n:127.0.0.1:53099_) [n:127.0.0.1:53099_ c:control_collection s:shard1 r:core_node1 x:collection1] o.a.s.c.RequestHandlers Registered paths: /update,/update/csv,/config,/get,standard,/admin/ping,/update/json,/admin/threads,/admin/mbeans,/admin/file,/admin/logging,/admin/system,/admin/segments,/dump,/replication,/schema,/admin/luke,/admin/properties,/update/json/docs,/admin/plugins
   [junit4]   2> 1058966 INFO  (coreLoadExecutor-2541-thread-1-processing-n:127.0.0.1:53099_) [n:127.0.0.1:53099_ c:control_collection s:shard1 r:core_node1 x:collection1] o.a.s.c.SolrCore Using default statsCache cache: org.apache.solr.search.stats.LocalStatsCache
   [junit4]   2> 1058967 INFO  (coreLoadExecutor-2541-thread-1-processing-n:127.0.0.1:53099_) [n:127.0.0.1:53099_ c:control_collection s:shard1 r:core_node1 x:collection1] o.a.s.u.UpdateHandler Using UpdateLog implementation: org.apache.solr.update.UpdateLog
   [junit4]   2> 1058967 INFO  (coreLoadExecutor-2541-thread-1-processing-n:127.0.0.1:53099_) [n:127.0.0.1:53099_ c:control_collection s:shard1 r:core_node1 x:collection1] o.a.s.u.UpdateLog Initializing UpdateLog: dataDir= defaultSyncLevel=FLUSH numRecordsToKeep=100 maxNumLogsToKeep=10 numVersionBuckets=65536
   [junit4]   2> 1058967 INFO  (coreLoadExecutor-2541-thread-1-processing-n:127.0.0.1:53099_) [n:127.0.0.1:53099_ c:control_collection s:shard1 r:core_node1 x:collection1] o.a.s.u.CommitTracker Hard AutoCommit: disabled
   [junit4]   2> 1058968 INFO  (coreLoadExecutor-2541-thread-1-processing-n:127.0.0.1:53099_) [n:127.0.0.1:53099_ c:control_collection s:shard1 r:core_node1 x:collection1] o.a.s.u.CommitTracker Soft AutoCommit: disabled
   [junit4]   2> 1058968 INFO  (coreLoadExecutor-2541-thread-1-processing-n:127.0.0.1:53099_) [n:127.0.0.1:53099_ c:control_collection s:shard1 r:core_node1 x:collection1] o.a.s.u.RandomMergePolicy RandomMergePolicy wrapping class org.apache.lucene.index.LogByteSizeMergePolicy: [LogByteSizeMergePolicy: minMergeSize=1677721, mergeFactor=37, maxMergeSize=2147483648, maxMergeSizeForForcedMerge=9223372036854775807, calibrateSizeByDeletes=false, maxMergeDocs=2147483647, maxCFSSegmentSizeMB=8.796093022207999E12, noCFSRatio=0.0]
   [junit4]   2> 1058968 INFO  (coreLoadExecutor-2541-thread-1-processing-n:127.0.0.1:53099_) [n:127.0.0.1:53099_ c:control_collection s:shard1 r:core_node1 x:collection1] o.a.s.c.SolrDeletionPolicy SolrDeletionPolicy.onInit: commits: num=1
   [junit4]   2> 	commit{dir=MockDirectoryWrapper(RAMDirectory@56daa7cf lockFactory=org.apache.lucene.store.SingleInstanceLockFactory@2d3f3395),segFN=segments_1,generation=1}
   [junit4]   2> 1058968 INFO  (coreLoadExecutor-2541-thread-1-processing-n:127.0.0.1:53099_) [n:127.0.0.1:53099_ c:control_collection s:shard1 r:core_node1 x:collection1] o.a.s.c.SolrDeletionPolicy newest commit generation = 1
   [junit4]   2> 1058968 INFO  (coreLoadExecutor-2541-thread-1-processing-n:127.0.0.1:53099_) [n:127.0.0.1:53099_ c:control_collection s:shard1 r:core_node1 x:collection1] o.a.s.s.SolrIndexSearcher Opening Searcher@261ea926[collection1] main
   [junit4]   2> 1058969 INFO  (coreLoadExecutor-2541-thread-1-processing-n:127.0.0.1:53099_) [n:127.0.0.1:53099_ c:control_collection s:shard1 r:core_node1 x:collection1] o.a.s.c.c.ZkStateReader Load collection config from: [/collections/control_collection]
   [junit4]   2> 1058969 INFO  (coreLoadExecutor-2541-thread-1-processing-n:127.0.0.1:53099_) [n:127.0.0.1:53099_ c:control_collection s:shard1 r:core_node1 x:collection1] o.a.s.c.c.ZkStateReader path=[/collections/control_collection] [configName]=[conf1] specified config exists in ZooKeeper
   [junit4]   2> 1058969 INFO  (coreLoadExecutor-2541-thread-1-processing-n:127.0.0.1:53099_) [n:127.0.0.1:53099_ c:control_collection s:shard1 r:core_node1 x:collection1] o.a.s.r.ManagedResourceStorage Setting up ZooKeeper-based storage for the RestManager with znodeBase: /configs/conf1
   [junit4]   2> 1058970 INFO  (coreLoadExecutor-2541-thread-1-processing-n:127.0.0.1:53099_) [n:127.0.0.1:53099_ c:control_collection s:shard1 r:core_node1 x:collection1] o.a.s.r.ManagedResourceStorage Configured ZooKeeperStorageIO with znodeBase: /configs/conf1
   [junit4]   2> 1058970 INFO  (coreLoadExecutor-2541-thread-1-processing-n:127.0.0.1:53099_) [n:127.0.0.1:53099_ c:control_collection s:shard1 r:core_node1 x:collection1] o.a.s.r.RestManager Initializing RestManager with initArgs: {}
   [junit4]   2> 1058970 INFO  (coreLoadExecutor-2541-thread-1-processing-n:127.0.0.1:53099_) [n:127.0.0.1:53099_ c:control_collection s:shard1 r:core_node1 x:collection1] o.a.s.r.ManagedResourceStorage Reading _rest_managed.json using ZooKeeperStorageIO:path=/configs/conf1
   [junit4]   2> 1058970 INFO  (coreLoadExecutor-2541-thread-1-processing-n:127.0.0.1:53099_) [n:127.0.0.1:53099_ c:control_collection s:shard1 r:core_node1 x:collection1] o.a.s.r.ManagedResourceStorage No data found for znode /configs/conf1/_rest_managed.json
   [junit4]   2> 1058970 INFO  (coreLoadExecutor-2541-thread-1-processing-n:127.0.0.1:53099_) [n:127.0.0.1:53099_ c:control_collection s:shard1 r:core_node1 x:collection1] o.a.s.r.ManagedResourceStorage Loaded null at path _rest_managed.json using ZooKeeperStorageIO:path=/configs/conf1
   [junit4]   2> 1058971 INFO  (coreLoadExecutor-2541-thread-1-processing-n:127.0.0.1:53099_) [n:127.0.0.1:53099_ c:control_collection s:shard1 r:core_node1 x:collection1] o.a.s.r.RestManager Initializing 0 registered ManagedResources
   [junit4]   2> 1058971 INFO  (coreLoadExecutor-2541-thread-1-processing-n:127.0.0.1:53099_) [n:127.0.0.1:53099_ c:control_collection s:shard1 r:core_node1 x:collection1] o.a.s.h.ReplicationHandler Commits will be reserved for  10000
   [junit4]   2> 1058971 INFO  (searcherExecutor-2542-thread-1-processing-c:control_collection x:collection1 n:127.0.0.1:53099_ s:shard1 r:core_node1) [n:127.0.0.1:53099_ c:control_collection s:shard1 r:core_node1 x:collection1] o.a.s.c.SolrCore [collection1] Registered new searcher Searcher@261ea926[collection1] main{ExitableDirectoryReader(UninvertingDirectoryReader())}
   [junit4]   2> 1058971 INFO  (coreLoadExecutor-2541-thread-1-processing-n:127.0.0.1:53099_) [n:127.0.0.1:53099_ c:control_collection s:shard1 r:core_node1 x:collection1] o.a.s.u.UpdateLog Looking up max value of version field to seed version buckets
   [junit4]   2> 1058971 INFO  (coreLoadExecutor-2541-thread-1-processing-n:127.0.0.1:53099_) [n:127.0.0.1:53099_ c:control_collection s:shard1 r:core_node1 x:collection1] o.a.s.u.VersionInfo Refreshing highest value of _version_ for 65536 version buckets from index
   [junit4]   2> 1058971 INFO  (coreLoadExecutor-2541-thread-1-processing-n:127.0.0.1:53099_) [n:127.0.0.1:53099_ c:control_collection s:shard1 r:core_node1 x:collection1] o.a.s.u.VersionInfo No terms found for _version_, cannot seed version bucket highest value from index
   [junit4]   2> 1058972 INFO  (coreLoadExecutor-2541-thread-1-processing-n:127.0.0.1:53099_) [n:127.0.0.1:53099_ c:control_collection s:shard1 r:core_node1 x:collection1] o.a.s.u.UpdateLog Could not find max version in index or recent updates, using new clock 1523052438623354880
   [junit4]   2> 1058974 INFO  (coreLoadExecutor-2541-thread-1-processing-n:127.0.0.1:53099_) [n:127.0.0.1:53099_ c:control_collection s:shard1 r:core_node1 x:collection1] o.a.s.u.UpdateLog Took 2.0ms to seed version buckets with highest version 1523052438623354880
   [junit4]   2> 1058974 INFO  (coreLoadExecutor-2541-thread-1-processing-n:127.0.0.1:53099_) [n:127.0.0.1:53099_ c:control_collection s:shard1 r:core_node1 x:collection1] o.a.s.c.ZkController watch zkdir /configs/conf1
   [junit4]   2> 1058974 INFO  (coreLoadExecutor-2541-thread-1-processing-n:127.0.0.1:53099_) [n:127.0.0.1:53099_ c:control_collection s:shard1 r:core_node1 x:collection1] o.a.s.c.CoreContainer registering core: collection1
   [junit4]   2> 1058975 INFO  (coreZkRegister-2535-thread-1-processing-c:control_collection x:collection1 n:127.0.0.1:53099_ s:shard1 r:core_node1) [n:127.0.0.1:53099_ c:control_collection s:shard1 r:core_node1 x:collection1] o.a.s.c.ZkController Register replica - core:collection1 address:https://127.0.0.1:53099 collection:control_collection shard:shard1
   [junit4]   2> 1058976 INFO  (coreZkRegister-2535-thread-1-processing-c:control_collection x:collection1 n:127.0.0.1:53099_ s:shard1 r:core_node1) [n:127.0.0.1:53099_ c:control_collection s:shard1 r:core_node1 x:collection1] o.a.s.c.c.SolrZkClient makePath: /collections/control_collection/leader_elect/shard1/election
   [junit4]   2> 1058979 INFO  (coreZkRegister-2535-thread-1-processing-c:control_collection x:collection1 n:127.0.0.1:53099_ s:shard1 r:core_node1) [n:127.0.0.1:53099_ c:control_collection s:shard1 r:core_node1 x:collection1] o.a.s.c.LeaderElector Joined leadership election with path: /collections/control_collection/leader_elect/shard1/election/95190777287278597-core_node1-n_0000000000
   [junit4]   2> 1058980 INFO  (coreZkRegister-2535-thread-1-processing-c:control_collection x:collection1 n:127.0.0.1:53099_ s:shard1 r:core_node1) [n:127.0.0.1:53099_ c:control_collection s:shard1 r:core_node1 x:collection1] o.a.s.c.ShardLeaderElectionContext Running the leader process for shard=shard1 and weAreReplacement=false and leaderVoteWait=180000
   [junit4]   2> 1058981 INFO  (coreZkRegister-2535-thread-1-processing-c:control_collection x:collection1 n:127.0.0.1:53099_ s:shard1 r:core_node1) [n:127.0.0.1:53099_ c:control_collection s:shard1 r:core_node1 x:collection1] o.a.s.c.ShardLeaderElectionContext Enough replicas found to continue.
   [junit4]   2> 1058981 INFO  (coreZkRegister-2535-thread-1-processing-c:control_collection x:collection1 n:127.0.0.1:53099_ s:shard1 r:core_node1) [n:127.0.0.1:53099_ c:control_collection s:shard1 r:core_node1 x:collection1] o.a.s.c.ShardLeaderElectionContext I may be the new leader - try and sync
   [junit4]   2> 1058981 INFO  (coreZkRegister-2535-thread-1-processing-c:control_collection x:collection1 n:127.0.0.1:53099_ s:shard1 r:core_node1) [n:127.0.0.1:53099_ c:control_collection s:shard1 r:core_node1 x:collection1] o.a.s.c.SyncStrategy Sync replicas to https://127.0.0.1:53099/collection1/
   [junit4]   2> 1058981 INFO  (coreZkRegister-2535-thread-1-processing-c:control_collection x:collection1 n:127.0.0.1:53099_ s:shard1 r:core_node1) [n:127.0.0.1:53099_ c:control_collection s:shard1 r:core_node1 x:collection1] o.a.s.c.SyncStrategy Sync Success - now sync replicas to me
   [junit4]   2> 1058982 INFO  (OverseerStateUpdate-95190777287278597-127.0.0.1:53099_-n_0000000000) [n:127.0.0.1:53099_    ] o.a.s.c.Overseer processMessage: queueSize: 1, message = {
   [junit4]   2>   "operation":"leader",
   [junit4]   2>   "shard":"shard1",
   [junit4]   2>   "collection":"control_collection"} current state version: 1
   [junit4]   2> 1058982 INFO  (coreZkRegister-2535-thread-1-processing-c:control_collection x:collection1 n:127.0.0.1:53099_ s:shard1 r:core_node1) [n:127.0.0.1:53099_ c:control_collection s:shard1 r:core_node1 x:collection1] o.a.s.c.SyncStrategy https://127.0.0.1:53099/collection1/ has no replicas
   [junit4]   2> 1058983 INFO  (coreZkRegister-2535-thread-1-processing-c:control_collection x:collection1 n:127.0.0.1:53099_ s:shard1 r:core_node1) [n:127.0.0.1:53099_ c:control_collection s:shard1 r:core_node1 x:collection1] o.a.s.c.c.SolrZkClient makePath: /collections/control_collection/leaders/shard1
   [junit4]   2> 1058985 INFO  (coreZkRegister-2535-thread-1-processing-c:control_collection x:collection1 n:127.0.0.1:53099_ s:shard1 r:core_node1) [n:127.0.0.1:53099_ c:control_collection s:shard1 r:core_node1 x:collection1] o.a.s.c.ShardLeaderElectionContextBase Creating leader registration node
   [junit4]   2> 1058992 INFO  (coreZkRegister-2535-thread-1-processing-c:control_collection x:collection1 n:127.0.0.1:53099_ s:shard1 r:core_node1) [n:127.0.0.1:53099_ c:control_collection s:shard1 r:core_node1 x:collection1] o.a.s.c.ShardLeaderElectionContext I am the new leader: https://127.0.0.1:53099/collection1/ shard1
   [junit4]   2> 1058993 INFO  (OverseerStateUpdate-95190777287278597-127.0.0.1:53099_-n_0000000000) [n:127.0.0.1:53099_    ] o.a.s.c.Overseer processMessage: queueSize: 1, message = {
   [junit4]   2>   "operation":"leader",
   [junit4]   2>   "shard":"shard1",
   [junit4]   2>   "collection":"control_collection",
   [junit4]   2>   "base_url":"https://127.0.0.1:53099",
   [junit4]   2>   "core":"collection1",
   [junit4]   2>   "state":"active"} current state version: 1
   [junit4]   2> 1059084 INFO  (TEST-CollectionsAPIDistributedZkTest.test-seed#[DE7C8A873249D256]) [    ] o.a.s.c.c.SolrZkClient Using default ZkCredentialsProvider
   [junit4]   2> 1059085 INFO  (TEST-CollectionsAPIDistributedZkTest.test-seed#[DE7C8A873249D256]) [    ] o.a.s.c.c.ConnectionManager Waiting for client to connect to ZooKeeper
   [junit4]   2> 1059086 INFO  (zkCallback-695-thread-1) [    ] o.a.s.c.c.ConnectionManager Watcher org.apache.solr.common.cloud.ConnectionManager@5bdd1354 name:ZooKeeperConnection Watcher:127.0.0.1:45744/solr got event WatchedEvent state:SyncConnected type:None path:null path:null type:None
   [junit4]   2> 1059086 INFO  (TEST-CollectionsAPIDistributedZkTest.test-seed#[DE7C8A873249D256]) [    ] o.a.s.c.c.ConnectionManager Client is connected to ZooKeeper
   [junit4]   2> 1059087 INFO  (TEST-CollectionsAPIDistributedZkTest.test-seed#[DE7C8A873249D256]) [    ] o.a.s.c.c.SolrZkClient Using default ZkACLProvider
   [junit4]   2> 1059087 INFO  (TEST-CollectionsAPIDistributedZkTest.test-seed#[DE7C8A873249D256]) [    ] o.a.s.c.c.ZkStateReader Updating cluster state from ZooKeeper... 
   [junit4]   2> 1059089 INFO  (TEST-CollectionsAPIDistributedZkTest.test-seed#[DE7C8A873249D256]) [    ] o.a.s.c.ChaosMonkey monkey: init - expire sessions:false cause connection loss:false
   [junit4]   2> 1059089 INFO  (TEST-CollectionsAPIDistributedZkTest.test-seed#[DE7C8A873249D256]) [    ] o.a.s.c.AbstractFullDistribZkTestBase Creating collection1 with stateFormat=2
   [junit4]   2> 1059089 INFO  (TEST-CollectionsAPIDistributedZkTest.test-seed#[DE7C8A873249D256]) [    ] o.a.s.c.c.SolrZkClient Using default ZkCredentialsProvider
   [junit4]   2> 1059089 INFO  (TEST-CollectionsAPIDistributedZkTest.test-seed#[DE7C8A873249D256]) [    ] o.a.s.c.c.ConnectionManager Waiting for client to connect to ZooKeeper
   [junit4]   2> 1059091 INFO  (zkCallback-696-thread-1) [    ] o.a.s.c.c.ConnectionManager Watcher org.apache.solr.common.cloud.ConnectionManager@1ff1e90e name:ZooKeeperConnection Watcher:127.0.0.1:45744/solr got event WatchedEvent state:SyncConnected type:None path:null path:null type:None
   [junit4]   2> 1059091 INFO  (TEST-CollectionsAPIDistributedZkTest.test-seed#[DE7C8A873249D256]) [    ] o.a.s.c.c.ConnectionManager Client is connected to ZooKeeper
   [junit4]   2> 1059091 INFO  (TEST-CollectionsAPIDistributedZkTest.test-seed#[DE7C8A873249D256]) [    ] o.a.s.c.c.SolrZkClient Using default ZkACLProvider
   [junit4]   2> 1059093 INFO  (OverseerStateUpdate-95190777287278597-127.0.0.1:53099_-n_0000000000) [n:127.0.0.1:53099_    ] o.a.s.c.Overseer processMessage: queueSize: 1, message = {
   [junit4]   2>   "operation":"create",
   [junit4]   2>   "name":"collection1",
   [junit4]   2>   "numShards":"2",
   [junit4]   2>   "stateFormat":"2"} current state version: 1
   [junit4]   2> 1059093 INFO  (OverseerStateUpdate-95190777287278597-127.0.0.1:53099_-n_0000000000) [n:127.0.0.1:53099_    ] o.a.s.c.o.ClusterStateMutator building a new cName: collection1
   [junit4]   2> 1059094 INFO  (zkCallback-693-thread-1-processing-n:127.0.0.1:53099_) [n:127.0.0.1:53099_    ] o.a.s.c.c.ZkStateReader A cluster state change: [WatchedEvent state:SyncConnected type:NodeDataChanged path:/clusterstate.json], has occurred - updating... (live nodes size: [1])
   [junit4]   2> 1059095 INFO  (zkCallback-695-thread-1) [    ] o.a.s.c.c.ZkStateReader A cluster state change: [WatchedEvent state:SyncConnected type:NodeDataChanged path:/clusterstate.json], has occurred - updating... (live nodes size: [1])
   [junit4]   2> 1059143 INFO  (coreZkRegister-2535-thread-1-processing-c:control_collection x:collection1 n:127.0.0.1:53099_ s:shard1 r:core_node1) [n:127.0.0.1:53099_ c:control_collection s:shard1 r:core_node1 x:collection1] o.a.s.c.ZkController We are https://127.0.0.1:53099/collection1/ and leader is https://127.0.0.1:53099/collection1/
   [junit4]   2> 1059144 INFO  (coreZkRegister-2535-thread-1-processing-c:control_collection x:collection1 n:127.0.0.1:53099_ s:shard1 r:core_node1) [n:127.0.0.1:53099_ c:control_collection s:shard1 r:core_node1 x:collection1] o.a.s.c.ZkController No LogReplay needed for core=collection1 baseURL=https://127.0.0.1:53099
   [junit4]   2> 1059144 INFO  (coreZkRegister-2535-thread-1-processing-c:control_collection x:collection1 n:127.0.0.1:53099_ s:shard1 r:core_node1) [n:127.0.0.1:53099_ c:control_collection s:shard1 r:core_node1 x:collection1] o.a.s.c.ZkController I am the leader, no recovery necessary
   [junit4]   2> 1059144 INFO  (coreZkRegister-2535-thread-1-processing-c:control_collection x:collection1 n:127.0.0.1:53099_ s:shard1 r:core_node1) [n:127.0.0.1:53099_ c:control_collection s:shard1 r:core_node1 x:collection1] o.a.s.c.ZkController publishing state=active
   [junit4]   2> 1059144 INFO  (coreZkRegister-2535-thread-1-processing-c:control_collection x:collection1 n:127.0.0.1:53099_ s:shard1 r:core_node1) [n:127.0.0.1:53099_ c:control_collection s:shard1 r:core_node1 x:collection1] o.a.s.c.ZkController numShards not found on descriptor - reading it from system property
   [junit4]   2> 1059146 INFO  (OverseerStateUpdate-95190777287278597-127.0.0.1:53099_-n_0000000000) [n:127.0.0.1:53099_    ] o.a.s.c.Overseer processMessage: queueSize: 1, message = {
   [junit4]   2>   "collection":"control_collection",
   [junit4]   2>   "core":"collection1",
   [junit4]   2>   "numShards":"2",
   [junit4]   2>   "operation":"state",
   [junit4]   2>   "base_url":"https://127.0.0.1:53099",
   [junit4]   2>   "core_node_name":"core_node1",
   [junit4]   2>   "node_name":"127.0.0.1:53099_",
   [junit4]   2>   "state":"active",
   [junit4]   2>   "shard":"shard1",
   [junit4]   2>   "roles":null} current state version: 2
   [junit4]   2> 1059147 INFO  (OverseerStateUpdate-95190777287278597-127.0.0.1:53099_-n_0000000000) [n:127.0.0.1:53099_    ] o.a.s.c.o.ReplicaMutator Update state numShards=2 message={
   [junit4]   2>   "collection":"control_collection",
   [junit4]   2>   "core":"collection1",
   [junit4]   2>   "numShards":"2",
   [junit4]   2>   "operation":"state",
   [junit4]   2>   "base_url":"https://127.0.0.1:53099",
   [junit4]   2>   "core_node_name":"core_node1",
   [junit4]   2>   "node_name":"127.0.0.1:53099_",
   [junit4]   2>   "state":"active",
   [junit4]   2>   "shard":"shard1",
   [junit4]   2>   "roles":null}
   [junit4]   2> 1059148 INFO  (OverseerStateUpdate-95190777287278597-127.0.0.1:53099_-n_0000000000) [n:127.0.0.1:53099_    ] o.a.s.c.o.ZkStateWriter going to create_collection /collections/collection1/state.json
   [junit4]   2> 1059252 INFO  (zkCallback-695-thread-1) [    ] o.a.s.c.c.ZkStateReader A cluster state change: [WatchedEvent state:SyncConnected type:NodeDataChanged path:/clusterstate.json], has occurred - updating... (live nodes size: [1])
   [junit4]   2> 1059252 INFO  (zkCallback-693-thread-1-processing-n:127.0.0.1:53099_) [n:127.0.0.1:53099_    ] o.a.s.c.c.ZkStateReader A cluster state change: [WatchedEvent state:SyncConnected type:NodeDataChanged path:/clusterstate.json], has occurred - updating... (live nodes size: [1])
   [junit4]   2> 1059416 INFO  (TEST-CollectionsAPIDistributedZkTest.test-seed#[DE7C8A873249D256]) [    ] o.a.s.SolrTestCaseJ4 Writing core.properties file to /x1/jenkins/jenkins-slave/workspace/Lucene-Solr-Tests-5.x-Java7/solr/build/solr-core/test/J1/temp/solr.cloud.CollectionsAPIDistributedZkTest_DE7C8A873249D256-001/shard-1-001/cores/collection1
   [junit4]   2> 1059417 INFO  (TEST-CollectionsAPIDistributedZkTest.test-seed#[DE7C8A873249D256]) [    ] o.a.s.c.AbstractFullDistribZkTestBase create jetty 1 in directory /x1/jenkins/jenkins-slave/workspace/Lucene-Solr-Tests-5.x-Java7/solr/build/solr-core/test/J1/temp/solr.cloud.CollectionsAPIDistributedZkTest_DE7C8A873249D256-001/shard-1-001
   [junit4]   2> 1059418 INFO  (TEST-CollectionsAPIDistributedZkTest.test-seed#[DE7C8A873249D256]) [    ] o.e.j.s.Server jetty-9.2.13.v20150730
   [junit4]   2> 1059421 INFO  (TEST-CollectionsAPIDistributedZkTest.test-seed#[DE7C8A873249D256]) [    ] o.e.j.s.h.ContextHandler Started o.e.j.s.ServletContextHandler@533afa7d{/,null,AVAILABLE}
   [junit4]   2> 1059426 INFO  (TEST-CollectionsAPIDistributedZkTest.test-seed#[DE7C8A873249D256]) [    ] o.e.j.s.ServerConnector Started ServerConnector@76b6cdea{SSL-http/1.1}{127.0.0.1:50371}
   [junit4]   2> 1059426 INFO  (TEST-CollectionsAPIDistributedZkTest.test-seed#[DE7C8A873249D256]) [    ] o.e.j.s.Server Started @1062315ms
   [junit4]   2> 1059426 INFO  (TEST-CollectionsAPIDistributedZkTest.test-seed#[DE7C8A873249D256]) [    ] o.a.s.c.s.e.JettySolrRunner Jetty properties: {hostContext=/, coreRootDirectory=/x1/jenkins/jenkins-slave/workspace/Lucene-Solr-Tests-5.x-Java7/solr/build/solr-core/test/J1/temp/solr.cloud.CollectionsAPIDistributedZkTest_DE7C8A873249D256-001/shard-1-001/cores, hostPort=50371, solr.data.dir=/x1/jenkins/jenkins-slave/workspace/Lucene-Solr-Tests-5.x-Java7/solr/build/solr-core/test/J1/temp/solr.cloud.CollectionsAPIDistributedZkTest_DE7C8A873249D256-001/tempDir-001/jetty1, solrconfig=solrconfig.xml}
   [junit4]   2> 1059426 INFO  (TEST-CollectionsAPIDistributedZkTest.test-seed#[DE7C8A873249D256]) [    ] o.a.s.s.SolrDispatchFilter SolrDispatchFilter.init(): sun.misc.Launcher$AppClassLoader@3827de24
   [junit4]   2> 1059426 INFO  (TEST-CollectionsAPIDistributedZkTest.test-seed#[DE7C8A873249D256]) [    ] o.a.s.c.SolrResourceLoader new SolrResourceLoader for directory: '/x1/jenkins/jenkins-slave/workspace/Lucene-Solr-Tests-5.x-Java7/solr/build/solr-core/test/J1/temp/solr.cloud.CollectionsAPIDistributedZkTest_DE7C8A873249D256-001/shard-1-001'
   [junit4]   2> 1059426 INFO  (TEST-CollectionsAPIDistributedZkTest.test-seed#[DE7C8A873249D256]) [    ] o.a.s.c.SolrResourceLoader JNDI not configured for solr (NoInitialContextEx)
   [junit4]   2> 1059426 INFO  (TEST-CollectionsAPIDistributedZkTest.test-seed#[DE7C8A873249D256]) [    ] o.a.s.c.SolrResourceLoader solr home defaulted to 'solr/' (could not find system property or JNDI)
   [junit4]   2> 1059427 INFO  (TEST-CollectionsAPIDistributedZkTest.test-seed#[DE7C8A873249D256]) [    ] o.a.s.c.c.SolrZkClient Using default ZkCredentialsProvider
   [junit4]   2> 1059431 INFO  (TEST-CollectionsAPIDistributedZkTest.test-seed#[DE7C8A873249D256]) [    ] o.a.s.c.c.ConnectionManager Waiting for client to connect to ZooKeeper
   [junit4]   2> 1059434 INFO  (zkCallback-697-thread-1) [    ] o.a.s.c.c.ConnectionManager Watcher org.apache.solr.common.cloud.ConnectionManager@3a5ba32f name:ZooKeeperConnection Watcher:127.0.0.1:45744/solr got event WatchedEvent state:SyncConnected type:None path:null path:null type:None
   [junit4]   2> 1059434 INFO  (TEST-CollectionsAPIDistributedZkTest.test-seed#[DE7C8A873249D256]) [    ] o.a.s.c.c.ConnectionManager Client is connected to ZooKeeper
   [junit4]   2> 1059434 INFO  (TEST-CollectionsAPIDistributedZkTest.test-seed#[DE7C8A873249D256]) [    ] o.a.s.c.c.SolrZkClient Using default ZkACLProvider
   [junit4]   2> 1059436 INFO  (TEST-CollectionsAPIDistributedZkTest.test-seed#[DE7C8A873249D256]) [    ] o.a.s.s.SolrDispatchFilter Loading solr.xml from SolrHome (not found in ZooKeeper)
   [junit4]   2> 1059436 INFO  (TEST-CollectionsAPIDistributedZkTest.test-seed#[DE7C8A873249D256]) [    ] o.a.s.c.SolrXmlConfig Loading container configuration from /x1/jenkins/jenkins-slave/workspace/Lucene-Solr-Tests-5.x-Java7/solr/build/solr-core/test/J1/temp/solr.cloud.CollectionsAPIDistributedZkTest_DE7C8A873249D256-001/shard-1-001/solr.xml
   [junit4]   2> 1059450 INFO  (TEST-CollectionsAPIDistributedZkTest.test-seed#[DE7C8A873249D256]) [    ] o.a.s.c.CorePropertiesLocator Config-defined core root directory: /x1/jenkins/jenkins-slave/workspace/Lucene-Solr-Tests-5.x-Java7/solr/build/solr-core/test/J1/temp/solr.cloud.CollectionsAPIDistributedZkTest_DE7C8A873249D256-001/shard-1-001/cores
   [junit4]   2> 1059450 INFO  (TEST-CollectionsAPIDistributedZkTest.test-seed#[DE7C8A873249D256]) [    ] o.a.s.c.CoreContainer New CoreContainer 566236935
   [junit4]   2> 1059450 INFO  (TEST-CollectionsAPIDistributedZkTest.test-seed#[DE7C8A873249D256]) [    ] o.a.s.c.CoreContainer Loading cores into CoreContainer [instanceDir=/x1/jenkins/jenkins-slave/workspace/Lucene-Solr-Tests-5.x-Java7/solr/build/solr-core/test/J1/temp/solr.cloud.CollectionsAPIDistributedZkTest_DE7C8A873249D256-001/shard-1-001]
   [junit4]   2> 1059451 WARN  (TEST-CollectionsAPIDistributedZkTest.test-seed#[DE7C8A873249D256]) [    ] o.a.s.c.CoreContainer Couldn't add files from /x1/jenkins/jenkins-slave/workspace/Lucene-Solr-Tests-5.x-Java7/solr/build/solr-core/test/J1/temp/solr.cloud.CollectionsAPIDistributedZkTest_DE7C8A873249D256-001/shard-1-001/lib to classpath: /x1/jenkins/jenkins-slave/workspace/Lucene-Solr-Tests-5.x-Java7/solr/build/solr-core/test/J1/temp/solr.cloud.CollectionsAPIDistributedZkTest_DE7C8A873249D256-001/shard-1-001/lib
   [junit4]   2> 1059451 INFO  (TEST-CollectionsAPIDistributedZkTest.test-seed#[DE7C8A873249D256]) [    ] o.a.s.h.c.HttpShardHandlerFactory created with socketTimeout : 90000,urlScheme : ,connTimeout : 15000,maxConnectionsPerHost : 20,maxConnections : 10000,corePoolSize : 0,maximumPoolSize : 2147483647,maxThreadIdleTime : 5,sizeOfQueue : -1,fairnessPolicy : false,useRetries : false,
   [junit4]   2> 1059453 INFO  (TEST-CollectionsAPIDistributedZkTest.test-seed#[DE7C8A873249D256]) [    ] o.a.s.u.UpdateShardHandler Creating UpdateShardHandler HTTP client with params: socketTimeout=340000&connTimeout=45000&retry=true
   [junit4]   2> 1059455 INFO  (TEST-CollectionsAPIDistributedZkTest.test-seed#[DE7C8A873249D256]) [    ] o.a.s.l.LogWatcher SLF4J impl is org.slf4j.impl.Log4jLoggerFactory
   [junit4]   2> 1059455 INFO  (TEST-CollectionsAPIDistributedZkTest.test-seed#[DE7C8A873249D256]) [    ] o.a.s.l.LogWatcher Registering Log Listener [Log4j (org.slf4j.impl.Log4jLoggerFactory)]
   [junit4]   2> 1059455 INFO  (TEST-CollectionsAPIDistributedZkTest.test-seed#[DE7C8A873249D256]) [    ] o.a.s.c.ZkContainer Zookeeper client=127.0.0.1:45744/solr
   [junit4]   2> 1059455 INFO  (TEST-CollectionsAPIDistributedZkTest.test-seed#[DE7C8A873249D256]) [    ] o.a.s.c.ZkController zkHost includes chroot
   [junit4]   2> 1059455 INFO  (TEST-CollectionsAPIDistributedZkTest.test-seed#[DE7C8A873249D256]) [    ] o.a.s.c.c.SolrZkClient Using default ZkCredentialsProvider
   [junit4]   2> 1059456 INFO  (TEST-CollectionsAPIDistributedZkTest.test-seed#[DE7C8A873249D256]) [    ] o.a.s.c.c.ConnectionManager Waiting for client to connect to ZooKeeper
   [junit4]   2> 1059457 INFO  (zkCallback-699-thread-1) [    ] o.a.s.c.c.ConnectionManager Watcher org.apache.solr.common.cloud.ConnectionManager@59bc132b name:ZooKeeperConnection Watcher:127.0.0.1:45744 got event WatchedEvent state:SyncConnected type:None path:null path:null type:None
   [junit4]   2> 1059457 INFO  (TEST-CollectionsAPIDistributedZkTest.test-seed#[DE7C8A873249D256]) [    ] o.a.s.c.c.ConnectionManager Client is connected to ZooKeeper
   [junit4]   2> 1059457 INFO  (TEST-CollectionsAPIDistributedZkTest.test-seed#[DE7C8A873249D256]) [    ] o.a.s.c.c.SolrZkClient Using default ZkACLProvider
   [junit4]   2> 1059459 INFO  (TEST-CollectionsAPIDistributedZkTest.test-seed#[DE7C8A873249D256]) [n:127.0.0.1:50371_    ] o.a.s.c.c.ConnectionManager Waiting for client to connect to ZooKeeper
   [junit4]   2> 1059460 INFO  (zkCallback-700-thread-1-processing-n:127.0.0.1:50371_) [n:127.0.0.1:50371_    ] o.a.s.c.c.ConnectionManager Watcher org.apache.solr.common.cloud.ConnectionManager@5b63810a name:ZooKeeperConnection Watcher:127.0.0.1:45744/solr got event WatchedEvent state:SyncConnected type:None path:null path:null type:None
   [junit4]   2> 1059460 INFO  (TEST-CollectionsAPIDistributedZkTest.test-seed#[DE7C8A873249D256]) [n:127.0.0.1:50371_    ] o.a.s.c.c.ConnectionManager Client is connected to ZooKeeper
   [junit4]   2> 1059466 INFO  (TEST-CollectionsAPIDistributedZkTest.test-seed#[DE7C8A873249D256]) [n:127.0.0.1:50371_    ] o.a.s.c.c.ZkStateReader Updating cluster state from ZooKeeper... 
   [junit4]   2> 1060472 INFO  (TEST-CollectionsAPIDistributedZkTest.test-seed#[DE7C8A873249D256]) [n:127.0.0.1:50371_    ] o.a.s.c.ZkController Register node as live in ZooKeeper:/live_nodes/127.0.0.1:50371_
   [junit4]   2> 1060475 INFO  (TEST-CollectionsAPIDistributedZkTest.test-seed#[DE7C8A873249D256]) [n:127.0.0.1:50371_    ] o.a.s.c.c.SolrZkClient makePath: /live_nodes/127.0.0.1:50371_
   [junit4]   

[...truncated too long message...]

eaderTest, CollectionsAPIDistributedZkTest]
   [junit4]   2> NOTE: reproduce with: ant test  -Dtestcase=CollectionsAPIDistributedZkTest -Dtests.seed=DE7C8A873249D256 -Dtests.multiplier=2 -Dtests.slow=true -Dtests.locale=ar_SY -Dtests.timezone=Europe/Berlin -Dtests.asserts=true -Dtests.file.encoding=US-ASCII
   [junit4] ERROR   0.00s J1 | CollectionsAPIDistributedZkTest (suite) <<<
   [junit4]    > Throwable #1: com.carrotsearch.randomizedtesting.ThreadLeakError: 5 threads leaked from SUITE scope at org.apache.solr.cloud.CollectionsAPIDistributedZkTest: 
   [junit4]    >    1) Thread[id=6922, name=zkCallback-720-thread-2, state=TIMED_WAITING, group=TGRP-CollectionsAPIDistributedZkTest]
   [junit4]    >         at sun.misc.Unsafe.park(Native Method)
   [junit4]    >         at java.util.concurrent.locks.LockSupport.parkNanos(LockSupport.java:226)
   [junit4]    >         at java.util.concurrent.SynchronousQueue$TransferStack.awaitFulfill(SynchronousQueue.java:460)
   [junit4]    >         at java.util.concurrent.SynchronousQueue$TransferStack.transfer(SynchronousQueue.java:359)
   [junit4]    >         at java.util.concurrent.SynchronousQueue.poll(SynchronousQueue.java:942)
   [junit4]    >         at java.util.concurrent.ThreadPoolExecutor.getTask(ThreadPoolExecutor.java:1068)
   [junit4]    >         at java.util.concurrent.ThreadPoolExecutor.runWorker(ThreadPoolExecutor.java:1130)
   [junit4]    >         at java.util.concurrent.ThreadPoolExecutor$Worker.run(ThreadPoolExecutor.java:615)
   [junit4]    >         at java.lang.Thread.run(Thread.java:745)
   [junit4]    >    2) Thread[id=6312, name=TEST-CollectionsAPIDistributedZkTest.test-seed#[DE7C8A873249D256]-EventThread, state=WAITING, group=TGRP-CollectionsAPIDistributedZkTest]
   [junit4]    >         at sun.misc.Unsafe.park(Native Method)
   [junit4]    >         at java.util.concurrent.locks.LockSupport.park(LockSupport.java:186)
   [junit4]    >         at java.util.concurrent.locks.AbstractQueuedSynchronizer$ConditionObject.await(AbstractQueuedSynchronizer.java:2043)
   [junit4]    >         at java.util.concurrent.LinkedBlockingQueue.take(LinkedBlockingQueue.java:442)
   [junit4]    >         at org.apache.zookeeper.ClientCnxn$EventThread.run(ClientCnxn.java:494)
   [junit4]    >    3) Thread[id=6313, name=zkCallback-720-thread-1, state=TIMED_WAITING, group=TGRP-CollectionsAPIDistributedZkTest]
   [junit4]    >         at sun.misc.Unsafe.park(Native Method)
   [junit4]    >         at java.util.concurrent.locks.LockSupport.parkNanos(LockSupport.java:226)
   [junit4]    >         at java.util.concurrent.SynchronousQueue$TransferStack.awaitFulfill(SynchronousQueue.java:460)
   [junit4]    >         at java.util.concurrent.SynchronousQueue$TransferStack.transfer(SynchronousQueue.java:359)
   [junit4]    >         at java.util.concurrent.SynchronousQueue.poll(SynchronousQueue.java:942)
   [junit4]    >         at java.util.concurrent.ThreadPoolExecutor.getTask(ThreadPoolExecutor.java:1068)
   [junit4]    >         at java.util.concurrent.ThreadPoolExecutor.runWorker(ThreadPoolExecutor.java:1130)
   [junit4]    >         at java.util.concurrent.ThreadPoolExecutor$Worker.run(ThreadPoolExecutor.java:615)
   [junit4]    >         at java.lang.Thread.run(Thread.java:745)
   [junit4]    >    4) Thread[id=6923, name=zkCallback-720-thread-3, state=TIMED_WAITING, group=TGRP-CollectionsAPIDistributedZkTest]
   [junit4]    >         at sun.misc.Unsafe.park(Native Method)
   [junit4]    >         at java.util.concurrent.locks.LockSupport.parkNanos(LockSupport.java:226)
   [junit4]    >         at java.util.concurrent.SynchronousQueue$TransferStack.awaitFulfill(SynchronousQueue.java:460)
   [junit4]    >         at java.util.concurrent.SynchronousQueue$TransferStack.transfer(SynchronousQueue.java:359)
   [junit4]    >         at java.util.concurrent.SynchronousQueue.poll(SynchronousQueue.java:942)
   [junit4]    >         at java.util.concurrent.ThreadPoolExecutor.getTask(ThreadPoolExecutor.java:1068)
   [junit4]    >         at java.util.concurrent.ThreadPoolExecutor.runWorker(ThreadPoolExecutor.java:1130)
   [junit4]    >         at java.util.concurrent.ThreadPoolExecutor$Worker.run(ThreadPoolExecutor.java:615)
   [junit4]    >         at java.lang.Thread.run(Thread.java:745)
   [junit4]    >    5) Thread[id=6311, name=TEST-CollectionsAPIDistributedZkTest.test-seed#[DE7C8A873249D256]-SendThread(127.0.0.1:45744), state=TIMED_WAITING, group=TGRP-CollectionsAPIDistributedZkTest]
   [junit4]    >         at java.lang.Thread.sleep(Native Method)
   [junit4]    >         at org.apache.zookeeper.ClientCnxn$SendThread.run(ClientCnxn.java:994)
   [junit4]    > 	at __randomizedtesting.SeedInfo.seed([DE7C8A873249D256]:0)Throwable #2: com.carrotsearch.randomizedtesting.ThreadLeakError: There are still zombie threads that couldn't be terminated:
   [junit4]    >    1) Thread[id=6313, name=zkCallback-720-thread-1, state=TIMED_WAITING, group=TGRP-CollectionsAPIDistributedZkTest]
   [junit4]    >         at sun.misc.Unsafe.park(Native Method)
   [junit4]    >         at java.util.concurrent.locks.LockSupport.parkNanos(LockSupport.java:226)
   [junit4]    >         at java.util.concurrent.SynchronousQueue$TransferStack.awaitFulfill(SynchronousQueue.java:460)
   [junit4]    >         at java.util.concurrent.SynchronousQueue$TransferStack.transfer(SynchronousQueue.java:359)
   [junit4]    >         at java.util.concurrent.SynchronousQueue.poll(SynchronousQueue.java:942)
   [junit4]    >         at java.util.concurrent.ThreadPoolExecutor.getTask(ThreadPoolExecutor.java:1068)
   [junit4]    >         at java.util.concurrent.ThreadPoolExecutor.runWorker(ThreadPoolExecutor.java:1130)
   [junit4]    >         at java.util.concurrent.ThreadPoolExecutor$Worker.run(ThreadPoolExecutor.java:615)
   [junit4]    >         at java.lang.Thread.run(Thread.java:745)
   [junit4]    >    2) Thread[id=6923, name=zkCallback-720-thread-3, state=TIMED_WAITING, group=TGRP-CollectionsAPIDistributedZkTest]
   [junit4]    >         at sun.misc.Unsafe.park(Native Method)
   [junit4]    >         at java.util.concurrent.locks.LockSupport.parkNanos(LockSupport.java:226)
   [junit4]    >         at java.util.concurrent.SynchronousQueue$TransferStack.awaitFulfill(SynchronousQueue.java:460)
   [junit4]    >         at java.util.concurrent.SynchronousQueue$TransferStack.transfer(SynchronousQueue.java:359)
   [junit4]    >         at java.util.concurrent.SynchronousQueue.poll(SynchronousQueue.java:942)
   [junit4]    >         at java.util.concurrent.ThreadPoolExecutor.getTask(ThreadPoolExecutor.java:1068)
   [junit4]    >         at java.util.concurrent.ThreadPoolExecutor.runWorker(ThreadPoolExecutor.java:1130)
   [junit4]    >         at java.util.concurrent.ThreadPoolExecutor$Worker.run(ThreadPoolExecutor.java:615)
   [junit4]    >         at java.lang.Thread.run(Thread.java:745)
   [junit4]    >    3) Thread[id=6311, name=TEST-CollectionsAPIDistributedZkTest.test-seed#[DE7C8A873249D256]-SendThread(127.0.0.1:45744), state=TIMED_WAITING, group=TGRP-CollectionsAPIDistributedZkTest]
   [junit4]    >         at java.lang.Thread.sleep(Native Method)
   [junit4]    >         at org.apache.zookeeper.client.StaticHostProvider.next(StaticHostProvider.java:101)
   [junit4]    >         at org.apache.zookeeper.ClientCnxn$SendThread.startConnect(ClientCnxn.java:940)
   [junit4]    >         at org.apache.zookeeper.ClientCnxn$SendThread.run(ClientCnxn.java:1003)
   [junit4]    >    4) Thread[id=6922, name=zkCallback-720-thread-2, state=TIMED_WAITING, group=TGRP-CollectionsAPIDistributedZkTest]
   [junit4]    >         at sun.misc.Unsafe.park(Native Method)
   [junit4]    >         at java.util.concurrent.locks.LockSupport.parkNanos(LockSupport.java:226)
   [junit4]    >         at java.util.concurrent.SynchronousQueue$TransferStack.awaitFulfill(SynchronousQueue.java:460)
   [junit4]    >         at java.util.concurrent.SynchronousQueue$TransferStack.transfer(SynchronousQueue.java:359)
   [junit4]    >         at java.util.concurrent.SynchronousQueue.poll(SynchronousQueue.java:942)
   [junit4]    >         at java.util.concurrent.ThreadPoolExecutor.getTask(ThreadPoolExecutor.java:1068)
   [junit4]    >         at java.util.concurrent.ThreadPoolExecutor.runWorker(ThreadPoolExecutor.java:1130)
   [junit4]    >         at java.util.concurrent.ThreadPoolExecutor$Worker.run(ThreadPoolExecutor.java:615)
   [junit4]    >         at java.lang.Thread.run(Thread.java:745)
   [junit4]    > 	at __randomizedtesting.SeedInfo.seed([DE7C8A873249D256]:0)
   [junit4] Completed [273/563 (1!)] on J1 in 71.26s, 1 test, 3 errors <<< FAILURES!

[...truncated 905 lines...]
BUILD FAILED
/x1/jenkins/jenkins-slave/workspace/Lucene-Solr-Tests-5.x-Java7/build.xml:794: The following error occurred while executing this line:
/x1/jenkins/jenkins-slave/workspace/Lucene-Solr-Tests-5.x-Java7/build.xml:738: The following error occurred while executing this line:
/x1/jenkins/jenkins-slave/workspace/Lucene-Solr-Tests-5.x-Java7/build.xml:59: The following error occurred while executing this line:
/x1/jenkins/jenkins-slave/workspace/Lucene-Solr-Tests-5.x-Java7/solr/build.xml:233: The following error occurred while executing this line:
/x1/jenkins/jenkins-slave/workspace/Lucene-Solr-Tests-5.x-Java7/solr/common-build.xml:526: The following error occurred while executing this line:
/x1/jenkins/jenkins-slave/workspace/Lucene-Solr-Tests-5.x-Java7/lucene/common-build.xml:1444: The following error occurred while executing this line:
/x1/jenkins/jenkins-slave/workspace/Lucene-Solr-Tests-5.x-Java7/lucene/common-build.xml:1000: There were test failures: 563 suites (7 ignored), 2236 tests, 2 suite-level errors, 1 error, 1193 ignored (31 assumptions) [seed: DE7C8A873249D256]

Total time: 48 minutes 27 seconds
Build step 'Invoke Ant' marked build as failure
Archiving artifacts
Recording test results
Email was triggered for: Failure - Any
Sending email for trigger: Failure - Any



Mime
View raw message