lucene-dev mailing list archives

Site index · List index
Message view « Date » · « Thread »
Top « Date » · « Thread »
From Apache Jenkins Server <jenk...@builds.apache.org>
Subject [JENKINS] Lucene-Solr-SmokeRelease-5.x - Build # 435 - Failure
Date Tue, 12 Jan 2016 19:49:17 GMT
Build: https://builds.apache.org/job/Lucene-Solr-SmokeRelease-5.x/435/

No tests ran.

Build Log:
[...truncated 53235 lines...]
prepare-release-no-sign:
    [mkdir] Created dir: /x1/jenkins/jenkins-slave/workspace/Lucene-Solr-SmokeRelease-5.x/lucene/build/smokeTestRelease/dist
     [copy] Copying 461 files to /x1/jenkins/jenkins-slave/workspace/Lucene-Solr-SmokeRelease-5.x/lucene/build/smokeTestRelease/dist/lucene
     [copy] Copying 245 files to /x1/jenkins/jenkins-slave/workspace/Lucene-Solr-SmokeRelease-5.x/lucene/build/smokeTestRelease/dist/solr
   [smoker] Java 1.7 JAVA_HOME=/home/jenkins/jenkins-slave/tools/hudson.model.JDK/latest1.7
   [smoker] Java 1.8 JAVA_HOME=/home/jenkins/jenkins-slave/tools/hudson.model.JDK/latest1.8
   [smoker] NOTE: output encoding is UTF-8
   [smoker] 
   [smoker] Load release URL "file:/x1/jenkins/jenkins-slave/workspace/Lucene-Solr-SmokeRelease-5.x/lucene/build/smokeTestRelease/dist/"...
   [smoker] 
   [smoker] Test Lucene...
   [smoker]   test basics...
   [smoker]   get KEYS
   [smoker]     0.2 MB in 0.02 sec (7.7 MB/sec)
   [smoker]   check changes HTML...
   [smoker]   download lucene-5.5.0-src.tgz...
   [smoker]     28.7 MB in 0.04 sec (814.9 MB/sec)
   [smoker]     verify md5/sha1 digests
   [smoker]   download lucene-5.5.0.tgz...
   [smoker]     63.4 MB in 0.08 sec (821.7 MB/sec)
   [smoker]     verify md5/sha1 digests
   [smoker]   download lucene-5.5.0.zip...
   [smoker]     73.8 MB in 0.09 sec (825.6 MB/sec)
   [smoker]     verify md5/sha1 digests
   [smoker]   unpack lucene-5.5.0.tgz...
   [smoker]     verify JAR metadata/identity/no javax.* or java.* classes...
   [smoker]     test demo with 1.7...
   [smoker]       got 6174 hits for query "lucene"
   [smoker]     checkindex with 1.7...
   [smoker]     test demo with 1.8...
   [smoker]       got 6174 hits for query "lucene"
   [smoker]     checkindex with 1.8...
   [smoker]     check Lucene's javadoc JAR
   [smoker]   unpack lucene-5.5.0.zip...
   [smoker]     verify JAR metadata/identity/no javax.* or java.* classes...
   [smoker]     test demo with 1.7...
   [smoker]       got 6174 hits for query "lucene"
   [smoker]     checkindex with 1.7...
   [smoker]     test demo with 1.8...
   [smoker]       got 6174 hits for query "lucene"
   [smoker]     checkindex with 1.8...
   [smoker]     check Lucene's javadoc JAR
   [smoker]   unpack lucene-5.5.0-src.tgz...
   [smoker]     make sure no JARs/WARs in src dist...
   [smoker]     run "ant validate"
   [smoker]     run tests w/ Java 7 and testArgs='-Dtests.slow=false'...
   [smoker] 
   [smoker] command "export JAVA_HOME="/home/jenkins/jenkins-slave/tools/hudson.model.JDK/latest1.7" PATH="/home/jenkins/jenkins-slave/tools/hudson.model.JDK/latest1.7/bin:$PATH" JAVACMD="/home/jenkins/jenkins-slave/tools/hudson.model.JDK/latest1.7/bin/java"; ant clean test -Dtests.slow=false" failed:
   [smoker] Buildfile: /x1/jenkins/jenkins-slave/workspace/Lucene-Solr-SmokeRelease-5.x/lucene/build/smokeTestRelease/tmp/unpack/lucene-5.5.0/build.xml
   [smoker] 
   [smoker] clean:
   [smoker]    [delete] Deleting directory /x1/jenkins/jenkins-slave/workspace/Lucene-Solr-SmokeRelease-5.x/lucene/build/smokeTestRelease/tmp/unpack/lucene-5.5.0/build
   [smoker] 
   [smoker] ivy-availability-check:
   [smoker] 
   [smoker] ivy-fail:
   [smoker] 
   [smoker] ivy-configure:
   [smoker] [ivy:configure] :: Apache Ivy 2.3.0 - 20130110142753 :: http://ant.apache.org/ivy/ ::
   [smoker] [ivy:configure] :: loading settings :: file = /x1/jenkins/jenkins-slave/workspace/Lucene-Solr-SmokeRelease-5.x/lucene/build/smokeTestRelease/tmp/unpack/lucene-5.5.0/ivy-settings.xml
   [smoker] 
   [smoker] -clover.load:
   [smoker] 
   [smoker] resolve-groovy:
   [smoker] [ivy:cachepath] :: resolving dependencies :: org.codehaus.groovy#groovy-all-caller;working
   [smoker] [ivy:cachepath] 	confs: [default]
   [smoker] [ivy:cachepath] 	found org.codehaus.groovy#groovy-all;2.4.4 in public
   [smoker] [ivy:cachepath] :: resolution report :: resolve 285ms :: artifacts dl 8ms
   [smoker] 	---------------------------------------------------------------------
   [smoker] 	|                  |            modules            ||   artifacts   |
   [smoker] 	|       conf       | number| search|dwnlded|evicted|| number|dwnlded|
   [smoker] 	---------------------------------------------------------------------
   [smoker] 	|      default     |   1   |   0   |   0   |   0   ||   1   |   0   |
   [smoker] 	---------------------------------------------------------------------
   [smoker] 
   [smoker] -init-totals:
   [smoker] 
   [smoker] test-core:
   [smoker] 
   [smoker] -clover.disable:
   [smoker] 
   [smoker] ivy-availability-check:
   [smoker] 
   [smoker] ivy-fail:
   [smoker] 
   [smoker] ivy-configure:
   [smoker] [ivy:configure] :: loading settings :: file = /x1/jenkins/jenkins-slave/workspace/Lucene-Solr-SmokeRelease-5.x/lucene/build/smokeTestRelease/tmp/unpack/lucene-5.5.0/ivy-settings.xml
   [smoker] 
   [smoker] -clover.load:
   [smoker] 
   [smoker] -clover.classpath:
   [smoker] 
   [smoker] -clover.setup:
   [smoker] 
   [smoker] clover:
   [smoker] 
   [smoker] resolve:
   [smoker] 
   [smoker] init:
   [smoker] 
   [smoker] compile-core:
   [smoker]     [mkdir] Created dir: /x1/jenkins/jenkins-slave/workspace/Lucene-Solr-SmokeRelease-5.x/lucene/build/smokeTestRelease/tmp/unpack/lucene-5.5.0/build/core/classes/java
   [smoker]     [javac] Compiling 733 source files to /x1/jenkins/jenkins-slave/workspace/Lucene-Solr-SmokeRelease-5.x/lucene/build/smokeTestRelease/tmp/unpack/lucene-5.5.0/build/core/classes/java
   [smoker]     [javac] Note: Some input files use or override a deprecated API.
   [smoker]     [javac] Note: Recompile with -Xlint:deprecation for details.
   [smoker]     [javac] Creating empty /x1/jenkins/jenkins-slave/workspace/Lucene-Solr-SmokeRelease-5.x/lucene/build/smokeTestRelease/tmp/unpack/lucene-5.5.0/build/core/classes/java/org/apache/lucene/codecs/blocktree/package-info.class
   [smoker]     [javac] Creating empty /x1/jenkins/jenkins-slave/workspace/Lucene-Solr-SmokeRelease-5.x/lucene/build/smokeTestRelease/tmp/unpack/lucene-5.5.0/build/core/classes/java/org/apache/lucene/codecs/lucene54/package-info.class
   [smoker]     [javac] Creating empty /x1/jenkins/jenkins-slave/workspace/Lucene-Solr-SmokeRelease-5.x/lucene/build/smokeTestRelease/tmp/unpack/lucene-5.5.0/build/core/classes/java/org/apache/lucene/util/packed/package-info.class
   [smoker]     [javac] Creating empty /x1/jenkins/jenkins-slave/workspace/Lucene-Solr-SmokeRelease-5.x/lucene/build/smokeTestRelease/tmp/unpack/lucene-5.5.0/build/core/classes/java/org/apache/lucene/analysis/package-info.class
   [smoker]     [javac] Creating empty /x1/jenkins/jenkins-slave/workspace/Lucene-Solr-SmokeRelease-5.x/lucene/build/smokeTestRelease/tmp/unpack/lucene-5.5.0/build/core/classes/java/org/apache/lucene/document/package-info.class
   [smoker]     [javac] Creating empty /x1/jenkins/jenkins-slave/workspace/Lucene-Solr-SmokeRelease-5.x/lucene/build/smokeTestRelease/tmp/unpack/lucene-5.5.0/build/core/classes/java/org/apache/lucene/util/package-info.class
   [smoker]     [javac] Creating empty /x1/jenkins/jenkins-slave/workspace/Lucene-Solr-SmokeRelease-5.x/lucene/build/smokeTestRelease/tmp/unpack/lucene-5.5.0/build/core/classes/java/org/apache/lucene/analysis/tokenattributes/package-info.class
   [smoker]     [javac] Creating empty /x1/jenkins/jenkins-slave/workspace/Lucene-Solr-SmokeRelease-5.x/lucene/build/smokeTestRelease/tmp/unpack/lucene-5.5.0/build/core/classes/java/org/apache/lucene/codecs/lucene50/package-info.class
   [smoker]     [javac] Creating empty /x1/jenkins/jenkins-slave/workspace/Lucene-Solr-SmokeRelease-5.x/lucene/build/smokeTestRelease/tmp/unpack/lucene-5.5.0/build/core/classes/java/org/apache/lucene/index/package-info.class
   [smoker]     [javac] Creating empty /x1/jenkins/jenkins-slave/workspace/Lucene-Solr-SmokeRelease-5.x/lucene/build/smokeTestRelease/tmp/unpack/lucene-5.5.0/build/core/classes/java/org/apache/lucene/codecs/compressing/package-info.class
   [smoker]     [javac] Creating empty /x1/jenkins/jenkins-slave/workspace/Lucene-Solr-SmokeRelease-5.x/lucene/build/smokeTestRelease/tmp/unpack/lucene-5.5.0/build/core/classes/java/org/apache/lucene/codecs/lucene53/package-info.class
   [smoker]     [javac] Creating empty /x1/jenkins/jenkins-slave/workspace/Lucene-Solr-SmokeRelease-5.x/lucene/build/smokeTestRelease/tmp/unpack/lucene-5.5.0/build/core/classes/java/org/apache/lucene/util/automaton/package-info.class
   [smoker]     [javac] Creating empty /x1/jenkins/jenkins-slave/workspace/Lucene-Solr-SmokeRelease-5.x/lucene/build/smokeTestRelease/tmp/unpack/lucene-5.5.0/build/core/classes/java/org/apache/lucene/util/fst/package-info.class
   [smoker]     [javac] Creating empty /x1/jenkins/jenkins-slave/workspace/Lucene-Solr-SmokeRelease-5.x/lucene/build/smokeTestRelease/tmp/unpack/lucene-5.5.0/build/core/classes/java/org/apache/lucene/util/mutable/package-info.class
   [smoker]     [javac] Creating empty /x1/jenkins/jenkins-slave/workspace/Lucene-Solr-SmokeRelease-5.x/lucene/build/smokeTestRelease/tmp/unpack/lucene-5.5.0/build/core/classes/java/org/apache/lucene/search/similarities/package-info.class
   [smoker]     [javac] Creating empty /x1/jenkins/jenkins-slave/workspace/Lucene-Solr-SmokeRelease-5.x/lucene/build/smokeTestRelease/tmp/unpack/lucene-5.5.0/build/core/classes/java/org/apache/lucene/codecs/perfield/package-info.class
   [smoker]     [javac] Creating empty /x1/jenkins/jenkins-slave/workspace/Lucene-Solr-SmokeRelease-5.x/lucene/build/smokeTestRelease/tmp/unpack/lucene-5.5.0/build/core/classes/java/org/apache/lucene/store/package-info.class
   [smoker]     [javac] Creating empty /x1/jenkins/jenkins-slave/workspace/Lucene-Solr-SmokeRelease-5.x/lucene/build/smokeTestRelease/tmp/unpack/lucene-5.5.0/build/core/classes/java/org/apache/lucene/package-info.class
   [smoker]     [javac] Creating empty /x1/jenkins/jenkins-slave/workspace/Lucene-Solr-SmokeRelease-5.x/lucene/build/smokeTestRelease/tmp/unpack/lucene-5.5.0/build/core/classes/java/org/apache/lucene/search/package-info.class
   [smoker]     [javac] Creating empty /x1/jenkins/jenkins-slave/workspace/Lucene-Solr-SmokeRelease-5.x/lucene/build/smokeTestRelease/tmp/unpack/lucene-5.5.0/build/core/classes/java/org/apache/lucene/codecs/package-info.class
   [smoker]     [javac] Creating empty /x1/jenkins/jenkins-slave/workspace/Lucene-Solr-SmokeRelease-5.x/lucene/build/smokeTestRelease/tmp/unpack/lucene-5.5.0/build/core/classes/java/org/apache/lucene/search/spans/package-info.class
   [smoker]      [copy] Copying 3 files to /x1/jenkins/jenkins-slave/workspace/Lucene-Solr-SmokeRelease-5.x/lucene/build/smokeTestRelease/tmp/unpack/lucene-5.5.0/build/core/classes/java
   [smoker] 
   [smoker] compile-test-framework:
   [smoker] 
   [smoker] ivy-availability-check:
   [smoker] 
   [smoker] ivy-fail:
   [smoker] 
   [smoker] ivy-configure:
   [smoker] [ivy:configure] :: loading settings :: file = /x1/jenkins/jenkins-slave/workspace/Lucene-Solr-SmokeRelease-5.x/lucene/build/smokeTestRelease/tmp/unpack/lucene-5.5.0/ivy-settings.xml
   [smoker] 
   [smoker] resolve:
   [smoker] 
   [smoker] init:
   [smoker] 
   [smoker] compile-lucene-core:
   [smoker] 
   [smoker] ivy-availability-check:
   [smoker] 
   [smoker] ivy-fail:
   [smoker] 
   [smoker] ivy-configure:
   [smoker] [ivy:configure] :: loading settings :: file = /x1/jenkins/jenkins-slave/workspace/Lucene-Solr-SmokeRelease-5.x/lucene/build/smokeTestRelease/tmp/unpack/lucene-5.5.0/ivy-settings.xml
   [smoker] 
   [smoker] resolve:
   [smoker] 
   [smoker] init:
   [smoker] 
   [smoker] -clover.disable:
   [smoker] 
   [smoker] -clover.load:
   [smoker] 
   [smoker] -clover.classpath:
   [smoker] 
   [smoker] -clover.setup:
   [smoker] 
   [smoker] clover:
   [smoker] 
   [smoker] compile-core:
   [smoker] 
   [smoker] compile-codecs:
   [smoker] 
   [smoker] ivy-availability-check:
   [smoker] 
   [smoker] ivy-fail:
   [smoker] 
   [smoker] ivy-configure:
   [smoker] [ivy:configure] :: loading settings :: file = /x1/jenkins/jenkins-slave/workspace/Lucene-Solr-SmokeRelease-5.x/lucene/build/smokeTestRelease/tmp/unpack/lucene-5.5.0/ivy-settings.xml
   [smoker] 
   [smoker] resolve:
   [smoker] 
   [smoker] common.init:
   [smoker] 
   [smoker] compile-lucene-core:
   [smoker] 
   [smoker] init:
   [smoker] 
   [smoker] -clover.disable:
   [smoker] 
   [smoker] -clover.load:
   [smoker] 
   [smoker] -clover.classpath:
   [smoker] 
   [smoker] -clover.setup:
   [smoker] 
   [smoker] clover:
   [smoker] 
   [smoker] compile-core:
   [smoker]     [mkdir] Created dir: /x1/jenkins/jenkins-slave/workspace/Lucene-Solr-SmokeRelease-5.x/lucene/build/smokeTestRelease/tmp/unpack/lucene-5.5.0/build/codecs/classes/java
   [smoker]     [javac] Compiling 64 source files to /x1/jenkins/jenkins-slave/workspace/Lucene-Solr-SmokeRelease-5.x/lucene/build/smokeTestRelease/tmp/unpack/lucene-5.5.0/build/codecs/classes/java
   [smoker]     [javac] Note: Some input files use or override a deprecated API.
   [smoker]     [javac] Note: Recompile with -Xlint:deprecation for details.
   [smoker]     [javac] Creating empty /x1/jenkins/jenkins-slave/workspace/Lucene-Solr-SmokeRelease-5.x/lucene/build/smokeTestRelease/tmp/unpack/lucene-5.5.0/build/codecs/classes/java/org/apache/lucene/codecs/blocktreeords/package-info.class
   [smoker]     [javac] Creating empty /x1/jenkins/jenkins-slave/workspace/Lucene-Solr-SmokeRelease-5.x/lucene/build/smokeTestRelease/tmp/unpack/lucene-5.5.0/build/codecs/classes/java/org/apache/lucene/codecs/memory/package-info.class
   [smoker]     [javac] Creating empty /x1/jenkins/jenkins-slave/workspace/Lucene-Solr-SmokeRelease-5.x/lucene/build/smokeTestRelease/tmp/unpack/lucene-5.5.0/build/codecs/classes/java/org/apache/lucene/codecs/simpletext/package-info.class
   [smoker]     [javac] Creating empty /x1/jenkins/jenkins-slave/workspace/Lucene-Solr-SmokeRelease-5.x/lucene/build/smokeTestRelease/tmp/unpack/lucene-5.5.0/build/codecs/classes/java/org/apache/lucene/codecs/blockterms/package-info.class
   [smoker]     [javac] Creating empty /x1/jenkins/jenkins-slave/workspace/Lucene-Solr-SmokeRelease-5.x/lucene/build/smokeTestRelease/tmp/unpack/lucene-5.5.0/build/codecs/classes/java/org/apache/lucene/codecs/bloom/package-info.class
   [smoker]     [javac] Creating empty /x1/jenkins/jenkins-slave/workspace/Lucene-Solr-SmokeRelease-5.x/lucene/build/smokeTestRelease/tmp/unpack/lucene-5.5.0/build/codecs/classes/java/org/apache/lucene/codecs/autoprefix/package-info.class
   [smoker]      [copy] Copying 3 files to /x1/jenkins/jenkins-slave/workspace/Lucene-Solr-SmokeRelease-5.x/lucene/build/smokeTestRelease/tmp/unpack/lucene-5.5.0/build/codecs/classes/java
   [smoker] 
   [smoker] -clover.disable:
   [smoker] 
   [smoker] -clover.load:
   [smoker] 
   [smoker] -clover.classpath:
   [smoker] 
   [smoker] -clover.setup:
   [smoker] 
   [smoker] clover:
   [smoker] 
   [smoker] common.compile-core:
   [smoker]     [mkdir] Created dir: /x1/jenkins/jenkins-slave/workspace/Lucene-Solr-SmokeRelease-5.x/lucene/build/smokeTestRelease/tmp/unpack/lucene-5.5.0/build/test-framework/classes/java
   [smoker]     [javac] Compiling 174 source files to /x1/jenkins/jenkins-slave/workspace/Lucene-Solr-SmokeRelease-5.x/lucene/build/smokeTestRelease/tmp/unpack/lucene-5.5.0/build/test-framework/classes/java
   [smoker]     [javac] Note: Some input files use or override a deprecated API.
   [smoker]     [javac] Note: Recompile with -Xlint:deprecation for details.
   [smoker]     [javac] Creating empty /x1/jenkins/jenkins-slave/workspace/Lucene-Solr-SmokeRelease-5.x/lucene/build/smokeTestRelease/tmp/unpack/lucene-5.5.0/build/test-framework/classes/java/org/apache/lucene/mockfile/package-info.class
   [smoker]     [javac] Creating empty /x1/jenkins/jenkins-slave/workspace/Lucene-Solr-SmokeRelease-5.x/lucene/build/smokeTestRelease/tmp/unpack/lucene-5.5.0/build/test-framework/classes/java/org/apache/lucene/codecs/cranky/package-info.class
   [smoker]     [javac] Creating empty /x1/jenkins/jenkins-slave/workspace/Lucene-Solr-SmokeRelease-5.x/lucene/build/smokeTestRelease/tmp/unpack/lucene-5.5.0/build/test-framework/classes/java/org/apache/lucene/codecs/compressing/dummy/package-info.class
   [smoker]     [javac] Creating empty /x1/jenkins/jenkins-slave/workspace/Lucene-Solr-SmokeRelease-5.x/lucene/build/smokeTestRelease/tmp/unpack/lucene-5.5.0/build/test-framework/classes/java/org/apache/lucene/codecs/asserting/package-info.class
   [smoker]     [javac] Creating empty /x1/jenkins/jenkins-slave/workspace/Lucene-Solr-SmokeRelease-5.x/lucene/build/smokeTestRelease/tmp/unpack/lucene-5.5.0/build/test-framework/classes/java/org/apache/lucene/codecs/ramonly/package-info.class
   [smoker]     [javac] Creating empty /x1/jenkins/jenkins-slave/workspace/Lucene-Solr-SmokeRelease-5.x/lucene/build/smokeTestRelease/tmp/unpack/lucene-5.5.0/build/test-framework/classes/java/org/apache/lucene/codecs/cheapbastard/package-info.class
   [smoker]     [javac] Creating empty /x1/jenkins/jenkins-slave/workspace/Lucene-Solr-SmokeRelease-5.x/lucene/build/smokeTestRelease/tmp/unpack/lucene-5.5.0/build/test-framework/classes/java/org/apache/lucene/codecs/mockrandom/package-info.class
   [smoker]      [copy] Copying 4 files to /x1/jenkins/jenkins-slave/workspace/Lucene-Solr-SmokeRelease-5.x/lucene/build/smokeTestRelease/tmp/unpack/lucene-5.5.0/build/test-framework/classes/java
   [smoker] 
   [smoker] compile-core:
   [smoker] 
   [smoker] compile-test:
   [smoker]     [mkdir] Created dir: /x1/jenkins/jenkins-slave/workspace/Lucene-Solr-SmokeRelease-5.x/lucene/build/smokeTestRelease/tmp/unpack/lucene-5.5.0/build/core/classes/test
   [smoker]     [javac] Compiling 423 source files to /x1/jenkins/jenkins-slave/workspace/Lucene-Solr-SmokeRelease-5.x/lucene/build/smokeTestRelease/tmp/unpack/lucene-5.5.0/build/core/classes/test
   [smoker]     [javac] Note: Some input files use or override a deprecated API.
   [smoker]     [javac] Note: Recompile with -Xlint:deprecation for details.
   [smoker]      [copy] Copying 3 files to /x1/jenkins/jenkins-slave/workspace/Lucene-Solr-SmokeRelease-5.x/lucene/build/smokeTestRelease/tmp/unpack/lucene-5.5.0/build/core/classes/test
   [smoker] 
   [smoker] install-junit4-taskdef:
   [smoker] 
   [smoker] validate:
   [smoker] 
   [smoker] resolve-groovy:
   [smoker] 
   [smoker] -init-totals:
   [smoker] 
   [smoker] -test:
   [smoker]     [mkdir] Created dir: /x1/jenkins/jenkins-slave/workspace/Lucene-Solr-SmokeRelease-5.x/lucene/build/smokeTestRelease/tmp/unpack/lucene-5.5.0/build/core/test
   [smoker] [loadresource] Do not set property tests.explicitclass as its length is 0.
   [smoker]     [mkdir] Created dir: /x1/jenkins/jenkins-slave/workspace/Lucene-Solr-SmokeRelease-5.x/lucene/build/smokeTestRelease/tmp/unpack/lucene-5.5.0/build/core/test/temp
   [smoker]     [mkdir] Created dir: /x1/jenkins/jenkins-slave/workspace/Lucene-Solr-SmokeRelease-5.x/lucene/build/smokeTestRelease/tmp/unpack/.caches/test-stats/core
   [smoker]    [junit4] <JUnit4> says 今日は! Master seed: 171283D9999AC8EC
   [smoker]    [junit4] Executing 415 suites with 3 JVMs.
   [smoker]    [junit4] 
   [smoker]    [junit4] Started J2 PID(22654@localhost).
   [smoker]    [junit4] Started J0 PID(22660@localhost).
   [smoker]    [junit4] Started J1 PID(22657@localhost).
   [smoker]    [junit4] Suite: org.apache.lucene.search.spans.TestSpansAdvanced
   [smoker]    [junit4] Completed [1/415] on J2 in 2.28s, 1 test
   [smoker]    [junit4] 
   [smoker]    [junit4] Suite: org.apache.lucene.index.TestDocInverterPerFieldErrorInfo
   [smoker]    [junit4] Completed [2/415] on J2 in 0.32s, 2 tests
   [smoker]    [junit4] 
   [smoker]    [junit4] Suite: org.apache.lucene.search.TestSortRescorer
   [smoker]    [junit4] Completed [4/415] on J2 in 3.72s, 2 tests
   [smoker]    [junit4] 
   [smoker]    [junit4] Suite: org.apache.lucene.index.TestIndexFileDeleter
   [smoker]    [junit4] Completed [5/415] on J2 in 0.95s, 9 tests
   [smoker]    [junit4] 
   [smoker]    [junit4] Suite: org.apache.lucene.index.TestOrdinalMap
   [smoker]    [junit4] Completed [6/415] on J2 in 0.77s, 1 test
   [smoker]    [junit4] 
   [smoker]    [junit4] Suite: org.apache.lucene.index.TestMaxPosition
   [smoker]    [junit4] Completed [7/415] on J2 in 0.14s, 2 tests
   [smoker]    [junit4] 
   [smoker]    [junit4] Suite: org.apache.lucene.search.TestMinShouldMatch2
   [smoker]    [junit4] Completed [8/415] on J0 in 10.83s, 6 tests
   [smoker]    [junit4] 
   [smoker]    [junit4] Suite: org.apache.lucene.index.TestLogMergePolicy
   [smoker]    [junit4] Completed [9/415] on J0 in 0.13s, 2 tests
   [smoker]    [junit4] 
   [smoker]    [junit4] Suite: org.apache.lucene.index.TestOmitNorms
   [smoker]    [junit4] Completed [10/415] on J2 in 3.85s, 5 tests
   [smoker]    [junit4] 
   [smoker]    [junit4] Suite: org.apache.lucene.search.TestDocTermOrdsRewriteMethod
   [smoker]    [junit4] Completed [11/415] on J1 in 12.83s, 2 tests
   [smoker]    [junit4] 
   [smoker]    [junit4] Suite: org.apache.lucene.store.TestFileSwitchDirectory
   [smoker]    [junit4] IGNOR/A 0.05s J0 | TestFileSwitchDirectory.testFsyncDoesntCreateNewFiles
   [smoker]    [junit4]    > Assumption #1: test only works for FSDirectory subclasses
   [smoker]    [junit4] Completed [12/415] on J0 in 4.61s, 41 tests, 1 skipped
   [smoker]    [junit4] 
   [smoker]    [junit4] Suite: org.apache.lucene.TestSearch
   [smoker]    [junit4] Completed [13/415] on J0 in 0.51s, 2 tests
   [smoker]    [junit4] 
   [smoker]    [junit4] Suite: org.apache.lucene.search.spans.TestSpanNearQuery
   [smoker]    [junit4] Completed [14/415] on J0 in 0.20s, 4 tests
   [smoker]    [junit4] 
   [smoker]    [junit4] Suite: org.apache.lucene.index.TestIndexWriterWithThreads
   [smoker]    [junit4] IGNOR/A 0.00s J0 | TestIndexWriterWithThreads.testIOExceptionDuringWriteSegmentWithThreads
   [smoker]    [junit4]    > Assumption #1: 'slow' test group is disabled (@Slow())
   [smoker]    [junit4] IGNOR/A 0.00s J0 | TestIndexWriterWithThreads.testCloseWithThreads
   [smoker]    [junit4]    > Assumption #1: 'slow' test group is disabled (@Slow())
   [smoker]    [junit4] IGNOR/A 0.00s J0 | TestIndexWriterWithThreads.testIOExceptionDuringWriteSegmentWithThreadsOnlyOnce
   [smoker]    [junit4]    > Assumption #1: 'slow' test group is disabled (@Slow())
   [smoker]    [junit4] IGNOR/A 0.00s J0 | TestIndexWriterWithThreads.testIOExceptionDuringWriteSegmentOnlyOnce
   [smoker]    [junit4]    > Assumption #1: 'slow' test group is disabled (@Slow())
   [smoker]    [junit4] IGNOR/A 0.00s J0 | TestIndexWriterWithThreads.testIOExceptionDuringAbort
   [smoker]    [junit4]    > Assumption #1: 'slow' test group is disabled (@Slow())
   [smoker]    [junit4] IGNOR/A 0.00s J0 | TestIndexWriterWithThreads.testIOExceptionDuringAbortWithThreads
   [smoker]    [junit4]    > Assumption #1: 'slow' test group is disabled (@Slow())
   [smoker]    [junit4] IGNOR/A 0.00s J0 | TestIndexWriterWithThreads.testIOExceptionDuringWriteSegment
   [smoker]    [junit4]    > Assumption #1: 'slow' test group is disabled (@Slow())
   [smoker]    [junit4] IGNOR/A 0.00s J0 | TestIndexWriterWithThreads.testOpenTwoIndexWritersOnDifferentThreads
   [smoker]    [junit4]    > Assumption #1: 'slow' test group is disabled (@Slow())
   [smoker]    [junit4] IGNOR/A 0.00s J0 | TestIndexWriterWithThreads.testIOExceptionDuringAbortWithThreadsOnlyOnce
   [smoker]    [junit4]    > Assumption #1: 'slow' test group is disabled (@Slow())
   [smoker]    [junit4] IGNOR/A 0.00s J0 | TestIndexWriterWithThreads.testRollbackAndCommitWithThreads
   [smoker]    [junit4]    > Assumption #1: 'slow' test group is disabled (@Slow())
   [smoker]    [junit4] IGNOR/A 0.00s J0 | TestIndexWriterWithThreads.testImmediateDiskFullWithThreads
   [smoker]    [junit4]    > Assumption #1: 'slow' test group is disabled (@Slow())
   [smoker]    [junit4] IGNOR/A 0.00s J0 | TestIndexWriterWithThreads.testIOExceptionDuringAbortOnlyOnce
   [smoker]    [junit4]    > Assumption #1: 'slow' test group is disabled (@Slow())
   [smoker]    [junit4] Completed [15/415] on J0 in 0.05s, 12 tests, 12 skipped
   [smoker]    [junit4] 
   [smoker]    [junit4] Suite: org.apache.lucene.index.TestForTooMuchCloning
   [smoker]    [junit4] Completed [16/415] on J0 in 1.30s, 1 test
   [smoker]    [junit4] 
   [smoker]    [junit4] Suite: org.apache.lucene.index.TestSegmentReader
   [smoker]    [junit4] Completed [17/415] on J0 in 3.31s, 7 tests
   [smoker]    [junit4] 
   [smoker]    [junit4] Suite: org.apache.lucene.search.TestMultiset
   [smoker]    [junit4] Completed [18/415] on J0 in 0.09s, 2 tests
   [smoker]    [junit4] 
   [smoker]    [junit4] Suite: org.apache.lucene.index.TestIndexWriterForceMerge
   [smoker]    [junit4] Completed [19/415] on J1 in 9.01s, 4 tests
   [smoker]    [junit4] 
   [smoker]    [junit4] Suite: org.apache.lucene.codecs.lucene50.TestLucene50StoredFieldsFormat
   [smoker]    [junit4] IGNOR/A 0.02s J2 | TestLucene50StoredFieldsFormat.testBigDocuments
   [smoker]    [junit4]    > Assumption #1: 'nightly' test group is disabled (@Nightly())
   [smoker]    [junit4] IGNOR/A 0.00s J2 | TestLucene50StoredFieldsFormat.testRamBytesUsed
   [smoker]    [junit4]    > Assumption #1: 'slow' test group is disabled (@Slow())
   [smoker]    [junit4] Completed [20/415] on J2 in 10.66s, 17 tests, 2 skipped
   [smoker]    [junit4] 
   [smoker]    [junit4] Suite: org.apache.lucene.store.TestFilterDirectory
   [smoker]    [junit4] IGNOR/A 0.00s J0 | TestFilterDirectory.testFsyncDoesntCreateNewFiles
   [smoker]    [junit4]    > Assumption #1: test only works for FSDirectory subclasses
   [smoker]    [junit4] Completed [21/415] on J0 in 1.70s, 42 tests, 1 skipped
   [smoker]    [junit4] 
   [smoker]    [junit4] Suite: org.apache.lucene.index.TestCrashCausesCorruptIndex
   [smoker]    [junit4] Completed [22/415] on J2 in 0.51s, 1 test
   [smoker]    [junit4] 
   [smoker]    [junit4] Suite: org.apache.lucene.store.TestMmapDirectory
   [smoker]    [junit4] Completed [23/415] on J1 in 3.36s, 40 tests
   [smoker]    [junit4] 
   [smoker]    [junit4] Suite: org.apache.lucene.analysis.TestCachingTokenFilter
   [smoker]    [junit4] Completed [24/415] on J1 in 0.08s, 2 tests
   [smoker]    [junit4] 
   [smoker]    [junit4] Suite: org.apache.lucene.search.spans.TestSpansEnum
   [smoker]    [junit4] Completed [25/415] on J1 in 0.74s, 7 tests
   [smoker]    [junit4] 
   [smoker]    [junit4] Suite: org.apache.lucene.index.TestNRTThreads
   [smoker]    [junit4] Completed [26/415] on J2 in 9.20s, 1 test
   [smoker]    [junit4] 
   [smoker]    [junit4] Suite: org.apache.lucene.util.TestRollingBuffer
   [smoker]    [junit4] Completed [27/415] on J2 in 0.76s, 1 test
   [smoker]    [junit4] 
   [smoker]    [junit4] Suite: org.apache.lucene.search.spans.TestFilterSpans
   [smoker]    [junit4] Completed [28/415] on J2 in 0.07s, 1 test
   [smoker]    [junit4] 
   [smoker]    [junit4] Suite: org.apache.lucene.store.TestWindowsMMap
   [smoker]    [junit4] Completed [29/415] on J2 in 0.43s, 1 test
   [smoker]    [junit4] 
   [smoker]    [junit4] Suite: org.apache.lucene.store.TestBufferedChecksum
   [smoker]    [junit4] Completed [30/415] on J2 in 0.68s, 2 tests
   [smoker]    [junit4] 
   [smoker]    [junit4] Suite: org.apache.lucene.index.TestThreadedForceMerge
   [smoker]    [junit4] Completed [31/415] on J2 in 1.53s, 1 test
   [smoker]    [junit4] 
   [smoker]    [junit4] Suite: org.apache.lucene.store.TestNativeFSLockFactory
   [smoker]    [junit4] Completed [32/415] on J0 in 13.61s, 10 tests
   [smoker]    [junit4] 
   [smoker]    [junit4] Suite: org.apache.lucene.search.spans.TestSpans
   [smoker]    [junit4] Completed [33/415] on J2 in 1.92s, 26 tests
   [smoker]    [junit4] 
   [smoker]    [junit4] Suite: org.apache.lucene.store.TestMultiMMap
   [smoker]    [junit4] Completed [34/415] on J2 in 6.20s, 52 tests
   [smoker]    [junit4] 
   [smoker]    [junit4] Suite: org.apache.lucene.codecs.TestCodecLoadingDeadlock
   [smoker]    [junit4] Completed [35/415] on J2 in 0.63s, 1 test
   [smoker]    [junit4] 
   [smoker]    [junit4] Suite: org.apache.lucene.index.TestTieredMergePolicy
   [smoker]    [junit4] Completed [36/415] on J0 in 10.01s, 6 tests
   [smoker]    [junit4] 
   [smoker]    [junit4] Suite: org.apache.lucene.index.TestRollingUpdates
   [smoker]    [junit4] Completed [37/415] on J2 in 2.40s, 2 tests
   [smoker]    [junit4] 
   [smoker]    [junit4] Suite: org.apache.lucene.index.TestIndexWriterExceptions
   [smoker]    [junit4] IGNOR/A 0.01s J1 | TestIndexWriterExceptions.testTooManyTokens
   [smoker]    [junit4]    > Assumption #1: 'nightly' test group is disabled (@Nightly())
   [smoker]    [junit4] Completed [38/415] on J1 in 21.22s, 36 tests, 1 skipped
   [smoker]    [junit4] 
   [smoker]    [junit4] Suite: org.apache.lucene.index.TestDuelingCodecsAtNight
   [smoker]    [junit4] IGNOR/A 0.00s J1 | TestDuelingCodecsAtNight.testCrazyReaderEquals
   [smoker]    [junit4]    > Assumption #1: 'slow' test group is disabled (@Slow())
   [smoker]    [junit4] IGNOR/A 0.01s J1 | TestDuelingCodecsAtNight.testEquals
   [smoker]    [junit4]    > Assumption #1: 'slow' test group is disabled (@Slow())
   [smoker]    [junit4] IGNOR/A 0.00s J1 | TestDuelingCodecsAtNight.testBigEquals
   [smoker]    [junit4]    > Assumption #1: 'slow' test group is disabled (@Slow())
   [smoker]    [junit4] Completed [39/415] on J1 in 0.06s, 3 tests, 3 skipped
   [smoker]    [junit4] 
   [smoker]    [junit4] Suite: org.apache.lucene.index.TestReaderWrapperDVTypeCheck
   [smoker]    [junit4] Completed [40/415] on J1 in 0.16s, 1 test
   [smoker]    [junit4] 
   [smoker]    [junit4] Suite: org.apache.lucene.index.TestRollback
   [smoker]    [junit4] Completed [41/415] on J2 in 0.10s, 1 test
   [smoker]    [junit4] 
   [smoker]    [junit4] Suite: org.apache.lucene.index.TestOmitTf
   [smoker]    [junit4] Completed [42/415] on J2 in 1.46s, 6 tests
   [smoker]    [junit4] 
   [smoker]    [junit4] Suite: org.apache.lucene.index.TestDirectoryReader
   [smoker]    [junit4] Completed [43/415] on J0 in 4.49s, 24 tests
   [smoker]    [junit4] 
   [smoker]    [junit4] Suite: org.apache.lucene.util.TestMathUtil
   [smoker]    [junit4] Completed [44/415] on J0 in 0.09s, 5 tests
   [smoker]    [junit4] 
   [smoker]    [junit4] Suite: org.apache.lucene.search.TestFieldValueQuery
   [smoker]    [junit4] Completed [45/415] on J1 in 5.25s, 6 tests
   [smoker]    [junit4] 
   [smoker]    [junit4] Suite: org.apache.lucene.codecs.compressing.TestHighCompressionMode
   [smoker]    [junit4] Completed [46/415] on J0 in 2.63s, 7 tests
   [smoker]    [junit4] 
   [smoker]    [junit4] Suite: org.apache.lucene.search.TestNumericRangeQuery32
   [smoker]    [junit4] Completed [47/415] on J2 in 15.45s, 23 tests
   [smoker]    [junit4] 
   [smoker]    [junit4] Suite: org.apache.lucene.index.TestIndexWriterOutOfFileDescriptors
   [smoker]    [junit4] Completed [48/415] on J0 in 11.32s, 1 test
   [smoker]    [junit4] 
   [smoker]    [junit4] Suite: org.apache.lucene.index.TestMaxTermFrequency
   [smoker]    [junit4] Completed [49/415] on J2 in 0.88s, 1 test
   [smoker]    [junit4] 
   [smoker]    [junit4] Suite: org.apache.lucene.util.TestFilterIterator
   [smoker]    [junit4] Completed [50/415] on J2 in 0.20s, 8 tests
   [smoker]    [junit4] 
   [smoker]    [junit4] Suite: org.apache.lucene.search.TestCachingCollector
   [smoker]    [junit4] Completed [51/415] on J2 in 0.15s, 4 tests
   [smoker]    [junit4] 
   [smoker]    [junit4] Suite: org.apache.lucene.search.TestMultiPhraseEnum
   [smoker]    [junit4] Completed [52/415] on J2 in 0.15s, 2 tests
   [smoker]    [junit4] 
   [smoker]    [junit4] Suite: org.apache.lucene.TestAssertions
   [smoker]    [junit4] Completed [53/415] on J2 in 0.10s, 1 test
   [smoker]    [junit4] 
   [smoker]    [junit4] Suite: org.apache.lucene.store.TestNRTCachingDirectory
   [smoker]    [junit4] IGNOR/A 0.00s J1 | TestNRTCachingDirectory.testFsyncDoesntCreateNewFiles
   [smoker]    [junit4]    > Assumption #1: test only works for FSDirectory subclasses
   [smoker]    [junit4] Completed [54/415] on J1 in 13.88s, 41 tests, 1 skipped
   [smoker]    [junit4] 
   [smoker]    [junit4] Suite: org.apache.lucene.index.TestIndexWriterOnVMError
   [smoker]    [junit4] IGNOR/A 0.00s J2 | TestIndexWriterOnVMError.testCheckpoint
   [smoker]    [junit4]    > Assumption #1: 'nightly' test group is disabled (@Nightly())
   [smoker]    [junit4] Completed [55/415] on J2 in 1.69s, 3 tests, 1 skipped
   [smoker]    [junit4] 
   [smoker]    [junit4] Suite: org.apache.lucene.util.TestIOUtils
   [smoker]    [junit4] Completed [56/415] on J2 in 0.33s, 18 tests
   [smoker]    [junit4] 
   [smoker]    [junit4] Suite: org.apache.lucene.search.TestTopFieldCollector
   [smoker]    [junit4] Completed [57/415] on J2 in 0.53s, 7 tests
   [smoker]    [junit4] 
   [smoker]    [junit4] Suite: org.apache.lucene.search.FuzzyTermOnShortTermsTest
   [smoker]    [junit4] Completed [58/415] on J2 in 0.22s, 1 test
   [smoker]    [junit4] 
   [smoker]    [junit4] Suite: org.apache.lucene.search.TestQueryRescorer
   [smoker]    [junit4] Completed [59/415] on J0 in 4.37s, 6 tests
   [smoker]    [junit4] 
   [smoker]    [junit4] Suite: org.apache.lucene.index.TestMultiLevelSkipList
   [smoker]    [junit4] Completed [60/415] on J0 in 1.39s, 1 test
   [smoker]    [junit4] 
   [smoker]    [junit4] Suite: org.apache.lucene.search.TestNot
   [smoker]    [junit4] Completed [61/415] on J0 in 0.08s, 1 test
   [smoker]    [junit4] 
   [smoker]    [junit4] Suite: org.apache.lucene.store.TestSingleInstanceLockFactory
   [smoker]    [junit4] Completed [62/415] on J1 in 4.65s, 7 tests
   [smoker]    [junit4] 
   [smoker]    [junit4] Suite: org.apache.lucene.index.TestTermVectorsReader
   [smoker]    [junit4] Completed [63/415] on J1 in 0.29s, 6 tests
   [smoker]    [junit4] 
   [smoker]    [junit4] Suite: org.apache.lucene.index.TestCrash
   [smoker]    [junit4] Completed [64/415] on J1 in 1.06s, 5 tests
   [smoker]    [junit4] 
   [smoker]    [junit4] Suite: org.apache.lucene.util.TestRecyclingIntBlockAllocator
   [smoker]    [junit4] Completed [65/415] on J1 in 0.11s, 3 tests
   [smoker]    [junit4] 
   [smoker]    [junit4] Suite: org.apache.lucene.codecs.lucene50.TestForUtil
   [smoker]    [junit4] Completed [66/415] on J1 in 0.16s, 1 test
   [smoker]    [junit4] 
   [smoker]    [junit4] Suite: org.apache.lucene.search.TestBooleanRewrites
   [smoker]    [junit4] Completed [67/415] on J0 in 2.15s, 7 tests
   [smoker]    [junit4] 
   [smoker]    [junit4] Suite: org.apache.lucene.index.TestIndexWriterDeleteByQuery
   [smoker]    [junit4] Completed [68/415] on J1 in 0.10s, 1 test
   [smoker]    [junit4] 
   [smoker]    [junit4] Suite: org.apache.lucene.search.TestPositiveScoresOnlyCollector
   [smoker]    [junit4] Completed [69/415] on J1 in 0.06s, 1 test
   [smoker]    [junit4] 
   [smoker]    [junit4] Suite: org.apache.lucene.document.TestField
   [smoker]    [junit4] Completed [70/415] on J0 in 0.17s, 19 tests
   [smoker]    [junit4] 
   [smoker]    [junit4] Suite: org.apache.lucene.index.TestNRTReaderCleanup
   [smoker]    [junit4] Completed [71/415] on J0 in 0.07s, 1 test
   [smoker]    [junit4] 
   [smoker]    [junit4] Suite: org.apache.lucene.index.TestLongPostings
   [smoker]    [junit4] Completed [72/415] on J2 in 7.66s, 2 tests
   [smoker]    [junit4] 
   [smoker]    [junit4] Suite: org.apache.lucene.search.TestQueryWrapperFilter
   [smoker]    [junit4] Completed [73/415] on J2 in 1.17s, 6 tests
   [smoker]    [junit4] 
   [smoker]    [junit4] Suite: org.apache.lucene.search.TestCachingWrapperQuery
   [smoker]    [junit4] Completed [74/415] on J2 in 0.41s, 7 tests
   [smoker]    [junit4] 
   [smoker]    [junit4] Suite: org.apache.lucene.util.TestBytesRefArray
   [smoker]    [junit4] Completed [75/415] on J2 in 0.32s, 2 tests
   [smoker]    [junit4] 
   [smoker]    [junit4] Suite: org.apache.lucene.index.TestIndexWriterThreadsToSegments
   [smoker]    [junit4] Completed [76/415] on J1 in 5.49s, 4 tests
   [smoker]    [junit4] 
   [smoker]    [junit4] Suite: org.apache.lucene.search.TestSearchWithThreads
   [smoker]    [junit4] Completed [77/415] on J2 in 6.81s, 1 test
   [smoker]    [junit4] 
   [smoker]    [junit4] Suite: org.apache.lucene.index.TestCodecHoldsOpenFiles
   [smoker]    [junit4] Completed [78/415] on J2 in 0.08s, 1 test
   [smoker]    [junit4] 
   [smoker]    [junit4] Suite: org.apache.lucene.search.TestDocIdSet
   [smoker]    [junit4] Completed [79/415] on J2 in 0.08s, 3 tests
   [smoker]    [junit4] 
   [smoker]    [junit4] Suite: org.apache.lucene.index.TestTermsEnum
   [smoker]    [junit4] IGNOR/A 0.00s J0 | TestTermsEnum.testVaryingTermsPerSegment
   [smoker]    [junit4]    > Assumption #1: 'slow' test group is disabled (@Slow())
   [smoker]    [junit4] Completed [80/415] on J0 in 13.84s, 11 tests, 1 skipped
   [smoker]    [junit4] 
   [smoker]    [junit4] Suite: org.apache.lucene.search.TestBooleanOr
   [smoker]    [junit4] Completed [81/415] on J2 in 4.71s, 7 tests
   [smoker]    [junit4] 
   [smoker]    [junit4] Suite: org.apache.lucene.store.TestSimpleFSDirectory
   [smoker]    [junit4] Completed [82/415] on J2 in 2.81s, 40 tests
   [smoker]    [junit4] 
   [smoker]    [junit4] Suite: org.apache.lucene.search.TestLRUQueryCache
   [smoker]    [junit4] Completed [83/415] on J1 in 18.99s, 17 tests
   [smoker]    [junit4] 
   [smoker]    [junit4] Suite: org.apache.lucene.util.automaton.TestDeterminizeLexicon
   [smoker]    [junit4] Completed [84/415] on J2 in 5.28s, 1 test
   [smoker]    [junit4] 
   [smoker]    [junit4] Suite: org.apache.lucene.index.TestUniqueTermCount
   [smoker]    [junit4] Completed [85/415] on J1 in 0.40s, 1 test
   [smoker]    [junit4] 
   [smoker]    [junit4] Suite: org.apache.lucene.document.TestDateTools
   [smoker]    [junit4] Completed [86/415] on J1 in 0.12s, 5 tests
   [smoker]    [junit4] 
   [smoker]    [junit4] Suite: org.apache.lucene.search.TestConjunctionDISI
   [smoker]    [junit4] Completed [87/415] on J0 in 11.54s, 5 tests
   [smoker]    [junit4] 
   [smoker]    [junit4] Suite: org.apache.lucene.search.TestDateFilter
   [smoker]    [junit4] Completed [88/415] on J0 in 0.19s, 2 tests
   [smoker]    [junit4] 
   [smoker]    [junit4] Suite: org.apache.lucene.index.TestParallelReaderEmptyIndex
   [smoker]    [junit4] Completed [89/415] on J0 in 0.17s, 2 tests
   [smoker]    [junit4] 
   [smoker]    [junit4] Suite: org.apache.lucene.search.TestMultiPhraseQuery
   [smoker]    [junit4] Completed [90/415] on J0 in 0.23s, 17 tests, 1 skipped
   [smoker]    [junit4] 
   [smoker]    [junit4] Suite: org.apache.lucene.index.TestIntBlockPool
   [smoker]    [junit4] Completed [91/415] on J1 in 1.94s, 2 tests
   [smoker]    [junit4] 
   [smoker]    [junit4] Suite: org.apache.lucene.search.TestSimpleSearchEquivalence
   [smoker]    [junit4] Completed [92/415] on J2 in 3.53s, 16 tests
   [smoker]    [junit4] 
   [smoker]    [junit4] Suite: org.apache.lucene.index.TestTermVectors
   [smoker]    [junit4] Completed [93/415] on J1 in 2.95s, 3 tests
   [smoker]    [junit4] 
   [smoker]    [junit4] Suite: org.apache.lucene.search.MultiCollectorTest
   [smoker]    [junit4] Completed [94/415] on J1 in 0.09s, 4 tests
   [smoker]    [junit4] 
   [smoker]    [junit4] Suite: org.apache.lucene.search.TestBooleanQueryVisitSubscorers
   [smoker]    [junit4] Completed [95/415] on J1 in 0.17s, 5 tests
   [smoker]    [junit4] 
   [smoker]    [junit4] Suite: org.apache.lucene.store.TestBufferedIndexInput
   [smoker]    [junit4] Completed [96/415] on J2 in 4.21s, 4 tests
   [smoker]    [junit4] 
   [smoker]    [junit4] Suite: org.apache.lucene.index.TestPayloadsOnVectors
   [smoker]    [junit4] Completed [97/415] on J2 in 0.14s, 3 tests
   [smoker]    [junit4] 
   [smoker]    [junit4] Suite: org.apache.lucene.search.TestShardSearching
   [smoker]    [junit4] Completed [98/415] on J0 in 9.51s, 1 test
   [smoker]    [junit4] 
   [smoker]    [junit4] Suite: org.apache.lucene.analysis.tokenattributes.TestSimpleAttributeImpl
   [smoker]    [junit4] Completed [99/415] on J0 in 0.06s, 1 test
   [smoker]    [junit4] 
   [smoker]    [junit4] Suite: org.apache.lucene.index.TestPrefixCodedTerms
   [smoker]    [junit4] Completed [100/415] on J0 in 0.83s, 5 tests
   [smoker]    [junit4] 
   [smoker]    [junit4] Suite: org.apache.lucene.search.TestConjunctions
   [smoker]    [junit4] Completed [101/415] on J0 in 0.07s, 1 test
   [smoker]    [junit4] 
   [smoker]    [junit4] Suite: org.apache.lucene.analysis.tokenattributes.TestCharTermAttributeImpl
   [smoker]    [junit4] Completed [102/415] on J0 in 1.37s, 12 tests
   [smoker]    [junit4] 
   [smoker]    [junit4] Suite: org.apache.lucene.util.TestPagedBytes
   [smoker]    [junit4] Completed [103/415] on J2 in 7.31s, 4 tests, 1 skipped
   [smoker]    [junit4] 
   [smoker]    [junit4] Suite: org.apache.lucene.search.TestCustomSearcherSort
   [smoker]    [junit4] Completed [104/415] on J0 in 5.46s, 2 tests
   [smoker]    [junit4] 
   [smoker]    [junit4] Suite: org.apache.lucene.search.TestUsageTrackingFilterCachingPolicy
   [smoker]    [junit4] Completed [105/415] on J0 in 0.08s, 2 tests
   [smoker]    [junit4] 
   [smoker]    [junit4] Suite: org.apache.lucene.index.TestMixedDocValuesUpdates
   [smoker]    [junit4] IGNOR/A 0.00s J1 | TestMixedDocValuesUpdates.testTonsOfUpdates
   [smoker]    [junit4]    > Assumption #1: 'nightly' test group is disabled (@Nightly())
   [smoker]    [junit4] Completed [106/415] on J1 in 13.73s, 4 tests, 1 skipped
   [smoker]    [junit4] 
   [smoker]    [junit4] Suite: org.apache.lucene.search.TestDocValuesScoring
   [smoker]    [junit4] Completed [107/415] on J1 in 0.29s, 1 test
   [smoker]    [junit4] 
   [smoker]    [junit4] Suite: org.apache.lucene.search.TestScoreCachingWrappingScorer
   [smoker]    [junit4] Completed [108/415] on J1 in 0.07s, 1 test
   [smoker]    [junit4] 
   [smoker]    [junit4] Suite: org.apache.lucene.index.TestDocumentsWriterDeleteQueue
   [smoker]    [junit4] Completed [109/415] on J0 in 1.55s, 5 tests
   [smoker]    [junit4] 
   [smoker]    [junit4] Suite: org.apache.lucene.index.TestSnapshotDeletionPolicy
   [smoker]    [junit4] Completed [110/415] on J0 in 1.57s, 7 tests
   [smoker]    [junit4] 
   [smoker]    [junit4] Suite: org.apache.lucene.codecs.compressing.TestFastDecompressionMode
   [smoker]    [junit4] Completed [111/415] on J1 in 3.75s, 11 tests
   [smoker]    [junit4] 
   [smoker]    [junit4] Suite: org.apache.lucene.index.TestNoMergePolicy
   [smoker]    [junit4] Completed [112/415] on J1 in 0.07s, 3 tests
   [smoker]    [junit4] 
   [smoker]    [junit4] Suite: org.apache.lucene.search.TestBlendedTermQuery
   [smoker]    [junit4] Completed [113/415] on J1 in 0.08s, 3 tests
   [smoker]    [junit4] 
   [smoker]    [junit4] Suite: org.apache.lucene.analysis.tokenattributes.TestPackedTokenAttributeImpl
   [smoker]    [junit4] Completed [114/415] on J1 in 0.06s, 4 tests
   [smoker]    [junit4] 
   [smoker]    [junit4] Suite: org.apache.lucene.search.TestDocValuesRewriteMethod
   [smoker]    [junit4] Completed [115/415] on J2 in 11.29s, 2 tests
   [smoker]    [junit4] 
   [smoker]    [junit4] Suite: org.apache.lucene.search.TestDocBoost
   [smoker]    [junit4] Completed [116/415] on J2 in 0.07s, 1 test
   [smoker]    [junit4] 
   [smoker]    [junit4] Suite: org.apache.lucene.index.TestIndexWriterMergePolicy
   [smoker]    [junit4] Completed [117/415] on J0 in 4.84s, 7 tests
   [smoker]    [junit4] 
   [smoker]    [junit4] Suite: org.apache.lucene.util.TestIntsRef
   [smoker]    [junit4] Completed [118/415] on J2 in 0.04s, 2 tests
   [smoker]    [junit4] 
   [smoker]    [junit4] Suite: org.apache.lucene.util.TestTimSorterWorstCase
   [smoker]    [junit4] IGNOR/A 0.00s J0 | TestTimSorterWorstCase.testWorstCaseStackSize
   [smoker]    [junit4]    > Assumption #1: 'slow' test group is disabled (@Slow())
   [smoker]    [junit4] Completed [119/415] on J0 in 0.03s, 1 test, 1 skipped
   [smoker]    [junit4] 
   [smoker]    [junit4] Suite: org.apache.lucene.search.TestPhrasePrefixQuery
   [smoker]    [junit4] Completed [120/415] on J0 in 0.09s, 1 test
   [smoker]    [junit4] 
   [smoker]    [junit4] Suite: org.apache.lucene.index.TestIndexWriterMerging
   [smoker]    [junit4] IGNOR/A 0.00s J2 | TestIndexWriterMerging.testNoWaitClose
   [smoker]    [junit4]    > Assumption #1: 'slow' test group is disabled (@Slow())
   [smoker]    [junit4] Completed [121/415] on J2 in 5.27s, 6 tests, 1 skipped
   [smoker]    [junit4] 
   [smoker]    [junit4] Suite: org.apache.lucene.search.TestMultiTermConstantScore
   [smoker]    [junit4] Completed [122/415] on J0 in 5.10s, 8 tests
   [smoker]    [junit4] 
   [smoker]    [junit4] Suite: org.apache.lucene.util.mutable.TestMutableValues
   [smoker]    [junit4] Completed [123/415] on J0 in 0.03s, 6 tests
   [smoker]    [junit4] 
   [smoker]    [junit4] Suite: org.apache.lucene.util.TestPriorityQueue
   [smoker]    [junit4] Completed [124/415] on J0 in 0.80s, 7 tests
   [smoker]    [junit4] 
   [smoker]    [junit4] Suite: org.apache.lucene.util.TestSPIClassIterator
   [smoker]    [junit4] Completed [125/415] on J0 in 0.05s, 1 test
   [smoker]    [junit4] 
   [smoker]    [junit4] Suite: org.apache.lucene.search.spans.TestSpanTermQuery
   [smoker]    [junit4] Completed [126/415] on J0 in 0.07s, 2 tests
   [smoker]    [junit4] 
   [smoker]    [junit4] Suite: org.apache.lucene.search.TestElevationComparator
   [smoker]    [junit4] Completed [127/415] on J0 in 0.09s, 1 test
   [smoker]    [junit4] 
   [smoker]    [junit4] Suite: org.apache.lucene.index.TestSameTokenSamePosition
   [smoker]    [junit4] Completed [128/415] on J0 in 0.08s, 2 tests
   [smoker]    [junit4] 
   [smoker]    [junit4] Suite: org.apache.lucene.index.TestNoMergeScheduler
   [smoker]    [junit4] Completed [129/415] on J0 in 0.06s, 3 tests
   [smoker]    [junit4] 
   [smoker]    [junit4] Suite: org.apache.lucene.index.TestIndexWriterFromReader
   [smoker]    [junit4] Completed [130/415] on J0 in 1.07s, 12 tests
   [smoker]    [junit4] 
   [smoker]    [junit4] Suite: org.apache.lucene.search.TestBooleanMinShouldMatch
   [smoker]    [junit4] Completed [131/415] on J1 in 10.99s, 17 tests
   [smoker]    [junit4] 
   [smoker]    [junit4] Suite: org.apache.lucene.index.TestSumDocFreq
   [smoker]    [junit4] Completed [132/415] on J0 in 0.46s, 1 test
   [smoker]    [junit4] 
   [smoker]    [junit4] Suite: org.apache.lucene.search.TestConstantScoreQuery
   [smoker]    [junit4] Completed [133/415] on J0 in 0.15s, 6 tests
   [smoker]    [junit4] 
   [smoker]    [junit4] Suite: org.apache.lucene.search.spans.TestFieldMaskingSpanQuery
   [smoker]    [junit4] Completed [134/415] on J1 in 1.37s, 11 tests
   [smoker]    [junit4] 
   [smoker]    [junit4] Suite: org.apache.lucene.util.packed.TestDirectPacked
   [smoker]    [junit4] Completed [135/415] on J2 in 4.56s, 4 tests
   [smoker]    [junit4] 
   [smoker]    [junit4] Suite: org.apache.lucene.index.TestSegmentTermEnum
   [smoker]    [junit4] Completed [136/415] on J2 in 0.03s, 2 tests
   [smoker]    [junit4] 
   [smoker]    [junit4] Suite: org.apache.lucene.util.TestSetOnce
   [smoker]    [junit4] Completed [137/415] on J2 in 0.05s, 4 tests
   [smoker]    [junit4] 
   [smoker]    [junit4] Suite: org.apache.lucene.index.TestDocValuesIndexing
   [smoker]    [junit4] Completed [138/415] on J1 in 0.90s, 34 tests
   [smoker]    [junit4] 
   [smoker]    [junit4] Suite: org.apache.lucene.index.TestSegmentTermDocs
   [smoker]    [junit4] Completed [139/415] on J1 in 0.82s, 4 tests
   [smoker]    [junit4] 
   [smoker]    [junit4] Suite: org.apache.lucene.index.TestIndexCommit
   [smoker]    [junit4] Completed [140/415] on J1 in 0.04s, 1 test
   [smoker]    [junit4] 
   [smoker]    [junit4] Suite: org.apache.lucene.search.spans.TestSpanExplanations
   [smoker]    [junit4] Completed [141/415] on J2 in 2.19s, 30 tests
   [smoker]    [junit4] 
   [smoker]    [junit4] Suite: org.apache.lucene.search.TestMultiValuedNumericRangeQuery
   [smoker]    [junit4] Completed [142/415] on J2 in 1.92s, 1 test
   [smoker]    [junit4] 
   [smoker]    [junit4] Suite: org.apache.lucene.util.automaton.FiniteStringsIteratorTest
   [smoker]    [junit4] Completed [143/415] on J1 in 2.71s, 7 tests
   [smoker]    [junit4] 
   [smoker]    [junit4] Suite: org.apache.lucene.search.TestMultiTermQueryRewrites
   [smoker]    [junit4] Completed [144/415] on J1 in 0.15s, 3 tests
   [smoker]    [junit4] 
   [smoker]    [junit4] Suite: org.apache.lucene.search.spans.TestSpanContainQuery
   [smoker]    [junit4] Completed [145/415] on J2 in 0.23s, 4 tests
   [smoker]    [junit4] 
   [smoker]    [junit4] Suite: org.apache.lucene.search.TestFuzzyQuery
   [smoker]    [junit4] Completed [146/415] on J2 in 0.32s, 10 tests
   [smoker]    [junit4] 
   [smoker]    [junit4] Suite: org.apache.lucene.search.TestSearcherManager
   [smoker]    [junit4] Completed [147/415] on J0 in 6.33s, 10 tests
   [smoker]    [junit4] 
   [smoker]    [junit4] Suite: org.apache.lucene.index.TestBinaryTerms
   [smoker]    [junit4] Completed [148/415] on J2 in 0.29s, 2 tests
   [smoker]    [junit4] 
   [smoker]    [junit4] Suite: org.apache.lucene.index.TestNorms
   [smoker]    [junit4] IGNOR/A 0.00s J2 | TestNorms.testMaxByteNorms
   [smoker]    [junit4]    > Assumption #1: 'slow' test group is disabled (@Slow())
   [smoker]    [junit4] IGNOR/A 0.00s J2 | TestNorms.testCustomEncoder
   [smoker]    [junit4]    > Assumption #1: 'slow' test group is disabled (@Slow())
   [smoker]    [junit4] Completed [149/415] on J2 in 0.02s, 2 tests, 2 skipped
   [smoker]    [junit4] 
   [smoker]    [junit4] Suite: org.apache.lucene.search.similarities.TestSimilarity2
   [smoker]    [junit4] Completed [150/415] on J0 in 0.66s, 7 tests
   [smoker]    [junit4] 
   [smoker]    [junit4] Suite: org.apache.lucene.search.spans.TestSpanBoostQuery
   [smoker]    [junit4] Completed [151/415] on J0 in 0.07s, 2 tests
   [smoker]    [junit4] 
   [smoker]    [junit4] Suite: org.apache.lucene.util.automaton.LimitedFiniteStringsIteratorTest
   [smoker]    [junit4] Completed [152/415] on J2 in 0.52s, 6 tests
   [smoker]    [junit4] 
   [smoker]    [junit4] Suite: org.apache.lucene.search.TestIndexSearcher
   [smoker]    [junit4] Completed [153/415] on J2 in 0.46s, 5 tests
   [smoker]    [junit4] 
   [smoker]    [junit4] Suite: org.apache.lucene.index.TestFilterDirectoryReader
   [smoker]    [junit4] Completed [154/415] on J2 in 0.06s, 1 test
   [smoker]    [junit4] 
   [smoker]    [junit4] Suite: org.apache.lucene.index.Test2BSortedDocValuesFixedSorted
   [smoker]    [junit4] IGNOR/A 0.00s J2 | Test2BSortedDocValuesFixedSorted.testFixedSorted
   [smoker]    [junit4]    > Assumption #1: 'monster' test group is disabled (@Monster(value=Takes ~ 6 hours if the heap is 5gb))
   [smoker]    [junit4] Completed [155/415] on J2 in 0.02s, 1 test, 1 skipped
   [smoker]    [junit4] 
   [smoker]    [junit4] Suite: org.apache.lucene.util.TestRamUsageEstimator
   [smoker]    [junit4] IGNOR/A 0.02s J2 | TestRamUsageEstimator.testPrintValues
   [smoker]    [junit4]    > Assumption #1: Specify -Dtests.verbose=true to print constants of RamUsageEstimator.
   [smoker]    [junit4] Completed [156/415] on J2 in 0.08s, 5 tests, 1 skipped
   [smoker]    [junit4] 
   [smoker]    [junit4] Suite: org.apache.lucene.search.similarities.TestSimilarityBase
   [smoker]    [junit4] Completed [157/415] on J2 in 0.54s, 30 tests
   [smoker]    [junit4] 
   [smoker]    [junit4] Suite: org.apache.lucene.search.TestFieldCacheRewriteMethod
   [smoker]    [junit4] Completed [158/415] on J1 in 4.69s, 2 tests
   [smoker]    [junit4] 
   [smoker]    [junit4] Suite: org.apache.lucene.index.TestPostingsOffsets
   [smoker]    [junit4] Completed [159/415] on J2 in 2.67s, 13 tests
   [smoker]    [junit4] 
   [smoker]    [junit4] Suite: org.apache.lucene.search.spans.TestSpanOrQuery
   [smoker]    [junit4] Completed [160/415] on J2 in 0.08s, 3 tests
   [smoker]    [junit4] 
   [smoker]    [junit4] Suite: org.apache.lucene.search.TestRegexpRandom2
   [smoker]    [junit4] Completed [161/415] on J0 in 5.76s, 1 test
   [smoker]    [junit4] 
   [smoker]    [junit4] Suite: org.apache.lucene.util.TestBytesRefHash
   [smoker]    [junit4] Completed [162/415] on J0 in 1.75s, 8 tests
   [smoker]    [junit4] 
   [smoker]    [junit4] Suite: org.apache.lucene.util.TestFrequencyTrackingRingBuffer
   [smoker]    [junit4] Completed [163/415] on J0 in 0.33s, 2 tests
   [smoker]    [junit4] 
   [smoker]    [junit4] Suite: org.apache.lucene.search.spans.TestNearSpansOrdered
   [smoker]    [junit4] Completed [164/415] on J0 in 0.33s, 18 tests
   [smoker]    [junit4] 
   [smoker]    [junit4] Suite: org.apache.lucene.index.TestBagOfPostings
   [smoker]    [junit4] Completed [165/415] on J2 in 6.50s, 1 test
   [smoker]    [junit4] 
   [smoker]    [junit4] Suite: org.apache.lucene.index.TestMultiDocValues
   [smoker]    [junit4] Completed [166/415] on J2 in 0.95s, 8 tests
   [smoker]    [junit4] 
   [smoker]    [junit4] Suite: org.apache.lucene.index.Test2BPostings
   [smoker]    [junit4] IGNOR/A 0.00s J2 | Test2BPostings.test
   [smoker]    [junit4]    > Assumption #1: 'nightly' test group is disabled (@Nightly())
   [smoker]    [junit4] Completed [167/415] on J2 in 0.01s, 1 test, 1 skipped
   [smoker]    [junit4] 
   [smoker]    [junit4] Suite: org.apache.lucene.index.TestIndexWriter
   [smoker]    [junit4] Completed [168/415] on J0 in 8.04s, 70 tests
   [smoker]    [junit4] 
   [smoker]    [junit4] Suite: org.apache.lucene.index.TestTragicIndexWriterDeadlock
   [smoker]    [junit4] Completed [169/415] on J0 in 0.17s, 1 test
   [smoker]    [junit4] 
   [smoker]    [junit4] Suite: org.apache.lucene.index.TestCustomNorms
   [smoker]    [junit4] Completed [170/415] on J0 in 3.19s, 1 test
   [smoker]    [junit4] 
   [smoker]    [junit4] Suite: org.apache.lucene.util.packed.TestPackedInts
   [smoker]    [junit4] IGNOR/A 0.00s J1 | TestPackedInts.testBlockReaderOverflow
   [smoker]    [junit4]    > Assumption #1: 'nightly' test group is disabled (@Nightly())
   [smoker]    [junit4] Completed [171/415] on J1 in 16.09s, 28 tests, 3 skipped
   [smoker]    [junit4] 
   [smoker]    [junit4] Suite: org.apache.lucene.util.Test2BPagedBytes
   [smoker]    [junit4] IGNOR/A 0.00s J0 | Test2BPagedBytes.test
   [smoker]    [junit4]    > Assumption #1: 'monster' test group is disabled (@Monster(value=You must increase heap to > 2 G to run this))
   [smoker]    [junit4] Completed [172/415] on J0 in 0.01s, 1 test, 1 skipped
   [smoker]    [junit4] 
   [smoker]    [junit4] Suite: org.apache.lucene.util.TestStringHelper
   [smoker]    [junit4] Completed [173/415] on J1 in 0.06s, 7 tests
   [smoker]    [junit4] 
   [smoker]    [junit4] Suite: org.apache.lucene.search.TestEarlyTermination
   [smoker]    [junit4] Completed [174/415] on J0 in 0.12s, 1 test
   [smoker]    [junit4] 
   [smoker]    [junit4] Suite: org.apache.lucene.util.TestUnicodeUtil
   [smoker]    [junit4] Completed [175/415] on J1 in 1.17s, 5 tests
   [smoker]    [junit4] 
   [smoker]    [junit4] Suite: org.apache.lucene.store.TestLockFactory
   [smoker]    [junit4] Completed [176/415] on J1 in 0.07s, 2 tests
   [smoker]    [junit4] 
   [smoker]    [junit4] Suite: org.apache.lucene.util.automaton.TestUTF32ToUTF8
   [smoker]    [junit4] Completed [177/415] on J0 in 5.21s, 6 tests
   [smoker]    [junit4] 
   [smoker]    [junit4] Suite: org.apache.lucene.search.TestControlledRealTimeReopenThread
   [smoker]    [junit4] IGNOR/A 0.00s J1 | TestControlledRealTimeReopenThread.testCRTReopen
   [smoker]    [junit4]    > Assumption #1: 'awaitsfix' test group is disabled (@AwaitsFix(bugUrl=https://issues.apache.org/jira/browse/LUCENE-5737))
   [smoker]    [junit4] Completed [178/415] on J1 in 4.43s, 5 tests, 1 skipped
   [smoker]    [junit4] 
   [smoker]    [junit4] Suite: org.apache.lucene.index.TestPayloads
   [smoker]    [junit4] Completed [179/415] on J1 in 0.34s, 7 tests
   [smoker]    [junit4] 
   [smoker]    [junit4] Suite: org.apache.lucene.store.TestTrackingDirectoryWrapper
   [smoker]    [junit4] IGNOR/A 0.00s J0 | TestTrackingDirectoryWrapper.testFsyncDoesntCreateNewFiles
   [smoker]    [junit4]    > Assumption #1: test only works for FSDirectory subclasses
   [smoker]    [junit4] Completed [180/415] on J0 in 1.13s, 45 tests, 1 skipped
   [smoker]    [junit4] 
   [smoker]    [junit4] Suite: org.apache.lucene.search.TestRegexpRandom
   [smoker]    [junit4] Completed [181/415] on J0 in 0.41s, 1 test
   [smoker]    [junit4] 
   [smoker]    [junit4] Suite: org.apache.lucene.util.TestNumericUtils
   [smoker]    [junit4] Completed [182/415] on J0 in 2.37s, 12 tests
   [smoker]    [junit4] 
   [smoker]    [junit4] Suite: org.apache.lucene.analysis.TestToken
   [smoker]    [junit4] Completed [183/415] on J0 in 0.02s, 5 tests
   [smoker]    [junit4] 
   [smoker]    [junit4] Suite: org.apache.lucene.analysis.TestReusableStringReader
   [smoker]    [junit4] Completed [184/415] on J0 in 0.02s, 1 test
   [smoker]    [junit4] 
   [smoker]    [junit4] Suite: org.apache.lucene.index.TestPerSegmentDeletes
   [smoker]    [junit4] Completed [185/415] on J0 in 0.10s, 1 test
   [smoker]    [junit4] 
   [smoker]    [junit4] Suite: org.apache.lucene.index.TestManyFields
   [smoker]    [junit4] Completed [186/415] on J1 in 9.52s, 3 tests
   [smoker]    [junit4] 
   [smoker]    [junit4] Suite: org.apache.lucene.index.TestIndexWriterReader
   [smoker]    [junit4] IGNOR/A 0.00s J0 | TestIndexWriterReader.testDuringAddIndexes
   [smoker]    [junit4]    > Assumption #1: 'nightly' test group is disabled (@Nightly())
   [smoker]    [junit4] IGNOR/A 0.00s J0 | TestIndexWriterReader.testAddIndexesAndDoDeletesThreads
   [smoker]    [junit4]    > Assumption #1: 'slow' test group is disabled (@Slow())
   [smoker]    [junit4] Completed [187/415] on J0 in 6.38s, 23 tests, 2 skipped
   [smoker]    [junit4] 
   [smoker]    [junit4] Suite: org.apache.lucene.index.TestForceMergeForever
   [smoker]    [junit4] Completed [188/415] on J1 in 0.75s, 1 test
   [smoker]    [junit4] 
   [smoker]    [junit4] Suite: org.apache.lucene.util.fst.TestFSTs
   [smoker]    [junit4] IGNOR/A 0.00s J0 | TestFSTs.testShortestPathsWFSTRandom
   [smoker]    [junit4]    > Assumption #1: 'slow' test group is disabled (@Slow())
   [smoker]    [junit4] IGNOR/A 0.00s J0 | TestFSTs.testShortestPathsWFST
   [smoker]    [junit4]    > Assumption #1: 'slow' test group is disabled (@Slow())
   [smoker]    [junit4] IGNOR/A 0.00s J0 | TestFSTs.testIllegallyModifyRootArc
   [smoker]    [junit4]    > Assumption #1: 'slow' test group is disabled (@Slow())
   [smoker]    [junit4] IGNOR/A 0.00s J0 | TestFSTs.testRandomWords
   [smoker]    [junit4]    > Assumption #1: 'slow' test group is disabled (@Slow())
   [smoker]    [junit4] IGNOR/A 0.00s J0 | TestFSTs.testShortestPathsRandom
   [smoker]    [junit4]    > Assumption #1: 'slow' test group is disabled (@Slow())
   [smoker]    [junit4] IGNOR/A 0.00s J0 | TestFSTs.testRandomTermLookup
   [smoker]    [junit4]    > Assumption #1: 'slow' test group is disabled (@Slow())
   [smoker]    [junit4] IGNOR/A 0.00s J0 | TestFSTs.testLargeOutputsOnArrayArcs
   [smoker]    [junit4]    > Assumption #1: 'slow' test group is disabled (@Slow())
   [smoker]    [junit4] IGNOR/A 0.00s J0 | TestFSTs.testInternalFinalState
   [smoker]    [junit4]    > Assumption #1: 'slow' test group is disabled (@Slow())
   [smoker]    [junit4] IGNOR/A 0.00s J0 | TestFSTs.testRejectNoLimits
   [smoker]    [junit4]    > Assumption #1: 'slow' test group is disabled (@Slow())
   [smoker]    [junit4] IGNOR/A 0.00s J0 | TestFSTs.testShortestPaths
   [smoker]    [junit4]    > Assumption #1: 'slow' test group is disabled (@Slow())
   [smoker]    [junit4] IGNOR/A 0.00s J0 | TestFSTs.testBasicFSA
   [smoker]    [junit4]    > Assumption #1: 'slow' test group is disabled (@Slow())
   [smoker]    [junit4] IGNOR/A 0.00s J0 | TestFSTs.testExpandedCloseToRoot
   [smoker]    [junit4]    > Assumption #1: 'slow' test group is disabled (@Slow())
   [smoker]    [junit4] IGNOR/A 0.00s J0 | TestFSTs.testSingleString
   [smoker]    [junit4]    > Assumption #1: 'slow' test group is disabled (@Slow())
   [smoker]    [junit4] IGNOR/A 0.00s J0 | TestFSTs.testBigSet
   [smoker]    [junit4]    > Assumption #1: 'slow' test group is disabled (@Slow())
   [smoker]    [junit4] IGNOR/A 0.00s J0 | TestFSTs.testPrimaryKeys
   [smoker]    [junit4]    > Assumption #1: 'slow' test group is disabled (@Slow())
   [smoker]    [junit4] IGNOR/A 0.00s J0 | TestFSTs.testFinalOutputOnEndState
   [smoker]    [junit4]    > Assumption #1: 'slow' test group is disabled (@Slow())
   [smoker]    [junit4] IGNOR/A 0.00s J0 | TestFSTs.testDuplicateFSAString
   [smoker]    [junit4]    > Assumption #1: 'slow' test group is disabled (@Slow())
   [smoker]    [junit4] IGNOR/A 0.01s J0 | TestFSTs.testNonFinalStopNode
   [smoker]    [junit4]    > Assumption #1: 'slow' test group is disabled (@Slow())
   [smoker]    [junit4] IGNOR/A 0.00s J0 | TestFSTs.testRealTerms
   [smoker]    [junit4]    > Assumption #1: 'slow' test group is disabled (@Slow())
   [smoker]    [junit4] IGNOR/A 0.00s J0 | TestFSTs.testSimple
   [smoker]    [junit4]    > Assumption #1: 'slow' test group is disabled (@Slow())
   [smoker]    [junit4] Completed [189/415] on J0 in 0.06s, 20 tests, 20 skipped
   [smoker]    [junit4] 
   [smoker]    [junit4] Suite: org.apache.lucene.index.TestStressIndexing2
   [smoker]    [junit4] Completed [190/415] on J1 in 1.72s, 3 tests
   [smoker]    [junit4] 
   [smoker]    [junit4] Suite: org.apache.lucene.search.TestBoolean2
   [smoker]    [junit4] Completed [191/415] on J1 in 5.67s, 11 tests
   [smoker]    [junit4] 
   [smoker]    [junit4] Suite: org.apache.lucene.search.TestNumericRangeQuery64
   [smoker]    [junit4] Completed [192/415] on J0 in 8.24s, 29 tests
   [smoker]    [junit4] 
   [smoker]    [junit4] Suite: org.apache.lucene.search.TestSameScoresWithThreads
   [smoker]    [junit4] Completed [193/415] on J1 in 1.24s, 1 test
   [smoker]    [junit4] 
   [smoker]    [junit4] Suite: org.apache.lucene.search.spans.TestSpanCollection
   [smoker]    [junit4] Completed [194/415] on J1 in 0.04s, 3 tests
   [smoker]    [junit4] 
   [smoker]    [junit4] Suite: org.apache.lucene.search.spans.TestSpanNotQuery
   [smoker]    [junit4] Completed [195/415] on J1 in 0.04s, 3 tests
   [smoker]    [junit4] 
   [smoker]    [junit4] Suite: org.apache.lucene.search.TestReqExclBulkScorer
   [smoker]    [junit4] Completed [196/415] on J1 in 0.04s, 1 test
   [smoker]    [junit4] 
   [smoker]    [junit4] Suite: org.apache.lucene.util.TestInPlaceMergeSorter
   [smoker]    [junit4] Completed [197/415] on J1 in 0.67s, 9 tests
   [smoker]    [junit4] 
   [smoker]    [junit4] Suite: org.apache.lucene.util.TestQueryBuilder
   [smoker]    [junit4] Completed [198/415] on J1 in 0.13s, 20 tests
   [smoker]    [junit4] 
   [smoker]    [junit4] Suite: org.apache.lucene.search.spans.TestSpanExplanationsOfNonMatches
   [smoker]    [junit4] Completed [199/415] on J1 in 0.22s, 30 tests
   [smoker]    [junit4] 
   [smoker]    [junit4] Suite: org.apache.lucene.index.TestFieldsReader
   [smoker]    [junit4] Completed [200/415] on J1 in 0.61s, 2 tests
   [smoker]    [junit4] 
   [smoker]    [junit4] Suite: org.apache.lucene.index.TestTermdocPerf
   [smoker]    [junit4] Completed [201/415] on J1 in 0.06s, 1 test
   [smoker]    [junit4] 
   [smoker]    [junit4] Suite: org.apache.lucene.util.fst.TestBytesStore
   [smoker]    [junit4] Completed [202/415] on J0 in 1.84s, 1 test
   [smoker]    [junit4] 
   [smoker]    [junit4] Suite: org.apache.lucene.index.TestCheckIndex
   [smoker]    [junit4] Completed [203/415] on J1 in 1.31s, 5 tests
   [smoker]    [junit4] 
   [smoker]    [junit4] Suite: org.apache.lucene.util.TestCloseableThreadLocal
   [smoker]    [junit4] Completed [204/415] on J1 in 0.04s, 3 tests
   [smoker]    [junit4] 
   [smoker]    [junit4] Suite: org.apache.lucene.search.TestBoostQuery
   [smoker]    [junit4] Completed [205/415] on J1 in 0.09s, 4 tests
   [smoker]    [junit4] 
   [smoker]    [junit4] Suite: org.apache.lucene.index.TestAddIndexes
   [smoker]    [junit4] Completed [206/415] on J0 in 3.52s, 23 tests
   [smoker]    [junit4] 
   [smoker]    [junit4] Suite: org.apache.lucene.codecs.perfield.TestPerFieldDocValuesFormat
   [smoker]    [junit4] IGNOR/A 0.00s J2 | TestPerFieldDocValuesFormat.testRamBytesUsed
   [smoker]    [junit4]    > Assumption #1: 'slow' test group is disabled (@Slow())
   [smoker]    [junit4] IGNOR/A 0.00s J2 | TestPerFieldDocValuesFormat.testThreads2
   [smoker]    [junit4]    > Assumption #1: 'slow' test group is disabled (@Slow())
   [smoker]    [junit4] IGNOR/A 0.00s J2 | TestPerFieldDocValuesFormat.testThreads3
   [smoker]    [junit4]    > Assumption #1: 'slow' test group is disabled (@Slow())
   [smoker]    [junit4] Completed [207/415] on J2 in 40.49s, 96 tests, 3 skipped
   [smoker]    [junit4] 
   [smoker]    [junit4] Suite: org.apache.lucene.util.packed.TestDirectMonotonic
   [smoker]    [junit4] Completed [208/415] on J1 in 5.32s, 4 tests
   [smoker]    [junit4] 
   [smoker]    [junit4] Suite: org.apache.lucene.util.TestCharsRef
   [smoker]    [junit4] Completed [209/415] on J1 in 0.07s, 5 tests
   [smoker]    [junit4] 
   [smoker]    [junit4] Suite: org.apache.lucene.index.TestDeletionPolicy
   [smoker]    [junit4] Completed [210/415] on J0 in 3.42s, 6 tests
   [smoker]    [junit4] 
   [smoker]    [junit4] Suite: org.apache.lucene.search.TestPrefixRandom
   [smoker]    [junit4] Completed [211/415] on J1 in 2.27s, 1 test
   [smoker]    [junit4] 
   [smoker]    [junit4] Suite: org.apache.lucene.util.TestSloppyMath
   [smoker]    [junit4] Completed [212/415] on J1 in 0.33s, 3 tests
   [smoker]    [junit4] 
   [smoker]    [junit4] Suite: org.apache.lucene.search.spans.TestBasics
   [smoker]    [junit4] Completed [213/415] on J2 in 3.68s, 25 tests
   [smoker]    [junit4] 
   [smoker]    [junit4] Suite: org.apache.lucene.analysis.TestNumericTokenStream
   [smoker]    [junit4] Completed [214/415] on J1 in 0.07s, 5 tests
   [smoker]    [junit4] 
   [smoker]    [junit4] Suite: org.apache.lucene.analysis.TestCharFilter
   [smoker]    [junit4] Completed [215/415] on J1 in 0.06s, 4 tests
   [smoker]    [junit4] 
   [smoker]    [junit4] Suite: org.apache.lucene.index.TestFlushByRamOrCountsPolicy
   [smoker]    [junit4] Completed [216/415] on J0 in 2.63s, 5 tests
   [smoker]    [junit4] 
   [smoker]    [junit4] Suite: org.apache.lucene.index.TestNRTReaderWithThreads
   [smoker]    [junit4] Completed [217/415] on J1 in 1.68s, 1 test
   [smoker]    [junit4] 
   [smoker]    [junit4] Suite: org.apache.lucene.index.TestDuelingCodecs
   [smoker]    [junit4] IGNOR/A 0.00s J1 | TestDuelingCodecs.testEquals
   [smoker]    [junit4]    > Assumption #1: 'slow' test group is disabled (@Slow())
   [smoker]    [junit4] IGNOR/A 0.00s J1 | TestDuelingCodecs.testCrazyReaderEquals
   [smoker]    [junit4]    > Assumption #1: 'slow' test group is disabled (@Slow())
   [smoker]    [junit4] Completed [218/415] on J1 in 0.01s, 2 tests, 2 skipped
   [smoker]    [junit4] 
   [smoker]    [junit4] Suite: org.apache.lucene.search.TestSloppyPhraseQuery
   [smoker]    [junit4] Completed [219/415] on J2 in 2.09s, 9 tests
   [smoker]    [junit4] 
   [smoker]    [junit4] Suite: org.apache.lucene.index.TestPersistentSnapshotDeletionPolicy
   [smoker]    [junit4] Completed [220/415] on J1 in 1.33s, 13 tests
   [smoker]    [junit4] 
   [smoker]    [junit4] Suite: org.apache.lucene.index.TestAtomicUpdate
   [smoker]    [junit4] Completed [221/415] on J2 in 3.16s, 1 test
   [smoker]    [junit4] 
   [smoker]    [junit4] Suite: org.apache.lucene.index.TestIndexWriterDelete
   [smoker]    [junit4] IGNOR/A 0.00s J0 | TestIndexWriterDelete.testApplyDeletesOnFlush
   [smoker]    [junit4]    > Assumption #1: 'nightly' test group is disabled (@Nightly())
   [smoker]    [junit4] Completed [222/415] on J0 in 5.65s, 27 tests, 1 skipped
   [smoker]    [junit4] 
   [smoker]    [junit4] Suite: org.apache.lucene.index.TestStressAdvance
   [smoker]    [junit4] Completed [223/415] on J1 in 2.85s, 1 test
   [smoker]    [junit4] 
   [smoker]    [junit4] Suite: org.apache.lucene.index.TestIndexWriterCommit
   [smoker]    [junit4] IGNOR/A 0.00s J2 | TestIndexWriterCommit.testCommitOnCloseDiskUsage
   [smoker]    [junit4]    > Assumption #1: This test cannot run with Memory codec
   [smoker]    [junit4] Completed [224/415] on J2 in 1.05s, 13 tests, 1 skipped
   [smoker]    [junit4] 
   [smoker]    [junit4] Suite: org.apache.lucene.search.TestSearchAfter
   [smoker]    [junit4] Completed [225/415] on J2 in 1.03s, 1 test
   [smoker]    [junit4] 
   [smoker]    [junit4] Suite: org.apache.lucene.index.TestDirectoryReaderReopen
   [smoker]    [junit4] Completed [226/415] on J0 in 1.61s, 9 tests
   [smoker]    [junit4] 
   [smoker]    [junit4] Suite: org.apache.lucene.search.TestTimeLimitingCollector
   [smoker]    [junit4] Completed [227/415] on J1 in 2.76s, 7 tests
   [smoker]    [junit4] 
   [smoker]    [junit4] Suite: org.apache.lucene.index.TestConcurrentMergeScheduler
   [smoker]    [junit4] Completed [228/415] on J2 in 3.86s, 16 tests
   [smoker]    [junit4] 
   [smoker]    [junit4] Suite: org.apache.lucene.search.TestTopDocsMerge
   [smoker]    [junit4] Completed [229/415] on J2 in 0.93s, 2 tests
   [smoker]    [junit4] 
   [smoker]    [junit4] Suite: org.apache.lucene.index.TestNeverDelete
   [smoker]    [junit4] Completed [230/415] on J1 in 3.31s, 1 test
   [smoker]    [junit4] 
   [smoker]    [junit4] Suite: org.apache.lucene.index.TestStressIndexing
   [smoker]    [junit4] Completed [231/415] on J2 in 2.32s, 1 test
   [smoker]    [junit4] 
   [smoker]    [junit4] Suite: org.apache.lucene.util.automaton.TestMinimize
   [smoker]    [junit4] Completed [232/415] on J1 in 3.00s, 3 tests
   [smoker]    [junit4] 
   [smoker]    [junit4] Suite: org.apache.lucene.index.TestIndexWriterUnicode
   [smoker]    [junit4] Completed [233/415] on J2 in 5.01s, 5 tests
   [smoker]    [junit4] 
   [smoker]    [junit4] Suite: org.apache.lucene.codecs.perfield.TestPerFieldPostingsFormat
   [smoker]    [junit4] IGNOR/A 0.00s J1 | TestPerFieldPostingsFormat.testMergeStability
   [smoker]    [junit4]    > Assumption #1: The MockRandom PF randomizes content on the fly, so we can't check it
   [smoker]    [junit4] IGNOR/A 0.00s J1 | TestPerFieldPostingsFormat.testRamBytesUsed
   [smoker]    [junit4]    > Assumption #1: 'slow' test group is disabled (@Slow())
   [smoker]    [junit4] IGNOR/A 0.01s J1 | TestPerFieldPostingsFormat.testPostingsEnumReuse
   [smoker]    [junit4]    > Assumption #1: The MockRandom PF randomizes content on the fly, so we can't check it
   [smoker]    [junit4] Completed [234/415] on J1 in 5.30s, 30 tests, 3 skipped
   [smoker]    [junit4] 
   [smoker]    [junit4] Suite: org.apache.lucene.util.TestArrayUtil
   [smoker]    [junit4] Completed [235/415] on J2 in 2.34s, 13 tests
   [smoker]    [junit4] 
   [smoker]    [junit4] Suite: org.apache.lucene.util.automaton.TestLevenshteinAutomata
   [smoker]    [junit4] Completed [236/415] on J1 in 1.37s, 4 tests
   [smoker]    [junit4] 
   [smoker]    [junit4] Suite: org.apache.lucene.index.TestDocumentsWriterStallControl
   [smoker]    [junit4] Completed [237/415] on J0 in 15.87s, 3 tests
   [smoker]    [junit4] 
   [smoker]    [junit4] Suite: org.apache.lucene.index.TestConsistentFieldNumbers
   [smoker]    [junit4] Completed [238/415] on J1 in 0.91s, 4 tests
   [smoker]    [junit4] 
   [smoker]    [junit4] Suite: org.apache.lucene.search.TestSimpleExplanations
   [smoker]    [junit4] Completed [239/415] on J1 in 3.96s, 72 tests
   [smoker]    [junit4] 
   [smoker]    [junit4] Suite: org.apache.lucene.index.TestSegmentMerger
   [smoker]    [junit4] Completed [240/415] on J1 in 0.99s, 3 tests
   [smoker]    [junit4] 
   [smoker]    [junit4] Suite: org.apache.lucene.util.TestWeakIdentityMap
   [smoker]    [junit4] Completed [241/415] on J0 in 5.26s, 2 tests
   [smoker]    [junit4] 
   [smoker]    [junit4] Suite: org.apache.lucene.index.TestByteSlices
   [smoker]    [junit4] Completed [242/415] on J2 in 6.25s, 1 test
   [smoker]    [junit4] 
   [smoker]    [junit4] Suite: org.apache.lucene.search.TestPhraseQuery
   [smoker]    [junit4] Completed [243/415] on J1 in 1.76s, 23 tests
   [smoker]    [junit4] 
   [smoker]    [junit4] Suite: org.apache.lucene.index.TestBagOfPositions
   [smoker]    [junit4] Completed [244/415] on J2 in 4.81s, 1 test
   [smoker]    [junit4] 
   [smoker]    [junit4] Suite: org.apache.lucene.util.TestFixedBitSet
   [smoker]    [junit4] Completed [245/415] on J1 in 5.57s, 25 tests
   [smoker]    [junit4] 
   [smoker]    [junit4] Suite: org.apache.lucene.util.TestCollectionUtil
   [smoker]    [junit4] Completed [246/415] on J0 in 7.99s, 4 tests
   [smoker]    [junit4] 
   [smoker]    [junit4] Suite: org.apache.lucene.search.TestComplexExplanations
   [smoker]    [junit4] Completed [247/415] on J2 in 2.90s, 21 tests
   [smoker]    [junit4] 
   [smoker]    [junit4] Suite: org.apache.lucene.index.TestParallelCompositeReader
   [smoker]    [junit4] Completed [248/415] on J1 in 0.79s, 16 tests
   [smoker]    [junit4] 
   [smoker]    [junit4] Suite: org.apache.lucene.index.TestTransactions
   [smoker]    [junit4] Completed [249/415] on J2 in 1.44s, 1 test
   [smoker]    [junit4] 
   [smoker]    [junit4] Suite: org.apache.lucene.search.TestMultiThreadTermVectors
   [smoker]    [junit4] Completed [250/415] on J1 in 2.49s, 1 test
   [smoker]    [junit4] 
   [smoker]    [junit4] Suite: org.apache.lucene.search.TestSort
   [smoker]    [junit4] Completed [251/415] on J1 in 0.35s, 25 tests
   [smoker]    [junit4] 
   [smoker]    [junit4] Suite: org.apache.lucene.codecs.perfield.TestPerFieldPostingsFormat2
   [smoker]    [junit4] Completed [252/415] on J2 in 4.67s, 5 tests
   [smoker]    [junit4] 
   [smoker]    [junit4] Suite: org.apache.lucene.index.TestTermsEnum2
   [smoker]    [junit4] Completed [253/415] on J2 in 0.90s, 4 tests
   [smoker]    [junit4] 
   [smoker]    [junit4] Suite: org.apache.lucene.index.TestIndexWriterOnDiskFull
   [smoker]    [junit4] IGNOR/A 0.00s J2 | TestIndexWriterOnDiskFull.testAddIndexOnDiskFull
   [smoker]    [junit4]    > Assumption #1: This test cannot run with Memory codec
   [smoker]    [junit4] Completed [254/415] on J2 in 0.25s, 4 tests, 1 skipped
   [smoker]    [junit4] 
   [smoker]    [junit4] Suite: org.apache.lucene.index.TestIndexWriterNRTIsCurrent
   [smoker]    [junit4] Completed [255/415] on J0 in 8.48s, 1 test
   [smoker]    [junit4] 
   [smoker]    [junit4] Suite: org.apache.lucene.index.TestTransactionRollback
   [smoker]    [junit4] Completed [256/415] on J0 in 0.30s, 2 tests
   [smoker]    [junit4] 
   [smoker]    [junit4] Suite: org.apache.lucene.index.TestMixedCodecs
   [smoker]    [junit4] Completed [257/415] on J2 in 1.21s, 1 test
   [smoker]    [junit4] 
   [smoker]    [junit4] Suite: org.apache.lucene.index.TestFlex
   [smoker]    [junit4] Completed [258/415] on J0 in 0.10s, 2 tests
   [smoker]    [junit4] 
   [smoker]    [junit4] Suite: org.apache.lucene.store.TestRAMDirectory
   [smoker]    [junit4] IGNOR/A 0.00s J0 | TestRAMDirectory.testFsyncDoesntCreateNewFiles
   [smoker]    [junit4]    > Assumption #1: test only works for FSDirectory subclasses
   [smoker]    [junit4] Completed [259/415] on J0 in 0.57s, 43 tests, 1 skipped
   [smoker]    [junit4] 
   [smoker]    [junit4] Suite: org.apache.lucene.index.TestLazyProxSkipping
   [smoker]    [junit4] Completed [260/415] on J0 in 0.23s, 2 tests
   [smoker]    [junit4] 
   [smoker]    [junit4] Suite: org.apache.lucene.codecs.compressing.TestFastCompressionMode
   [smoker]    [junit4] Completed [261/415] on J2 in 1.08s, 11 tests
   [smoker]    [junit4] 
   [smoker]    [junit4] Suite: org.apache.lucene.index.TestDocsAndPositions
   [smoker]    [junit4] Completed [262/415] on J2 in 0.28s, 6 tests
   [smoker]    [junit4] 
   [smoker]    [junit4] Suite: org.apache.lucene.util.automaton.TestDeterminism
   [smoker]    [junit4] Completed [263/415] on J0 in 0.80s, 2 tests
   [smoker]    [junit4] 
   [smoker]    [junit4] Suite: org.apache.lucene.index.TestTermVectorsWriter
   [smoker]    [junit4] Completed [264/415] on J0 in 0.14s, 15 tests
   [smoker]    [junit4] 
   [smoker]    [junit4] Suite: org.apache.lucene.TestMergeSchedulerExternal
   [smoker]    [junit4] Completed [265/415] on J2 in 0.53s, 2 tests
   [smoker]    [junit4] 
   [smoker]    [junit4] Suite: org.apache.lucene.index.TestOmitPositions
   [smoker]    [junit4] Completed [266/415] on J2 in 0.33s, 4 tests
   [smoker]    [junit4] 
   [smoker]    [junit4] Suite: org.apache.lucene.index.TestCodecs
   [smoker]    [junit4] Completed [267/415] on J0 in 0.50s, 3 tests
   [smoker]    [junit4] 
   [smoker]    [junit4] Suite: org.apache.lucene.store.TestHugeRamFile
   [smoker]    [junit4] Completed [268/415] on J1 in 8.65s, 1 test
   [smoker]    [junit4] 
   [smoker]    [junit4] Suite: org.apache.lucene.index.TestParallelLeafReader
   [smoker]    [junit4] Completed [269/415] on J2 in 0.08s, 7 tests
   [smoker]    [junit4] 
   [smoker]    [junit4] Suite: org.apache.lucene.index.TestStressNRT
   [smoker]    [junit4] Completed [270/415] on J0 in 0.60s, 1 test
   [smoker]    [junit4] 
   [smoker]    [junit4] Suite: org.apache.lucene.search.TestFilteredQuery
   [smoker]    [junit4] Completed [271/415] on J2 in 1.27s, 11 tests
   [smoker]    [junit4] 
   [smoker]    [junit4] Suite: org.apache.lucene.index.TestIndexInput
   [smoker]    [junit4] Completed [272/415] on J1 in 1.52s, 2 tests
   [smoker]    [junit4] 
   [smoker]    [junit4] Suite: org.apache.lucene.search.TestDisjunctionMaxQuery
   [smoker]    [junit4] Completed [273/415] on J2 in 0.85s, 12 tests
   [smoker]    [junit4] 
   [smoker]    [junit4] Suite: org.apache.lucene.search.TestTermRangeQuery
   [smoker]    [junit4] Completed [274/415] on J2 in 0.20s, 7 tests
   [smoker]    [junit4] 
   [smoker]    [junit4] Suite: org.apache.lucene.search.TestSloppyPhraseQuery2
   [smoker]    [junit4] Completed [275/415] on J0 in 2.21s, 9 tests
   [smoker]    [junit4] 
   [smoker]    [junit4] Suite: org.apache.lucene.index.TestMultiFields
   [smoker]    [junit4] Completed [276/415] on J1 in 1.02s, 3 tests
   [smoker]    [junit4] 
   [smoker]    [junit4] Suite: org.apache.lucene.index.TestDocumentWriter
   [smoker]    [junit4] Completed [277/415] on J2 in 0.14s, 6 tests
   [smoker]    [junit4] 
   [smoker]    [junit4] Suite: org.apache.lucene.search.TestLiveFieldValues
   [smoker]    [junit4] Completed [278/415] on J1 in 1.22s, 1 test
   [smoker]    [junit4] 
   [smoker]    [junit4] Suite: org.apache.lucene.index.TestDoc
   [smoker]    [junit4] Completed [279/415] on J1 in 0.30s, 1 test
   [smoker]    [junit4] 
   [smoker]    [junit4] Suite: org.apache.lucene.search.TestWildcard
   [smoker]    [junit4] Completed [280/415] on J1 in 0.12s, 8 tests
   [smoker]    [junit4] 
   [smoker]    [junit4] Suite: org.apache.lucene.search.TestTermRangeFilter
   [smoker]    [junit4] Completed [281/415] on J1 in 1.20s, 3 tests
   [smoker]    [junit4] 
   [smoker]    [junit4] Suite: org.apache.lucene.TestExternalCodecs
   [smoker]    [junit4] Completed [282/415] on J1 in 0.31s, 1 test
   [smoker]    [junit4] 
   [smoker]    [junit4] Suite: org.apache.lucene.search.spans.TestSpanSearchEquivalence
   [smoker]    [junit4] Completed [283/415] on J2 in 3.90s, 33 tests
   [smoker]    [junit4] 
   [smoker]    [junit4] Suite: org.apache.lucene.index.TestNoDeletionPolicy
   [smoker]    [junit4] Completed [284/415] on J1 in 0.09s, 4 tests
   [smoker]    [junit4] 
   [smoker]    [junit4] Suite: org.apache.lucene.search.TestSimpleExplanationsOfNonMatches
   [smoker]    [junit4] Completed [285/415] on J2 in 0.20s, 72 tests
   [smoker]    [junit4] 
   [smoker]    [junit4] Suite: org.apache.lucene.search.TestRegexpQuery
   [smoker]    [junit4] Completed [286/415] on J1 in 0.07s, 7 tests
   [smoker]    [junit4] 
   [smoker]    [junit4] Suite: org.apache.lucene.search.spans.TestSpansAdvanced2
   [smoker]    [junit4] Completed [287/415] on J2 in 0.24s, 4 tests
   [smoker]    [junit4] 
   [smoker]    [junit4] Suite: org.apache.lucene.search.TestTopDocsCollector
   [smoker]    [junit4] Completed [288/415] on J2 in 0.12s, 8 tests
   [smoker]    [junit4] 
   [smoker]    [junit4] Suite: org.apache.lucene.search.TestPrefixInBooleanQuery
   [smoker]    [junit4] Completed [289/415] on J1 in 0.76s, 4 tests
   [smoker]    [junit4] 
   [smoker]    [junit4] Suite: org.apache.lucene.search.TestBooleanQuery
   [smoker]    [junit4] Completed [290/415] on J2 in 0.35s, 25 tests
   [smoker]    [junit4] 
   [smoker]    [junit4] Suite: org.apache.lucene.search.TestComplexExplanationsOfNonMatches
   [smoker]    [junit4] Completed [291/415] on J1 in 0.11s, 21 tests
   [smoker]    [junit4] 
   [smoker]    [junit4] Suite: org.apache.lucene.index.TestAllFilesHaveCodecHeader
   [smoker]    [junit4] Completed [292/415] on J1 in 0.20s, 1 test
   [smoker]    [junit4] 
   [smoker]    [junit4] Suite: org.apache.lucene.search.TestSortRandom
   [smoker]    [junit4] Completed [293/415] on J2 in 0.68s, 2 tests
   [smoker]    [junit4] 
   [smoker]    [junit4] Suite: org.apache.lucene.document.TestDocument
   [smoker]    [junit4] Completed [294/415] on J2 in 0.13s, 11 tests
   [smoker]    [junit4] 
   [smoker]    [junit4] Suite: org.apache.lucene.search.TestTermScorer
   [smoker]    [junit4] Completed [295/415] on J2 in 0.13s, 4 tests
   [smoker]    [junit4] 
   [smoker]    [junit4] Suite: org.apache.lucene.index.TestIndexableField
   [smoker]    [junit4] Completed [296/415] on J2 in 1.20s, 2 tests
   [smoker]    [junit4] 
   [smoker]    [junit4] Suite: org.apache.lucene.util.TestSentinelIntSet
   [smoker]    [junit4] Completed [297/415] on J2 in 0.22s, 2 tests
   [smoker]    [junit4] 
   [smoker]    [junit4] Suite: org.apache.lucene.search.TestAutomatonQuery
   [smoker]    [junit4] Completed [298/415] on J1 in 2.26s, 8 tests
   [smoker]    [junit4] 
   [smoker]    [junit4] Suite: org.apache.lucene.search.TestWildcardRandom
   [smoker]    [junit4] Completed [299/415] on J2 in 0.17s, 1 test
   [smoker]    [junit4] 
   [smoker]    [junit4] Suite: org.apache.lucene.store.TestDirectory
   [smoker]    [junit4] Completed [300/415] on J1 in 0.66s, 3 tests
   [smoker]    [junit4] 
   [smoker]    [junit4] Suite: org.apache.lucene.search.TestCachingWrapperFilter
   [smoker]    [junit4] Completed [301/415] on J2 in 0.68s, 11 tests
   [smoker]    [junit4] 
   [smoker]    [junit4] Suite: org.apache.lucene.search.TestFieldValueFilter
   [smoker]    [junit4] Completed [302/415] on J1 in 0.05s, 3 tests
   [smoker]    [junit4] 
   [smoker]    [junit4] Suite: org.apache.lucene.search.TestScorerPerf
   [smoker]    [junit4] Completed [303/415] on J0 in 9.48s, 1 test
   [smoker]    [junit4] 
   [smoker]    [junit4] Suite: org.apache.lucene.search.spans.TestSpanMultiTermQueryWrapper
   [smoker]    [junit4] Completed [304/415] on J2 in 0.08s, 8 tests
   [smoker]    [junit4] 
   [smoker]    [junit4] Suite: org.apache.lucene.TestSearchForDuplicates
   [smoker]    [junit4] Completed [305/415] on J1 in 0.10s, 1 test
   [smoker]    [junit4] 
   [smoker]    [junit4] Suite: org.apache.lucene.index.TestSizeBoundedForceMerge
   [smoker]    [junit4] Completed [306/415] on J0 in 0.10s, 11 tests
   [smoker]    [junit4] 
   [smoker]    [junit4] Suite: org.apache.lucene.util.automaton.TestCompiledAutomaton
   [smoker]    [junit4] Completed [307/415] on J2 in 0.14s, 6 tests
   [smoker]    [junit4] 
   [smoker]    [junit4] Suite: org.apache.lucene.search.TestMatchAllDocsQuery
   [smoker]    [junit4] Completed [308/415] on J1 in 0.02s, 2 tests
   [smoker]    [junit4] 
   [smoker]    [junit4] Suite: org.apache.lucene.index.TestParallelTermEnum
   [smoker]    [junit4] Completed [309/415] on J2 in 0.02s, 1 test
   [smoker]    [junit4] 
   [smoker]    [junit4] Suite: org.apache.lucene.search.TestFilteredSearch
   [smoker]    [junit4] Completed [310/415] on J1 in 0.05s, 1 test
   [smoker]    [junit4] 
   [smoker]    [junit4] Suite: org.apache.lucene.search.TestSubScorerFreqs
   [smoker]    [junit4] Completed [311/415] on J2 in 0.05s, 3 tests
   [smoker]    [junit4] 
   [smoker]    [junit4] Suite: org.apache.lucene.index.TestIndexWriterConfig
   [smoker]    [junit4] Completed [312/415] on J1 in 0.05s, 8 tests
   [smoker]    [junit4] 
   [smoker]    [junit4] Suite: org.apache.lucene.search.TestPositionIncrement
   [smoker]    [junit4] Completed [313/415] on J2 in 0.03s, 2 tests
   [smoker]    [junit4] 
   [smoker]    [junit4] Suite: org.apache.lucene.search.TestDateSort
   [smoker]    [junit4] Completed [314/415] on J1 in 0.02s, 1 test
   [smoker]    [junit4] 
   [smoker]    [junit4] Suite: org.apache.lucene.search.TestSimilarity
   [smoker]    [junit4] Completed [315/415] on J2 in 0.02s, 1 test
   [smoker]    [junit4] 
   [smoker]    [junit4] Suite: org.apache.lucene.util.TestVirtualMethod
   [smoker]    [junit4] Completed [316/415] on J1 in 0.02s, 2 tests
   [smoker]    [junit4] 
   [smoker]    [junit4] Suite: org.apache.lucene.util.TestSmallFloat
   [smoker]    [junit4] Completed [317/415] on J2 in 0.09s, 2 tests
   [smoker]    [junit4] 
   [smoker]    [junit4] Suite: org.apache.lucene.search.TestSimilarityProvider
   [smoker]    [junit4] Completed [318/415] on J1 in 0.02s, 1 test
   [smoker]    [junit4] 
   [smoker]    [junit4] Suite: org.apache.lucene.index.TestFilterLeafReader
   [smoker]    [junit4] Completed [319/415] on J2 in 0.05s, 3 tests
   [smoker]    [junit4] 
   [smoker]    [junit4] Suite: org.apache.lucene.index.TestDocCount
   [smoker]    [junit4] Completed [320/415] on J1 in 0.07s, 1 test
   [smoker]    [junit4] 
   [smoker]    [junit4] Suite: org.apache.lucene.document.TestBinaryDocument
   [smoker]    [junit4] Completed [321/415] on J2 in 0.02s, 2 tests
   [smoker]    [junit4] 
   [smoker]    [junit4] Suite: org.apache.lucene.search.TestAutomatonQueryUnicode
   [smoker]    [junit4] Completed [322/415] on J1 in 0.02s, 1 test
   [smoker]    [junit4] 
   [smoker]    [junit4] Suite: org.apache.lucene.util.TestAttributeSource
   [smoker]    [junit4] Completed [323/415] on J2 in 0.02s, 7 tests
   [smoker]    [junit4] 
   [smoker]    [junit4] Suite: org.apache.lucene.search.TestTotalHitCountCollector
   [smoker]    [junit4] Completed [324/415] on J1 in 0.01s, 1 test
   [smoker]    [junit4] 
   [smoker]    [junit4] Suite: org.apache.lucene.util.TestRecyclingByteBlockAllocator
   [smoker]    [junit4] Completed [325/415] on J2 in 0.03s, 3 tests
   [smoker]    [junit4] 
   [smoker]    [junit4] Suite: org.apache.lucene.search.spans.TestSpanFirstQuery
   [smoker]    [junit4] Completed [326/415] on J2 in 0.02s, 1 test
   [smoker]    [junit4] 
   [smoker]    [junit4] Suite: org.apache.lucene.index.TestIsCurrent
   [smoker]    [junit4] Completed [327/415] on J2 in 0.02s, 2 tests
   [smoker]    [junit4] 
   [smoker]    [junit4] Suite: org.apache.lucene.util.TestNamedSPILoader
   [smoker]    [junit4] Completed [328/415] on J2 in 0.01s, 3 tests
   [smoker]    [junit4] 
   [smoker]    [junit4] Suite: org.apache.lucene.index.TestIndexWriterLockRelease
   [smoker]    [junit4] Completed [329/415] on J2 in 0.01s, 1 test
   [smoker]    [junit4] 
   [smoker]    [junit4] Suite: org.apache.lucene.search.TestPrefixQuery
   [smoker]    [junit4] Completed [330/415] on J0 in 3.44s, 3 tests
   [smoker]    [junit4] 
   [smoker]    [junit4] Suite: org.apache.lucene.util.TestByteBlockPool
   [smoker]    [junit4] Completed [331/415] on J2 in 0.03s, 1 test
   [smoker]    [junit4] 
   [smoker]    [junit4] Suite: org.apache.lucene.util.TestBytesRef
   [smoker]    [junit4] Completed [332/415] on J0 in 0.01s, 3 tests
   [smoker]    [junit4] 
   [smoker]    [junit4] Suite: org.apache.lucene.TestDemo
   [smoker]    [junit4] Completed [333/415] on J2 in 0.02s, 1 test
   [smoker]    [junit4] 
   [smoker]    [junit4] Suite: org.apache.lucene.index.TestTwoPhaseCommitTool
   [smoker]    [junit4] Completed [334/415] on J0 in 0.02s, 3 tests
   [smoker]    [junit4] 
   [smoker]    [junit4] Suite: org.apache.lucene.index.TestIndexWriterOnJRECrash
   [smoker]    [junit4] IGNOR/A 0.00s J2 | TestIndexWriterOnJRECrash.testNRTThreads
   [smoker]    [junit4]    > Assumption #1: 'nightly' test group is disabled (@Nightly())
   [smoker]    [junit4] Completed [335/415] on J2 in 0.00s, 1 test, 1 skipped
   [smoker]    [junit4] 
   [smoker]    [junit4] Suite: org.apache.lucene.search.TestPrefixFilter
   [smoker]    [junit4] Completed [336/415] on J0 in 0.02s, 1 test
   [smoker]    [junit4] 
   [smoker]    [junit4] Suite: org.apache.lucene.util.TestVersion
   [smoker]    [junit4] Completed [337/415] on J2 in 0.04s, 11 tests
   [smoker]    [junit4] 
   [smoker]    [junit4] Suite: org.apache.lucene.index.Test4GBStoredFields
   [smoker]    [junit4] IGNOR/A 0.00s J0 | Test4GBStoredFields.test
   [smoker]    [junit4]    > Assumption #1: 'nightly' test group is disabled (@Nightly())
   [smoker]    [junit4] Completed [338/415] on J0 in 0.00s, 1 test, 1 skipped
   [smoker]    [junit4] 
   [smoker]    [junit4] Suite: org.apache.lucene.index.TestReaderClosed
   [smoker]    [junit4] Completed [339/415] on J2 in 0.02s, 2 tests
   [smoker]    [junit4] 
   [smoker]    [junit4] Suite: org.apache.lucene.search.TestNGramPhraseQuery
   [smoker]    [junit4] Completed [340/415] on J0 in 0.01s, 1 test
   [smoker]    [junit4] 
   [smoker]    [junit4] Suite: org.apache.lucene.index.Test2BPositions
   [smoker]    [junit4] IGNOR/A 0.00s J2 | Test2BPositions.test
   [smoker]    [junit4]    > Assumption #1: 'monster' test group is disabled (@Monster(value=uses lots of space and takes a few minutes))
   [smoker]    [junit4] Completed [341/415] on J2 in 0.00s, 1 test, 1 skipped
   

[...truncated too long message...]

smoker]    [junit4] Suite: org.apache.lucene.codecs.lucene40.TestLucene40FieldInfoFormat
   [smoker]    [junit4] Completed [25/30 (1!)] on J2 in 0.88s, 11 tests
   [smoker]    [junit4] 
   [smoker]    [junit4] Suite: org.apache.lucene.codecs.lucene46.TestLucene46SegmentInfoFormat
   [smoker]    [junit4] Completed [26/30 (1!)] on J2 in 1.22s, 15 tests
   [smoker]    [junit4] 
   [smoker]    [junit4] Suite: org.apache.lucene.codecs.lucene45.TestLucene45DocValuesFormat
   [smoker]    [junit4] IGNOR/A 0.00s J1 | TestLucene45DocValuesFormat.testSortedNumericsSingleValuedMissingVsStoredFields
   [smoker]    [junit4]    > Assumption #1: Codec does not support SORTED_NUMERIC
   [smoker]    [junit4] IGNOR/A 0.00s J1 | TestLucene45DocValuesFormat.testTwoSortedNumber
   [smoker]    [junit4]    > Assumption #1: Codec does not support SORTED_NUMERIC
   [smoker]    [junit4] IGNOR/A 0.01s J1 | TestLucene45DocValuesFormat.testSortedNumericsFewUniqueSetsVsStoredFields
   [smoker]    [junit4]    > Assumption #1: Codec does not support SORTED_NUMERIC
   [smoker]    [junit4] IGNOR/A 0.00s J1 | TestLucene45DocValuesFormat.testThreads2
   [smoker]    [junit4]    > Assumption #1: 'slow' test group is disabled (@Slow())
   [smoker]    [junit4] IGNOR/A 0.00s J1 | TestLucene45DocValuesFormat.testSortedNumericMergeAwayAllValuesLargeSegment
   [smoker]    [junit4]    > Assumption #1: Codec does not support SORTED_NUMERIC
   [smoker]    [junit4] IGNOR/A 0.01s J1 | TestLucene45DocValuesFormat.testTwoSortedNumberOneMissing
   [smoker]    [junit4]    > Assumption #1: Codec does not support SORTED_NUMERIC
   [smoker]    [junit4] IGNOR/A 0.00s J1 | TestLucene45DocValuesFormat.testThreads3
   [smoker]    [junit4]    > Assumption #1: 'slow' test group is disabled (@Slow())
   [smoker]    [junit4] IGNOR/A 0.00s J1 | TestLucene45DocValuesFormat.testOneSortedNumber
   [smoker]    [junit4]    > Assumption #1: Codec does not support SORTED_NUMERIC
   [smoker]    [junit4] IGNOR/A 0.02s J1 | TestLucene45DocValuesFormat.testSortedNumberMergeAwayAllValues
   [smoker]    [junit4]    > Assumption #1: Codec does not support SORTED_NUMERIC
   [smoker]    [junit4] IGNOR/A 0.00s J1 | TestLucene45DocValuesFormat.testRamBytesUsed
   [smoker]    [junit4]    > Assumption #1: 'slow' test group is disabled (@Slow())
   [smoker]    [junit4] IGNOR/A 0.00s J1 | TestLucene45DocValuesFormat.testOneSortedNumberOneMissing
   [smoker]    [junit4]    > Assumption #1: Codec does not support SORTED_NUMERIC
   [smoker]    [junit4] IGNOR/A 0.00s J1 | TestLucene45DocValuesFormat.testTwoSortedNumberSameValue
   [smoker]    [junit4]    > Assumption #1: Codec does not support SORTED_NUMERIC
   [smoker]    [junit4] IGNOR/A 0.00s J1 | TestLucene45DocValuesFormat.testSortedNumericsSingleValuedVsStoredFields
   [smoker]    [junit4]    > Assumption #1: Codec does not support SORTED_NUMERIC
   [smoker]    [junit4] IGNOR/A 0.01s J1 | TestLucene45DocValuesFormat.testSortedNumericsMultipleValuesVsStoredFields
   [smoker]    [junit4]    > Assumption #1: Codec does not support SORTED_NUMERIC
   [smoker]    [junit4] IGNOR/A 0.00s J1 | TestLucene45DocValuesFormat.testSortedNumberMerge
   [smoker]    [junit4]    > Assumption #1: Codec does not support SORTED_NUMERIC
   [smoker]    [junit4] Completed [27/30 (1!)] on J1 in 23.21s, 98 tests, 15 skipped
   [smoker]    [junit4] 
   [smoker]    [junit4] Suite: org.apache.lucene.index.TestDocValuesUpdatesOnOldSegments
   [smoker]    [junit4] Completed [28/30 (1!)] on J1 in 0.21s, 2 tests
   [smoker]    [junit4] 
   [smoker]    [junit4] Suite: org.apache.lucene.codecs.lucene49.TestLucene49DocValuesFormat
   [smoker]    [junit4] IGNOR/A 0.00s J2 | TestLucene49DocValuesFormat.testThreads2
   [smoker]    [junit4]    > Assumption #1: 'slow' test group is disabled (@Slow())
   [smoker]    [junit4] IGNOR/A 0.00s J2 | TestLucene49DocValuesFormat.testThreads3
   [smoker]    [junit4]    > Assumption #1: 'slow' test group is disabled (@Slow())
   [smoker]    [junit4] IGNOR/A 0.00s J2 | TestLucene49DocValuesFormat.testRamBytesUsed
   [smoker]    [junit4]    > Assumption #1: 'slow' test group is disabled (@Slow())
   [smoker]    [junit4] Completed [29/30 (1!)] on J2 in 26.32s, 98 tests, 3 skipped
   [smoker]    [junit4] 
   [smoker]    [junit4] Suite: org.apache.lucene.codecs.lucene410.TestLucene410DocValuesFormat
   [smoker]    [junit4] IGNOR/A 0.00s J0 | TestLucene410DocValuesFormat.testTermsEnumRandomMany
   [smoker]    [junit4]    > Assumption #1: 'nightly' test group is disabled (@Nightly())
   [smoker]    [junit4] IGNOR/A 0.00s J0 | TestLucene410DocValuesFormat.testRamBytesUsed
   [smoker]    [junit4]    > Assumption #1: 'slow' test group is disabled (@Slow())
   [smoker]    [junit4] IGNOR/A 0.00s J0 | TestLucene410DocValuesFormat.testThreads2
   [smoker]    [junit4]    > Assumption #1: 'slow' test group is disabled (@Slow())
   [smoker]    [junit4] IGNOR/A 0.00s J0 | TestLucene410DocValuesFormat.testThreads3
   [smoker]    [junit4]    > Assumption #1: 'slow' test group is disabled (@Slow())
   [smoker]    [junit4] IGNOR/A 0.00s J0 | TestLucene410DocValuesFormat.testSortedSetVariableLengthManyVsStoredFields
   [smoker]    [junit4]    > Assumption #1: 'nightly' test group is disabled (@Nightly())
   [smoker]    [junit4] IGNOR/A 0.00s J0 | TestLucene410DocValuesFormat.testSortedVariableLengthManyVsStoredFields
   [smoker]    [junit4]    > Assumption #1: 'nightly' test group is disabled (@Nightly())
   [smoker]    [junit4] Completed [30/30 (1!)] on J0 in 65.22s, 105 tests, 6 skipped
   [smoker]    [junit4] 
   [smoker]    [junit4] 
   [smoker]    [junit4] Tests with failures [seed: B1247BE6202DF46D]:
   [smoker]    [junit4]   - org.apache.lucene.index.TestBackwardsCompatibility.testAllVersionsTested
   [smoker]    [junit4] 
   [smoker]    [junit4] 
   [smoker]    [junit4] JVM J0:     0.57 ..   171.71 =   171.14s
   [smoker]    [junit4] JVM J1:     0.57 ..   141.78 =   141.21s
   [smoker]    [junit4] JVM J2:     0.58 ..   149.49 =   148.91s
   [smoker]    [junit4] Execution time total: 2 minutes 51 seconds
   [smoker]    [junit4] Tests summary: 30 suites, 831 tests, 1 failure, 112 ignored (112 assumptions)
   [smoker] 
   [smoker] BUILD FAILED
   [smoker] /x1/jenkins/jenkins-slave/workspace/Lucene-Solr-SmokeRelease-5.x/lucene/build/smokeTestRelease/tmp/unpack/lucene-5.5.0/build.xml:472: The following error occurred while executing this line:
   [smoker] /x1/jenkins/jenkins-slave/workspace/Lucene-Solr-SmokeRelease-5.x/lucene/build/smokeTestRelease/tmp/unpack/lucene-5.5.0/common-build.xml:2240: The following error occurred while executing this line:
   [smoker] /x1/jenkins/jenkins-slave/workspace/Lucene-Solr-SmokeRelease-5.x/lucene/build/smokeTestRelease/tmp/unpack/lucene-5.5.0/module-build.xml:58: The following error occurred while executing this line:
   [smoker] /x1/jenkins/jenkins-slave/workspace/Lucene-Solr-SmokeRelease-5.x/lucene/build/smokeTestRelease/tmp/unpack/lucene-5.5.0/common-build.xml:1444: The following error occurred while executing this line:
   [smoker] /x1/jenkins/jenkins-slave/workspace/Lucene-Solr-SmokeRelease-5.x/lucene/build/smokeTestRelease/tmp/unpack/lucene-5.5.0/common-build.xml:1000: There were test failures: 30 suites, 831 tests, 1 failure, 112 ignored (112 assumptions) [seed: B1247BE6202DF46D]
   [smoker] 
   [smoker] Total time: 14 minutes 18 seconds
   [smoker] 
   [smoker] 
   [smoker] Traceback (most recent call last):
   [smoker]   File "/x1/jenkins/jenkins-slave/workspace/Lucene-Solr-SmokeRelease-5.x/dev-tools/scripts/smokeTestRelease.py", line 1460, in <module>
   [smoker]     main()
   [smoker]   File "/x1/jenkins/jenkins-slave/workspace/Lucene-Solr-SmokeRelease-5.x/dev-tools/scripts/smokeTestRelease.py", line 1405, in main
   [smoker]     smokeTest(c.java, c.url, c.revision, c.version, c.tmp_dir, c.is_signed, ' '.join(c.test_args))
   [smoker]   File "/x1/jenkins/jenkins-slave/workspace/Lucene-Solr-SmokeRelease-5.x/dev-tools/scripts/smokeTestRelease.py", line 1443, in smokeTest
   [smoker]     unpackAndVerify(java, 'lucene', tmpDir, 'lucene-%s-src.tgz' % version, svnRevision, version, testArgs, baseURL)
   [smoker]   File "/x1/jenkins/jenkins-slave/workspace/Lucene-Solr-SmokeRelease-5.x/dev-tools/scripts/smokeTestRelease.py", line 588, in unpackAndVerify
   [smoker]     verifyUnpacked(java, project, artifact, unpackPath, svnRevision, version, testArgs, tmpDir, baseURL)
   [smoker]   File "/x1/jenkins/jenkins-slave/workspace/Lucene-Solr-SmokeRelease-5.x/dev-tools/scripts/smokeTestRelease.py", line 680, in verifyUnpacked
   [smoker]     java.run_java7('ant clean test %s' % testArgs, '%s/test.log' % unpackPath)
   [smoker]   File "/x1/jenkins/jenkins-slave/workspace/Lucene-Solr-SmokeRelease-5.x/dev-tools/scripts/smokeTestRelease.py", line 1231, in run_java
   [smoker]     run('%s; %s' % (cmd_prefix, cmd), logfile)
   [smoker]   File "/x1/jenkins/jenkins-slave/workspace/Lucene-Solr-SmokeRelease-5.x/dev-tools/scripts/smokeTestRelease.py", line 513, in run
   [smoker]     raise RuntimeError('command "%s" failed; see log file %s' % (command, logPath))
   [smoker] RuntimeError: command "export JAVA_HOME="/home/jenkins/jenkins-slave/tools/hudson.model.JDK/latest1.7" PATH="/home/jenkins/jenkins-slave/tools/hudson.model.JDK/latest1.7/bin:$PATH" JAVACMD="/home/jenkins/jenkins-slave/tools/hudson.model.JDK/latest1.7/bin/java"; ant clean test -Dtests.slow=false" failed; see log file /x1/jenkins/jenkins-slave/workspace/Lucene-Solr-SmokeRelease-5.x/lucene/build/smokeTestRelease/tmp/unpack/lucene-5.5.0/test.log

BUILD FAILED
/x1/jenkins/jenkins-slave/workspace/Lucene-Solr-SmokeRelease-5.x/build.xml:545: exec returned: 1

Total time: 29 minutes 9 seconds
Build step 'Invoke Ant' marked build as failure
Email was triggered for: Failure - Any
Sending email for trigger: Failure - Any
Setting LATEST1_8_HOME=/home/jenkins/jenkins-slave/tools/hudson.model.JDK/latest1.8
Setting LATEST1_8_HOME=/home/jenkins/jenkins-slave/tools/hudson.model.JDK/latest1.8



Mime
View raw message