lucene-dev mailing list archives

Site index · List index
Message view « Date » · « Thread »
Top « Date » · « Thread »
From Policeman Jenkins Server <jenk...@thetaphi.de>
Subject [JENKINS] Lucene-Solr-trunk-MacOSX (64bit/jdk1.8.0) - Build # 3027 - Failure!
Date Tue, 19 Jan 2016 07:01:16 GMT
Build: http://jenkins.thetaphi.de/job/Lucene-Solr-trunk-MacOSX/3027/
Java: 64bit/jdk1.8.0 -XX:-UseCompressedOops -XX:+UseConcMarkSweepGC

2 tests failed.
FAILED:  org.apache.solr.cloud.CloudExitableDirectoryReaderTest.test

Error Message:
No live SolrServers available to handle this request

Stack Trace:
org.apache.solr.client.solrj.SolrServerException: No live SolrServers available to handle this request
	at __randomizedtesting.SeedInfo.seed([37B2AB63772961A3:BFE694B9D9D50C5B]:0)
	at org.apache.solr.client.solrj.impl.LBHttpSolrClient.request(LBHttpSolrClient.java:350)
	at org.apache.solr.client.solrj.impl.CloudSolrClient.sendRequest(CloudSolrClient.java:1100)
	at org.apache.solr.client.solrj.impl.CloudSolrClient.requestWithRetryOnStaleState(CloudSolrClient.java:871)
	at org.apache.solr.client.solrj.impl.CloudSolrClient.request(CloudSolrClient.java:807)
	at org.apache.solr.client.solrj.SolrRequest.process(SolrRequest.java:150)
	at org.apache.solr.client.solrj.SolrClient.query(SolrClient.java:943)
	at org.apache.solr.client.solrj.SolrClient.query(SolrClient.java:958)
	at org.apache.solr.cloud.AbstractFullDistribZkTestBase.queryServer(AbstractFullDistribZkTestBase.java:1398)
	at org.apache.solr.cloud.CloudExitableDirectoryReaderTest.assertPartialResults(CloudExitableDirectoryReaderTest.java:101)
	at org.apache.solr.cloud.CloudExitableDirectoryReaderTest.doTimeoutTests(CloudExitableDirectoryReaderTest.java:73)
	at org.apache.solr.cloud.CloudExitableDirectoryReaderTest.test(CloudExitableDirectoryReaderTest.java:52)
	at sun.reflect.NativeMethodAccessorImpl.invoke0(Native Method)
	at sun.reflect.NativeMethodAccessorImpl.invoke(NativeMethodAccessorImpl.java:62)
	at sun.reflect.DelegatingMethodAccessorImpl.invoke(DelegatingMethodAccessorImpl.java:43)
	at java.lang.reflect.Method.invoke(Method.java:497)
	at com.carrotsearch.randomizedtesting.RandomizedRunner.invoke(RandomizedRunner.java:1764)
	at com.carrotsearch.randomizedtesting.RandomizedRunner$8.evaluate(RandomizedRunner.java:871)
	at com.carrotsearch.randomizedtesting.RandomizedRunner$9.evaluate(RandomizedRunner.java:907)
	at com.carrotsearch.randomizedtesting.RandomizedRunner$10.evaluate(RandomizedRunner.java:921)
	at org.apache.solr.BaseDistributedSearchTestCase$ShardsRepeatRule$ShardsFixedStatement.callStatement(BaseDistributedSearchTestCase.java:965)
	at org.apache.solr.BaseDistributedSearchTestCase$ShardsRepeatRule$ShardsStatement.evaluate(BaseDistributedSearchTestCase.java:940)
	at com.carrotsearch.randomizedtesting.rules.SystemPropertiesRestoreRule$1.evaluate(SystemPropertiesRestoreRule.java:57)
	at org.apache.lucene.util.TestRuleSetupTeardownChained$1.evaluate(TestRuleSetupTeardownChained.java:50)
	at org.apache.lucene.util.AbstractBeforeAfterRule$1.evaluate(AbstractBeforeAfterRule.java:46)
	at org.apache.lucene.util.TestRuleThreadAndTestName$1.evaluate(TestRuleThreadAndTestName.java:49)
	at org.apache.lucene.util.TestRuleIgnoreAfterMaxFailures$1.evaluate(TestRuleIgnoreAfterMaxFailures.java:65)
	at org.apache.lucene.util.TestRuleMarkFailure$1.evaluate(TestRuleMarkFailure.java:48)
	at com.carrotsearch.randomizedtesting.rules.StatementAdapter.evaluate(StatementAdapter.java:36)
	at com.carrotsearch.randomizedtesting.ThreadLeakControl$StatementRunner.run(ThreadLeakControl.java:367)
	at com.carrotsearch.randomizedtesting.ThreadLeakControl.forkTimeoutingTask(ThreadLeakControl.java:809)
	at com.carrotsearch.randomizedtesting.ThreadLeakControl$3.evaluate(ThreadLeakControl.java:460)
	at com.carrotsearch.randomizedtesting.RandomizedRunner.runSingleTest(RandomizedRunner.java:880)
	at com.carrotsearch.randomizedtesting.RandomizedRunner$5.evaluate(RandomizedRunner.java:781)
	at com.carrotsearch.randomizedtesting.RandomizedRunner$6.evaluate(RandomizedRunner.java:816)
	at com.carrotsearch.randomizedtesting.RandomizedRunner$7.evaluate(RandomizedRunner.java:827)
	at com.carrotsearch.randomizedtesting.rules.StatementAdapter.evaluate(StatementAdapter.java:36)
	at com.carrotsearch.randomizedtesting.rules.SystemPropertiesRestoreRule$1.evaluate(SystemPropertiesRestoreRule.java:57)
	at org.apache.lucene.util.AbstractBeforeAfterRule$1.evaluate(AbstractBeforeAfterRule.java:46)
	at com.carrotsearch.randomizedtesting.rules.StatementAdapter.evaluate(StatementAdapter.java:36)
	at org.apache.lucene.util.TestRuleStoreClassName$1.evaluate(TestRuleStoreClassName.java:42)
	at com.carrotsearch.randomizedtesting.rules.NoShadowingOrOverridesOnMethodsRule$1.evaluate(NoShadowingOrOverridesOnMethodsRule.java:40)
	at com.carrotsearch.randomizedtesting.rules.NoShadowingOrOverridesOnMethodsRule$1.evaluate(NoShadowingOrOverridesOnMethodsRule.java:40)
	at com.carrotsearch.randomizedtesting.rules.StatementAdapter.evaluate(StatementAdapter.java:36)
	at com.carrotsearch.randomizedtesting.rules.StatementAdapter.evaluate(StatementAdapter.java:36)
	at com.carrotsearch.randomizedtesting.rules.StatementAdapter.evaluate(StatementAdapter.java:36)
	at org.apache.lucene.util.TestRuleAssertionsRequired$1.evaluate(TestRuleAssertionsRequired.java:54)
	at org.apache.lucene.util.TestRuleMarkFailure$1.evaluate(TestRuleMarkFailure.java:48)
	at org.apache.lucene.util.TestRuleIgnoreAfterMaxFailures$1.evaluate(TestRuleIgnoreAfterMaxFailures.java:65)
	at org.apache.lucene.util.TestRuleIgnoreTestSuites$1.evaluate(TestRuleIgnoreTestSuites.java:55)
	at com.carrotsearch.randomizedtesting.rules.StatementAdapter.evaluate(StatementAdapter.java:36)
	at com.carrotsearch.randomizedtesting.ThreadLeakControl$StatementRunner.run(ThreadLeakControl.java:367)
	at java.lang.Thread.run(Thread.java:745)


FAILED:  org.apache.solr.cloud.DistribDocExpirationUpdateProcessorTest.test

Error Message:
There are still nodes recoverying - waited for 45 seconds

Stack Trace:
java.lang.AssertionError: There are still nodes recoverying - waited for 45 seconds
	at __randomizedtesting.SeedInfo.seed([37B2AB63772961A3:BFE694B9D9D50C5B]:0)
	at org.junit.Assert.fail(Assert.java:93)
	at org.apache.solr.cloud.AbstractDistribZkTestBase.waitForRecoveriesToFinish(AbstractDistribZkTestBase.java:175)
	at org.apache.solr.cloud.AbstractFullDistribZkTestBase.waitForRecoveriesToFinish(AbstractFullDistribZkTestBase.java:857)
	at org.apache.solr.cloud.DistribDocExpirationUpdateProcessorTest.test(DistribDocExpirationUpdateProcessorTest.java:73)
	at sun.reflect.NativeMethodAccessorImpl.invoke0(Native Method)
	at sun.reflect.NativeMethodAccessorImpl.invoke(NativeMethodAccessorImpl.java:62)
	at sun.reflect.DelegatingMethodAccessorImpl.invoke(DelegatingMethodAccessorImpl.java:43)
	at java.lang.reflect.Method.invoke(Method.java:497)
	at com.carrotsearch.randomizedtesting.RandomizedRunner.invoke(RandomizedRunner.java:1764)
	at com.carrotsearch.randomizedtesting.RandomizedRunner$8.evaluate(RandomizedRunner.java:871)
	at com.carrotsearch.randomizedtesting.RandomizedRunner$9.evaluate(RandomizedRunner.java:907)
	at com.carrotsearch.randomizedtesting.RandomizedRunner$10.evaluate(RandomizedRunner.java:921)
	at org.apache.solr.BaseDistributedSearchTestCase$ShardsRepeatRule$ShardsFixedStatement.callStatement(BaseDistributedSearchTestCase.java:965)
	at org.apache.solr.BaseDistributedSearchTestCase$ShardsRepeatRule$ShardsStatement.evaluate(BaseDistributedSearchTestCase.java:940)
	at com.carrotsearch.randomizedtesting.rules.SystemPropertiesRestoreRule$1.evaluate(SystemPropertiesRestoreRule.java:57)
	at org.apache.lucene.util.TestRuleSetupTeardownChained$1.evaluate(TestRuleSetupTeardownChained.java:50)
	at org.apache.lucene.util.AbstractBeforeAfterRule$1.evaluate(AbstractBeforeAfterRule.java:46)
	at org.apache.lucene.util.TestRuleThreadAndTestName$1.evaluate(TestRuleThreadAndTestName.java:49)
	at org.apache.lucene.util.TestRuleIgnoreAfterMaxFailures$1.evaluate(TestRuleIgnoreAfterMaxFailures.java:65)
	at org.apache.lucene.util.TestRuleMarkFailure$1.evaluate(TestRuleMarkFailure.java:48)
	at com.carrotsearch.randomizedtesting.rules.StatementAdapter.evaluate(StatementAdapter.java:36)
	at com.carrotsearch.randomizedtesting.ThreadLeakControl$StatementRunner.run(ThreadLeakControl.java:367)
	at com.carrotsearch.randomizedtesting.ThreadLeakControl.forkTimeoutingTask(ThreadLeakControl.java:809)
	at com.carrotsearch.randomizedtesting.ThreadLeakControl$3.evaluate(ThreadLeakControl.java:460)
	at com.carrotsearch.randomizedtesting.RandomizedRunner.runSingleTest(RandomizedRunner.java:880)
	at com.carrotsearch.randomizedtesting.RandomizedRunner$5.evaluate(RandomizedRunner.java:781)
	at com.carrotsearch.randomizedtesting.RandomizedRunner$6.evaluate(RandomizedRunner.java:816)
	at com.carrotsearch.randomizedtesting.RandomizedRunner$7.evaluate(RandomizedRunner.java:827)
	at com.carrotsearch.randomizedtesting.rules.StatementAdapter.evaluate(StatementAdapter.java:36)
	at com.carrotsearch.randomizedtesting.rules.SystemPropertiesRestoreRule$1.evaluate(SystemPropertiesRestoreRule.java:57)
	at org.apache.lucene.util.AbstractBeforeAfterRule$1.evaluate(AbstractBeforeAfterRule.java:46)
	at com.carrotsearch.randomizedtesting.rules.StatementAdapter.evaluate(StatementAdapter.java:36)
	at org.apache.lucene.util.TestRuleStoreClassName$1.evaluate(TestRuleStoreClassName.java:42)
	at com.carrotsearch.randomizedtesting.rules.NoShadowingOrOverridesOnMethodsRule$1.evaluate(NoShadowingOrOverridesOnMethodsRule.java:40)
	at com.carrotsearch.randomizedtesting.rules.NoShadowingOrOverridesOnMethodsRule$1.evaluate(NoShadowingOrOverridesOnMethodsRule.java:40)
	at com.carrotsearch.randomizedtesting.rules.StatementAdapter.evaluate(StatementAdapter.java:36)
	at com.carrotsearch.randomizedtesting.rules.StatementAdapter.evaluate(StatementAdapter.java:36)
	at com.carrotsearch.randomizedtesting.rules.StatementAdapter.evaluate(StatementAdapter.java:36)
	at org.apache.lucene.util.TestRuleAssertionsRequired$1.evaluate(TestRuleAssertionsRequired.java:54)
	at org.apache.lucene.util.TestRuleMarkFailure$1.evaluate(TestRuleMarkFailure.java:48)
	at org.apache.lucene.util.TestRuleIgnoreAfterMaxFailures$1.evaluate(TestRuleIgnoreAfterMaxFailures.java:65)
	at org.apache.lucene.util.TestRuleIgnoreTestSuites$1.evaluate(TestRuleIgnoreTestSuites.java:55)
	at com.carrotsearch.randomizedtesting.rules.StatementAdapter.evaluate(StatementAdapter.java:36)
	at com.carrotsearch.randomizedtesting.ThreadLeakControl$StatementRunner.run(ThreadLeakControl.java:367)
	at java.lang.Thread.run(Thread.java:745)




Build Log:
[...truncated 10853 lines...]
   [junit4] Suite: org.apache.solr.cloud.CloudExitableDirectoryReaderTest
   [junit4]   2> Creating dataDir: /Users/jenkins/workspace/Lucene-Solr-trunk-MacOSX/solr/build/solr-core/test/J1/temp/solr.cloud.CloudExitableDirectoryReaderTest_37B2AB63772961A3-001/init-core-data-001
   [junit4]   2> 1934041 INFO  (SUITE-CloudExitableDirectoryReaderTest-seed#[37B2AB63772961A3]-worker) [    ] o.a.s.SolrTestCaseJ4 Randomized ssl (false) and clientAuth (false)
   [junit4]   2> 1934042 INFO  (SUITE-CloudExitableDirectoryReaderTest-seed#[37B2AB63772961A3]-worker) [    ] o.a.s.BaseDistributedSearchTestCase Setting hostContext system property: /n_vee/
   [junit4]   2> 1934044 INFO  (TEST-CloudExitableDirectoryReaderTest.test-seed#[37B2AB63772961A3]) [    ] o.a.s.c.ZkTestServer STARTING ZK TEST SERVER
   [junit4]   2> 1934045 INFO  (Thread-3864) [    ] o.a.s.c.ZkTestServer client port:0.0.0.0/0.0.0.0:0
   [junit4]   2> 1934045 INFO  (Thread-3864) [    ] o.a.s.c.ZkTestServer Starting server
   [junit4]   2> 1934146 INFO  (TEST-CloudExitableDirectoryReaderTest.test-seed#[37B2AB63772961A3]) [    ] o.a.s.c.ZkTestServer start zk server on port:62425
   [junit4]   2> 1934147 INFO  (TEST-CloudExitableDirectoryReaderTest.test-seed#[37B2AB63772961A3]) [    ] o.a.s.c.c.SolrZkClient Using default ZkCredentialsProvider
   [junit4]   2> 1934148 INFO  (TEST-CloudExitableDirectoryReaderTest.test-seed#[37B2AB63772961A3]) [    ] o.a.s.c.c.ConnectionManager Waiting for client to connect to ZooKeeper
   [junit4]   2> 1934154 INFO  (zkCallback-2327-thread-1) [    ] o.a.s.c.c.ConnectionManager Watcher org.apache.solr.common.cloud.ConnectionManager@72f965c2 name:ZooKeeperConnection Watcher:127.0.0.1:62425 got event WatchedEvent state:SyncConnected type:None path:null path:null type:None
   [junit4]   2> 1934154 INFO  (TEST-CloudExitableDirectoryReaderTest.test-seed#[37B2AB63772961A3]) [    ] o.a.s.c.c.ConnectionManager Client is connected to ZooKeeper
   [junit4]   2> 1934155 INFO  (TEST-CloudExitableDirectoryReaderTest.test-seed#[37B2AB63772961A3]) [    ] o.a.s.c.c.SolrZkClient Using default ZkACLProvider
   [junit4]   2> 1934155 INFO  (TEST-CloudExitableDirectoryReaderTest.test-seed#[37B2AB63772961A3]) [    ] o.a.s.c.c.SolrZkClient makePath: /solr
   [junit4]   2> 1934159 INFO  (TEST-CloudExitableDirectoryReaderTest.test-seed#[37B2AB63772961A3]) [    ] o.a.s.c.c.SolrZkClient Using default ZkCredentialsProvider
   [junit4]   2> 1934161 INFO  (TEST-CloudExitableDirectoryReaderTest.test-seed#[37B2AB63772961A3]) [    ] o.a.s.c.c.ConnectionManager Waiting for client to connect to ZooKeeper
   [junit4]   2> 1934163 INFO  (zkCallback-2328-thread-1) [    ] o.a.s.c.c.ConnectionManager Watcher org.apache.solr.common.cloud.ConnectionManager@15a5bb6f name:ZooKeeperConnection Watcher:127.0.0.1:62425/solr got event WatchedEvent state:SyncConnected type:None path:null path:null type:None
   [junit4]   2> 1934163 INFO  (TEST-CloudExitableDirectoryReaderTest.test-seed#[37B2AB63772961A3]) [    ] o.a.s.c.c.ConnectionManager Client is connected to ZooKeeper
   [junit4]   2> 1934163 INFO  (TEST-CloudExitableDirectoryReaderTest.test-seed#[37B2AB63772961A3]) [    ] o.a.s.c.c.SolrZkClient Using default ZkACLProvider
   [junit4]   2> 1934163 INFO  (TEST-CloudExitableDirectoryReaderTest.test-seed#[37B2AB63772961A3]) [    ] o.a.s.c.c.SolrZkClient makePath: /collections/collection1
   [junit4]   2> 1934167 INFO  (TEST-CloudExitableDirectoryReaderTest.test-seed#[37B2AB63772961A3]) [    ] o.a.s.c.c.SolrZkClient makePath: /collections/collection1/shards
   [junit4]   2> 1934171 INFO  (TEST-CloudExitableDirectoryReaderTest.test-seed#[37B2AB63772961A3]) [    ] o.a.s.c.c.SolrZkClient makePath: /collections/control_collection
   [junit4]   2> 1934174 INFO  (TEST-CloudExitableDirectoryReaderTest.test-seed#[37B2AB63772961A3]) [    ] o.a.s.c.c.SolrZkClient makePath: /collections/control_collection/shards
   [junit4]   2> 1934178 INFO  (TEST-CloudExitableDirectoryReaderTest.test-seed#[37B2AB63772961A3]) [    ] o.a.s.c.AbstractZkTestCase put /Users/jenkins/workspace/Lucene-Solr-trunk-MacOSX/solr/core/src/test-files/solr/collection1/conf/solrconfig-tlog-with-delayingcomponent.xml to /configs/conf1/solrconfig.xml
   [junit4]   2> 1934179 INFO  (TEST-CloudExitableDirectoryReaderTest.test-seed#[37B2AB63772961A3]) [    ] o.a.s.c.c.SolrZkClient makePath: /configs/conf1/solrconfig.xml
   [junit4]   2> 1934186 INFO  (TEST-CloudExitableDirectoryReaderTest.test-seed#[37B2AB63772961A3]) [    ] o.a.s.c.AbstractZkTestCase put /Users/jenkins/workspace/Lucene-Solr-trunk-MacOSX/solr/core/src/test-files/solr/collection1/conf/schema.xml to /configs/conf1/schema.xml
   [junit4]   2> 1934186 INFO  (TEST-CloudExitableDirectoryReaderTest.test-seed#[37B2AB63772961A3]) [    ] o.a.s.c.c.SolrZkClient makePath: /configs/conf1/schema.xml
   [junit4]   2> 1934190 INFO  (TEST-CloudExitableDirectoryReaderTest.test-seed#[37B2AB63772961A3]) [    ] o.a.s.c.AbstractZkTestCase put /Users/jenkins/workspace/Lucene-Solr-trunk-MacOSX/solr/core/src/test-files/solr/collection1/conf/solrconfig.snippet.randomindexconfig.xml to /configs/conf1/solrconfig.snippet.randomindexconfig.xml
   [junit4]   2> 1934190 INFO  (TEST-CloudExitableDirectoryReaderTest.test-seed#[37B2AB63772961A3]) [    ] o.a.s.c.c.SolrZkClient makePath: /configs/conf1/solrconfig.snippet.randomindexconfig.xml
   [junit4]   2> 1934194 INFO  (TEST-CloudExitableDirectoryReaderTest.test-seed#[37B2AB63772961A3]) [    ] o.a.s.c.AbstractZkTestCase put /Users/jenkins/workspace/Lucene-Solr-trunk-MacOSX/solr/core/src/test-files/solr/collection1/conf/stopwords.txt to /configs/conf1/stopwords.txt
   [junit4]   2> 1934195 INFO  (TEST-CloudExitableDirectoryReaderTest.test-seed#[37B2AB63772961A3]) [    ] o.a.s.c.c.SolrZkClient makePath: /configs/conf1/stopwords.txt
   [junit4]   2> 1934198 INFO  (TEST-CloudExitableDirectoryReaderTest.test-seed#[37B2AB63772961A3]) [    ] o.a.s.c.AbstractZkTestCase put /Users/jenkins/workspace/Lucene-Solr-trunk-MacOSX/solr/core/src/test-files/solr/collection1/conf/protwords.txt to /configs/conf1/protwords.txt
   [junit4]   2> 1934199 INFO  (TEST-CloudExitableDirectoryReaderTest.test-seed#[37B2AB63772961A3]) [    ] o.a.s.c.c.SolrZkClient makePath: /configs/conf1/protwords.txt
   [junit4]   2> 1934203 INFO  (TEST-CloudExitableDirectoryReaderTest.test-seed#[37B2AB63772961A3]) [    ] o.a.s.c.AbstractZkTestCase put /Users/jenkins/workspace/Lucene-Solr-trunk-MacOSX/solr/core/src/test-files/solr/collection1/conf/currency.xml to /configs/conf1/currency.xml
   [junit4]   2> 1934203 INFO  (TEST-CloudExitableDirectoryReaderTest.test-seed#[37B2AB63772961A3]) [    ] o.a.s.c.c.SolrZkClient makePath: /configs/conf1/currency.xml
   [junit4]   2> 1934207 INFO  (TEST-CloudExitableDirectoryReaderTest.test-seed#[37B2AB63772961A3]) [    ] o.a.s.c.AbstractZkTestCase put /Users/jenkins/workspace/Lucene-Solr-trunk-MacOSX/solr/core/src/test-files/solr/collection1/conf/enumsConfig.xml to /configs/conf1/enumsConfig.xml
   [junit4]   2> 1934208 INFO  (TEST-CloudExitableDirectoryReaderTest.test-seed#[37B2AB63772961A3]) [    ] o.a.s.c.c.SolrZkClient makePath: /configs/conf1/enumsConfig.xml
   [junit4]   2> 1934212 INFO  (TEST-CloudExitableDirectoryReaderTest.test-seed#[37B2AB63772961A3]) [    ] o.a.s.c.AbstractZkTestCase put /Users/jenkins/workspace/Lucene-Solr-trunk-MacOSX/solr/core/src/test-files/solr/collection1/conf/open-exchange-rates.json to /configs/conf1/open-exchange-rates.json
   [junit4]   2> 1934212 INFO  (TEST-CloudExitableDirectoryReaderTest.test-seed#[37B2AB63772961A3]) [    ] o.a.s.c.c.SolrZkClient makePath: /configs/conf1/open-exchange-rates.json
   [junit4]   2> 1934216 INFO  (TEST-CloudExitableDirectoryReaderTest.test-seed#[37B2AB63772961A3]) [    ] o.a.s.c.AbstractZkTestCase put /Users/jenkins/workspace/Lucene-Solr-trunk-MacOSX/solr/core/src/test-files/solr/collection1/conf/mapping-ISOLatin1Accent.txt to /configs/conf1/mapping-ISOLatin1Accent.txt
   [junit4]   2> 1934216 INFO  (TEST-CloudExitableDirectoryReaderTest.test-seed#[37B2AB63772961A3]) [    ] o.a.s.c.c.SolrZkClient makePath: /configs/conf1/mapping-ISOLatin1Accent.txt
   [junit4]   2> 1934220 INFO  (TEST-CloudExitableDirectoryReaderTest.test-seed#[37B2AB63772961A3]) [    ] o.a.s.c.AbstractZkTestCase put /Users/jenkins/workspace/Lucene-Solr-trunk-MacOSX/solr/core/src/test-files/solr/collection1/conf/old_synonyms.txt to /configs/conf1/old_synonyms.txt
   [junit4]   2> 1934220 INFO  (TEST-CloudExitableDirectoryReaderTest.test-seed#[37B2AB63772961A3]) [    ] o.a.s.c.c.SolrZkClient makePath: /configs/conf1/old_synonyms.txt
   [junit4]   2> 1934224 INFO  (TEST-CloudExitableDirectoryReaderTest.test-seed#[37B2AB63772961A3]) [    ] o.a.s.c.AbstractZkTestCase put /Users/jenkins/workspace/Lucene-Solr-trunk-MacOSX/solr/core/src/test-files/solr/collection1/conf/synonyms.txt to /configs/conf1/synonyms.txt
   [junit4]   2> 1934224 INFO  (TEST-CloudExitableDirectoryReaderTest.test-seed#[37B2AB63772961A3]) [    ] o.a.s.c.c.SolrZkClient makePath: /configs/conf1/synonyms.txt
   [junit4]   2> 1934487 INFO  (TEST-CloudExitableDirectoryReaderTest.test-seed#[37B2AB63772961A3]) [    ] o.a.s.SolrTestCaseJ4 Writing core.properties file to /Users/jenkins/workspace/Lucene-Solr-trunk-MacOSX/solr/build/solr-core/test/J1/temp/solr.cloud.CloudExitableDirectoryReaderTest_37B2AB63772961A3-001/control-001/cores/collection1
   [junit4]   2> 1934489 INFO  (TEST-CloudExitableDirectoryReaderTest.test-seed#[37B2AB63772961A3]) [    ] o.e.j.s.Server jetty-9.2.13.v20150730
   [junit4]   2> 1934492 INFO  (TEST-CloudExitableDirectoryReaderTest.test-seed#[37B2AB63772961A3]) [    ] o.e.j.s.h.ContextHandler Started o.e.j.s.ServletContextHandler@6bd9b862{/n_vee,null,AVAILABLE}
   [junit4]   2> 1934492 INFO  (TEST-CloudExitableDirectoryReaderTest.test-seed#[37B2AB63772961A3]) [    ] o.e.j.s.ServerConnector Started ServerConnector@14851570{HTTP/1.1}{127.0.0.1:62428}
   [junit4]   2> 1934492 INFO  (TEST-CloudExitableDirectoryReaderTest.test-seed#[37B2AB63772961A3]) [    ] o.e.j.s.Server Started @1937837ms
   [junit4]   2> 1934492 INFO  (TEST-CloudExitableDirectoryReaderTest.test-seed#[37B2AB63772961A3]) [    ] o.a.s.c.s.e.JettySolrRunner Jetty properties: {solr.data.dir=/Users/jenkins/workspace/Lucene-Solr-trunk-MacOSX/solr/build/solr-core/test/J1/temp/solr.cloud.CloudExitableDirectoryReaderTest_37B2AB63772961A3-001/tempDir-001/control/data, hostContext=/n_vee, hostPort=62428, coreRootDirectory=/Users/jenkins/workspace/Lucene-Solr-trunk-MacOSX/solr/build/solr-core/test/J1/../../../../../../../../../Users/jenkins/workspace/Lucene-Solr-trunk-MacOSX/solr/build/solr-core/test/J1/temp/solr.cloud.CloudExitableDirectoryReaderTest_37B2AB63772961A3-001/control-001/cores}
   [junit4]   2> 1934493 INFO  (TEST-CloudExitableDirectoryReaderTest.test-seed#[37B2AB63772961A3]) [    ] o.a.s.s.SolrDispatchFilter SolrDispatchFilter.init(): sun.misc.Launcher$AppClassLoader@74a14482
   [junit4]   2> 1934493 INFO  (TEST-CloudExitableDirectoryReaderTest.test-seed#[37B2AB63772961A3]) [    ] o.a.s.c.SolrResourceLoader new SolrResourceLoader for directory: '/Users/jenkins/workspace/Lucene-Solr-trunk-MacOSX/solr/build/solr-core/test/J1/temp/solr.cloud.CloudExitableDirectoryReaderTest_37B2AB63772961A3-001/control-001'
   [junit4]   2> 1934493 INFO  (TEST-CloudExitableDirectoryReaderTest.test-seed#[37B2AB63772961A3]) [    ] o.a.s.c.SolrResourceLoader JNDI not configured for solr (NoInitialContextEx)
   [junit4]   2> 1934493 INFO  (TEST-CloudExitableDirectoryReaderTest.test-seed#[37B2AB63772961A3]) [    ] o.a.s.c.SolrResourceLoader solr home defaulted to 'solr/' (could not find system property or JNDI)
   [junit4]   2> 1934493 INFO  (TEST-CloudExitableDirectoryReaderTest.test-seed#[37B2AB63772961A3]) [    ] o.a.s.c.c.SolrZkClient Using default ZkCredentialsProvider
   [junit4]   2> 1934495 INFO  (TEST-CloudExitableDirectoryReaderTest.test-seed#[37B2AB63772961A3]) [    ] o.a.s.c.c.ConnectionManager Waiting for client to connect to ZooKeeper
   [junit4]   2> 1934496 INFO  (zkCallback-2329-thread-1) [    ] o.a.s.c.c.ConnectionManager Watcher org.apache.solr.common.cloud.ConnectionManager@62c5c7e7 name:ZooKeeperConnection Watcher:127.0.0.1:62425/solr got event WatchedEvent state:SyncConnected type:None path:null path:null type:None
   [junit4]   2> 1934496 INFO  (TEST-CloudExitableDirectoryReaderTest.test-seed#[37B2AB63772961A3]) [    ] o.a.s.c.c.ConnectionManager Client is connected to ZooKeeper
   [junit4]   2> 1934497 INFO  (TEST-CloudExitableDirectoryReaderTest.test-seed#[37B2AB63772961A3]) [    ] o.a.s.c.c.SolrZkClient Using default ZkACLProvider
   [junit4]   2> 1934499 INFO  (TEST-CloudExitableDirectoryReaderTest.test-seed#[37B2AB63772961A3]) [    ] o.a.s.s.SolrDispatchFilter Loading solr.xml from SolrHome (not found in ZooKeeper)
   [junit4]   2> 1934499 INFO  (TEST-CloudExitableDirectoryReaderTest.test-seed#[37B2AB63772961A3]) [    ] o.a.s.c.SolrXmlConfig Loading container configuration from /Users/jenkins/workspace/Lucene-Solr-trunk-MacOSX/solr/build/solr-core/test/J1/temp/solr.cloud.CloudExitableDirectoryReaderTest_37B2AB63772961A3-001/control-001/solr.xml
   [junit4]   2> 1934524 INFO  (TEST-CloudExitableDirectoryReaderTest.test-seed#[37B2AB63772961A3]) [    ] o.a.s.c.CorePropertiesLocator Config-defined core root directory: /Users/jenkins/workspace/Lucene-Solr-trunk-MacOSX/solr/build/solr-core/test/J1/../../../../../../../../../Users/jenkins/workspace/Lucene-Solr-trunk-MacOSX/solr/build/solr-core/test/J1/temp/solr.cloud.CloudExitableDirectoryReaderTest_37B2AB63772961A3-001/control-001/cores
   [junit4]   2> 1934524 INFO  (TEST-CloudExitableDirectoryReaderTest.test-seed#[37B2AB63772961A3]) [    ] o.a.s.c.CoreContainer New CoreContainer 1381395573
   [junit4]   2> 1934524 INFO  (TEST-CloudExitableDirectoryReaderTest.test-seed#[37B2AB63772961A3]) [    ] o.a.s.c.CoreContainer Loading cores into CoreContainer [instanceDir=/Users/jenkins/workspace/Lucene-Solr-trunk-MacOSX/solr/build/solr-core/test/J1/temp/solr.cloud.CloudExitableDirectoryReaderTest_37B2AB63772961A3-001/control-001]
   [junit4]   2> 1934524 WARN  (TEST-CloudExitableDirectoryReaderTest.test-seed#[37B2AB63772961A3]) [    ] o.a.s.c.CoreContainer Couldn't add files from /Users/jenkins/workspace/Lucene-Solr-trunk-MacOSX/solr/build/solr-core/test/J1/temp/solr.cloud.CloudExitableDirectoryReaderTest_37B2AB63772961A3-001/control-001/lib to classpath: /Users/jenkins/workspace/Lucene-Solr-trunk-MacOSX/solr/build/solr-core/test/J1/temp/solr.cloud.CloudExitableDirectoryReaderTest_37B2AB63772961A3-001/control-001/lib
   [junit4]   2> 1934525 INFO  (TEST-CloudExitableDirectoryReaderTest.test-seed#[37B2AB63772961A3]) [    ] o.a.s.h.c.HttpShardHandlerFactory created with socketTimeout : 90000,urlScheme : ,connTimeout : 15000,maxConnectionsPerHost : 20,maxConnections : 10000,corePoolSize : 0,maximumPoolSize : 2147483647,maxThreadIdleTime : 5,sizeOfQueue : -1,fairnessPolicy : false,useRetries : false,
   [junit4]   2> 1934527 INFO  (TEST-CloudExitableDirectoryReaderTest.test-seed#[37B2AB63772961A3]) [    ] o.a.s.u.UpdateShardHandler Creating UpdateShardHandler HTTP client with params: socketTimeout=340000&connTimeout=45000&retry=true
   [junit4]   2> 1934527 INFO  (TEST-CloudExitableDirectoryReaderTest.test-seed#[37B2AB63772961A3]) [    ] o.a.s.l.LogWatcher SLF4J impl is org.slf4j.impl.Log4jLoggerFactory
   [junit4]   2> 1934528 INFO  (TEST-CloudExitableDirectoryReaderTest.test-seed#[37B2AB63772961A3]) [    ] o.a.s.l.LogWatcher Registering Log Listener [Log4j (org.slf4j.impl.Log4jLoggerFactory)]
   [junit4]   2> 1934528 INFO  (TEST-CloudExitableDirectoryReaderTest.test-seed#[37B2AB63772961A3]) [    ] o.a.s.c.ZkContainer Zookeeper client=127.0.0.1:62425/solr
   [junit4]   2> 1934528 INFO  (TEST-CloudExitableDirectoryReaderTest.test-seed#[37B2AB63772961A3]) [    ] o.a.s.c.ZkController zkHost includes chroot
   [junit4]   2> 1934528 INFO  (TEST-CloudExitableDirectoryReaderTest.test-seed#[37B2AB63772961A3]) [    ] o.a.s.c.c.SolrZkClient Using default ZkCredentialsProvider
   [junit4]   2> 1934529 INFO  (TEST-CloudExitableDirectoryReaderTest.test-seed#[37B2AB63772961A3]) [    ] o.a.s.c.c.ConnectionManager Waiting for client to connect to ZooKeeper
   [junit4]   2> 1934531 INFO  (zkCallback-2332-thread-1) [    ] o.a.s.c.c.ConnectionManager Watcher org.apache.solr.common.cloud.ConnectionManager@156789dd name:ZooKeeperConnection Watcher:127.0.0.1:62425 got event WatchedEvent state:SyncConnected type:None path:null path:null type:None
   [junit4]   2> 1934531 INFO  (TEST-CloudExitableDirectoryReaderTest.test-seed#[37B2AB63772961A3]) [    ] o.a.s.c.c.ConnectionManager Client is connected to ZooKeeper
   [junit4]   2> 1934531 INFO  (TEST-CloudExitableDirectoryReaderTest.test-seed#[37B2AB63772961A3]) [    ] o.a.s.c.c.SolrZkClient Using default ZkACLProvider
   [junit4]   2> 1934534 INFO  (TEST-CloudExitableDirectoryReaderTest.test-seed#[37B2AB63772961A3]) [n:127.0.0.1:62428_n_vee    ] o.a.s.c.c.ConnectionManager Waiting for client to connect to ZooKeeper
   [junit4]   2> 1934535 INFO  (zkCallback-2333-thread-1-processing-n:127.0.0.1:62428_n_vee) [n:127.0.0.1:62428_n_vee    ] o.a.s.c.c.ConnectionManager Watcher org.apache.solr.common.cloud.ConnectionManager@12350264 name:ZooKeeperConnection Watcher:127.0.0.1:62425/solr got event WatchedEvent state:SyncConnected type:None path:null path:null type:None
   [junit4]   2> 1934535 INFO  (TEST-CloudExitableDirectoryReaderTest.test-seed#[37B2AB63772961A3]) [n:127.0.0.1:62428_n_vee    ] o.a.s.c.c.ConnectionManager Client is connected to ZooKeeper
   [junit4]   2> 1934537 INFO  (TEST-CloudExitableDirectoryReaderTest.test-seed#[37B2AB63772961A3]) [n:127.0.0.1:62428_n_vee    ] o.a.s.c.c.SolrZkClient makePath: /overseer/queue
   [junit4]   2> 1934542 INFO  (TEST-CloudExitableDirectoryReaderTest.test-seed#[37B2AB63772961A3]) [n:127.0.0.1:62428_n_vee    ] o.a.s.c.c.SolrZkClient makePath: /overseer/collection-queue-work
   [junit4]   2> 1934549 INFO  (TEST-CloudExitableDirectoryReaderTest.test-seed#[37B2AB63772961A3]) [n:127.0.0.1:62428_n_vee    ] o.a.s.c.c.SolrZkClient makePath: /overseer/collection-map-running
   [junit4]   2> 1934554 INFO  (TEST-CloudExitableDirectoryReaderTest.test-seed#[37B2AB63772961A3]) [n:127.0.0.1:62428_n_vee    ] o.a.s.c.c.SolrZkClient makePath: /overseer/collection-map-completed
   [junit4]   2> 1934559 INFO  (TEST-CloudExitableDirectoryReaderTest.test-seed#[37B2AB63772961A3]) [n:127.0.0.1:62428_n_vee    ] o.a.s.c.c.SolrZkClient makePath: /overseer/collection-map-failure
   [junit4]   2> 1934564 INFO  (TEST-CloudExitableDirectoryReaderTest.test-seed#[37B2AB63772961A3]) [n:127.0.0.1:62428_n_vee    ] o.a.s.c.c.SolrZkClient makePath: /live_nodes
   [junit4]   2> 1934568 INFO  (TEST-CloudExitableDirectoryReaderTest.test-seed#[37B2AB63772961A3]) [n:127.0.0.1:62428_n_vee    ] o.a.s.c.c.SolrZkClient makePath: /aliases.json
   [junit4]   2> 1934571 INFO  (TEST-CloudExitableDirectoryReaderTest.test-seed#[37B2AB63772961A3]) [n:127.0.0.1:62428_n_vee    ] o.a.s.c.c.SolrZkClient makePath: /clusterstate.json
   [junit4]   2> 1934573 INFO  (TEST-CloudExitableDirectoryReaderTest.test-seed#[37B2AB63772961A3]) [n:127.0.0.1:62428_n_vee    ] o.a.s.c.c.SolrZkClient makePath: /security.json
   [junit4]   2> 1934575 INFO  (TEST-CloudExitableDirectoryReaderTest.test-seed#[37B2AB63772961A3]) [n:127.0.0.1:62428_n_vee    ] o.a.s.c.ZkController Register node as live in ZooKeeper:/live_nodes/127.0.0.1:62428_n_vee
   [junit4]   2> 1934576 INFO  (TEST-CloudExitableDirectoryReaderTest.test-seed#[37B2AB63772961A3]) [n:127.0.0.1:62428_n_vee    ] o.a.s.c.c.SolrZkClient makePath: /live_nodes/127.0.0.1:62428_n_vee
   [junit4]   2> 1934580 INFO  (TEST-CloudExitableDirectoryReaderTest.test-seed#[37B2AB63772961A3]) [n:127.0.0.1:62428_n_vee    ] o.a.s.c.c.SolrZkClient makePath: /overseer_elect
   [junit4]   2> 1934583 INFO  (TEST-CloudExitableDirectoryReaderTest.test-seed#[37B2AB63772961A3]) [n:127.0.0.1:62428_n_vee    ] o.a.s.c.c.SolrZkClient makePath: /overseer_elect/election
   [junit4]   2> 1934586 INFO  (TEST-CloudExitableDirectoryReaderTest.test-seed#[37B2AB63772961A3]) [n:127.0.0.1:62428_n_vee    ] o.a.s.c.Overseer Overseer (id=null) closing
   [junit4]   2> 1934587 INFO  (TEST-CloudExitableDirectoryReaderTest.test-seed#[37B2AB63772961A3]) [n:127.0.0.1:62428_n_vee    ] o.a.s.c.LeaderElector Joined leadership election with path: /overseer_elect/election/95235982798946308-127.0.0.1:62428_n_vee-n_0000000000
   [junit4]   2> 1934588 INFO  (TEST-CloudExitableDirectoryReaderTest.test-seed#[37B2AB63772961A3]) [n:127.0.0.1:62428_n_vee    ] o.a.s.c.OverseerElectionContext I am going to be the leader 127.0.0.1:62428_n_vee
   [junit4]   2> 1934588 INFO  (TEST-CloudExitableDirectoryReaderTest.test-seed#[37B2AB63772961A3]) [n:127.0.0.1:62428_n_vee    ] o.a.s.c.c.SolrZkClient makePath: /overseer_elect/leader
   [junit4]   2> 1934591 INFO  (TEST-CloudExitableDirectoryReaderTest.test-seed#[37B2AB63772961A3]) [n:127.0.0.1:62428_n_vee    ] o.a.s.c.Overseer Overseer (id=95235982798946308-127.0.0.1:62428_n_vee-n_0000000000) starting
   [junit4]   2> 1934594 INFO  (TEST-CloudExitableDirectoryReaderTest.test-seed#[37B2AB63772961A3]) [n:127.0.0.1:62428_n_vee    ] o.a.s.c.c.SolrZkClient makePath: /overseer/queue-work
   [junit4]   2> 1934607 INFO  (TEST-CloudExitableDirectoryReaderTest.test-seed#[37B2AB63772961A3]) [n:127.0.0.1:62428_n_vee    ] o.a.s.c.OverseerAutoReplicaFailoverThread Starting OverseerAutoReplicaFailoverThread autoReplicaFailoverWorkLoopDelay=10000 autoReplicaFailoverWaitAfterExpiration=30000 autoReplicaFailoverBadNodeExpiration=60000
   [junit4]   2> 1934608 INFO  (OverseerCollectionConfigSetProcessor-95235982798946308-127.0.0.1:62428_n_vee-n_0000000000) [n:127.0.0.1:62428_n_vee    ] o.a.s.c.OverseerTaskProcessor Process current queue of overseer operations
   [junit4]   2> 1934608 INFO  (TEST-CloudExitableDirectoryReaderTest.test-seed#[37B2AB63772961A3]) [n:127.0.0.1:62428_n_vee    ] o.a.s.c.c.ZkStateReader Updating cluster state from ZooKeeper... 
   [junit4]   2> 1934608 INFO  (OverseerStateUpdate-95235982798946308-127.0.0.1:62428_n_vee-n_0000000000) [n:127.0.0.1:62428_n_vee    ] o.a.s.c.Overseer Starting to work on the main queue
   [junit4]   2> 1934629 INFO  (TEST-CloudExitableDirectoryReaderTest.test-seed#[37B2AB63772961A3]) [n:127.0.0.1:62428_n_vee    ] o.a.s.c.CoreContainer Security conf doesn't exist. Skipping setup for authorization module.
   [junit4]   2> 1934629 INFO  (TEST-CloudExitableDirectoryReaderTest.test-seed#[37B2AB63772961A3]) [n:127.0.0.1:62428_n_vee    ] o.a.s.c.CoreContainer No authentication plugin used.
   [junit4]   2> 1934633 INFO  (TEST-CloudExitableDirectoryReaderTest.test-seed#[37B2AB63772961A3]) [n:127.0.0.1:62428_n_vee    ] o.a.s.c.CorePropertiesLocator Looking for core definitions underneath /Users/jenkins/workspace/Lucene-Solr-trunk-MacOSX/solr/build/solr-core/test/J1/../../../../../../../../../Users/jenkins/workspace/Lucene-Solr-trunk-MacOSX/solr/build/solr-core/test/J1/temp/solr.cloud.CloudExitableDirectoryReaderTest_37B2AB63772961A3-001/control-001/cores
   [junit4]   2> 1934635 INFO  (TEST-CloudExitableDirectoryReaderTest.test-seed#[37B2AB63772961A3]) [n:127.0.0.1:62428_n_vee    ] o.a.s.c.CoreDescriptor Created CoreDescriptor: {name=collection1, config=solrconfig.xml, transient=false, schema=schema.xml, loadOnStartup=true, configSetProperties=configsetprops.json, collection=control_collection, coreNodeName=, dataDir=data/, shard=}
   [junit4]   2> 1934635 INFO  (TEST-CloudExitableDirectoryReaderTest.test-seed#[37B2AB63772961A3]) [n:127.0.0.1:62428_n_vee    ] o.a.s.c.CorePropertiesLocator Found core collection1 in /Users/jenkins/workspace/Lucene-Solr-trunk-MacOSX/solr/build/solr-core/test/J1/../../../../../../../../../Users/jenkins/workspace/Lucene-Solr-trunk-MacOSX/solr/build/solr-core/test/J1/temp/solr.cloud.CloudExitableDirectoryReaderTest_37B2AB63772961A3-001/control-001/cores/collection1
   [junit4]   2> 1934635 INFO  (TEST-CloudExitableDirectoryReaderTest.test-seed#[37B2AB63772961A3]) [n:127.0.0.1:62428_n_vee    ] o.a.s.c.CorePropertiesLocator Found 1 core definitions
   [junit4]   2> 1934637 INFO  (TEST-CloudExitableDirectoryReaderTest.test-seed#[37B2AB63772961A3]) [n:127.0.0.1:62428_n_vee    ] o.a.s.s.SolrDispatchFilter user.dir=/Users/jenkins/workspace/Lucene-Solr-trunk-MacOSX/solr/build/solr-core/test/J1
   [junit4]   2> 1934637 INFO  (TEST-CloudExitableDirectoryReaderTest.test-seed#[37B2AB63772961A3]) [n:127.0.0.1:62428_n_vee    ] o.a.s.s.SolrDispatchFilter SolrDispatchFilter.init() done
   [junit4]   2> 1934638 INFO  (coreLoadExecutor-5277-thread-1-processing-n:127.0.0.1:62428_n_vee) [n:127.0.0.1:62428_n_vee c:control_collection   x:collection1] o.a.s.c.ZkController publishing state=down
   [junit4]   2> 1934638 INFO  (coreLoadExecutor-5277-thread-1-processing-n:127.0.0.1:62428_n_vee) [n:127.0.0.1:62428_n_vee c:control_collection   x:collection1] o.a.s.c.ZkController numShards not found on descriptor - reading it from system property
   [junit4]   2> 1934641 INFO  (OverseerStateUpdate-95235982798946308-127.0.0.1:62428_n_vee-n_0000000000) [n:127.0.0.1:62428_n_vee    ] o.a.s.c.Overseer processMessage: queueSize: 1, message = {
   [junit4]   2>   "core":"collection1",
   [junit4]   2>   "roles":null,
   [junit4]   2>   "base_url":"http://127.0.0.1:62428/n_vee",
   [junit4]   2>   "node_name":"127.0.0.1:62428_n_vee",
   [junit4]   2>   "numShards":"1",
   [junit4]   2>   "state":"down",
   [junit4]   2>   "shard":null,
   [junit4]   2>   "collection":"control_collection",
   [junit4]   2>   "operation":"state"} current state version: 0
   [junit4]   2> 1934642 INFO  (coreLoadExecutor-5277-thread-1-processing-n:127.0.0.1:62428_n_vee) [n:127.0.0.1:62428_n_vee c:control_collection   x:collection1] o.a.s.c.ZkController look for our core node name
   [junit4]   2> 1934642 INFO  (OverseerStateUpdate-95235982798946308-127.0.0.1:62428_n_vee-n_0000000000) [n:127.0.0.1:62428_n_vee    ] o.a.s.c.o.ReplicaMutator Update state numShards=1 message={
   [junit4]   2>   "core":"collection1",
   [junit4]   2>   "roles":null,
   [junit4]   2>   "base_url":"http://127.0.0.1:62428/n_vee",
   [junit4]   2>   "node_name":"127.0.0.1:62428_n_vee",
   [junit4]   2>   "numShards":"1",
   [junit4]   2>   "state":"down",
   [junit4]   2>   "shard":null,
   [junit4]   2>   "collection":"control_collection",
   [junit4]   2>   "operation":"state"}
   [junit4]   2> 1934643 INFO  (OverseerStateUpdate-95235982798946308-127.0.0.1:62428_n_vee-n_0000000000) [n:127.0.0.1:62428_n_vee    ] o.a.s.c.o.ClusterStateMutator building a new cName: control_collection
   [junit4]   2> 1934644 INFO  (OverseerStateUpdate-95235982798946308-127.0.0.1:62428_n_vee-n_0000000000) [n:127.0.0.1:62428_n_vee    ] o.a.s.c.o.ReplicaMutator Assigning new node to shard shard=shard1
   [junit4]   2> 1934646 INFO  (zkCallback-2333-thread-1-processing-n:127.0.0.1:62428_n_vee) [n:127.0.0.1:62428_n_vee    ] o.a.s.c.c.ZkStateReader A cluster state change: [WatchedEvent state:SyncConnected type:NodeDataChanged path:/clusterstate.json], has occurred - updating... (live nodes size: [1])
   [junit4]   2> 1935644 INFO  (coreLoadExecutor-5277-thread-1-processing-n:127.0.0.1:62428_n_vee) [n:127.0.0.1:62428_n_vee c:control_collection   x:collection1] o.a.s.c.ZkController waiting to find shard id in clusterstate for collection1
   [junit4]   2> 1935644 INFO  (coreLoadExecutor-5277-thread-1-processing-n:127.0.0.1:62428_n_vee) [n:127.0.0.1:62428_n_vee c:control_collection   x:collection1] o.a.s.c.ZkController Check for collection zkNode:control_collection
   [junit4]   2> 1935645 INFO  (coreLoadExecutor-5277-thread-1-processing-n:127.0.0.1:62428_n_vee) [n:127.0.0.1:62428_n_vee c:control_collection   x:collection1] o.a.s.c.ZkController Collection zkNode exists
   [junit4]   2> 1935645 INFO  (coreLoadExecutor-5277-thread-1-processing-n:127.0.0.1:62428_n_vee) [n:127.0.0.1:62428_n_vee c:control_collection   x:collection1] o.a.s.c.c.ZkStateReader Load collection config from: [/collections/control_collection]
   [junit4]   2> 1935647 INFO  (coreLoadExecutor-5277-thread-1-processing-n:127.0.0.1:62428_n_vee) [n:127.0.0.1:62428_n_vee c:control_collection   x:collection1] o.a.s.c.c.ZkStateReader path=[/collections/control_collection] [configName]=[conf1] specified config exists in ZooKeeper
   [junit4]   2> 1935647 INFO  (coreLoadExecutor-5277-thread-1-processing-n:127.0.0.1:62428_n_vee) [n:127.0.0.1:62428_n_vee c:control_collection   x:collection1] o.a.s.c.SolrResourceLoader new SolrResourceLoader for directory: '/Users/jenkins/workspace/Lucene-Solr-trunk-MacOSX/solr/build/solr-core/test/J1/temp/solr.cloud.CloudExitableDirectoryReaderTest_37B2AB63772961A3-001/control-001/cores/collection1'
   [junit4]   2> 1935647 INFO  (coreLoadExecutor-5277-thread-1-processing-n:127.0.0.1:62428_n_vee) [n:127.0.0.1:62428_n_vee c:control_collection   x:collection1] o.a.s.c.SolrResourceLoader JNDI not configured for solr (NoInitialContextEx)
   [junit4]   2> 1935647 INFO  (coreLoadExecutor-5277-thread-1-processing-n:127.0.0.1:62428_n_vee) [n:127.0.0.1:62428_n_vee c:control_collection   x:collection1] o.a.s.c.SolrResourceLoader solr home defaulted to 'solr/' (could not find system property or JNDI)
   [junit4]   2> 1935650 INFO  (coreLoadExecutor-5277-thread-1-processing-n:127.0.0.1:62428_n_vee) [n:127.0.0.1:62428_n_vee c:control_collection   x:collection1] o.a.s.c.Config loaded config solrconfig.xml with version 0 
   [junit4]   2> 1935657 INFO  (coreLoadExecutor-5277-thread-1-processing-n:127.0.0.1:62428_n_vee) [n:127.0.0.1:62428_n_vee c:control_collection   x:collection1] o.a.s.c.SolrConfig current version of requestparams : -1
   [junit4]   2> 1935660 INFO  (coreLoadExecutor-5277-thread-1-processing-n:127.0.0.1:62428_n_vee) [n:127.0.0.1:62428_n_vee c:control_collection   x:collection1] o.a.s.c.SolrConfig Using Lucene MatchVersion: 6.0.0
   [junit4]   2> 1935668 INFO  (coreLoadExecutor-5277-thread-1-processing-n:127.0.0.1:62428_n_vee) [n:127.0.0.1:62428_n_vee c:control_collection   x:collection1] o.a.s.c.SolrConfig Loaded SolrConfig: solrconfig.xml
   [junit4]   2> 1935676 INFO  (coreLoadExecutor-5277-thread-1-processing-n:127.0.0.1:62428_n_vee) [n:127.0.0.1:62428_n_vee c:control_collection   x:collection1] o.a.s.s.IndexSchema [collection1] Schema name=test
   [junit4]   2> 1936166 INFO  (coreLoadExecutor-5277-thread-1-processing-n:127.0.0.1:62428_n_vee) [n:127.0.0.1:62428_n_vee c:control_collection   x:collection1] o.a.s.s.OpenExchangeRatesOrgProvider Initialized with rates=open-exchange-rates.json, refreshInterval=1440.
   [junit4]   2> 1936172 INFO  (coreLoadExecutor-5277-thread-1-processing-n:127.0.0.1:62428_n_vee) [n:127.0.0.1:62428_n_vee c:control_collection   x:collection1] o.a.s.s.IndexSchema default search field in schema is text
   [junit4]   2> 1936172 INFO  (coreLoadExecutor-5277-thread-1-processing-n:127.0.0.1:62428_n_vee) [n:127.0.0.1:62428_n_vee c:control_collection   x:collection1] o.a.s.s.IndexSchema unique key field: id
   [junit4]   2> 1936374 INFO  (coreLoadExecutor-5277-thread-1-processing-n:127.0.0.1:62428_n_vee) [n:127.0.0.1:62428_n_vee c:control_collection   x:collection1] o.a.s.s.FileExchangeRateProvider Reloading exchange rates from file currency.xml
   [junit4]   2> 1936377 INFO  (coreLoadExecutor-5277-thread-1-processing-n:127.0.0.1:62428_n_vee) [n:127.0.0.1:62428_n_vee c:control_collection   x:collection1] o.a.s.s.FileExchangeRateProvider Reloading exchange rates from file currency.xml
   [junit4]   2> 1936379 INFO  (coreLoadExecutor-5277-thread-1-processing-n:127.0.0.1:62428_n_vee) [n:127.0.0.1:62428_n_vee c:control_collection   x:collection1] o.a.s.s.OpenExchangeRatesOrgProvider Reloading exchange rates from open-exchange-rates.json
   [junit4]   2> 1936381 INFO  (coreLoadExecutor-5277-thread-1-processing-n:127.0.0.1:62428_n_vee) [n:127.0.0.1:62428_n_vee c:control_collection   x:collection1] o.a.s.s.OpenExchangeRatesOrgProvider Reloading exchange rates from open-exchange-rates.json
   [junit4]   2> 1936384 INFO  (coreLoadExecutor-5277-thread-1-processing-n:127.0.0.1:62428_n_vee) [n:127.0.0.1:62428_n_vee c:control_collection   x:collection1] o.a.s.c.ConfigSetProperties Did not find ConfigSet properties, assuming default properties: Can't find resource 'configsetprops.json' in classpath or '/configs/conf1', cwd=/Users/jenkins/workspace/Lucene-Solr-trunk-MacOSX/solr/build/solr-core/test/J1
   [junit4]   2> 1936384 INFO  (coreLoadExecutor-5277-thread-1-processing-n:127.0.0.1:62428_n_vee) [n:127.0.0.1:62428_n_vee c:control_collection   x:collection1] o.a.s.c.CoreContainer Creating SolrCore 'collection1' using configuration from collection control_collection
   [junit4]   2> 1936384 INFO  (coreLoadExecutor-5277-thread-1-processing-n:127.0.0.1:62428_n_vee) [n:127.0.0.1:62428_n_vee c:control_collection s:shard1 r:core_node1 x:collection1] o.a.s.c.SolrCore org.apache.solr.core.MockDirectoryFactory
   [junit4]   2> 1936384 INFO  (coreLoadExecutor-5277-thread-1-processing-n:127.0.0.1:62428_n_vee) [n:127.0.0.1:62428_n_vee c:control_collection s:shard1 r:core_node1 x:collection1] o.a.s.c.SolrCore [[collection1] ] Opening new SolrCore at [/Users/jenkins/workspace/Lucene-Solr-trunk-MacOSX/solr/build/solr-core/test/J1/temp/solr.cloud.CloudExitableDirectoryReaderTest_37B2AB63772961A3-001/control-001/cores/collection1], dataDir=[/Users/jenkins/workspace/Lucene-Solr-trunk-MacOSX/solr/build/solr-core/test/J1/../../../../../../../../../Users/jenkins/workspace/Lucene-Solr-trunk-MacOSX/solr/build/solr-core/test/J1/temp/solr.cloud.CloudExitableDirectoryReaderTest_37B2AB63772961A3-001/control-001/cores/collection1/data/]
   [junit4]   2> 1936384 INFO  (coreLoadExecutor-5277-thread-1-processing-n:127.0.0.1:62428_n_vee) [n:127.0.0.1:62428_n_vee c:control_collection s:shard1 r:core_node1 x:collection1] o.a.s.c.JmxMonitoredMap JMX monitoring is enabled. Adding Solr mbeans to JMX Server: com.sun.jmx.mbeanserver.JmxMBeanServer@6ce21c05
   [junit4]   2> 1936385 INFO  (coreLoadExecutor-5277-thread-1-processing-n:127.0.0.1:62428_n_vee) [n:127.0.0.1:62428_n_vee c:control_collection s:shard1 r:core_node1 x:collection1] o.a.s.c.CachingDirectoryFactory return new directory for /Users/jenkins/workspace/Lucene-Solr-trunk-MacOSX/solr/build/solr-core/test/J1/../../../../../../../../../Users/jenkins/workspace/Lucene-Solr-trunk-MacOSX/solr/build/solr-core/test/J1/temp/solr.cloud.CloudExitableDirectoryReaderTest_37B2AB63772961A3-001/control-001/cores/collection1/data
   [junit4]   2> 1936385 INFO  (coreLoadExecutor-5277-thread-1-processing-n:127.0.0.1:62428_n_vee) [n:127.0.0.1:62428_n_vee c:control_collection s:shard1 r:core_node1 x:collection1] o.a.s.c.SolrCore New index directory detected: old=null new=/Users/jenkins/workspace/Lucene-Solr-trunk-MacOSX/solr/build/solr-core/test/J1/../../../../../../../../../Users/jenkins/workspace/Lucene-Solr-trunk-MacOSX/solr/build/solr-core/test/J1/temp/solr.cloud.CloudExitableDirectoryReaderTest_37B2AB63772961A3-001/control-001/cores/collection1/data/index/
   [junit4]   2> 1936385 WARN  (coreLoadExecutor-5277-thread-1-processing-n:127.0.0.1:62428_n_vee) [n:127.0.0.1:62428_n_vee c:control_collection s:shard1 r:core_node1 x:collection1] o.a.s.c.SolrCore [collection1] Solr index directory '/Users/jenkins/workspace/Lucene-Solr-trunk-MacOSX/solr/build/solr-core/test/J1/../../../../../../../../../Users/jenkins/workspace/Lucene-Solr-trunk-MacOSX/solr/build/solr-core/test/J1/temp/solr.cloud.CloudExitableDirectoryReaderTest_37B2AB63772961A3-001/control-001/cores/collection1/data/index' doesn't exist. Creating new index...
   [junit4]   2> 1936385 INFO  (coreLoadExecutor-5277-thread-1-processing-n:127.0.0.1:62428_n_vee) [n:127.0.0.1:62428_n_vee c:control_collection s:shard1 r:core_node1 x:collection1] o.a.s.c.CachingDirectoryFactory return new directory for /Users/jenkins/workspace/Lucene-Solr-trunk-MacOSX/solr/build/solr-core/test/J1/../../../../../../../../../Users/jenkins/workspace/Lucene-Solr-trunk-MacOSX/solr/build/solr-core/test/J1/temp/solr.cloud.CloudExitableDirectoryReaderTest_37B2AB63772961A3-001/control-001/cores/collection1/data/index
   [junit4]   2> 1936385 INFO  (coreLoadExecutor-5277-thread-1-processing-n:127.0.0.1:62428_n_vee) [n:127.0.0.1:62428_n_vee c:control_collection s:shard1 r:core_node1 x:collection1] o.a.s.u.RandomMergePolicy RandomMergePolicy wrapping class org.apache.lucene.index.AlcoholicMergePolicy: [AlcoholicMergePolicy: minMergeSize=0, mergeFactor=10, maxMergeSize=1232430514, maxMergeSizeForForcedMerge=9223372036854775807, calibrateSizeByDeletes=true, maxMergeDocs=2147483647, maxCFSSegmentSizeMB=8.796093022207999E12, noCFSRatio=0.1]
   [junit4]   2> 1936386 INFO  (coreLoadExecutor-5277-thread-1-processing-n:127.0.0.1:62428_n_vee) [n:127.0.0.1:62428_n_vee c:control_collection s:shard1 r:core_node1 x:collection1] o.a.s.c.SolrDeletionPolicy SolrDeletionPolicy.onCommit: commits: num=1
   [junit4]   2> 	commit{dir=MockDirectoryWrapper(RAMDirectory@16aae339 lockFactory=org.apache.lucene.store.SingleInstanceLockFactory@4145e7b4),segFN=segments_1,generation=1}
   [junit4]   2> 1936386 INFO  (coreLoadExecutor-5277-thread-1-processing-n:127.0.0.1:62428_n_vee) [n:127.0.0.1:62428_n_vee c:control_collection s:shard1 r:core_node1 x:collection1] o.a.s.c.SolrDeletionPolicy newest commit generation = 1
   [junit4]   2> 1936386 INFO  (OldIndexDirectoryCleanupThreadForCore-collection1) [n:127.0.0.1:62428_n_vee c:control_collection s:shard1 r:core_node1 x:collection1] o.a.s.c.SolrCore Looking for old index directories to cleanup for core collection1 in /Users/jenkins/workspace/Lucene-Solr-trunk-MacOSX/solr/build/solr-core/test/J1/../../../../../../../../../Users/jenkins/workspace/Lucene-Solr-trunk-MacOSX/solr/build/solr-core/test/J1/temp/solr.cloud.CloudExitableDirectoryReaderTest_37B2AB63772961A3-001/control-001/cores/collection1/data/
   [junit4]   2> 1936387 WARN  (OldIndexDirectoryCleanupThreadForCore-collection1) [n:127.0.0.1:62428_n_vee c:control_collection s:shard1 r:core_node1 x:collection1] o.a.s.c.DirectoryFactory /Users/jenkins/workspace/Lucene-Solr-trunk-MacOSX/solr/build/solr-core/test/J1/../../../../../../../../../Users/jenkins/workspace/Lucene-Solr-trunk-MacOSX/solr/build/solr-core/test/J1/temp/solr.cloud.CloudExitableDirectoryReaderTest_37B2AB63772961A3-001/control-001/cores/collection1/data/ does not point to a valid data directory; skipping clean-up of old index directories.
   [junit4]   2> 1936850 INFO  (coreLoadExecutor-5277-thread-1-processing-n:127.0.0.1:62428_n_vee) [n:127.0.0.1:62428_n_vee c:control_collection s:shard1 r:core_node1 x:collection1] o.a.s.u.p.UpdateRequestProcessorChain creating updateRequestProcessorChain "nodistrib"
   [junit4]   2> 1936850 INFO  (coreLoadExecutor-5277-thread-1-processing-n:127.0.0.1:62428_n_vee) [n:127.0.0.1:62428_n_vee c:control_collection s:shard1 r:core_node1 x:collection1] o.a.s.u.p.UpdateRequestProcessorChain creating updateRequestProcessorChain "dedupe"
   [junit4]   2> 1936850 INFO  (coreLoadExecutor-5277-thread-1-processing-n:127.0.0.1:62428_n_vee) [n:127.0.0.1:62428_n_vee c:control_collection s:shard1 r:core_node1 x:collection1] o.a.s.u.p.UpdateRequestProcessorChain inserting DistributedUpdateProcessorFactory into updateRequestProcessorChain "dedupe"
   [junit4]   2> 1936851 INFO  (coreLoadExecutor-5277-thread-1-processing-n:127.0.0.1:62428_n_vee) [n:127.0.0.1:62428_n_vee c:control_collection s:shard1 r:core_node1 x:collection1] o.a.s.u.p.UpdateRequestProcessorChain creating updateRequestProcessorChain "stored_sig"
   [junit4]   2> 1936851 INFO  (coreLoadExecutor-5277-thread-1-processing-n:127.0.0.1:62428_n_vee) [n:127.0.0.1:62428_n_vee c:control_collection s:shard1 r:core_node1 x:collection1] o.a.s.u.p.UpdateRequestProcessorChain inserting DistributedUpdateProcessorFactory into updateRequestProcessorChain "stored_sig"
   [junit4]   2> 1936851 INFO  (coreLoadExecutor-5277-thread-1-processing-n:127.0.0.1:62428_n_vee) [n:127.0.0.1:62428_n_vee c:control_collection s:shard1 r:core_node1 x:collection1] o.a.s.u.p.UpdateRequestProcessorChain creating updateRequestProcessorChain "distrib-dup-test-chain-explicit"
   [junit4]   2> 1936851 INFO  (coreLoadExecutor-5277-thread-1-processing-n:127.0.0.1:62428_n_vee) [n:127.0.0.1:62428_n_vee c:control_collection s:shard1 r:core_node1 x:collection1] o.a.s.u.p.UpdateRequestProcessorChain creating updateRequestProcessorChain "distrib-dup-test-chain-implicit"
   [junit4]   2> 1936851 INFO  (coreLoadExecutor-5277-thread-1-processing-n:127.0.0.1:62428_n_vee) [n:127.0.0.1:62428_n_vee c:control_collection s:shard1 r:core_node1 x:collection1] o.a.s.u.p.UpdateRequestProcessorChain inserting DistributedUpdateProcessorFactory into updateRequestProcessorChain "distrib-dup-test-chain-implicit"
   [junit4]   2> 1936851 INFO  (coreLoadExecutor-5277-thread-1-processing-n:127.0.0.1:62428_n_vee) [n:127.0.0.1:62428_n_vee c:control_collection s:shard1 r:core_node1 x:collection1] o.a.s.c.SolrCore no updateRequestProcessorChain defined as default, creating implicit default
   [junit4]   2> 1936854 INFO  (coreLoadExecutor-5277-thread-1-processing-n:127.0.0.1:62428_n_vee) [n:127.0.0.1:62428_n_vee c:control_collection s:shard1 r:core_node1 x:collection1] o.a.s.h.l.XMLLoader xsltCacheLifetimeSeconds=60
   [junit4]   2> 1936855 INFO  (coreLoadExecutor-5277-thread-1-processing-n:127.0.0.1:62428_n_vee) [n:127.0.0.1:62428_n_vee c:control_collection s:shard1 r:core_node1 x:collection1] o.a.s.h.l.XMLLoader xsltCacheLifetimeSeconds=60
   [junit4]   2> 1936856 INFO  (coreLoadExecutor-5277-thread-1-processing-n:127.0.0.1:62428_n_vee) [n:127.0.0.1:62428_n_vee c:control_collection s:shard1 r:core_node1 x:collection1] o.a.s.h.l.XMLLoader xsltCacheLifetimeSeconds=60
   [junit4]   2> 1936856 INFO  (coreLoadExecutor-5277-thread-1-processing-n:127.0.0.1:62428_n_vee) [n:127.0.0.1:62428_n_vee c:control_collection s:shard1 r:core_node1 x:collection1] o.a.s.h.l.XMLLoader xsltCacheLifetimeSeconds=60
   [junit4]   2> 1936860 INFO  (coreLoadExecutor-5277-thread-1-processing-n:127.0.0.1:62428_n_vee) [n:127.0.0.1:62428_n_vee c:control_collection s:shard1 r:core_node1 x:collection1] o.a.s.c.RequestHandlers Registered paths: /admin/mbeans,standard,/update/csv,/sql,/update/json/docs,/admin/luke,/export,/select,/admin/segments,/get,/admin/system,/replication,/admin/properties,/config,/stream,/schema,/admin/plugins,/admin/logging,/update/json,/admin/threads,/admin/ping,/update,/admin/file
   [junit4]   2> 1936861 INFO  (coreLoadExecutor-5277-thread-1-processing-n:127.0.0.1:62428_n_vee) [n:127.0.0.1:62428_n_vee c:control_collection s:shard1 r:core_node1 x:collection1] o.a.s.c.SolrCore Using default statsCache cache: org.apache.solr.search.stats.LocalStatsCache
   [junit4]   2> 1936862 INFO  (coreLoadExecutor-5277-thread-1-processing-n:127.0.0.1:62428_n_vee) [n:127.0.0.1:62428_n_vee c:control_collection s:shard1 r:core_node1 x:collection1] o.a.s.u.UpdateHandler Using UpdateLog implementation: org.apache.solr.update.UpdateLog
   [junit4]   2> 1936862 INFO  (coreLoadExecutor-5277-thread-1-processing-n:127.0.0.1:62428_n_vee) [n:127.0.0.1:62428_n_vee c:control_collection s:shard1 r:core_node1 x:collection1] o.a.s.u.UpdateLog Initializing UpdateLog: dataDir= defaultSyncLevel=FLUSH numRecordsToKeep=100 maxNumLogsToKeep=10 numVersionBuckets=65536
   [junit4]   2> 1936864 INFO  (coreLoadExecutor-5277-thread-1-processing-n:127.0.0.1:62428_n_vee) [n:127.0.0.1:62428_n_vee c:control_collection s:shard1 r:core_node1 x:collection1] o.a.s.u.CommitTracker Hard AutoCommit: disabled
   [junit4]   2> 1936864 INFO  (coreLoadExecutor-5277-thread-1-processing-n:127.0.0.1:62428_n_vee) [n:127.0.0.1:62428_n_vee c:control_collection s:shard1 r:core_node1 x:collection1] o.a.s.u.CommitTracker Soft AutoCommit: disabled
   [junit4]   2> 1936864 INFO  (coreLoadExecutor-5277-thread-1-processing-n:127.0.0.1:62428_n_vee) [n:127.0.0.1:62428_n_vee c:control_collection s:shard1 r:core_node1 x:collection1] o.a.s.u.RandomMergePolicy RandomMergePolicy wrapping class org.apache.lucene.index.TieredMergePolicy: [TieredMergePolicy: maxMergeAtOnce=21, maxMergeAtOnceExplicit=47, maxMergedSegmentMB=98.3134765625, floorSegmentMB=2.181640625, forceMergeDeletesPctAllowed=19.780011309276706, segmentsPerTier=13.0, maxCFSSegmentSizeMB=8.796093022207999E12, noCFSRatio=1.0
   [junit4]   2> 1936865 INFO  (coreLoadExecutor-5277-thread-1-processing-n:127.0.0.1:62428_n_vee) [n:127.0.0.1:62428_n_vee c:control_collection s:shard1 r:core_node1 x:collection1] o.a.s.c.SolrDeletionPolicy SolrDeletionPolicy.onInit: commits: num=1
   [junit4]   2> 	commit{dir=MockDirectoryWrapper(RAMDirectory@16aae339 lockFactory=org.apache.lucene.store.SingleInstanceLockFactory@4145e7b4),segFN=segments_1,generation=1}
   [junit4]   2> 1936865 INFO  (coreLoadExecutor-5277-thread-1-processing-n:127.0.0.1:62428_n_vee) [n:127.0.0.1:62428_n_vee c:control_collection s:shard1 r:core_node1 x:collection1] o.a.s.c.SolrDeletionPolicy newest commit generation = 1
   [junit4]   2> 1936865 INFO  (coreLoadExecutor-5277-thread-1-processing-n:127.0.0.1:62428_n_vee) [n:127.0.0.1:62428_n_vee c:control_collection s:shard1 r:core_node1 x:collection1] o.a.s.s.SolrIndexSearcher Opening [Searcher@2fc85e7d[collection1] main]
   [junit4]   2> 1936865 INFO  (coreLoadExecutor-5277-thread-1-processing-n:127.0.0.1:62428_n_vee) [n:127.0.0.1:62428_n_vee c:control_collection s:shard1 r:core_node1 x:collection1] o.a.s.c.c.ZkStateReader Load collection config from: [/collections/control_collection]
   [junit4]   2> 1936867 INFO  (coreLoadExecutor-5277-thread-1-processing-n:127.0.0.1:62428_n_vee) [n:127.0.0.1:62428_n_vee c:control_collection s:shard1 r:core_node1 x:collection1] o.a.s.c.c.ZkStateReader path=[/collections/control_collection] [configName]=[conf1] specified config exists in ZooKeeper
   [junit4]   2> 1936867 INFO  (coreLoadExecutor-5277-thread-1-processing-n:127.0.0.1:62428_n_vee) [n:127.0.0.1:62428_n_vee c:control_collection s:shard1 r:core_node1 x:collection1] o.a.s.r.ManagedResourceStorage Setting up ZooKeeper-based storage for the RestManager with znodeBase: /configs/conf1
   [junit4]   2> 1936867 INFO  (coreLoadExecutor-5277-thread-1-processing-n:127.0.0.1:62428_n_vee) [n:127.0.0.1:62428_n_vee c:control_collection s:shard1 r:core_node1 x:collection1] o.a.s.r.ManagedResourceStorage Configured ZooKeeperStorageIO with znodeBase: /configs/conf1
   [junit4]   2> 1936868 INFO  (coreLoadExecutor-5277-thread-1-processing-n:127.0.0.1:62428_n_vee) [n:127.0.0.1:62428_n_vee c:control_collection s:shard1 r:core_node1 x:collection1] o.a.s.r.RestManager Initializing RestManager with initArgs: {}
   [junit4]   2> 1936868 INFO  (coreLoadExecutor-5277-thread-1-processing-n:127.0.0.1:62428_n_vee) [n:127.0.0.1:62428_n_vee c:control_collection s:shard1 r:core_node1 x:collection1] o.a.s.r.ManagedResourceStorage Reading _rest_managed.json using ZooKeeperStorageIO:path=/configs/conf1
   [junit4]   2> 1936868 INFO  (coreLoadExecutor-5277-thread-1-processing-n:127.0.0.1:62428_n_vee) [n:127.0.0.1:62428_n_vee c:control_collection s:shard1 r:core_node1 x:collection1] o.a.s.r.ManagedResourceStorage No data found for znode /configs/conf1/_rest_managed.json
   [junit4]   2> 1936869 INFO  (coreLoadExecutor-5277-thread-1-processing-n:127.0.0.1:62428_n_vee) [n:127.0.0.1:62428_n_vee c:control_collection s:shard1 r:core_node1 x:collection1] o.a.s.r.ManagedResourceStorage Loaded null at path _rest_managed.json using ZooKeeperStorageIO:path=/configs/conf1
   [junit4]   2> 1936869 INFO  (coreLoadExecutor-5277-thread-1-processing-n:127.0.0.1:62428_n_vee) [n:127.0.0.1:62428_n_vee c:control_collection s:shard1 r:core_node1 x:collection1] o.a.s.r.RestManager Initializing 0 registered ManagedResources
   [junit4]   2> 1936869 INFO  (coreLoadExecutor-5277-thread-1-processing-n:127.0.0.1:62428_n_vee) [n:127.0.0.1:62428_n_vee c:control_collection s:shard1 r:core_node1 x:collection1] o.a.s.h.ReplicationHandler Commits will be reserved for  10000
   [junit4]   2> 1936869 INFO  (searcherExecutor-5278-thread-1-processing-n:127.0.0.1:62428_n_vee x:collection1 s:shard1 c:control_collection r:core_node1) [n:127.0.0.1:62428_n_vee c:control_collection s:shard1 r:core_node1 x:collection1] o.a.s.c.SolrCore [collection1] Registered new searcher Searcher@2fc85e7d[collection1] main{ExitableDirectoryReader(UninvertingDirectoryReader())}
   [junit4]   2> 1936869 INFO  (coreLoadExecutor-5277-thread-1-processing-n:127.0.0.1:62428_n_vee) [n:127.0.0.1:62428_n_vee c:control_collection s:shard1 r:core_node1 x:collection1] o.a.s.u.UpdateLog Looking up max value of version field to seed version buckets
   [junit4]   2> 1936869 INFO  (coreLoadExecutor-5277-thread-1-processing-n:127.0.0.1:62428_n_vee) [n:127.0.0.1:62428_n_vee c:control_collection s:shard1 r:core_node1 x:collection1] o.a.s.u.VersionInfo Refreshing highest value of _version_ for 65536 version buckets from index
   [junit4]   2> 1936870 INFO  (coreLoadExecutor-5277-thread-1-processing-n:127.0.0.1:62428_n_vee) [n:127.0.0.1:62428_n_vee c:control_collection s:shard1 r:core_node1 x:collection1] o.a.s.u.VersionInfo No terms found for _version_, cannot seed version bucket highest value from index
   [junit4]   2> 1936870 INFO  (coreLoadExecutor-5277-thread-1-processing-n:127.0.0.1:62428_n_vee) [n:127.0.0.1:62428_n_vee c:control_collection s:shard1 r:core_node1 x:collection1] o.a.s.u.UpdateLog Could not find max version in index or recent updates, using new clock 1523775727742222336
   [junit4]   2> 1936872 INFO  (coreLoadExecutor-5277-thread-1-processing-n:127.0.0.1:62428_n_vee) [n:127.0.0.1:62428_n_vee c:control_collection s:shard1 r:core_node1 x:collection1] o.a.s.u.UpdateLog Took 2.0ms to seed version buckets with highest version 1523775727742222336
   [junit4]   2> 1936872 INFO  (coreLoadExecutor-5277-thread-1-processing-n:127.0.0.1:62428_n_vee) [n:127.0.0.1:62428_n_vee c:control_collection s:shard1 r:core_node1 x:collection1] o.a.s.c.ZkController watch zkdir /configs/conf1
   [junit4]   2> 1936873 INFO  (coreLoadExecutor-5277-thread-1-processing-n:127.0.0.1:62428_n_vee) [n:127.0.0.1:62428_n_vee c:control_collection s:shard1 r:core_node1 x:collection1] o.a.s.c.CoreContainer registering core: collection1
   [junit4]   2> 1936874 INFO  (coreZkRegister-5271-thread-1-processing-n:127.0.0.1:62428_n_vee x:collection1 s:shard1 c:control_collection r:core_node1) [n:127.0.0.1:62428_n_vee c:control_collection s:shard1 r:core_node1 x:collection1] o.a.s.c.ZkController Register replica - core:collection1 address:http://127.0.0.1:62428/n_vee collection:control_collection shard:shard1
   [junit4]   2> 1936875 INFO  (coreZkRegister-5271-thread-1-processing-n:127.0.0.1:62428_n_vee x:collection1 s:shard1 c:control_collection r:core_node1) [n:127.0.0.1:62428_n_vee c:control_collection s:shard1 r:core_node1 x:collection1] o.a.s.c.c.SolrZkClient makePath: /collections/control_collection/leader_elect/shard1/election
   [junit4]   2> 1936883 INFO  (coreZkRegister-5271-thread-1-processing-n:127.0.0.1:62428_n_vee x:collection1 s:shard1 c:control_collection r:core_node1) [n:127.0.0.1:62428_n_vee c:control_collection s:shard1 r:core_node1 x:collection1] o.a.s.c.LeaderElector Joined leadership election with path: /collections/control_collection/leader_elect/shard1/election/95235982798946308-core_node1-n_0000000000
   [junit4]   2> 1936883 INFO  (coreZkRegister-5271-thread-1-processing-n:127.0.0.1:62428_n_vee x:collection1 s:shard1 c:control_collection r:core_node1) [n:127.0.0.1:62428_n_vee c:control_collection s:shard1 r:core_node1 x:collection1] o.a.s.c.ShardLeaderElectionContext Running the leader process for shard=shard1 and weAreReplacement=false and leaderVoteWait=10000
   [junit4]   2> 1936887 INFO  (coreZkRegister-5271-thread-1-processing-n:127.0.0.1:62428_n_vee x:collection1 s:shard1 c:control_collection r:core_node1) [n:127.0.0.1:62428_n_vee c:control_collection s:shard1 r:core_node1 x:collection1] o.a.s.c.ShardLeaderElectionContext Enough replicas found to continue.
   [junit4]   2> 1936887 INFO  (coreZkRegister-5271-thread-1-processing-n:127.0.0.1:62428_n_vee x:collection1 s:shard1 c:control_collection r:core_node1) [n:127.0.0.1:62428_n_vee c:control_collection s:shard1 r:core_node1 x:collection1] o.a.s.c.ShardLeaderElectionContext I may be the new leader - try and sync
   [junit4]   2> 1936887 INFO  (coreZkRegister-5271-thread-1-processing-n:127.0.0.1:62428_n_vee x:collection1 s:shard1 c:control_collection r:core_node1) [n:127.0.0.1:62428_n_vee c:control_collection s:shard1 r:core_node1 x:collection1] o.a.s.c.SyncStrategy Sync replicas to http://127.0.0.1:62428/n_vee/collection1/
   [junit4]   2> 1936887 INFO  (coreZkRegister-5271-thread-1-processing-n:127.0.0.1:62428_n_vee x:collection1 s:shard1 c:control_collection r:core_node1) [n:127.0.0.1:62428_n_vee c:control_collection s:shard1 r:core_node1 x:collection1] o.a.s.c.SyncStrategy Sync Success - now sync replicas to me
   [junit4]   2> 1936888 INFO  (coreZkRegister-5271-thread-1-processing-n:127.0.0.1:62428_n_vee x:collection1 s:shard1 c:control_collection r:core_node1) [n:127.0.0.1:62428_n_vee c:control_collection s:shard1 r:core_node1 x:collection1] o.a.s.c.SyncStrategy http://127.0.0.1:62428/n_vee/collection1/ has no replicas
   [junit4]   2> 1936888 INFO  (OverseerStateUpdate-95235982798946308-127.0.0.1:62428_n_vee-n_0000000000) [n:127.0.0.1:62428_n_vee    ] o.a.s.c.Overseer processMessage: queueSize: 1, message = {
   [junit4]   2>   "operation":"leader",
   [junit4]   2>   "shard":"shard1",
   [junit4]   2>   "collection":"control_collection"} current state version: 1
   [junit4]   2> 1936889 INFO  (coreZkRegister-5271-thread-1-processing-n:127.0.0.1:62428_n_vee x:collection1 s:shard1 c:control_collection r:core_node1) [n:127.0.0.1:62428_n_vee c:control_collection s:shard1 r:core_node1 x:collection1] o.a.s.c.c.SolrZkClient makePath: /collections/control_collection/leaders/shard1
   [junit4]   2> 1936891 INFO  (zkCallback-2333-thread-1-processing-n:127.0.0.1:62428_n_vee) [n:127.0.0.1:62428_n_vee    ] o.a.s.c.c.ZkStateReader A cluster state change: [WatchedEvent state:SyncConnected type:NodeDataChanged path:/clusterstate.json], has occurred - updating... (live nodes size: [1])
   [junit4]   2> 1936895 INFO  (coreZkRegister-5271-thread-1-processing-n:127.0.0.1:62428_n_vee x:collection1 s:shard1 c:control_collection r:core_node1) [n:127.0.0.1:62428_n_vee c:control_collection s:shard1 r:core_node1 x:collection1] o.a.s.c.ShardLeaderElectionContextBase Creating leader registration node
   [junit4]   2> 1936898 INFO  (coreZkRegister-5271-thread-1-processing-n:127.0.0.1:62428_n_vee x:collection1 s:shard1 c:control_collection r:core_node1) [n:127.0.0.1:62428_n_vee c:control_collection s:shard1 r:core_node1 x:collection1] o.a.s.c.ShardLeaderElectionContext I am the new leader: http://127.0.0.1:62428/n_vee/collection1/ shard1
   [junit4]   2> 1936900 INFO  (OverseerStateUpdate-95235982798946308-127.0.0.1:62428_n_vee-n_0000000000) [n:127.0.0.1:62428_n_vee    ] o.a.s.c.Overseer processMessage: queueSize: 1, message = {
   [junit4]   2>   "operation":"leader",
   [junit4]   2>   "shard":"shard1",
   [junit4]   2>   "collection":"control_collection",
   [junit4]   2>   "base_url":"http://127.0.0.1:62428/n_vee",
   [junit4]   2>   "core":"collection1",
   [junit4]   2>   "state":"active"} current state version: 2
   [junit4]   2> 1937005 INFO  (zkCallback-2333-thread-1-processing-n:127.0.0.1:62428_n_vee) [n:127.0.0.1:62428_n_vee    ] o.a.s.c.c.ZkStateReader A cluster state change: [WatchedEvent state:SyncConnected type:NodeDataChanged path:/clusterstate.json], has occurred - updating... (live nodes size: [1])
   [junit4]   2> 1937054 INFO  (coreZkRegister-5271-thread-1-processing-n:127.0.0.1:62428_n_vee x:collection1 s:shard1 c:control_collection r:core_node1) [n:127.0.0.1:62428_n_vee c:control_collection s:shard1 r:core_node1 x:collection1] o.a.s.c.ZkController We are http://127.0.0.1:62428/n_vee/collection1/ and leader is http://127.0.0.1:62428/n_vee/collection1/
   [junit4]   2> 1937054 INFO  (coreZkRegister-5271-thread-1-processing-n:127.0.0.1:62428_n_vee x:collection1 s:shard1 c:control_collection r:core_node1) [n:127.0.0.1:62428_n_vee c:control_collection s:shard1 r:core_node1 x:collection1] o.a.s.c.ZkController No LogReplay needed for core=collection1 baseURL=http://127.0.0.1:62428/n_vee
   [junit4]   2> 1937054 INFO  (coreZkRegister-5271-thread-1-processing-n:127.0.0.1:62428_n_vee x:collection1 s:shard1 c:control_collection r:core_node1) [n:127.0.0.1:62428_n_vee c:control_collection s:shard1 r:core_node1 x:collection1] o.a.s.c.ZkController I am the leader, no recovery necessary
   [junit4]   2> 1937054 INFO  (coreZkRegister-5271-thread-1-processing-n:127.0.0.1:62428_n_vee x:collection1 s:shard1 c:control_collection r:core_node1) [n:127.0.0.1:62428_n_vee c:control_collection s:shard1 r:core_node1 x:collection1] o.a.s.c.ZkController publishing state=active
   [junit4]   2> 1937054 INFO  (coreZkRegister-5271-thread-1-processing-n:127.0.0.1:62428_n_vee x:collection1 s:shard1 c:control_collection r:core_node1) [n:127.0.0.1:62428_n_vee c:control_collection s:shard1 r:core_node1 x:collection1] o.a.s.c.ZkController numShards not found on descriptor - reading it from system property
   [junit4]   2> 1937057 INFO  (OverseerStateUpdate-95235982798946308-127.0.0.1:62428_n_vee-n_0000000000) [n:127.0.0.1:62428_n_vee    ] o.a.s.c.Overseer processMessage: queueSize: 1, message = {
   [junit4]   2>   "core":"collection1",
   [junit4]   2>   "core_node_name":"core_node1",
   [junit4]   2>   "roles":null,
   [junit4]   2>   "base_url":"http://127.0.0.1:62428/n_vee",
   [junit4]   2>   "node_name":"127.0.0.1:62428_n_vee",
   [junit4]   2>   "numShards":"1",
   [junit4]   2>   "state":"active",
   [junit4]   2>   "shard":"shard1",
   [junit4]   2>   "collection":"control_collection",
   [junit4]   2>   "operation":"state"} current state version: 3
   [junit4]   2> 1937058 INFO  (OverseerStateUpdate-95235982798946308-127.0.0.1:62428_n_vee-n_0000000000) [n:127.0.0.1:62428_n_vee    ] o.a.s.c.o.ReplicaMutator Update state numShards=1 message={
   [junit4]   2>   "core":"collection1",
   [junit4]   2>   "core_node_name":"core_node1",
   [junit4]   2>   "roles":null,
   [junit4]   2>   "base_url":"http://127.0.0.1:62428/n_vee",
   [junit4]   2>   "node_name":"127.0.0.1:62428_n_vee",
   [junit4]   2>   "numShards":"1",
   [junit4]   2>   "state":"active",
   [junit4]   2>   "shard":"shard1",
   [junit4]   2>   "collection":"control_collection",
   [junit4]   2>   "operation":"state"}
   [junit4]   2> 1937143 INFO  (TEST-CloudExitableDirectoryReaderTest.test-seed#[37B2AB63772961A3]) [    ] o.a.s.c.c.SolrZkClient Using default ZkCredentialsProvider
   [junit4]   2> 1937144 INFO  (TEST-CloudExitableDirectoryReaderTest.test-seed#[37B2AB63772961A3]) [    ] o.a.s.c.c.ConnectionManager Waiting for client to connect to ZooKeeper
   [junit4]   2> 1937145 INFO  (zkCallback-2335-thread-1) [    ] o.a.s.c.c.ConnectionManager Watcher org.apache.solr.common.cloud.ConnectionManager@1102b669 name:ZooKeeperConnection Watcher:127.0.0.1:62425/solr got event WatchedEvent state:SyncConnected type:None path:null path:null type:None
   [junit4]   2> 1937145 INFO  (TEST-CloudExitableDirectoryReaderTest.test-seed#[37B2AB63772961A3]) [    ] o.a.s.c.c.ConnectionManager Client is connected to ZooKeeper
   [junit4]   2> 1937146 INFO  (TEST-CloudExitableDirectoryReaderTest.test-seed#[37B2AB63772961A3]) [    ] o.a.s.c.c.SolrZkClient Using default ZkACLProvider
   [junit4]   2> 1937146 INFO  (TEST-CloudExitableDirectoryReaderTest.test-seed#[37B2AB63772961A3]) [    ] o.a.s.c.c.ZkStateReader Updating cluster state from ZooKeeper... 
   [junit4]   2> 1937151 INFO  (TEST-CloudExitableDirectoryReaderTest.test-seed#[37B2AB63772961A3]) [    ] o.a.s.c.ChaosMonkey monkey: init - expire sessions:false cause connection loss:false
   [junit4]   2> 1937151 INFO  (TEST-CloudExitableDirectoryReaderTest.test-seed#[37B2AB63772961A3]) [    ] o.a.s.c.AbstractFullDistribZkTestBase Creating collection1 with stateFormat=2
   [junit4]   2> 1937151 INFO  (TEST-CloudExitableDirectoryReaderTest.test-seed#[37B2AB63772961A3]) [    ] o.a.s.c.c.SolrZkClient Using default ZkCredentialsProvider
   [junit4]   2> 1937151 INFO  (TEST-CloudExitableDirectoryReaderTest.test-seed#[37B2AB63772961A3]) [    ] o.a.s.c.c.ConnectionManager Waiting for client to connect to ZooKeeper
   [junit4]   2> 1937152 INFO  (zkCallback-2336-thread-1) [    ] o.a.s.c.c.ConnectionManager Watcher org.apache.solr.common.cloud.ConnectionManager@672524ba name:ZooKeeperConnection Watcher:127.0.0.1:62425/solr got event WatchedEvent state:SyncConnected type:None path:null path:null type:None
   [junit4]   2> 1937153 INFO  (TEST-CloudExitableDirectoryReaderTest.test-seed#[37B2AB63772961A3]) [    ] o.a.s.c.c.ConnectionManager Client is connected to ZooKeeper
   [junit4]   2> 1937153 INFO  (TEST-CloudExitableDirectoryReaderTest.test-seed#[37B2AB63772961A3]) [    ] o.a.s.c.c.SolrZkClient Using default ZkACLProvider
   [junit4]   2> 1937156 INFO  (OverseerStateUpdate-95235982798946308-127.0.0.1:62428_n_vee-n_0000000000) [n:127.0.0.1:62428_n_vee    ] o.a.s.c.Overseer processMessage: queueSize: 1, message = {
   [junit4]   2>   "operation":"create",
   [junit4]   2>   "name":"collection1",
   [junit4]   2>   "numShards":"2",
   [junit4]   2>   "stateFormat":"2"} current state version: 3
   [junit4]   2> 1937156 INFO  (OverseerStateUpdate-95235982798946308-127.0.0.1:62428_n_vee-n_0000000000) [n:127.0.0.1:62428_n_vee    ] o.a.s.c.o.ClusterStateMutator building a new cName: collection1
   [junit4]   2> 1937157 INFO  (zkCallback-2335-thread-1) [    ] o.a.s.c.c.ZkStateReader A cluster state change: [WatchedEvent state:SyncConnected type:NodeDataChanged path:/clusterstate.json], has occurred - updating... (live nodes size: [1])
   [junit4]   2> 1937159 INFO  (zkCallback-2333-thread-1-processing-n:127.0.0.1:62428_n_vee) [n:127.0.0.1:62428_n_vee    ] o.a.s.c.c.ZkStateReader A cluster state change: [WatchedEvent state:SyncConnected type:NodeDataChanged path:/clusterstate.json], has occurred - updating... (live nodes size: [1])
   [junit4]   2> 1937267 INFO  (OverseerStateUpdate-95235982798946308-127.0.0.1:62428_n_vee-n_0000000000) [n:127.0.0.1:62428_n_vee    ] o.a.s.c.o.ZkStateWriter going to create_collection /collections/collection1/state.json
   [junit4]   2> 1940085 INFO  (TEST-CloudExitableDirectoryReaderTest.test-seed#[37B2AB63772961A3]) [    ] o.a.s.SolrTestCaseJ4 Writing core.properties file to /Users/jenkins/workspace/Lucene-Solr-trunk-MacOSX/solr/build/solr-core/test/J1/temp/solr.cloud.CloudExitableDirectoryReaderTest_37B2AB63772961A3-001/shard-1-001/cores/collection1
   [junit4]   2> 1940087 INFO  (TEST-CloudExitableDirectoryReaderTest.test-seed#[37B2AB63772961A3]) [    ] o.a.s.c.AbstractFullDistribZkTestBase create jetty 1 in directory /Users/jenkins/workspace/Lucene-Solr-trunk-MacOSX/solr/build/solr-core/test/J1/temp/solr.cloud.CloudExitableDirectoryReaderTest_37B2AB63772961A3-001/shard-1-001
   [junit4]   2> 1940087 INFO  (TEST-CloudExitableDirectoryReaderTest.test-seed#[37B2AB63772961A3]) [    ] o.e.j.s.Server jetty-9.2.13.v20150730
   [junit4]   2> 1940092 INFO  (TEST-CloudExitableDirectoryReaderTest.test-seed#[37B2AB63772961A3]) [    ] o.e.j.s.h.ContextHandler Started o.e.j.s.ServletContextHandler@257f95bc{/n_vee,null,AVAILABLE}
   [junit4]   2> 1940092 INFO  (TEST-CloudExitableDirectoryReaderTest.test-seed#[37B2AB63772961A3]) [    ] o.e.j.s.ServerConnector Started ServerConnector@74bc11e1{HTTP/1.1}{127.0.0.1:62434}
   [junit4]   2> 1940092 INFO  (TEST-CloudExitableDirectoryReaderTest.test-seed#[37B2AB63772961A3]) [    ] o.e.j.s.Server Started @1943437ms
   [junit4]   2> 1940092 INFO  (TEST-CloudExitableDirectoryReaderTest.test-seed#[37B2AB63772961A3]) [    ] o.a.s.c.s.e.JettySolrRunner Jetty properties: {solr.data.dir=/Users/jenkins/workspace/Lucene-Solr-trunk-MacOSX/solr/build/solr-core/test/J1/temp/solr.cloud.CloudExitableDirectoryReaderTest_37B2AB63772961A3-001/tempDir-001/jetty1, solrconfig=solrconfig.xml, hostContext=/n_vee, hostPort=62434, coreRootDirectory=/Users/jenkins/workspace/Lucene-Solr-trunk-MacOSX/solr/build/solr-core/test/J1/temp/solr.cloud.CloudExitableDirectoryReaderTest_37B2AB63772961A3-001/shard-1-001/cores}
   [junit4]   2> 1940093 INFO  (TEST-CloudExitableDirectoryReaderTest.test-seed#[37B2AB63772961A3]) [    ] o.a.s.s.SolrDispatchFilter SolrDispatchFilter.init(): sun.misc.Launcher$AppClassLoader@74a14482
   [junit4]   2> 1940093 INFO  (TEST-CloudExitableDirectoryReaderTest.test-seed#[37B2AB63772961A3]) [    ] o.a.s.c.SolrResourceLoader new SolrResourceLoader for directory: '/Users/jenkins/workspace/Lucene-Solr-trunk-MacOSX/solr/build/solr-core/test/J1/temp/solr.cloud.CloudExitableDirectoryReaderTest_37B2AB63772961A3-001/shard-1-001'
   [junit4]   2> 1940093 INFO  (TEST-CloudExitableDirectoryReaderTest.test-seed#[37B2AB63772961A3]) [    ] o.a.s.c.SolrResourceLoader JNDI not configured for solr (NoInitialContextEx)
   [junit4]   2> 1940093 INFO  (TEST-CloudExitableDirectoryReaderTest.test-seed#[37B2AB63772961A3]) [    ] o.a.s.c.SolrResourceLoader solr home defaulted to 'solr/' (could not find system property or JNDI)
   [junit4]   2> 1940093 INFO  (TEST-CloudExitableDirectoryReaderTest.test-seed#[37B2AB63772961A3]) [    ] o.a.s.c.c.SolrZkClient Using default ZkCredentialsProvider
   [junit4]   2> 1940094 INFO  (TEST-CloudExitableDirectoryReaderTest.test-seed#[37B2AB63772961A3]) [    ] o.a.s.c.c.ConnectionManager Waiting for client to connect to ZooKeeper
   [junit4]   2> 1940096 INFO  (zkCallback-2337-thread-1) [    ] o.a.s.c.c.ConnectionManager Watcher org.apache.solr.common.cloud.ConnectionManager@593dc2e4 name:ZooKeeperConnection Watcher:127.0.0.1:62425/solr got event WatchedEvent state:SyncConnected type:None path:null path:null type:None
   [junit4]   2> 1940096 INFO  (TEST-CloudExitableDirectoryReaderTest.test-seed#[37B2AB63772961A3]) [    ] o.a.s.c.c.ConnectionManager Client is connected to ZooKeeper
   [junit4]   2> 1940096 INFO  (TEST-CloudExitableDirectoryReaderTest.test-seed#[37B2AB63772961A3]) [    ] o.a.s.c.c.SolrZkClient Using default ZkACLProvider
   [junit4]   2> 1940099 INFO  (TEST-CloudExitableDirectoryReaderTest.test-seed#[37B2AB63772961A3]) [    ] o.a.s.s.SolrDispatchFilter Loading solr.xml from SolrHome (not found in ZooKeeper)
   [junit4]   2> 1940099 INFO  (TEST-CloudExitableDirectoryReaderTest.test-seed#[37B2AB63772961A3]) [    ] o.a.s.c.SolrXmlConfig Loading container configuration from /Users/jenkins/workspace/Lucene-Solr-trunk-MacOSX/solr/build/solr-core/test/J1/temp/solr.cloud.CloudExitableDirectoryReaderTest_37B2AB63772961A3-001/shard-1-001/solr.xml
   [junit4]   2> 1940106 INFO  (TEST-CloudExitableDirectoryReaderTest.test-seed#[37B2AB63772961A3]) [    ] o.a.s.c.CorePropertiesLocator Config-defined core root directory: /Users/jenkins/workspace/Lucene-Solr-trunk-MacOSX/solr/build/solr-core/test/J1/temp/solr.cloud.CloudExitableDirectoryReaderTest_37B2AB63772961A3-001/shard-1-001/cores
   [junit4]   2> 1940107 INFO  (TEST-CloudExitableDirectoryReaderTest.test-seed#[37B2AB63772961A3]) [    ] o.a.s.c.CoreContainer New CoreContainer 2007057033
   [junit4]   2> 1940107 INFO  (TEST-CloudExitableDirectoryReaderTest.test-seed#[37B2AB63772961A3]) [    ] o.a.s.c.CoreContainer Loading cores into CoreContainer [instanceDir=/Users/jenkins/workspace/Lucene-Solr-trunk-MacOSX/solr/build/solr-core/test/J1/temp/solr.cloud.CloudExitableDirectoryReaderTest_37B2AB63772961A3-001/shard-1-001]
   [junit4]   2> 1940107 WARN  (TEST-CloudExitableDirectoryReaderTest.test-seed#[37B2AB63772961A3]) [    ] o.a.s.c.CoreContainer Couldn't add files from /Users/jenkins/workspace/Lucene-Solr-trunk-MacOSX/solr/build/solr-core/test/J1/temp/solr.cloud.CloudExitableDirectoryReaderTest_37B2AB63772961A3-001/shard-1-001/lib to classpath: /Users/jenkins/workspace/Lucene-Solr-trunk-MacOSX/solr/build/solr-core/test/J1/temp/solr.cloud.CloudExitableDirectoryReaderTest_37B2AB63772961A3-001/shard-1-001/lib
   [junit4]   2> 1940107 INFO  (TEST-CloudExitableDirectoryReaderTest.test-seed#[37B2AB63772961A3]) [    ] o.a.s.h.c.HttpShardHandlerFactory created with socketTimeout : 90000,urlScheme : ,connTimeout : 15000,maxConnectionsPerHost : 20,maxConnections : 10000,corePoolSize : 0,maximumPoolSize : 2147483647,maxThreadIdleTime : 5,sizeOfQueue : -1,fairnessPolicy : false,useRetries : false,
   [junit4]   2> 1940109 INFO  (TEST-CloudExitableDirectoryReaderTest.test-seed#[37B2AB63772961A3]) [    ] o.a.s.u.UpdateShardHandler Creating UpdateShardHandler HTTP client with params: socketTimeout=340000&connTimeout=45000&retry=true
   [junit4]   2> 1940110 INFO  (TEST-CloudExitableDirectoryReaderTest.test-seed#[37B2AB63772961A3]) [    ] o.a.s.l.LogWatcher SLF4J impl is org.slf4j.impl.Log4jLoggerFactory
   [junit4]   2> 1940110 INFO  (TEST-CloudExitableDirectoryReaderTest.test-seed#[37B2AB63772961A3]) [    ] o.a.s.l.LogWatcher Registering Log Listener [Log4j (org.slf4j.impl.Log4jLoggerFactory)]
   [junit4]   2> 1940110 INFO  (TEST-CloudExitableDirectoryReaderTest.test-seed#[37B2AB63772961A3]) [    ] o.a.s.c.ZkContainer Zookeeper client=127.0.0.1:62425/solr
   [junit4]   2> 1940110 INFO  (TEST-CloudExitableDirectoryReaderTest.test-seed#[37B2AB63772961A3]) [    ] o.a.s.c.ZkController zkHost includes chroot
   [junit4]   2> 1940111 INFO  (TEST-CloudExitableDirectoryReaderTest.test-seed#[37B2AB63772961A3]) [    ] o.a.s.c.c.SolrZkClient Using default ZkCredentialsProvider
   [junit4]   2> 1940111 INFO  (TEST-CloudExitableDirectoryReaderTest.test-seed#[37B2AB63772961A3]) [    ] o.a.s.c.c.ConnectionManager Waiting for client to connect to ZooKeeper
   [junit4]   2> 1940113 INFO  (zkCallback-2340-thread-1) [    ] o.a.s.c.c.ConnectionManager Watcher org.apache.solr.common.cloud.ConnectionManager@7d7768a2 name:ZooKeeperConnection Watcher:127.0.0.1:62425 got event WatchedEvent state:SyncConnected type:None path:null path:null type:None
   [junit4]   2> 1940113 INFO  (TEST-CloudExitableDirectoryReaderTest.test-seed#[37B2AB63772961A3]) [    ] o.a.s.c.c.ConnectionManager Client is connected to ZooKeeper
   [junit4]   2> 1940113 INFO  (TEST-CloudExitableDirectoryReaderTest.test-seed#[37B2AB63772961A3]) [    ] o.a.s.c.c.SolrZkClient Using default ZkACLProvider
   [junit4]   2> 1940116 INFO  (TEST-CloudExitableDirectoryReaderTest.test-seed#[37B2AB63772961A3]) [n:127.0.0.1:62434_n_vee    ] o.a.s.c.c.ConnectionManager Waiting for client to connect to ZooKeeper
   [junit4]   2> 1940117 INFO  (zkCallback-2341-thread-1-processing-n:127.0.0.1:62434_n_vee) [n:127.0.0.1:62434_n_vee    ] o.a.s.c.c.ConnectionManager Watcher org.apache.solr.common.cloud.ConnectionManager@41062920 name:ZooKeeperConnection Watcher:127.0.0.1:62425/solr got event WatchedEvent state:SyncConnected type:None path:null path:null type:None
   [junit4]   2> 1940118 INFO  (TEST-CloudExitableDirectoryReaderTest.test-seed#[37B2AB63772961A3]) [n:127.0.0.1:62434_n_vee    ] o.a.s.c.c.ConnectionManager Client is connected to ZooKeeper
   [junit4]   2> 1940129 INFO  (TEST-CloudExitableDirectoryReaderTest.test-seed#[37B2AB63772961A3]) [n:127.0.0.1:62434_n_vee    ] o.a.s.c.c.ZkStateReader Updating cluster state from ZooKeeper... 
   [junit4]   2> 1941151 INFO  (TEST-CloudExitableDirectoryReaderTest.test-seed#[37B2AB63772961A3]) [n:127.0.0.1:62434_n_vee    ] o.a.s.c.ZkController Register node as live in ZooKeeper:/live_nodes/127.0.0.1:62434_n_vee
   [junit4]   2> 1941152 INFO  (TEST-CloudExitableDirectoryReaderTest.test-seed#[37B2AB63772961A3]) [n:127.0.0.1:62434_n_vee    ] o.a.s.c.c.SolrZkClient makePath: /live_nodes/127.0.0.1:62434_n_vee
   [junit4]   2> 1941155 INFO  (zkCallback-2335-thread-1) [    ] o.a.s.c.c.ZkStateReader A live node change: [WatchedEvent state:SyncConnected type:NodeChildrenChanged path:/live_nodes], has occurred - updating... (live nodes size: [1])
   [junit4]   2> 1941155 INFO  (zkCallback-2341-thread-1-processing-n:127.0.0.1:62434_n_vee) [n:127.0.0.1:62434_n_vee    ] o.a.s.c.c.ZkStateReader A live node change: [WatchedEvent state:SyncConnected type:NodeChildrenChanged path:/live_nodes], has occurred - updating... (live nodes size: [1])
   [junit4]   2> 1941155 INFO  (zkCallback-2333-thread-1-processing-n:127.0.0.1:62428_n_vee) [n:127.0.0.1:62428_n_vee    ] o.a.s.c.c.ZkStateReader A live node change: [WatchedEvent state:SyncConnected type:NodeChildrenChanged path:/live_nodes], has occurred - updating... (live nodes size: [1])
   [junit4]   2> 1941158 INFO  (TEST-CloudExitableDirectoryReaderTest.test-seed#[37B2AB63772961A3]) [n:127.0.0.1:62434_n_vee    ] o.a.s.c.Overseer Overseer (id=null) closing
   [junit4]   2> 1941159 INFO  (TEST-CloudExitableDirectoryReaderTest.test-seed#[37B2AB63772961A3]) [n:127.0.0.1:62434_n_vee    ] o.a.s.c.LeaderElector Joined leadership election with path: /overseer_elect/election/95235982798946313-127.0.0.1:62434_n_vee-n_0000000001
   [junit4]   2> 1941160 INFO  (TEST-CloudExitableDirectoryReaderTest.test-seed#[37B2AB63772961A3]) [n:127.0.0.1:62434_n_vee    ] o.a.s.c.LeaderElector Watching path /overseer_elect/election/95235982798946308-127.0.0.1:62428_n_vee-n_0000000000 to know if I could be the leader
   [junit4]   2> 1941175 INFO  (TEST-CloudExitableDirectoryReaderTest.test-seed#[37B2AB63772961A3]) [n:127.0.0.1:62434_n_vee    ] o.a.s.c.CoreContainer Security conf doesn't exist. Skipping setup for authorization module.
   [junit4]   2> 1941175 INFO  (TEST-CloudExitableDirectoryReaderTest.test-seed#[37B2AB63772961A3]) [n:127.0.0.1:62434_n_vee    ] o.a.s.c.CoreContainer No authentication plugin used.
   [junit4]   2> 1941178 INFO  (TEST-CloudExitableDirectoryReaderTest.test-seed#[37B2AB63772961A3]) [n:127.0.0.1:62434_n_vee    ] o.a.s.c.CorePropertiesLocator Looking for core definitions underneath /Users/jenkins/workspace/Lucene-Solr-trunk-MacOSX/solr/build/solr-core/test/J1/temp/solr.cloud.CloudExitableDirectoryReaderTest_37B2AB63772961A3-001/shard-1-001/cores
   [junit4]   2> 1941179 INFO  (TEST-CloudExitableDirectoryReaderTest.test-seed#[37B2AB63772961A3]) [n:127.0.0.1:62434_n_vee    ] o.a.s.c.CoreDescriptor Created CoreDescriptor: {name=collection1, config=solrconfig.xml, transient=false, schema=schema.xml, loadOnStartup=true, configSetProperties=configsetprops.json, collection=collection1, coreNodeName=, dataDir=data/, shard=}
   [junit4]   2> 1941179 INFO  (TEST-CloudExitableDirectoryReaderTest.test-seed#[37B2AB63772961A3]) [n:127.0.0.1:62434_n_vee    ] o.a.s.c.CorePropertiesLocator Found core collection1 in /Users/jenkins/workspace/Lucene-Solr-trunk-MacOSX/solr/build/solr-core/test/J1/temp/solr.cloud.CloudExitableDirectoryReaderTest_37B2AB63772961A3-001/shard-1-001/cores/collection1
   [junit4]   2> 1941179 INFO  (TEST-CloudExitableDirectoryReaderTest.test-seed#[37B2AB63772961A3]) [n:127.0.0.1:62434_n_vee    ] o.a.s.c.CorePropertiesLocator Found 1 core definitions
   [junit4]   2> 1941181 INFO  (TEST-CloudExitableDirectoryReaderTest.test-seed#[37B2AB63772961A3]) [n:127.0.0.1:62434_n_vee    ] o.a.s.s.SolrDispatchFilter user.dir=/Users/jenkins/workspace/Lucene-Solr-trunk-MacOSX/solr/build/solr-core/test/J1
   [junit4]   2> 1941181 INFO  (TEST-CloudExitableDirectoryReaderTest.test-seed#[37B2AB63772961A3]) [n:127.0.0.1:62434_n_vee    ] o.a.s.s.SolrDispatchFilter SolrDispatchFilter.init() done
   [junit4]   2> 1941182 INFO  (coreLoadExecutor-5288-thread-1-processing-n:127.0.0.1:62434_n_vee) [n:127.0.0.1:62434_n_vee c:collection1   x:collection1] o.a.s.c.ZkController publishing state=down
   [junit4]   2> 1941182 INFO  (coreLoadExecutor-5288-thread-1-processing-n:127.0.0.1:62434_n_vee) [n:127.0.0.1:62434_n_vee c:collection1   x:collection1] o.a.s.c.ZkController numShards not found on descriptor - reading it from system property
   [junit4]   2> 1941185 INFO  (coreLoadExecutor-5288-thread-1-processing-n:127.0.0.1:62434_n_vee) [n:127.0.0.1:62434_n_vee c:collection1   x:collection1] o.a.s.c.ZkController Registering watch for collection collection1
   [junit4]   2> 1941185 INFO  (coreLoadExecutor-5288-thread-1-processing-n:127.0.0.1:62434_n_vee) [n:127.0.0.1:62434_n_vee c:collection1   x:collection1] o.a.s.c.c.ZkStateReader addZkWatch [collection1]
   [junit4]   2> 1941185 INFO  (coreLoadExecutor-5288-thread-1-processing-n:127.0.0.1:62434_n_vee) [n:127.0.0.1:62434_n_vee c:collection1   x:collection1] o.a.s.c.c.ZkStateReader Add data for [collection1] ver [0]
   [junit4]   2> 1941185 INFO  (OverseerStateUpdate-95235982798946308-127.0.0.1:62428_n_vee-n_0000000000) [n:127.0.0.1:62428_n_vee    ] o.a.s.c.Overseer processMessage: queueSize: 1, message = {
   [junit4]   2>   "core":"collection1",
   [junit4]   2>   "roles":null,
   [junit4]   2>   "base_url":"http://127.0.0.1:62434/n_vee",
   [junit4]   2>   "node_name":"127.0.0.1:62434_n_vee",
   [junit4]   2>   "numShards":"2",
   [junit4]   2>   "state":"down",
   [junit4]   2>   "shard":null,
   [junit4]   2>   "collection":"collection1",
   [junit4]   2>   "operation":"state"} current state version: 4
   [junit4]   2> 1941185 INFO  (coreLoadExecutor-5288-thread-1-processing-n:127.0.0.1:62434_n_vee) [n:127.0.0.1:62434_n_vee c:collection1   x:collection1] o.a.s.c.ZkController look for our core node name
   [junit4]   2> 1941186 INFO  (OverseerStateUpdate-95235982798946308-127.0.0.1:62428_n_vee-n_0000000000) [n:127.0.0.1:62428_n_vee    ] o.a.s.c.o.ReplicaMutator Update state numShards=2 message={
   [junit4]   2>   "core":"collection1",
   [junit4]   2>   "roles":null,
   [junit4]   2>   "base_url":"http://127.0.0.1:62434/n_vee",
   [junit4]   2>   "node_name":"127.0.0.1:62434_n_vee",
   [junit4]   2>   "numShards":"2",
   [junit4]   2>   "state":"down",
   [junit4]   2>   "shard":null,
   [junit4]   2>   "collection":"collection1",
   [junit4]   2>   "operation":"state"}
   [junit4]   2> 1941186 INFO  (OverseerStateUpdate-95235982798946308-127.0.0.1:62428_n_vee-n_0000000000) [n:127.0.0.1:62428_n_vee    ] o.a.s.c.o.ReplicaMutator Collection already exists with numShards=2
   [junit4]   2> 1941186 INFO  (OverseerStateUpdate-95235982798946308-127.0.0.1:62428_n_vee-n_0000000000) [n:127.0.0.1:62428_n_vee    ] o.a.s.c.o.ReplicaMutator Assigning new node to shard shard=shard2
   [junit4]   2> 1941188 INFO  (OverseerStateUpdate-95235982798946308-127.0.0.1:62428_n_vee-n_0000000000) [n:127.0.0.1:62428_n_vee    ] o.a.s.c.o.ZkStateWriter going to update_collection /collections/collection1/state.json version: 0
   [junit4]   2> 1941189 INFO  (zkCallback-2341-thread-1-processing-n:127.0.0.1:62434_n_vee) [n:127.0.0.1:62434_n_vee    ] o.a.s.c.c.ZkStateReader A cluster state change: [WatchedEvent state:SyncConnected type:NodeDataChanged path:/collections/collection1/state.json] for collection [collection1] has occurred - updating... (live nodes size: [2])
   [junit4]   2> 1941190 INFO  (zkCallback-2341-thread-1-processing-n:127.0.0.1:62434_n_vee) [n:127.0.0.1:62434_n_vee    ] o.a.s.c.c.ZkStateReader Updating data for [collection1] from [0] to [1]
   [junit4]   2> 1942188 INFO  (coreLoadExecutor-5288-thread-1-processing-n:127.0.0.1:62434_n_vee) [n:127.0.0.1:62434_n_vee c:collection1   x:collection1] o.a.s.c.ZkController waiting to find shard id in clusterstate for collection1
   [junit4]   2> 1942188 INFO  (coreLoadExecutor-5288-thread-1-processing-n:127.0.0.1:62434_n_vee) [n:127.0.0.1:62434_n_vee c:collection1   x:collection1] o.a.s.c.ZkController Check for collection zkNode:collection1
   [junit4]   2> 1942189 INFO  (coreLoadExecutor-5288-thread-1-proc

[...truncated too long message...]

    ] o.e.j.s.ServerConnector Stopped ServerConnector@c8d4785{HTTP/1.1}{127.0.0.1:0}
   [junit4]   2> 2156123 INFO  (TEST-DistribDocExpirationUpdateProcessorTest.test-seed#[37B2AB63772961A3]) [    ] o.e.j.s.h.ContextHandler Stopped o.e.j.s.ServletContextHandler@3308bdec{/,null,UNAVAILABLE}
   [junit4]   2> 2156125 INFO  (TEST-DistribDocExpirationUpdateProcessorTest.test-seed#[37B2AB63772961A3]) [n:127.0.0.1:62927_ c:collection1 s:shard1 r:core_node4 x:collection1] o.a.s.c.ZkTestServer connecting to 127.0.0.1:62896 62896
   [junit4]   2> 2156176 INFO  (Thread-4223) [    ] o.a.s.c.ZkTestServer connecting to 127.0.0.1:62896 62896
   [junit4]   2> 2157696 WARN  (Thread-4223) [    ] o.a.s.c.ZkTestServer Watch limit violations: 
   [junit4]   2> Maximum concurrent create/delete watches above limit:
   [junit4]   2> 
   [junit4]   2> 	6	/solr/aliases.json
   [junit4]   2> 	5	/solr/security.json
   [junit4]   2> 	5	/solr/configs/conf1
   [junit4]   2> 
   [junit4]   2> Maximum concurrent data watches above limit:
   [junit4]   2> 
   [junit4]   2> 	6	/solr/clusterstate.json
   [junit4]   2> 	4	/solr/collections/collection1/state.json
   [junit4]   2> 
   [junit4]   2> Maximum concurrent children watches above limit:
   [junit4]   2> 
   [junit4]   2> 	6	/solr/live_nodes
   [junit4]   2> 	6	/solr/collections
   [junit4]   2> 	5	/solr/overseer/collection-queue-work
   [junit4]   2> 	4	/solr/overseer/queue
   [junit4]   2> 
   [junit4]   2> NOTE: reproduce with: ant test  -Dtestcase=DistribDocExpirationUpdateProcessorTest -Dtests.method=test -Dtests.seed=37B2AB63772961A3 -Dtests.slow=true -Dtests.locale=ko -Dtests.timezone=Asia/Phnom_Penh -Dtests.asserts=true -Dtests.file.encoding=UTF-8
   [junit4] FAILURE 71.7s J1 | DistribDocExpirationUpdateProcessorTest.test <<<
   [junit4]    > Throwable #1: java.lang.AssertionError: There are still nodes recoverying - waited for 45 seconds
   [junit4]    > 	at __randomizedtesting.SeedInfo.seed([37B2AB63772961A3:BFE694B9D9D50C5B]:0)
   [junit4]    > 	at org.apache.solr.cloud.AbstractDistribZkTestBase.waitForRecoveriesToFinish(AbstractDistribZkTestBase.java:175)
   [junit4]    > 	at org.apache.solr.cloud.AbstractFullDistribZkTestBase.waitForRecoveriesToFinish(AbstractFullDistribZkTestBase.java:857)
   [junit4]    > 	at org.apache.solr.cloud.DistribDocExpirationUpdateProcessorTest.test(DistribDocExpirationUpdateProcessorTest.java:73)
   [junit4]    > 	at org.apache.solr.BaseDistributedSearchTestCase$ShardsRepeatRule$ShardsFixedStatement.callStatement(BaseDistributedSearchTestCase.java:965)
   [junit4]    > 	at org.apache.solr.BaseDistributedSearchTestCase$ShardsRepeatRule$ShardsStatement.evaluate(BaseDistributedSearchTestCase.java:940)
   [junit4]    > 	at java.lang.Thread.run(Thread.java:745)
   [junit4]   2> 2157698 INFO  (SUITE-DistribDocExpirationUpdateProcessorTest-seed#[37B2AB63772961A3]-worker) [n:127.0.0.1:62927_ c:collection1 s:shard1 r:core_node4 x:collection1] o.a.s.SolrTestCaseJ4 ###deleteCore
   [junit4]   2> NOTE: leaving temporary files on disk at: /Users/jenkins/workspace/Lucene-Solr-trunk-MacOSX/solr/build/solr-core/test/J1/temp/solr.cloud.DistribDocExpirationUpdateProcessorTest_37B2AB63772961A3-001
   [junit4]   2> NOTE: test params are: codec=CheapBastard, sim=ClassicSimilarity, locale=ko, timezone=Asia/Phnom_Penh
   [junit4]   2> NOTE: Mac OS X 10.8.5 x86_64/Oracle Corporation 1.8.0_66 (64-bit)/cpus=3,threads=1,free=134819432,total=492855296
   [junit4]   2> NOTE: All tests run in this JVM: [ConnectionManagerTest, SuggesterWFSTTest, OutOfBoxZkACLAndCredentialsProvidersTest, TestRestoreCore, SaslZkACLProviderTest, TestSimpleTrackingShardHandler, TestDistributedGrouping, TestCrossCoreJoin, BinaryUpdateRequestHandlerTest, AliasIntegrationTest, DistribJoinFromCollectionTest, TestPivotHelperCode, TestSolrDeletionPolicy2, TestSortingResponseWriter, NoCacheHeaderTest, TestDynamicFieldCollectionResource, HdfsLockFactoryTest, HttpPartitionTest, TestBulkSchemaAPI, StatsComponentTest, TestRawTransformer, TestCloudManagedSchemaConcurrent, TestExceedMaxTermLength, TestRecoveryHdfs, TestMacros, TestReversedWildcardFilterFactory, TestStandardQParsers, HdfsChaosMonkeySafeLeaderTest, TestSolrCoreProperties, TestComplexPhraseQParserPlugin, VMParamsZkACLAndCredentialsProvidersTest, ConjunctionSolrSpellCheckerTest, ConcurrentDeleteAndCreateCollectionTest, TestIndexSearcher, DistributedMLTComponentTest, TestScoreJoinQPScore, TestDistributedStatsComponentCardinality, TestLeaderElectionZkExpiry, SpellPossibilityIteratorTest, TestTrieFacet, TestRTGBase, FieldMutatingUpdateProcessorTest, TestZkChroot, DateMathParserTest, TestConfigSets, GraphQueryTest, TestUtils, ConnectionReuseTest, ResourceLoaderTest, EchoParamsTest, DistributedDebugComponentTest, TestImplicitCoreProperties, TestSolrJ, SuggestComponentContextFilterQueryTest, TestNamedUpdateProcessors, SolrIndexSplitterTest, SortSpecParsingTest, TestStressRecovery, OutputWriterTest, TestRandomFaceting, CachingDirectoryFactoryTest, TestLRUStatsCache, HighlighterConfigTest, SolrXmlInZkTest, HLLSerializationTest, OverseerCollectionConfigSetProcessorTest, NotRequiredUniqueKeyTest, HdfsBasicDistributedZkTest, ChaosMonkeySafeLeaderTest, BigEndianAscendingWordSerializerTest, SpellingQueryConverterTest, StressHdfsTest, TestFoldingMultitermQuery, SearchHandlerTest, TestInitParams, SpellCheckCollatorTest, ZkSolrClientTest, SecurityConfHandlerTest, FieldAnalysisRequestHandlerTest, CollectionReloadTest, SuggesterTest, TestReload, OverseerStatusTest, ParsingFieldUpdateProcessorsTest, RollingRestartTest, MultiTermTest, SynonymTokenizerTest, TestPerFieldSimilarity, TestBM25SimilarityFactory, TestQueryUtils, TestSolr4Spatial, DistanceFunctionTest, TestRandomRequestDistribution, BJQParserTest, LeaderInitiatedRecoveryOnCommitTest, SparseHLLTest, AsyncCallRequestStatusResponseTest, BadCopyFieldTest, TestBinaryField, TestReloadAndDeleteDocs, ReplicationFactorTest, FileUtilsTest, TestFuzzyAnalyzedSuggestions, DistributedVersionInfoTest, TestQueryTypes, TestCollectionAPI, DistributedIntervalFacetingTest, DataDrivenBlockJoinTest, TestDistributedMissingSort, ExplicitHLLTest, CurrencyFieldOpenExchangeTest, TestQueryWrapperFilter, SmileWriterTest, CollectionsAPIDistributedZkTest, ResponseLogComponentTest, TestSchemaManager, RuleEngineTest, TestManagedSchemaFieldTypeResource, TestOmitPositions, CdcrReplicationHandlerTest, TestOrdValues, TestJsonFacets, TestManagedResourceStorage, TestSolrIndexConfig, TestCollationField, TestCopyFieldCollectionResource, NumericFieldsTest, BasicDistributedZk2Test, TestRTimerTree, ShardRoutingCustomTest, CheckHdfsIndexTest, TestBlendedInfixSuggestions, VersionInfoTest, TestTestInjection, HdfsRecoveryZkTest, DateFieldTest, TestBadConfig, TestFreeTextSuggestions, DeleteInactiveReplicaTest, AutoCommitTest, TestFaceting, TestRecovery, TestHashPartitioner, TermVectorComponentDistributedTest, ZkControllerTest, TestRealTimeGet, TestStressReorder, TestJoin, TestStressVersions, HardAutoCommitTest, DistributedTermsComponentTest, TestCoreContainer, SpellCheckComponentTest, QueryElevationComponentTest, BadIndexSchemaTest, TestFiltering, BasicFunctionalityTest, HighlighterTest, ShowFileRequestHandlerTest, CurrencyFieldXmlFileTest, TestCoreDiscovery, AnalysisAfterCoreReloadTest, SignatureUpdateProcessorFactoryTest, SuggesterFSTTest, CoreAdminHandlerTest, TestStressLucene, TestTrie, TestCSVLoader, PolyFieldTest, WordBreakSolrSpellCheckerTest, SchemaVersionSpecificBehaviorTest, SolrCoreCheckLockOnStartupTest, TestAtomicUpdateErrorCases, DefaultValueUpdateProcessorTest, StatelessScriptUpdateProcessorFactoryTest, XsltUpdateRequestHandlerTest, DebugComponentTest, LukeRequestHandlerTest, TestWriterPerf, FileBasedSpellCheckerTest, TestValueSourceCache, TestIndexingPerformance, MoreLikeThisHandlerTest, TestArbitraryIndexDir, LoggingHandlerTest, SolrPluginUtilsTest, UpdateRequestProcessorFactoryTest, TestCSVResponseWriter, QueryParsingTest, UniqFieldsUpdateProcessorFactoryTest, TestPHPSerializedResponseWriter, TestComponentsName, SOLR749Test, TestQuerySenderListener, TestQuerySenderNoQuery, CopyFieldTest, BadComponentTest, TestDocSet, MinimalSchemaTest, TestConfig, DirectSolrConnectionTest, TestCharFilters, TestCodecSupport, TestFastOutputStream, OpenExchangeRatesOrgProviderTest, PluginInfoTest, TestSystemIdResolver, RAMDirectoryFactoryTest, ZkNodePropsTest, SystemInfoHandlerTest, SolrTestCaseJ4Test, TestJettySolrRunner, AssignTest, AsyncMigrateRouteKeyTest, CloudExitableDirectoryReaderTest, CollectionTooManyReplicasTest, DeleteLastCustomShardedReplicaTest, DeleteReplicaTest, DistribDocExpirationUpdateProcessorTest]
   [junit4] Completed [431/577 (2!)] on J1 in 71.70s, 1 test, 1 failure <<< FAILURES!

[...truncated 489 lines...]
BUILD FAILED
/Users/jenkins/workspace/Lucene-Solr-trunk-MacOSX/build.xml:784: The following error occurred while executing this line:
/Users/jenkins/workspace/Lucene-Solr-trunk-MacOSX/build.xml:728: The following error occurred while executing this line:
/Users/jenkins/workspace/Lucene-Solr-trunk-MacOSX/build.xml:59: The following error occurred while executing this line:
/Users/jenkins/workspace/Lucene-Solr-trunk-MacOSX/solr/build.xml:233: The following error occurred while executing this line:
/Users/jenkins/workspace/Lucene-Solr-trunk-MacOSX/solr/common-build.xml:524: The following error occurred while executing this line:
/Users/jenkins/workspace/Lucene-Solr-trunk-MacOSX/lucene/common-build.xml:1424: The following error occurred while executing this line:
/Users/jenkins/workspace/Lucene-Solr-trunk-MacOSX/lucene/common-build.xml:981: There were test failures: 577 suites (8 ignored), 2312 tests, 1 error, 1 failure, 119 ignored (69 assumptions) [seed: 37B2AB63772961A3]

Total time: 68 minutes 27 seconds
Build step 'Invoke Ant' marked build as failure
Archiving artifacts
[WARNINGS] Skipping publisher since build result is FAILURE
Recording test results
Email was triggered for: Failure - Any
Sending email for trigger: Failure - Any



Mime
View raw message