lucene-dev mailing list archives

Site index · List index
Message view « Date » · « Thread »
Top « Date » · « Thread »
From Michael McCandless <m...@elastic.co>
Subject Re: [CI] Lucene 5x Linux 64 Test Only - Build # 79308 - Failure!
Date Mon, 18 Jan 2016 14:28:56 GMT
I'll dig.

Mike McCandless

On Mon, Jan 18, 2016 at 7:18 AM, <build@elastic.co> wrote:

> *BUILD FAILURE*
>
> Build URL
> http://build-eu-00.elastic.co/job/lucene_linux_java8_64_test_only/79308/
> Project: lucene_linux_java8_64_test_only
> Randomization: JDK8,local,heap[512m],-server +UseG1GC
> +UseCompressedOops,sec manager on
> Date of build: Mon, 18 Jan 2016 13:11:06 +0100
> Build duration: 7 min 29 sec
> *CHANGES*
> No Changes
> *BUILD ARTIFACTS*
> -
> checkout/lucene/build/grouping/test/temp/junit4-J0-20160118_131823_609.events
> <http://build-eu-00.elastic.co/job/lucene_linux_java8_64_test_only/79308/artifact/checkout/lucene/build/grouping/test/temp/junit4-J0-20160118_131823_609.events>
> -
> checkout/lucene/build/grouping/test/temp/junit4-J1-20160118_131823_609.events
> <http://build-eu-00.elastic.co/job/lucene_linux_java8_64_test_only/79308/artifact/checkout/lucene/build/grouping/test/temp/junit4-J1-20160118_131823_609.events>
> -
> checkout/lucene/build/grouping/test/temp/junit4-J2-20160118_131823_609.events
> <http://build-eu-00.elastic.co/job/lucene_linux_java8_64_test_only/79308/artifact/checkout/lucene/build/grouping/test/temp/junit4-J2-20160118_131823_609.events>
> -
> checkout/lucene/build/grouping/test/temp/junit4-J3-20160118_131823_609.events
> <http://build-eu-00.elastic.co/job/lucene_linux_java8_64_test_only/79308/artifact/checkout/lucene/build/grouping/test/temp/junit4-J3-20160118_131823_609.events>
> -
> checkout/lucene/build/grouping/test/temp/junit4-J4-20160118_131823_609.events
> <http://build-eu-00.elastic.co/job/lucene_linux_java8_64_test_only/79308/artifact/checkout/lucene/build/grouping/test/temp/junit4-J4-20160118_131823_609.events>
> -
> checkout/lucene/build/grouping/test/temp/junit4-J5-20160118_131823_609.events
> <http://build-eu-00.elastic.co/job/lucene_linux_java8_64_test_only/79308/artifact/checkout/lucene/build/grouping/test/temp/junit4-J5-20160118_131823_609.events>
> *FAILED JUNIT TESTS*
> Name: org.apache.lucene.search.grouping Failed: 1 test(s), Passed: 11
> test(s), Skipped: 0 test(s), Total: 12 test(s)
> *- Failed:
> org.apache.lucene.search.grouping.AllGroupHeadsCollectorTest.testRandom *
> *CONSOLE OUTPUT*
> [...truncated 8660 lines...]
> [junit4] Tests with failures [seed: 407E238788189BDD]:
> [junit4] -
> org.apache.lucene.search.grouping.AllGroupHeadsCollectorTest.testRandom
> [junit4]
> [junit4]
> [junit4] JVM J0: 0.29 .. 6.56 = 6.27s
> [junit4] JVM J1: 0.53 .. 5.30 = 4.77s
> [junit4] JVM J2: 0.28 .. 4.81 = 4.53s
> [junit4] JVM J3: 0.52 .. 4.78 = 4.26s
> [junit4] JVM J4: 0.53 .. 2.20 = 1.67s
> [junit4] JVM J5: 0.29 .. 2.45 = 2.16s
> [junit4] Execution time total: 6.56 sec.
> [junit4] Tests summary: 6 suites, 12 tests, 1 failure
> BUILD FAILED
> /home/jenkins/workspace/lucene_linux_java8_64_test_only/checkout/lucene/build.xml:472:
> The following error occurred while executing this line:
> /home/jenkins/workspace/lucene_linux_java8_64_test_only/checkout/lucene/common-build.xml:2240:
> The following error occurred while executing this line:
> /home/jenkins/workspace/lucene_linux_java8_64_test_only/checkout/lucene/module-build.xml:58:
> The following error occurred while executing this line:
> /home/jenkins/workspace/lucene_linux_java8_64_test_only/checkout/lucene/common-build.xml:1444:
> The following error occurred while executing this line:
> /home/jenkins/workspace/lucene_linux_java8_64_test_only/checkout/lucene/common-build.xml:1000:
> There were test failures: 6 suites, 12 tests, 1 failure [seed:
> 407E238788189BDD]
> Total time: 7 minutes 12 seconds
> Build step 'Invoke Ant' marked build as failure
> Archiving artifacts
> Recording test results
> [description-setter] Description set: JDK8,local,heap[512m],-server
> +UseG1GC +UseCompressedOops,sec manager on
> Email was triggered for: Failure - 1st
> Trigger Failure - Any was overridden by another trigger and will not send
> an email.
> Trigger Failure - Still was overridden by another trigger and will not
> send an email.
> Sending email for trigger: Failure - 1st
>

Mime
View raw message