lucene-dev mailing list archives

Site index · List index
Message view « Date » · « Thread »
Top « Date » · « Thread »
From Michael McCandless <luc...@mikemccandless.com>
Subject Re: [JENKINS] Lucene-Solr-NightlyTests-trunk - Build # 919 - Still Failing
Date Mon, 25 Jan 2016 18:57:01 GMT
I'll disable Direct and Memory for this test.

Mike McCandless

http://blog.mikemccandless.com


On Mon, Jan 25, 2016 at 6:12 AM, Apache Jenkins Server
<jenkins@builds.apache.org> wrote:
> Build: https://builds.apache.org/job/Lucene-Solr-NightlyTests-trunk/919/
>
> 1 tests failed.
> FAILED:  org.apache.lucene.search.TestGeoPointQuery.testRandomBig
>
> Error Message:
> CheckIndex failed
>
> Stack Trace:
> java.lang.RuntimeException: CheckIndex failed
>         at __randomizedtesting.SeedInfo.seed([D35E8C12334C2B8D:5409F19DA215570D]:0)
>         at org.apache.lucene.util.TestUtil.checkIndex(TestUtil.java:281)
>         at org.apache.lucene.util.TestUtil.checkIndex(TestUtil.java:263)
>         at org.apache.lucene.store.BaseDirectoryWrapper.close(BaseDirectoryWrapper.java:46)
>         at org.apache.lucene.util.IOUtils.close(IOUtils.java:89)
>         at org.apache.lucene.util.IOUtils.close(IOUtils.java:76)
>         at org.apache.lucene.util.BaseGeoPointTestCase.verify(BaseGeoPointTestCase.java:771)
>         at org.apache.lucene.util.BaseGeoPointTestCase.doTestRandom(BaseGeoPointTestCase.java:411)
>         at org.apache.lucene.util.BaseGeoPointTestCase.testRandomBig(BaseGeoPointTestCase.java:340)
>         at sun.reflect.NativeMethodAccessorImpl.invoke0(Native Method)
>         at sun.reflect.NativeMethodAccessorImpl.invoke(NativeMethodAccessorImpl.java:62)
>         at sun.reflect.DelegatingMethodAccessorImpl.invoke(DelegatingMethodAccessorImpl.java:43)
>         at java.lang.reflect.Method.invoke(Method.java:497)
>         at com.carrotsearch.randomizedtesting.RandomizedRunner.invoke(RandomizedRunner.java:1764)
>         at com.carrotsearch.randomizedtesting.RandomizedRunner$8.evaluate(RandomizedRunner.java:871)
>         at com.carrotsearch.randomizedtesting.RandomizedRunner$9.evaluate(RandomizedRunner.java:907)
>         at com.carrotsearch.randomizedtesting.RandomizedRunner$10.evaluate(RandomizedRunner.java:921)
>         at org.apache.lucene.util.TestRuleSetupTeardownChained$1.evaluate(TestRuleSetupTeardownChained.java:50)
>         at org.apache.lucene.util.AbstractBeforeAfterRule$1.evaluate(AbstractBeforeAfterRule.java:46)
>         at org.apache.lucene.util.TestRuleThreadAndTestName$1.evaluate(TestRuleThreadAndTestName.java:49)
>         at org.apache.lucene.util.TestRuleIgnoreAfterMaxFailures$1.evaluate(TestRuleIgnoreAfterMaxFailures.java:65)
>         at org.apache.lucene.util.TestRuleMarkFailure$1.evaluate(TestRuleMarkFailure.java:48)
>         at com.carrotsearch.randomizedtesting.rules.StatementAdapter.evaluate(StatementAdapter.java:36)
>         at com.carrotsearch.randomizedtesting.ThreadLeakControl$StatementRunner.run(ThreadLeakControl.java:367)
>         at com.carrotsearch.randomizedtesting.ThreadLeakControl.forkTimeoutingTask(ThreadLeakControl.java:809)
>         at com.carrotsearch.randomizedtesting.ThreadLeakControl$3.evaluate(ThreadLeakControl.java:460)
>         at com.carrotsearch.randomizedtesting.RandomizedRunner.runSingleTest(RandomizedRunner.java:880)
>         at com.carrotsearch.randomizedtesting.RandomizedRunner$5.evaluate(RandomizedRunner.java:781)
>         at com.carrotsearch.randomizedtesting.RandomizedRunner$6.evaluate(RandomizedRunner.java:816)
>         at com.carrotsearch.randomizedtesting.RandomizedRunner$7.evaluate(RandomizedRunner.java:827)
>         at org.apache.lucene.util.AbstractBeforeAfterRule$1.evaluate(AbstractBeforeAfterRule.java:46)
>         at com.carrotsearch.randomizedtesting.rules.StatementAdapter.evaluate(StatementAdapter.java:36)
>         at org.apache.lucene.util.TestRuleStoreClassName$1.evaluate(TestRuleStoreClassName.java:42)
>         at com.carrotsearch.randomizedtesting.rules.NoShadowingOrOverridesOnMethodsRule$1.evaluate(NoShadowingOrOverridesOnMethodsRule.java:40)
>         at com.carrotsearch.randomizedtesting.rules.NoShadowingOrOverridesOnMethodsRule$1.evaluate(NoShadowingOrOverridesOnMethodsRule.java:40)
>         at com.carrotsearch.randomizedtesting.rules.StatementAdapter.evaluate(StatementAdapter.java:36)
>         at com.carrotsearch.randomizedtesting.rules.StatementAdapter.evaluate(StatementAdapter.java:36)
>         at com.carrotsearch.randomizedtesting.rules.StatementAdapter.evaluate(StatementAdapter.java:36)
>         at org.apache.lucene.util.TestRuleAssertionsRequired$1.evaluate(TestRuleAssertionsRequired.java:54)
>         at org.apache.lucene.util.TestRuleMarkFailure$1.evaluate(TestRuleMarkFailure.java:48)
>         at org.apache.lucene.util.TestRuleIgnoreAfterMaxFailures$1.evaluate(TestRuleIgnoreAfterMaxFailures.java:65)
>         at org.apache.lucene.util.TestRuleIgnoreTestSuites$1.evaluate(TestRuleIgnoreTestSuites.java:55)
>         at com.carrotsearch.randomizedtesting.rules.StatementAdapter.evaluate(StatementAdapter.java:36)
>         at com.carrotsearch.randomizedtesting.ThreadLeakControl$StatementRunner.run(ThreadLeakControl.java:367)
>         at java.lang.Thread.run(Thread.java:745)
>
>
>
>
> Build Log:
> [...truncated 8026 lines...]
>    [junit4] Suite: org.apache.lucene.search.TestGeoPointQuery
>    [junit4]   1> CheckIndex failed
>    [junit4]   1> Segments file=segments_1 numSegments=1 version=6.0.0 id=3rikodqqkuixj14rg7sz56coj
format=
>    [junit4]   1>   1 of 1: name=_2w maxDoc=905204
>    [junit4]   1>     version=6.0.0
>    [junit4]   1>     id=3rikodqqkuixj14rg7sz56coi
>    [junit4]   1>     codec=Asserting(Lucene60)
>    [junit4]   1>     compound=false
>    [junit4]   1>     numFiles=14
>    [junit4]   1>     size (MB)=51.517
>    [junit4]   1>     diagnostics = {os=Linux, java.vendor=Oracle Corporation, java.version=1.8.0_66,
java.vm.version=25.66-b17, lucene.version=6.0.0, mergeMaxNumSegments=1, os.arch=amd64, java.runtime.version=1.8.0_66-b17,
source=merge, mergeFactor=26, os.version=3.13.0-52-generic, timestamp=1453720049607}
>    [junit4]   1>     no deletions
>    [junit4]   1>     test: open reader.........FAILED
>    [junit4]   1>     WARNING: exorciseIndex() would remove reference to this segment;
full exception:
>    [junit4]   1> java.lang.OutOfMemoryError: Java heap space
>    [junit4]   1>        at org.apache.lucene.util.ArrayUtil.grow(ArrayUtil.java:354)
>    [junit4]   1>        at org.apache.lucene.codecs.memory.DirectPostingsFormat$DirectField.<init>(DirectPostingsFormat.java:352)
>    [junit4]   1>        at org.apache.lucene.codecs.memory.DirectPostingsFormat$DirectFields.<init>(DirectPostingsFormat.java:130)
>    [junit4]   1>        at org.apache.lucene.codecs.memory.DirectPostingsFormat.fieldsProducer(DirectPostingsFormat.java:114)
>    [junit4]   1>        at org.apache.lucene.codecs.perfield.PerFieldPostingsFormat$FieldsReader.<init>(PerFieldPostingsFormat.java:261)
>    [junit4]   1>        at org.apache.lucene.codecs.perfield.PerFieldPostingsFormat.fieldsProducer(PerFieldPostingsFormat.java:341)
>    [junit4]   1>        at org.apache.lucene.index.SegmentCoreReaders.<init>(SegmentCoreReaders.java:106)
>    [junit4]   1>        at org.apache.lucene.index.SegmentReader.<init>(SegmentReader.java:66)
>    [junit4]   1>        at org.apache.lucene.index.CheckIndex.checkIndex(CheckIndex.java:668)
>    [junit4]   1>        at org.apache.lucene.util.TestUtil.checkIndex(TestUtil.java:276)
>    [junit4]   1>        at org.apache.lucene.util.TestUtil.checkIndex(TestUtil.java:263)
>    [junit4]   1>        at org.apache.lucene.store.BaseDirectoryWrapper.close(BaseDirectoryWrapper.java:46)
>    [junit4]   1>        at org.apache.lucene.util.IOUtils.close(IOUtils.java:89)
>    [junit4]   1>        at org.apache.lucene.util.IOUtils.close(IOUtils.java:76)
>    [junit4]   1>        at org.apache.lucene.util.BaseGeoPointTestCase.verify(BaseGeoPointTestCase.java:771)
>    [junit4]   1>        at org.apache.lucene.util.BaseGeoPointTestCase.doTestRandom(BaseGeoPointTestCase.java:411)
>    [junit4]   1>        at org.apache.lucene.util.BaseGeoPointTestCase.testRandomBig(BaseGeoPointTestCase.java:340)
>    [junit4]   1>        at sun.reflect.NativeMethodAccessorImpl.invoke0(Native Method)
>    [junit4]   1>        at sun.reflect.NativeMethodAccessorImpl.invoke(NativeMethodAccessorImpl.java:62)
>    [junit4]   1>        at sun.reflect.DelegatingMethodAccessorImpl.invoke(DelegatingMethodAccessorImpl.java:43)
>    [junit4]   1>        at java.lang.reflect.Method.invoke(Method.java:497)
>    [junit4]   1>        at com.carrotsearch.randomizedtesting.RandomizedRunner.invoke(RandomizedRunner.java:1764)
>    [junit4]   1>        at com.carrotsearch.randomizedtesting.RandomizedRunner$8.evaluate(RandomizedRunner.java:871)
>    [junit4]   1>        at com.carrotsearch.randomizedtesting.RandomizedRunner$9.evaluate(RandomizedRunner.java:907)
>    [junit4]   1>        at com.carrotsearch.randomizedtesting.RandomizedRunner$10.evaluate(RandomizedRunner.java:921)
>    [junit4]   1>        at org.apache.lucene.util.TestRuleSetupTeardownChained$1.evaluate(TestRuleSetupTeardownChained.java:50)
>    [junit4]   1>        at org.apache.lucene.util.AbstractBeforeAfterRule$1.evaluate(AbstractBeforeAfterRule.java:46)
>    [junit4]   1>        at org.apache.lucene.util.TestRuleThreadAndTestName$1.evaluate(TestRuleThreadAndTestName.java:49)
>    [junit4]   1>        at org.apache.lucene.util.TestRuleIgnoreAfterMaxFailures$1.evaluate(TestRuleIgnoreAfterMaxFailures.java:65)
>    [junit4]   1>        at org.apache.lucene.util.TestRuleMarkFailure$1.evaluate(TestRuleMarkFailure.java:48)
>    [junit4]   1>        at com.carrotsearch.randomizedtesting.rules.StatementAdapter.evaluate(StatementAdapter.java:36)
>    [junit4]   1>        at com.carrotsearch.randomizedtesting.ThreadLeakControl$StatementRunner.run(ThreadLeakControl.java:367)
>    [junit4]   1>
>    [junit4]   1> WARNING: 1 broken segments (containing 905204 documents) detected
>    [junit4]   1> Took 11.659 sec total.
>    [junit4]   1>
>    [junit4]   2> NOTE: download the large Jenkins line-docs file by running 'ant get-jenkins-line-docs'
in the lucene directory.
>    [junit4]   2> NOTE: reproduce with: ant test  -Dtestcase=TestGeoPointQuery -Dtests.method=testRandomBig
-Dtests.seed=D35E8C12334C2B8D -Dtests.multiplier=2 -Dtests.nightly=true -Dtests.slow=true
-Dtests.linedocsfile=/x1/jenkins/lucene-data/enwiki.random.lines.txt -Dtests.locale=sl -Dtests.timezone=Africa/Lome
-Dtests.asserts=true -Dtests.file.encoding=ISO-8859-1
>    [junit4] ERROR    120s J1 | TestGeoPointQuery.testRandomBig <<<
>    [junit4]    > Throwable #1: java.lang.RuntimeException: CheckIndex failed
>    [junit4]    >        at __randomizedtesting.SeedInfo.seed([D35E8C12334C2B8D:5409F19DA215570D]:0)
>    [junit4]    >        at org.apache.lucene.util.TestUtil.checkIndex(TestUtil.java:281)
>    [junit4]    >        at org.apache.lucene.util.TestUtil.checkIndex(TestUtil.java:263)
>    [junit4]    >        at org.apache.lucene.store.BaseDirectoryWrapper.close(BaseDirectoryWrapper.java:46)
>    [junit4]    >        at org.apache.lucene.util.IOUtils.close(IOUtils.java:89)
>    [junit4]    >        at org.apache.lucene.util.IOUtils.close(IOUtils.java:76)
>    [junit4]    >        at org.apache.lucene.util.BaseGeoPointTestCase.verify(BaseGeoPointTestCase.java:771)
>    [junit4]    >        at org.apache.lucene.util.BaseGeoPointTestCase.doTestRandom(BaseGeoPointTestCase.java:411)
>    [junit4]    >        at org.apache.lucene.util.BaseGeoPointTestCase.testRandomBig(BaseGeoPointTestCase.java:340)
>    [junit4]    >        at java.lang.Thread.run(Thread.java:745)
>    [junit4]   2> NOTE: leaving temporary files on disk at: /x1/jenkins/jenkins-slave/workspace/Lucene-Solr-NightlyTests-trunk/lucene/build/sandbox/test/J1/temp/lucene.search.TestGeoPointQuery_D35E8C12334C2B8D-001
>    [junit4]   2> NOTE: test params are: codec=Asserting(Lucene60): {string=PostingsFormat(name=LuceneVarGapDocFreqInterval),
id=PostingsFormat(name=LuceneVarGapDocFreqInterval), point=PostingsFormat(name=Direct)}, docValues:{id=DocValuesFormat(name=Asserting),
point=DocValuesFormat(name=Direct)}, sim=RandomSimilarity(queryNorm=true,coord=yes): {}, locale=sl,
timezone=Africa/Lome
>    [junit4]   2> NOTE: Linux 3.13.0-52-generic amd64/Oracle Corporation 1.8.0_66 (64-bit)/cpus=4,threads=1,free=43706672,total=346030080
>    [junit4]   2> NOTE: All tests run in this JVM: [TestSlowFuzzyQuery2, TestTermAutomatonQuery,
TestPayloadSpanUtil, TestDocValuesRangeQuery, TestDocValuesTermsQuery, TestGeoPointQuery]
>    [junit4] Completed [13/13 (1!)] on J1 in 176.42s, 23 tests, 1 error <<< FAILURES!
>
> [...truncated 1 lines...]
>    [junit4] JVM J1: stdout was not empty, see: /x1/jenkins/jenkins-slave/workspace/Lucene-Solr-NightlyTests-trunk/lucene/build/sandbox/test/temp/junit4-J1-20160125_110517_330.sysout
>    [junit4] >>> JVM J1 emitted unexpected output (verbatim) ----
>    [junit4] java.lang.OutOfMemoryError: Java heap space
>    [junit4] Dumping heap to /x1/jenkins/jenkins-slave/workspace/Lucene-Solr-NightlyTests-trunk/heapdumps/java_pid3746.hprof
...
>    [junit4] Heap dump file created [664036402 bytes in 4.323 secs]
>    [junit4] <<< JVM J1: EOF ----
>
> [...truncated 10 lines...]
> BUILD FAILED
> /x1/jenkins/jenkins-slave/workspace/Lucene-Solr-NightlyTests-trunk/build.xml:747: The
following error occurred while executing this line:
> /x1/jenkins/jenkins-slave/workspace/Lucene-Solr-NightlyTests-trunk/build.xml:684: The
following error occurred while executing this line:
> /x1/jenkins/jenkins-slave/workspace/Lucene-Solr-NightlyTests-trunk/build.xml:59: The
following error occurred while executing this line:
> /x1/jenkins/jenkins-slave/workspace/Lucene-Solr-NightlyTests-trunk/lucene/build.xml:475:
The following error occurred while executing this line:
> /x1/jenkins/jenkins-slave/workspace/Lucene-Solr-NightlyTests-trunk/lucene/common-build.xml:2154:
The following error occurred while executing this line:
> /x1/jenkins/jenkins-slave/workspace/Lucene-Solr-NightlyTests-trunk/lucene/module-build.xml:58:
The following error occurred while executing this line:
> /x1/jenkins/jenkins-slave/workspace/Lucene-Solr-NightlyTests-trunk/lucene/common-build.xml:1424:
The following error occurred while executing this line:
> /x1/jenkins/jenkins-slave/workspace/Lucene-Solr-NightlyTests-trunk/lucene/common-build.xml:981:
There were test failures: 13 suites, 97 tests, 1 error [seed: D35E8C12334C2B8D]
>
> Total time: 116 minutes 57 seconds
> Build step 'Invoke Ant' marked build as failure
> Archiving artifacts
> No prior successful build to compare, so performing full copy of artifacts
> Recording test results
> Email was triggered for: Failure - Any
> Sending email for trigger: Failure - Any
>
>
>
>
> ---------------------------------------------------------------------
> To unsubscribe, e-mail: dev-unsubscribe@lucene.apache.org
> For additional commands, e-mail: dev-help@lucene.apache.org

---------------------------------------------------------------------
To unsubscribe, e-mail: dev-unsubscribe@lucene.apache.org
For additional commands, e-mail: dev-help@lucene.apache.org


Mime
View raw message