lucene-dev mailing list archives

Site index · List index
Message view « Date » · « Thread »
Top « Date » · « Thread »
From Adrien Grand <jpou...@gmail.com>
Subject Re: [JENKINS-EA] Lucene-Solr-trunk-Linux (32bit/jdk-9-ea+95) - Build # 15458 - Still Failing!
Date Wed, 06 Jan 2016 13:57:22 GMT
I committed a fix for these failures.

Le mer. 6 janv. 2016 à 14:38, Policeman Jenkins Server <jenkins@thetaphi.de>
a écrit :

> Build: http://jenkins.thetaphi.de/job/Lucene-Solr-trunk-Linux/15458/
> Java: 32bit/jdk-9-ea+95 -client -XX:+UseParallelGC -XX:-CompactStrings
>
> 1 tests failed.
> FAILED:
> org.apache.lucene.search.suggest.analyzing.FuzzySuggesterTest.testKeyword
>
> Error Message:
> fuzzy_input_0.tmp in dir=NRTCachingDirectory(RAMDirectory@e92991
> lockFactory=org.apache.lucene.store.SingleInstanceLockFactory@992729;
> maxCacheMB=0.451171875 maxMergeSizeMB=0.8505859375)
>
> Stack Trace:
> java.nio.file.NoSuchFileException: fuzzy_input_0.tmp in
> dir=NRTCachingDirectory(RAMDirectory@e92991
> lockFactory=org.apache.lucene.store.SingleInstanceLockFactory@992729;
> maxCacheMB=0.451171875 maxMergeSizeMB=0.8505859375)
>         at
> __randomizedtesting.SeedInfo.seed([5F61484EFCBA10C:836C2BE9D65BC991]:0)
>         at
> org.apache.lucene.store.MockDirectoryWrapper.openInput(MockDirectoryWrapper.java:677)
>         at
> org.apache.lucene.util.OfflineSorter.sort(OfflineSorter.java:240)
>         at
> org.apache.lucene.search.suggest.analyzing.AnalyzingSuggester.build(AnalyzingSuggester.java:487)
>         at
> org.apache.lucene.search.suggest.analyzing.FuzzySuggesterTest.testKeyword(FuzzySuggesterTest.java:118)
>         at sun.reflect.NativeMethodAccessorImpl.invoke0(Native Method)
>         at
> sun.reflect.NativeMethodAccessorImpl.invoke(NativeMethodAccessorImpl.java:62)
>         at
> sun.reflect.DelegatingMethodAccessorImpl.invoke(DelegatingMethodAccessorImpl.java:43)
>         at java.lang.reflect.Method.invoke(Method.java:520)
>         at
> com.carrotsearch.randomizedtesting.RandomizedRunner.invoke(RandomizedRunner.java:1764)
>         at
> com.carrotsearch.randomizedtesting.RandomizedRunner$8.evaluate(RandomizedRunner.java:871)
>         at
> com.carrotsearch.randomizedtesting.RandomizedRunner$9.evaluate(RandomizedRunner.java:907)
>         at
> com.carrotsearch.randomizedtesting.RandomizedRunner$10.evaluate(RandomizedRunner.java:921)
>         at
> org.apache.lucene.util.TestRuleSetupTeardownChained$1.evaluate(TestRuleSetupTeardownChained.java:50)
>         at
> org.apache.lucene.util.AbstractBeforeAfterRule$1.evaluate(AbstractBeforeAfterRule.java:46)
>         at
> org.apache.lucene.util.TestRuleThreadAndTestName$1.evaluate(TestRuleThreadAndTestName.java:49)
>         at
> org.apache.lucene.util.TestRuleIgnoreAfterMaxFailures$1.evaluate(TestRuleIgnoreAfterMaxFailures.java:65)
>         at
> org.apache.lucene.util.TestRuleMarkFailure$1.evaluate(TestRuleMarkFailure.java:48)
>         at
> com.carrotsearch.randomizedtesting.rules.StatementAdapter.evaluate(StatementAdapter.java:36)
>         at
> com.carrotsearch.randomizedtesting.ThreadLeakControl$StatementRunner.run(ThreadLeakControl.java:367)
>         at
> com.carrotsearch.randomizedtesting.ThreadLeakControl.forkTimeoutingTask(ThreadLeakControl.java:809)
>         at
> com.carrotsearch.randomizedtesting.ThreadLeakControl$3.evaluate(ThreadLeakControl.java:460)
>         at
> com.carrotsearch.randomizedtesting.RandomizedRunner.runSingleTest(RandomizedRunner.java:880)
>         at
> com.carrotsearch.randomizedtesting.RandomizedRunner$5.evaluate(RandomizedRunner.java:781)
>         at
> com.carrotsearch.randomizedtesting.RandomizedRunner$6.evaluate(RandomizedRunner.java:816)
>         at
> com.carrotsearch.randomizedtesting.RandomizedRunner$7.evaluate(RandomizedRunner.java:827)
>         at
> org.apache.lucene.util.AbstractBeforeAfterRule$1.evaluate(AbstractBeforeAfterRule.java:46)
>         at
> com.carrotsearch.randomizedtesting.rules.StatementAdapter.evaluate(StatementAdapter.java:36)
>         at
> org.apache.lucene.util.TestRuleStoreClassName$1.evaluate(TestRuleStoreClassName.java:42)
>         at
> com.carrotsearch.randomizedtesting.rules.NoShadowingOrOverridesOnMethodsRule$1.evaluate(NoShadowingOrOverridesOnMethodsRule.java:40)
>         at
> com.carrotsearch.randomizedtesting.rules.NoShadowingOrOverridesOnMethodsRule$1.evaluate(NoShadowingOrOverridesOnMethodsRule.java:40)
>         at
> com.carrotsearch.randomizedtesting.rules.StatementAdapter.evaluate(StatementAdapter.java:36)
>         at
> com.carrotsearch.randomizedtesting.rules.StatementAdapter.evaluate(StatementAdapter.java:36)
>         at
> com.carrotsearch.randomizedtesting.rules.StatementAdapter.evaluate(StatementAdapter.java:36)
>         at
> org.apache.lucene.util.TestRuleAssertionsRequired$1.evaluate(TestRuleAssertionsRequired.java:54)
>         at
> org.apache.lucene.util.TestRuleMarkFailure$1.evaluate(TestRuleMarkFailure.java:48)
>         at
> org.apache.lucene.util.TestRuleIgnoreAfterMaxFailures$1.evaluate(TestRuleIgnoreAfterMaxFailures.java:65)
>         at
> org.apache.lucene.util.TestRuleIgnoreTestSuites$1.evaluate(TestRuleIgnoreTestSuites.java:55)
>         at
> com.carrotsearch.randomizedtesting.rules.StatementAdapter.evaluate(StatementAdapter.java:36)
>         at
> com.carrotsearch.randomizedtesting.ThreadLeakControl$StatementRunner.run(ThreadLeakControl.java:367)
>         at java.lang.Thread.run(Thread.java:747)
>
>
>
>
> Build Log:
> [...truncated 8239 lines...]
>    [junit4] Suite:
> org.apache.lucene.search.suggest.analyzing.FuzzySuggesterTest
>    [junit4]   2> NOTE: reproduce with: ant test
> -Dtestcase=FuzzySuggesterTest -Dtests.method=testKeyword
> -Dtests.seed=5F61484EFCBA10C -Dtests.multiplier=3 -Dtests.slow=true
> -Dtests.locale=no -Dtests.timezone=Mexico/BajaNorte -Dtests.asserts=true
> -Dtests.file.encoding=UTF-8
>    [junit4] ERROR   0.01s J1 | FuzzySuggesterTest.testKeyword <<<
>    [junit4]    > Throwable #1: java.nio.file.NoSuchFileException:
> fuzzy_input_0.tmp in dir=NRTCachingDirectory(RAMDirectory@e92991
> lockFactory=org.apache.lucene.store.SingleInstanceLockFactory@992729;
> maxCacheMB=0.451171875 maxMergeSizeMB=0.8505859375)
>    [junit4]    >        at
> __randomizedtesting.SeedInfo.seed([5F61484EFCBA10C:836C2BE9D65BC991]:0)
>    [junit4]    >        at
> org.apache.lucene.store.MockDirectoryWrapper.openInput(MockDirectoryWrapper.java:677)
>    [junit4]    >        at
> org.apache.lucene.util.OfflineSorter.sort(OfflineSorter.java:240)
>    [junit4]    >        at
> org.apache.lucene.search.suggest.analyzing.AnalyzingSuggester.build(AnalyzingSuggester.java:487)
>    [junit4]    >        at
> org.apache.lucene.search.suggest.analyzing.FuzzySuggesterTest.testKeyword(FuzzySuggesterTest.java:118)
>    [junit4]    >        at java.lang.Thread.run(Thread.java:747)
>    [junit4]   2> NOTE: test params are: codec=Asserting(Lucene60): {},
> docValues:{}, sim=RandomSimilarityProvider(queryNorm=true,coord=no): {},
> locale=no, timezone=Mexico/BajaNorte
>    [junit4]   2> NOTE: Linux 3.19.0-42-generic i386/Oracle Corporation
> 9-ea (32-bit)/cpus=12,threads=1,free=34577112,total=195559424
>    [junit4]   2> NOTE: All tests run in this JVM: [TestContextQuery,
> DocumentValueSourceDictionaryTest, FuzzySuggesterTest]
>    [junit4] Completed [29/32 (1!)] on J1 in 29.75s, 14 tests, 1 error <<<
> FAILURES!
>
> [...truncated 20 lines...]
> BUILD FAILED
> /home/jenkins/workspace/Lucene-Solr-trunk-Linux/build.xml:784: The
> following error occurred while executing this line:
> /home/jenkins/workspace/Lucene-Solr-trunk-Linux/build.xml:728: The
> following error occurred while executing this line:
> /home/jenkins/workspace/Lucene-Solr-trunk-Linux/build.xml:59: The
> following error occurred while executing this line:
> /home/jenkins/workspace/Lucene-Solr-trunk-Linux/lucene/build.xml:472: The
> following error occurred while executing this line:
> /home/jenkins/workspace/Lucene-Solr-trunk-Linux/lucene/common-build.xml:2154:
> The following error occurred while executing this line:
> /home/jenkins/workspace/Lucene-Solr-trunk-Linux/lucene/module-build.xml:58:
> The following error occurred while executing this line:
> /home/jenkins/workspace/Lucene-Solr-trunk-Linux/lucene/common-build.xml:1424:
> The following error occurred while executing this line:
> /home/jenkins/workspace/Lucene-Solr-trunk-Linux/lucene/common-build.xml:981:
> There were test failures: 32 suites (1 ignored), 205 tests, 1 error, 1
> ignored [seed: 5F61484EFCBA10C]
>
> Total time: 27 minutes 26 seconds
> Build step 'Invoke Ant' marked build as failure
> Archiving artifacts
> [WARNINGS] Skipping publisher since build result is FAILURE
> Recording test results
> Email was triggered for: Failure - Any
> Sending email for trigger: Failure - Any
>
>
>
> ---------------------------------------------------------------------
> To unsubscribe, e-mail: dev-unsubscribe@lucene.apache.org
> For additional commands, e-mail: dev-help@lucene.apache.org

Mime
View raw message