lucene-dev mailing list archives

Site index · List index
Message view « Date » · « Thread »
Top « Date » · « Thread »
From Policeman Jenkins Server <jenk...@thetaphi.de>
Subject [JENKINS] Lucene-Solr-trunk-MacOSX (64bit/jdk1.8.0) - Build # 3091 - Still Failing!
Date Wed, 17 Feb 2016 10:37:37 GMT
Build: http://jenkins.thetaphi.de/job/Lucene-Solr-trunk-MacOSX/3091/
Java: 64bit/jdk1.8.0 -XX:-UseCompressedOops -XX:+UseG1GC

1 tests failed.
FAILED:  org.apache.solr.handler.clustering.DistributedClusteringComponentTest.test

Error Message:
IOException occured when talking to server at: http://127.0.0.1:51185/_vnj/u/collection1

Stack Trace:
org.apache.solr.client.solrj.SolrServerException: IOException occured when talking to server at: http://127.0.0.1:51185/_vnj/u/collection1
	at __randomizedtesting.SeedInfo.seed([501CD408E008B061:D848EBD24EF4DD99]:0)
	at org.apache.solr.client.solrj.impl.HttpSolrClient.executeMethod(HttpSolrClient.java:591)
	at org.apache.solr.client.solrj.impl.HttpSolrClient.request(HttpSolrClient.java:241)
	at org.apache.solr.client.solrj.impl.HttpSolrClient.request(HttpSolrClient.java:230)
	at org.apache.solr.client.solrj.SolrRequest.process(SolrRequest.java:149)
	at org.apache.solr.client.solrj.SolrClient.deleteByQuery(SolrClient.java:895)
	at org.apache.solr.client.solrj.SolrClient.deleteByQuery(SolrClient.java:858)
	at org.apache.solr.client.solrj.SolrClient.deleteByQuery(SolrClient.java:873)
	at org.apache.solr.BaseDistributedSearchTestCase.del(BaseDistributedSearchTestCase.java:544)
	at org.apache.solr.handler.clustering.DistributedClusteringComponentTest.test(DistributedClusteringComponentTest.java:35)
	at sun.reflect.NativeMethodAccessorImpl.invoke0(Native Method)
	at sun.reflect.NativeMethodAccessorImpl.invoke(NativeMethodAccessorImpl.java:62)
	at sun.reflect.DelegatingMethodAccessorImpl.invoke(DelegatingMethodAccessorImpl.java:43)
	at java.lang.reflect.Method.invoke(Method.java:498)
	at com.carrotsearch.randomizedtesting.RandomizedRunner.invoke(RandomizedRunner.java:1764)
	at com.carrotsearch.randomizedtesting.RandomizedRunner$8.evaluate(RandomizedRunner.java:871)
	at com.carrotsearch.randomizedtesting.RandomizedRunner$9.evaluate(RandomizedRunner.java:907)
	at com.carrotsearch.randomizedtesting.RandomizedRunner$10.evaluate(RandomizedRunner.java:921)
	at org.apache.solr.BaseDistributedSearchTestCase$ShardsRepeatRule$ShardsRepeatStatement.callStatement(BaseDistributedSearchTestCase.java:990)
	at org.apache.solr.BaseDistributedSearchTestCase$ShardsRepeatRule$ShardsStatement.evaluate(BaseDistributedSearchTestCase.java:939)
	at com.carrotsearch.randomizedtesting.rules.SystemPropertiesRestoreRule$1.evaluate(SystemPropertiesRestoreRule.java:57)
	at org.apache.lucene.util.TestRuleSetupTeardownChained$1.evaluate(TestRuleSetupTeardownChained.java:49)
	at org.apache.lucene.util.AbstractBeforeAfterRule$1.evaluate(AbstractBeforeAfterRule.java:45)
	at org.apache.lucene.util.TestRuleThreadAndTestName$1.evaluate(TestRuleThreadAndTestName.java:48)
	at org.apache.lucene.util.TestRuleIgnoreAfterMaxFailures$1.evaluate(TestRuleIgnoreAfterMaxFailures.java:64)
	at org.apache.lucene.util.TestRuleMarkFailure$1.evaluate(TestRuleMarkFailure.java:47)
	at com.carrotsearch.randomizedtesting.rules.StatementAdapter.evaluate(StatementAdapter.java:36)
	at com.carrotsearch.randomizedtesting.ThreadLeakControl$StatementRunner.run(ThreadLeakControl.java:367)
	at com.carrotsearch.randomizedtesting.ThreadLeakControl.forkTimeoutingTask(ThreadLeakControl.java:809)
	at com.carrotsearch.randomizedtesting.ThreadLeakControl$3.evaluate(ThreadLeakControl.java:460)
	at com.carrotsearch.randomizedtesting.RandomizedRunner.runSingleTest(RandomizedRunner.java:880)
	at com.carrotsearch.randomizedtesting.RandomizedRunner$5.evaluate(RandomizedRunner.java:781)
	at com.carrotsearch.randomizedtesting.RandomizedRunner$6.evaluate(RandomizedRunner.java:816)
	at com.carrotsearch.randomizedtesting.RandomizedRunner$7.evaluate(RandomizedRunner.java:827)
	at com.carrotsearch.randomizedtesting.rules.StatementAdapter.evaluate(StatementAdapter.java:36)
	at com.carrotsearch.randomizedtesting.rules.SystemPropertiesRestoreRule$1.evaluate(SystemPropertiesRestoreRule.java:57)
	at org.apache.lucene.util.AbstractBeforeAfterRule$1.evaluate(AbstractBeforeAfterRule.java:45)
	at com.carrotsearch.randomizedtesting.rules.StatementAdapter.evaluate(StatementAdapter.java:36)
	at org.apache.lucene.util.TestRuleStoreClassName$1.evaluate(TestRuleStoreClassName.java:41)
	at com.carrotsearch.randomizedtesting.rules.NoShadowingOrOverridesOnMethodsRule$1.evaluate(NoShadowingOrOverridesOnMethodsRule.java:40)
	at com.carrotsearch.randomizedtesting.rules.NoShadowingOrOverridesOnMethodsRule$1.evaluate(NoShadowingOrOverridesOnMethodsRule.java:40)
	at com.carrotsearch.randomizedtesting.rules.StatementAdapter.evaluate(StatementAdapter.java:36)
	at com.carrotsearch.randomizedtesting.rules.StatementAdapter.evaluate(StatementAdapter.java:36)
	at com.carrotsearch.randomizedtesting.rules.StatementAdapter.evaluate(StatementAdapter.java:36)
	at org.apache.lucene.util.TestRuleAssertionsRequired$1.evaluate(TestRuleAssertionsRequired.java:53)
	at org.apache.lucene.util.TestRuleMarkFailure$1.evaluate(TestRuleMarkFailure.java:47)
	at org.apache.lucene.util.TestRuleIgnoreAfterMaxFailures$1.evaluate(TestRuleIgnoreAfterMaxFailures.java:64)
	at org.apache.lucene.util.TestRuleIgnoreTestSuites$1.evaluate(TestRuleIgnoreTestSuites.java:54)
	at com.carrotsearch.randomizedtesting.rules.StatementAdapter.evaluate(StatementAdapter.java:36)
	at com.carrotsearch.randomizedtesting.ThreadLeakControl$StatementRunner.run(ThreadLeakControl.java:367)
	at java.lang.Thread.run(Thread.java:745)
Caused by: java.net.SocketException: Connection reset
	at java.net.SocketInputStream.read(SocketInputStream.java:209)
	at java.net.SocketInputStream.read(SocketInputStream.java:141)
	at org.apache.http.impl.io.AbstractSessionInputBuffer.fillBuffer(AbstractSessionInputBuffer.java:160)
	at org.apache.http.impl.io.SocketInputBuffer.fillBuffer(SocketInputBuffer.java:84)
	at org.apache.http.impl.io.AbstractSessionInputBuffer.readLine(AbstractSessionInputBuffer.java:273)
	at org.apache.http.impl.conn.DefaultHttpResponseParser.parseHead(DefaultHttpResponseParser.java:140)
	at org.apache.http.impl.conn.DefaultHttpResponseParser.parseHead(DefaultHttpResponseParser.java:57)
	at org.apache.http.impl.io.AbstractMessageParser.parse(AbstractMessageParser.java:261)
	at org.apache.http.impl.AbstractHttpClientConnection.receiveResponseHeader(AbstractHttpClientConnection.java:283)
	at org.apache.http.impl.conn.DefaultClientConnection.receiveResponseHeader(DefaultClientConnection.java:251)
	at org.apache.http.impl.conn.ManagedClientConnectionImpl.receiveResponseHeader(ManagedClientConnectionImpl.java:197)
	at org.apache.http.protocol.HttpRequestExecutor.doReceiveResponse(HttpRequestExecutor.java:272)
	at org.apache.http.protocol.HttpRequestExecutor.execute(HttpRequestExecutor.java:124)
	at org.apache.http.impl.client.DefaultRequestDirector.tryExecute(DefaultRequestDirector.java:685)
	at org.apache.http.impl.client.DefaultRequestDirector.execute(DefaultRequestDirector.java:487)
	at org.apache.http.impl.client.AbstractHttpClient.doExecute(AbstractHttpClient.java:882)
	at org.apache.http.impl.client.CloseableHttpClient.execute(CloseableHttpClient.java:82)
	at org.apache.http.impl.client.CloseableHttpClient.execute(CloseableHttpClient.java:107)
	at org.apache.http.impl.client.CloseableHttpClient.execute(CloseableHttpClient.java:55)
	at org.apache.solr.client.solrj.impl.HttpSolrClient.executeMethod(HttpSolrClient.java:482)
	... 49 more




Build Log:
[...truncated 14284 lines...]
   [junit4] Suite: org.apache.solr.handler.clustering.DistributedClusteringComponentTest
   [junit4]   2> log4j:WARN No such property [conversionPattern] in org.apache.solr.util.SolrLogLayout.
   [junit4]   2> Creating dataDir: /Users/jenkins/workspace/Lucene-Solr-trunk-MacOSX/solr/build/contrib/solr-clustering/test/J0/temp/solr.handler.clustering.DistributedClusteringComponentTest_501CD408E008B061-001/init-core-data-001
   [junit4]   2> 1576 T12 oas.BaseDistributedSearchTestCase.initHostContext Setting hostContext system property: /_vnj/u
   [junit4]   2> 1692 T12 oas.SolrTestCaseJ4.writeCoreProperties Writing core.properties file to /Users/jenkins/workspace/Lucene-Solr-trunk-MacOSX/solr/build/contrib/solr-clustering/test/J0/temp/solr.handler.clustering.DistributedClusteringComponentTest_501CD408E008B061-001/tempDir-001/control/cores/collection1
   [junit4]   2> 1776 T12 oejul.Log.initialized Logging initialized @3982ms
   [junit4]   2> 2292 T12 oejs.Server.doStart jetty-9.3.6.v20151106
   [junit4]   2> 2394 T12 oejsh.ContextHandler.doStart Started o.e.j.s.ServletContextHandler@565b87aa{/_vnj/u,null,AVAILABLE}
   [junit4]   2> 2447 T12 oejs.AbstractConnector.doStart Started ServerConnector@d549136{HTTP/1.1,[http/1.1]}{127.0.0.1:51185}
   [junit4]   2> 2450 T12 oejs.Server.doStart Started @4658ms
   [junit4]   2> 2451 T12 oascse.JettySolrRunner$1.lifeCycleStarted Jetty properties: {hostContext=/_vnj/u, hostPort=51185, coreRootDirectory=/Users/jenkins/workspace/Lucene-Solr-trunk-MacOSX/solr/build/contrib/solr-clustering/test/J0/temp/solr.handler.clustering.DistributedClusteringComponentTest_501CD408E008B061-001/tempDir-001/control/cores}
   [junit4]   2> 2508 T12 oass.SolrDispatchFilter.init SolrDispatchFilter.init(): sun.misc.Launcher$AppClassLoader@1540e19d
   [junit4]   2> 2591 T12 oasc.SolrResourceLoader.<init> new SolrResourceLoader for directory: '/Users/jenkins/workspace/Lucene-Solr-trunk-MacOSX/solr/build/contrib/solr-clustering/test/J0/temp/solr.handler.clustering.DistributedClusteringComponentTest_501CD408E008B061-001/tempDir-001/control'
   [junit4]   2> 2605 T12 oasc.SolrResourceLoader.locateSolrHome JNDI not configured for solr (NoInitialContextEx)
   [junit4]   2> 2605 T12 oasc.SolrResourceLoader.locateSolrHome solr home defaulted to 'solr/' (could not find system property or JNDI)
   [junit4]   2> 2628 T12 oasc.SolrXmlConfig.fromFile Loading container configuration from /Users/jenkins/workspace/Lucene-Solr-trunk-MacOSX/solr/build/contrib/solr-clustering/test/J0/temp/solr.handler.clustering.DistributedClusteringComponentTest_501CD408E008B061-001/tempDir-001/control/solr.xml
   [junit4]   2> 2783 T12 oasc.CorePropertiesLocator.<init> Config-defined core root directory: /Users/jenkins/workspace/Lucene-Solr-trunk-MacOSX/solr/build/contrib/solr-clustering/test/J0/temp/solr.handler.clustering.DistributedClusteringComponentTest_501CD408E008B061-001/tempDir-001/control/cores
   [junit4]   2> 2950 T12 oasc.CoreContainer.<init> New CoreContainer 2113959441
   [junit4]   2> 2950 T12 oasc.CoreContainer.load Loading cores into CoreContainer [instanceDir=/Users/jenkins/workspace/Lucene-Solr-trunk-MacOSX/solr/build/contrib/solr-clustering/test/J0/temp/solr.handler.clustering.DistributedClusteringComponentTest_501CD408E008B061-001/tempDir-001/control]
   [junit4]   2> 2960 T12 oasc.CoreContainer.load WARN Couldn't add files from /Users/jenkins/workspace/Lucene-Solr-trunk-MacOSX/solr/build/contrib/solr-clustering/test/J0/temp/solr.handler.clustering.DistributedClusteringComponentTest_501CD408E008B061-001/tempDir-001/control/lib to classpath: /Users/jenkins/workspace/Lucene-Solr-trunk-MacOSX/solr/build/contrib/solr-clustering/test/J0/temp/solr.handler.clustering.DistributedClusteringComponentTest_501CD408E008B061-001/tempDir-001/control/lib
   [junit4]   2> 3044 T12 oashc.HttpShardHandlerFactory.init created with socketTimeout : 600000,urlScheme : ,connTimeout : 60000,maxConnectionsPerHost : 20,maxConnections : 10000,corePoolSize : 0,maximumPoolSize : 2147483647,maxThreadIdleTime : 5,sizeOfQueue : -1,fairnessPolicy : false,useRetries : false,
   [junit4]   2> 3496 T12 oasu.UpdateShardHandler.<init> Creating UpdateShardHandler HTTP client with params: socketTimeout=600000&connTimeout=60000&retry=true
   [junit4]   2> 3506 T12 oasl.LogWatcher.createWatcher SLF4J impl is org.slf4j.impl.Log4jLoggerFactory
   [junit4]   2> 3509 T12 oasl.LogWatcher.newRegisteredLogWatcher Registering Log Listener [Log4j (org.slf4j.impl.Log4jLoggerFactory)]
   [junit4]   2> 3518 T12 oasc.CoreContainer.initializeAuthorizationPlugin Security conf doesn't exist. Skipping setup for authorization module.
   [junit4]   2> 3518 T12 oasc.CoreContainer.initializeAuthenticationPlugin No authentication plugin used.
   [junit4]   2> 3742 T12 oasc.CorePropertiesLocator.discover Looking for core definitions underneath /Users/jenkins/workspace/Lucene-Solr-trunk-MacOSX/solr/build/contrib/solr-clustering/test/J0/temp/solr.handler.clustering.DistributedClusteringComponentTest_501CD408E008B061-001/tempDir-001/control/cores
   [junit4]   2> 3761 T12 oasc.CoreDescriptor.<init> Created CoreDescriptor: {name=collection1, config=solrconfig.xml, loadOnStartup=true, schema=schema.xml, configSetProperties=configsetprops.json, transient=false, dataDir=data/, configSet=collection1}
   [junit4]   2> 3762 T12 oasc.CorePropertiesLocator$1.visitFile Found core collection1 in /Users/jenkins/workspace/Lucene-Solr-trunk-MacOSX/solr/build/contrib/solr-clustering/test/J0/temp/solr.handler.clustering.DistributedClusteringComponentTest_501CD408E008B061-001/tempDir-001/control/cores/collection1
   [junit4]   2> 3763 T12 oasc.CorePropertiesLocator.discover Found 1 core definitions
   [junit4]   2> 3779 T12 oass.SolrDispatchFilter.init user.dir=/Users/jenkins/workspace/Lucene-Solr-trunk-MacOSX/solr/build/contrib/solr-clustering/test/J0
   [junit4]   2> 3780 T12 oass.SolrDispatchFilter.init SolrDispatchFilter.init() done
   [junit4]   2> 3779 T25 oasc.SolrResourceLoader.<init> new SolrResourceLoader for directory: '/Users/jenkins/workspace/Lucene-Solr-trunk-MacOSX/solr/build/contrib/solr-clustering/test/J0/temp/solr.handler.clustering.DistributedClusteringComponentTest_501CD408E008B061-001/tempDir-001/control/collection1'
   [junit4]   2> 3783 T25 oasc.SolrResourceLoader.locateSolrHome JNDI not configured for solr (NoInitialContextEx)
   [junit4]   2> 3783 T25 oasc.SolrResourceLoader.locateSolrHome solr home defaulted to 'solr/' (could not find system property or JNDI)
   [junit4]   2> 3855 T25 oasc.SolrConfig.refreshRequestParams current version of requestparams : -1
   [junit4]   2> 3906 T25 oasc.Config.assertWarnOrFail WARN Beginning with Solr 5.5, <maxMergeDocs> is deprecated, configure it on the relevant <mergePolicyFactory> instead.
   [junit4]   2> 3906 T25 oasc.Config.assertWarnOrFail WARN Beginning with Solr 5.5, <mergeFactor> is deprecated, configure it on the relevant <mergePolicyFactory> instead.
   [junit4]   2> 3910 T25 oasc.SolrConfig.<init> Using Lucene MatchVersion: 6.0.0
   [junit4]   2> 4101 T25 oasc.SolrConfig.<init> Loaded SolrConfig: solrconfig.xml
   [junit4]   2> 4163 T25 oass.IndexSchema.readSchema [collection1] Schema name=example
   [junit4]   2> 4897 T25 oass.IndexSchema.readSchema default search field in schema is text
   [junit4]   2> 4898 T25 oass.IndexSchema.readSchema query parser default operator is OR
   [junit4]   2> 4898 T25 oass.IndexSchema.readSchema unique key field: id
   [junit4]   2> 4968 T25 oasc.ConfigSetProperties.readFromResourceLoader Did not find ConfigSet properties, assuming default properties: Can't find resource 'configsetprops.json' in classpath or '/Users/jenkins/workspace/Lucene-Solr-trunk-MacOSX/solr/build/contrib/solr-clustering/test/J0/temp/solr.handler.clustering.DistributedClusteringComponentTest_501CD408E008B061-001/tempDir-001/control/collection1'
   [junit4]   2> 4970 T25 oasc.CoreContainer.create Creating SolrCore 'collection1' using configuration from configset /Users/jenkins/workspace/Lucene-Solr-trunk-MacOSX/solr/build/contrib/solr-clustering/test/J0/temp/solr.handler.clustering.DistributedClusteringComponentTest_501CD408E008B061-001/tempDir-001/control/collection1
   [junit4]   2> 5077 T25 x:x:collection1 oasc.SolrCore.initDirectoryFactory org.apache.solr.core.MockDirectoryFactory
   [junit4]   2> 5109 T25 x:x:collection1 oasc.SolrCore.<init> [[collection1] ] Opening new SolrCore at [/Users/jenkins/workspace/Lucene-Solr-trunk-MacOSX/solr/build/contrib/solr-clustering/test/J0/temp/solr.handler.clustering.DistributedClusteringComponentTest_501CD408E008B061-001/tempDir-001/control/collection1], dataDir=[/Users/jenkins/workspace/Lucene-Solr-trunk-MacOSX/solr/build/contrib/solr-clustering/test/J0/temp/solr.handler.clustering.DistributedClusteringComponentTest_501CD408E008B061-001/tempDir-001/control/cores/collection1/data/]
   [junit4]   2> 5113 T25 x:x:collection1 oasc.JmxMonitoredMap.<init> No JMX servers found, not exposing Solr information with JMX.
   [junit4]   2> 5136 T25 x:x:collection1 oasc.SolrCore.initListeners [[collection1] ] Added SolrEventListener for newSearcher: [org.apache.solr.core.QuerySenderListener{queries=[{q=solr,start=0,rows=10}, {q=rocks,start=0,rows=10}, {q=static newSearcher warming query from solrconfig.xml}]}]
   [junit4]   2> 5136 T25 x:x:collection1 oasc.SolrCore.initListeners [[collection1] ] Added SolrEventListener for firstSearcher: [org.apache.solr.core.QuerySenderListener{queries=[{q=fast_warm,start=0,rows=10}, {q=static firstSearcher warming query from solrconfig.xml}]}]
   [junit4]   2> 5189 T25 x:x:collection1 oasc.CachingDirectoryFactory.get return new directory for /Users/jenkins/workspace/Lucene-Solr-trunk-MacOSX/solr/build/contrib/solr-clustering/test/J0/temp/solr.handler.clustering.DistributedClusteringComponentTest_501CD408E008B061-001/tempDir-001/control/cores/collection1/data
   [junit4]   2> 5190 T25 x:x:collection1 oasc.SolrCore.getNewIndexDir New index directory detected: old=null new=/Users/jenkins/workspace/Lucene-Solr-trunk-MacOSX/solr/build/contrib/solr-clustering/test/J0/temp/solr.handler.clustering.DistributedClusteringComponentTest_501CD408E008B061-001/tempDir-001/control/cores/collection1/data/index/
   [junit4]   2> 5190 T25 x:x:collection1 oasc.SolrCore.initIndex WARN [collection1] Solr index directory '/Users/jenkins/workspace/Lucene-Solr-trunk-MacOSX/solr/build/contrib/solr-clustering/test/J0/temp/solr.handler.clustering.DistributedClusteringComponentTest_501CD408E008B061-001/tempDir-001/control/cores/collection1/data/index' doesn't exist. Creating new index...
   [junit4]   2> 5214 T25 x:x:collection1 oasc.CachingDirectoryFactory.get return new directory for /Users/jenkins/workspace/Lucene-Solr-trunk-MacOSX/solr/build/contrib/solr-clustering/test/J0/temp/solr.handler.clustering.DistributedClusteringComponentTest_501CD408E008B061-001/tempDir-001/control/cores/collection1/data/index
   [junit4]   2> 5330 T25 x:x:collection1 oasc.SolrDeletionPolicy.onCommit SolrDeletionPolicy.onCommit: commits: num=1
   [junit4]   2> 		commit{dir=MockDirectoryWrapper(RAMDirectory@3cfcbaf7 lockFactory=org.apache.lucene.store.SingleInstanceLockFactory@35e26618),segFN=segments_1,generation=1}
   [junit4]   2> 5332 T25 x:x:collection1 oasc.SolrDeletionPolicy.updateCommits newest commit generation = 1
   [junit4]   2> 5334 T29 x:x:collection1 oasc.SolrCore$12.run Looking for old index directories to cleanup for core collection1 in /Users/jenkins/workspace/Lucene-Solr-trunk-MacOSX/solr/build/contrib/solr-clustering/test/J0/temp/solr.handler.clustering.DistributedClusteringComponentTest_501CD408E008B061-001/tempDir-001/control/cores/collection1/data/
   [junit4]   2> 5335 T29 x:x:collection1 oasc.DirectoryFactory.cleanupOldIndexDirectories WARN /Users/jenkins/workspace/Lucene-Solr-trunk-MacOSX/solr/build/contrib/solr-clustering/test/J0/temp/solr.handler.clustering.DistributedClusteringComponentTest_501CD408E008B061-001/tempDir-001/control/cores/collection1/data/ does not point to a valid data directory; skipping clean-up of old index directories.
   [junit4]   2> 5356 T25 x:x:collection1 oasr.XSLTResponseWriter.init xsltCacheLifetimeSeconds=5
   [junit4]   2> 6016 T25 x:x:collection1 oasc.SolrCore.loadUpdateProcessorChains no updateRequestProcessorChain defined as default, creating implicit default
   [junit4]   2> 6162 T25 x:x:collection1 oashl.XMLLoader.init xsltCacheLifetimeSeconds=60
   [junit4]   2> 6174 T25 x:x:collection1 oashl.XMLLoader.init xsltCacheLifetimeSeconds=60
   [junit4]   2> 6176 T25 x:x:collection1 oashl.XMLLoader.init xsltCacheLifetimeSeconds=60
   [junit4]   2> 6177 T25 x:x:collection1 oashl.XMLLoader.init xsltCacheLifetimeSeconds=60
   [junit4]   2> 6310 T25 x:x:collection1 oasc.RequestHandlers.initHandlersFromConfig Registered paths: /admin/mbeans,standard,,/update/json/docs,/admin/luke,docClustering,/export,/get,/admin/properties,/update/json,/admin/threads,/update/csv,/sql,/admin/segments,/admin/system,/replication,/config,/stream,/schema,/admin/plugins,/admin/logging,/admin/ping,/update,/admin/file,/debug/dump
   [junit4]   2> 6313 T25 x:x:collection1 oasc.SolrCore.initStatsCache Using default statsCache cache: org.apache.solr.search.stats.LocalStatsCache
   [junit4]   2> 6350 T25 x:x:collection1 oasu.CommitTracker.<init> Hard AutoCommit: disabled
   [junit4]   2> 6351 T25 x:x:collection1 oasu.CommitTracker.<init> Soft AutoCommit: disabled
   [junit4]   2> 6359 T25 x:x:collection1 oasc.SolrDeletionPolicy.onInit SolrDeletionPolicy.onInit: commits: num=1
   [junit4]   2> 		commit{dir=MockDirectoryWrapper(RAMDirectory@3cfcbaf7 lockFactory=org.apache.lucene.store.SingleInstanceLockFactory@35e26618),segFN=segments_1,generation=1}
   [junit4]   2> 6359 T25 x:x:collection1 oasc.SolrDeletionPolicy.updateCommits newest commit generation = 1
   [junit4]   2> 6423 T25 x:x:collection1 oass.SolrIndexSearcher.<init> Opening [Searcher@571b1a8c[collection1] main]
   [junit4]   2> 6450 T25 x:x:collection1 oasr.ManagedResourceStorage$FileStorageIO.configure File-based storage initialized to use dir: /Users/jenkins/workspace/Lucene-Solr-trunk-MacOSX/solr/build/contrib/solr-clustering/test/J0/temp/solr.handler.clustering.DistributedClusteringComponentTest_501CD408E008B061-001/tempDir-001/control/collection1/conf
   [junit4]   2> 6450 T25 x:x:collection1 oasr.RestManager.init Initializing RestManager with initArgs: {storageDir=/Users/jenkins/workspace/Lucene-Solr-trunk-MacOSX/solr/build/contrib/solr-clustering/test/J0/temp/solr.handler.clustering.DistributedClusteringComponentTest_501CD408E008B061-001/tempDir-001/control/collection1/conf}
   [junit4]   2> 6502 T25 x:x:collection1 oasr.ManagedResourceStorage.load Reading _rest_managed.json using file:dir=/Users/jenkins/workspace/Lucene-Solr-trunk-MacOSX/solr/build/contrib/solr-clustering/test/J0/temp/solr.handler.clustering.DistributedClusteringComponentTest_501CD408E008B061-001/tempDir-001/control/collection1/conf
   [junit4]   2> 6503 T25 x:x:collection1 oasr.RestManager.init Initializing 0 registered ManagedResources
   [junit4]   2> 6558 T25 x:x:collection1 oashc.ClusteringComponent.inform Initializing Clustering Engines
   [junit4]   2> 6773 T25 x:x:collection1 oashcc.CarrotClusteringEngine.init Initializing Clustering Engine 'default'
   [junit4]   2> 6852 T25 x:x:collection1 oashcc.CarrotClusteringEngine.init Initializing Clustering Engine 'stc'
   [junit4]   2> 6861 T25 x:x:collection1 oashcc.CarrotClusteringEngine.init Initializing Clustering Engine 'mock'
   [junit4]   2> 6869 T25 x:x:collection1 oashcc.CarrotClusteringEngine.init Initializing Clustering Engine 'mock-external-attrs'
   [junit4]   2> 6869 T25 x:x:collection1 oashcc.SolrResourceLocator.getAll Loaded Solr resource: clustering/carrot2/mock-external-attrs-attributes.xml
   [junit4]   2> 7837 T25 x:x:collection1 oashcc.CarrotClusteringEngine.init Initializing Clustering Engine 'echo'
   [junit4]   2> 7855 T25 x:x:collection1 oashcc.CarrotClusteringEngine.init Initializing Clustering Engine 'lexical-resource-check'
   [junit4]   2> 7863 T25 x:x:collection1 oashcc.CarrotClusteringEngine.init Initializing Clustering Engine 'lexical-resource-check-custom-resource-dir'
   [junit4]   2> 7875 T25 x:x:collection1 oashcc.CarrotClusteringEngine.init Initializing Clustering Engine 'lexical-resource-check-custom-resource-dir-deprecated'
   [junit4]   2> 7886 T25 x:x:collection1 oashcc.CarrotClusteringEngine.init Initializing Clustering Engine 'custom-duplicating-tokenizer'
   [junit4]   2> 7894 T25 x:x:collection1 oashcc.CarrotClusteringEngine.init Initializing Clustering Engine 'custom-duplicating-stemmer'
   [junit4]   2> 7910 T25 x:x:collection1 oashc.ClusteringComponent.setupDefaultEngine Default engine for search results clustering: default [CarrotClusteringEngine]
   [junit4]   2> 7911 T25 x:x:collection1 oashc.ClusteringComponent.setupDefaultEngine WARN No default engine for document clustering.
   [junit4]   2> 7912 T25 x:x:collection1 oashc.ClusteringComponent.inform Finished Initializing Clustering Engines
   [junit4]   2> 7913 T25 x:x:collection1 oashc.ClusteringComponent.inform Initializing Clustering Engines
   [junit4]   2> 7915 T25 x:x:collection1 oashc.ClusteringComponent.setupDefaultEngine WARN No default engine for search results clustering.
   [junit4]   2> 7920 T25 x:x:collection1 oashc.ClusteringComponent.setupDefaultEngine Default engine for document clustering: mock [MockDocumentClusteringEngine]
   [junit4]   2> 7920 T25 x:x:collection1 oashc.ClusteringComponent.inform Finished Initializing Clustering Engines
   [junit4]   2> 7920 T25 x:x:collection1 oashc.ClusteringComponent.inform Initializing Clustering Engines
   [junit4]   2> 7922 T25 x:x:collection1 oashcc.CarrotClusteringEngine.init Initializing Clustering Engine 'stc'
   [junit4]   2> 7929 T25 x:x:collection1 oashcc.CarrotClusteringEngine.init Initializing Clustering Engine 'default'
   [junit4]   2> 7942 T25 x:x:collection1 oashcc.CarrotClusteringEngine.init Initializing Clustering Engine 'mock'
   [junit4]   2> 7950 T25 x:x:collection1 oashc.ClusteringComponent.setupDefaultEngine Default engine for search results clustering: default [CarrotClusteringEngine]
   [junit4]   2> 7952 T25 x:x:collection1 oashc.ClusteringComponent.setupDefaultEngine WARN No default engine for document clustering.
   [junit4]   2> 7952 T25 x:x:collection1 oashc.ClusteringComponent.inform Finished Initializing Clustering Engines
   [junit4]   2> 7952 T25 x:x:collection1 oashc.ClusteringComponent.inform Initializing Clustering Engines
   [junit4]   2> 8101 T25 x:x:collection1 oashcc.CarrotClusteringEngine.init Initializing Clustering Engine 'unavailable'
   [junit4]   2> 8113 T25 x:x:collection1 oashc.ClusteringComponent.inform Optional clustering engine not available: unavailable
   [junit4]   2> 8113 T25 x:x:collection1 oashcc.CarrotClusteringEngine.init Initializing Clustering Engine 'lingo'
   [junit4]   2> 8121 T25 x:x:collection1 oashcc.CarrotClusteringEngine.init Initializing Clustering Engine 'stc'
   [junit4]   2> 8130 T25 x:x:collection1 oashcc.CarrotClusteringEngine.init Initializing Clustering Engine 'mock'
   [junit4]   2> 8138 T25 x:x:collection1 oashc.ClusteringComponent.setupDefaultEngine Default engine for search results clustering: lingo [CarrotClusteringEngine]
   [junit4]   2> 8138 T25 x:x:collection1 oashc.ClusteringComponent.setupDefaultEngine WARN No default engine for document clustering.
   [junit4]   2> 8139 T25 x:x:collection1 oashc.ClusteringComponent.inform Finished Initializing Clustering Engines
   [junit4]   2> 8139 T25 x:x:collection1 oashc.ClusteringComponent.inform Initializing Clustering Engines
   [junit4]   2> 8139 T25 x:x:collection1 oashcc.CarrotClusteringEngine.init Initializing Clustering Engine '<no 'name' attribute>'
   [junit4]   2> 8139 T25 x:x:collection1 oashcc.CarrotClusteringEngine.init Initializing Clustering Engine '<no 'name' attribute>'
   [junit4]   2> 8139 T25 x:x:collection1 oashc.ClusteringComponent.inform WARN Duplicate clustering engine component named ''.
   [junit4]   2> 8140 T25 x:x:collection1 oashcc.CarrotClusteringEngine.init Initializing Clustering Engine '<no 'name' attribute>'
   [junit4]   2> 8140 T25 x:x:collection1 oashc.ClusteringComponent.inform WARN Duplicate clustering engine component named ''.
   [junit4]   2> 8140 T25 x:x:collection1 oashc.ClusteringComponent.setupDefaultEngine Default engine for search results clustering:  [CarrotClusteringEngine]
   [junit4]   2> 8140 T25 x:x:collection1 oashc.ClusteringComponent.setupDefaultEngine WARN No default engine for document clustering.
   [junit4]   2> 8140 T25 x:x:collection1 oashc.ClusteringComponent.inform Finished Initializing Clustering Engines
   [junit4]   2> 8143 T25 x:x:collection1 oash.ReplicationHandler.inform Commits will be reserved for  10000
   [junit4]   2> 8223 T30 x:x:collection1 oasc.QuerySenderListener.newSearcher QuerySenderListener sending requests to Searcher@571b1a8c[collection1] main{ExitableDirectoryReader(UninvertingDirectoryReader())}
   [junit4]   2> 8232 T25 x:x:collection1 oasc.CoreContainer.registerCore registering core: collection1
   [junit4]   2> 8406 T12 oas.SolrTestCaseJ4.writeCoreProperties Writing core.properties file to /Users/jenkins/workspace/Lucene-Solr-trunk-MacOSX/solr/build/contrib/solr-clustering/test/J0/temp/solr.handler.clustering.DistributedClusteringComponentTest_501CD408E008B061-001/tempDir-001/shard0/cores/collection1
   [junit4]   2> 8412 T12 oejs.Server.doStart jetty-9.3.6.v20151106
   [junit4]   2> 8432 T12 oejsh.ContextHandler.doStart Started o.e.j.s.ServletContextHandler@468ba9fa{/_vnj/u,null,AVAILABLE}
   [junit4]   2> 8433 T12 oejs.AbstractConnector.doStart Started ServerConnector@2b6ecfd4{HTTP/1.1,[http/1.1]}{127.0.0.1:51186}
   [junit4]   2> 8440 T12 oejs.Server.doStart Started @10647ms
   [junit4]   2> 8440 T12 oascse.JettySolrRunner$1.lifeCycleStarted Jetty properties: {hostContext=/_vnj/u, hostPort=51186, coreRootDirectory=/Users/jenkins/workspace/Lucene-Solr-trunk-MacOSX/solr/build/contrib/solr-clustering/test/J0/temp/solr.handler.clustering.DistributedClusteringComponentTest_501CD408E008B061-001/tempDir-001/shard0/cores}
   [junit4]   2> 8440 T12 oass.SolrDispatchFilter.init SolrDispatchFilter.init(): sun.misc.Launcher$AppClassLoader@1540e19d
   [junit4]   2> 8441 T12 oasc.SolrResourceLoader.<init> new SolrResourceLoader for directory: '/Users/jenkins/workspace/Lucene-Solr-trunk-MacOSX/solr/build/contrib/solr-clustering/test/J0/temp/solr.handler.clustering.DistributedClusteringComponentTest_501CD408E008B061-001/tempDir-001/shard0'
   [junit4]   2> 8441 T12 oasc.SolrResourceLoader.locateSolrHome JNDI not configured for solr (NoInitialContextEx)
   [junit4]   2> 8441 T12 oasc.SolrResourceLoader.locateSolrHome solr home defaulted to 'solr/' (could not find system property or JNDI)
   [junit4]   2> 8442 T12 oasc.SolrXmlConfig.fromFile Loading container configuration from /Users/jenkins/workspace/Lucene-Solr-trunk-MacOSX/solr/build/contrib/solr-clustering/test/J0/temp/solr.handler.clustering.DistributedClusteringComponentTest_501CD408E008B061-001/tempDir-001/shard0/solr.xml
   [junit4]   2> 8482 T12 oasc.CorePropertiesLocator.<init> Config-defined core root directory: /Users/jenkins/workspace/Lucene-Solr-trunk-MacOSX/solr/build/contrib/solr-clustering/test/J0/temp/solr.handler.clustering.DistributedClusteringComponentTest_501CD408E008B061-001/tempDir-001/shard0/cores
   [junit4]   2> 8482 T12 oasc.CoreContainer.<init> New CoreContainer 832181191
   [junit4]   2> 8482 T12 oasc.CoreContainer.load Loading cores into CoreContainer [instanceDir=/Users/jenkins/workspace/Lucene-Solr-trunk-MacOSX/solr/build/contrib/solr-clustering/test/J0/temp/solr.handler.clustering.DistributedClusteringComponentTest_501CD408E008B061-001/tempDir-001/shard0]
   [junit4]   2> 8483 T12 oasc.CoreContainer.load WARN Couldn't add files from /Users/jenkins/workspace/Lucene-Solr-trunk-MacOSX/solr/build/contrib/solr-clustering/test/J0/temp/solr.handler.clustering.DistributedClusteringComponentTest_501CD408E008B061-001/tempDir-001/shard0/lib to classpath: /Users/jenkins/workspace/Lucene-Solr-trunk-MacOSX/solr/build/contrib/solr-clustering/test/J0/temp/solr.handler.clustering.DistributedClusteringComponentTest_501CD408E008B061-001/tempDir-001/shard0/lib
   [junit4]   2> 8483 T12 oashc.HttpShardHandlerFactory.init created with socketTimeout : 600000,urlScheme : ,connTimeout : 60000,maxConnectionsPerHost : 20,maxConnections : 10000,corePoolSize : 0,maximumPoolSize : 2147483647,maxThreadIdleTime : 5,sizeOfQueue : -1,fairnessPolicy : false,useRetries : false,
   [junit4]   2> 8484 T12 oasu.UpdateShardHandler.<init> Creating UpdateShardHandler HTTP client with params: socketTimeout=600000&connTimeout=60000&retry=true
   [junit4]   2> 8485 T12 oasl.LogWatcher.createWatcher SLF4J impl is org.slf4j.impl.Log4jLoggerFactory
   [junit4]   2> 8485 T12 oasl.LogWatcher.newRegisteredLogWatcher Registering Log Listener [Log4j (org.slf4j.impl.Log4jLoggerFactory)]
   [junit4]   2> 8485 T12 oasc.CoreContainer.initializeAuthorizationPlugin Security conf doesn't exist. Skipping setup for authorization module.
   [junit4]   2> 8485 T12 oasc.CoreContainer.initializeAuthenticationPlugin No authentication plugin used.
   [junit4]   2> 8487 T12 oasc.CorePropertiesLocator.discover Looking for core definitions underneath /Users/jenkins/workspace/Lucene-Solr-trunk-MacOSX/solr/build/contrib/solr-clustering/test/J0/temp/solr.handler.clustering.DistributedClusteringComponentTest_501CD408E008B061-001/tempDir-001/shard0/cores
   [junit4]   2> 8488 T12 oasc.CoreDescriptor.<init> Created CoreDescriptor: {name=collection1, config=solrconfig.xml, loadOnStartup=true, schema=schema.xml, configSetProperties=configsetprops.json, transient=false, dataDir=data/, configSet=collection1}
   [junit4]   2> 8489 T12 oasc.CorePropertiesLocator$1.visitFile Found core collection1 in /Users/jenkins/workspace/Lucene-Solr-trunk-MacOSX/solr/build/contrib/solr-clustering/test/J0/temp/solr.handler.clustering.DistributedClusteringComponentTest_501CD408E008B061-001/tempDir-001/shard0/cores/collection1
   [junit4]   2> 8489 T12 oasc.CorePropertiesLocator.discover Found 1 core definitions
   [junit4]   2> 8499 T43 oasc.SolrResourceLoader.<init> new SolrResourceLoader for directory: '/Users/jenkins/workspace/Lucene-Solr-trunk-MacOSX/solr/build/contrib/solr-clustering/test/J0/temp/solr.handler.clustering.DistributedClusteringComponentTest_501CD408E008B061-001/tempDir-001/shard0/collection1'
   [junit4]   2> 8499 T43 oasc.SolrResourceLoader.locateSolrHome JNDI not configured for solr (NoInitialContextEx)
   [junit4]   2> 8499 T43 oasc.SolrResourceLoader.locateSolrHome solr home defaulted to 'solr/' (could not find system property or JNDI)
   [junit4]   2> 8502 T12 oass.SolrDispatchFilter.init user.dir=/Users/jenkins/workspace/Lucene-Solr-trunk-MacOSX/solr/build/contrib/solr-clustering/test/J0
   [junit4]   2> 8502 T12 oass.SolrDispatchFilter.init SolrDispatchFilter.init() done
   [junit4]   2> 8549 T43 oasc.SolrConfig.refreshRequestParams current version of requestparams : -1
   [junit4]   2> 8568 T43 oasc.Config.assertWarnOrFail WARN Beginning with Solr 5.5, <maxMergeDocs> is deprecated, configure it on the relevant <mergePolicyFactory> instead.
   [junit4]   2> 8569 T43 oasc.Config.assertWarnOrFail WARN Beginning with Solr 5.5, <mergeFactor> is deprecated, configure it on the relevant <mergePolicyFactory> instead.
   [junit4]   2> 8571 T43 oasc.SolrConfig.<init> Using Lucene MatchVersion: 6.0.0
   [junit4]   2> ASYNC  NEW_CORE C0 name=collection1 org.apache.solr.core.SolrCore@c53df6
   [junit4]   2> 8590 T30 x:x:collection1 C0 oasc.SolrCore.execute [collection1]  webapp=null path=null params={q=fast_warm&distrib=false&start=0&rows=10&event=firstSearcher} hits=0 status=0 QTime=353
   [junit4]   2> 8633 T43 oasc.SolrConfig.<init> Loaded SolrConfig: solrconfig.xml
   [junit4]   2> 8676 T43 oass.IndexSchema.readSchema [collection1] Schema name=example
   [junit4]   2> ASYNC  NEW_CORE C1 name=collection1 org.apache.solr.core.SolrCore@c53df6
   [junit4]   2> 8702 T30 x:x:collection1 C1 oasc.SolrCore.execute [collection1]  webapp=null path=null params={q=static+firstSearcher+warming+query+from+solrconfig.xml&distrib=false&event=firstSearcher} hits=0 status=0 QTime=98
   [junit4]   2> 8703 T30 x:x:collection1 oasc.QuerySenderListener.newSearcher QuerySenderListener done.
   [junit4]   2> 8717 T30 x:x:collection1 oasc.SolrCore.registerSearcher [collection1] Registered new searcher Searcher@571b1a8c[collection1] main{ExitableDirectoryReader(UninvertingDirectoryReader())}
   [junit4]   2> 8772 T43 oass.IndexSchema.readSchema default search field in schema is text
   [junit4]   2> 8772 T43 oass.IndexSchema.readSchema query parser default operator is OR
   [junit4]   2> 8773 T43 oass.IndexSchema.readSchema unique key field: id
   [junit4]   2> 8800 T43 oasc.ConfigSetProperties.readFromResourceLoader Did not find ConfigSet properties, assuming default properties: Can't find resource 'configsetprops.json' in classpath or '/Users/jenkins/workspace/Lucene-Solr-trunk-MacOSX/solr/build/contrib/solr-clustering/test/J0/temp/solr.handler.clustering.DistributedClusteringComponentTest_501CD408E008B061-001/tempDir-001/shard0/collection1'
   [junit4]   2> 8803 T43 oasc.CoreContainer.create Creating SolrCore 'collection1' using configuration from configset /Users/jenkins/workspace/Lucene-Solr-trunk-MacOSX/solr/build/contrib/solr-clustering/test/J0/temp/solr.handler.clustering.DistributedClusteringComponentTest_501CD408E008B061-001/tempDir-001/shard0/collection1
   [junit4]   2> 8803 T43 x:x:collection1 oasc.SolrCore.initDirectoryFactory org.apache.solr.core.MockDirectoryFactory
   [junit4]   2> 8804 T43 x:x:collection1 oasc.SolrCore.<init> [[collection1] ] Opening new SolrCore at [/Users/jenkins/workspace/Lucene-Solr-trunk-MacOSX/solr/build/contrib/solr-clustering/test/J0/temp/solr.handler.clustering.DistributedClusteringComponentTest_501CD408E008B061-001/tempDir-001/shard0/collection1], dataDir=[/Users/jenkins/workspace/Lucene-Solr-trunk-MacOSX/solr/build/contrib/solr-clustering/test/J0/temp/solr.handler.clustering.DistributedClusteringComponentTest_501CD408E008B061-001/tempDir-001/shard0/cores/collection1/data/]
   [junit4]   2> 8804 T43 x:x:collection1 oasc.JmxMonitoredMap.<init> No JMX servers found, not exposing Solr information with JMX.
   [junit4]   2> 8805 T43 x:x:collection1 oasc.SolrCore.initListeners [[collection1] ] Added SolrEventListener for newSearcher: [org.apache.solr.core.QuerySenderListener{queries=[{q=solr,start=0,rows=10}, {q=rocks,start=0,rows=10}, {q=static newSearcher warming query from solrconfig.xml}]}]
   [junit4]   2> 8805 T43 x:x:collection1 oasc.SolrCore.initListeners [[collection1] ] Added SolrEventListener for firstSearcher: [org.apache.solr.core.QuerySenderListener{queries=[{q=fast_warm,start=0,rows=10}, {q=static firstSearcher warming query from solrconfig.xml}]}]
   [junit4]   2> 8806 T43 x:x:collection1 oasc.CachingDirectoryFactory.get return new directory for /Users/jenkins/workspace/Lucene-Solr-trunk-MacOSX/solr/build/contrib/solr-clustering/test/J0/temp/solr.handler.clustering.DistributedClusteringComponentTest_501CD408E008B061-001/tempDir-001/shard0/cores/collection1/data
   [junit4]   2> 8807 T43 x:x:collection1 oasc.SolrCore.getNewIndexDir New index directory detected: old=null new=/Users/jenkins/workspace/Lucene-Solr-trunk-MacOSX/solr/build/contrib/solr-clustering/test/J0/temp/solr.handler.clustering.DistributedClusteringComponentTest_501CD408E008B061-001/tempDir-001/shard0/cores/collection1/data/index/
   [junit4]   2> 8807 T43 x:x:collection1 oasc.SolrCore.initIndex WARN [collection1] Solr index directory '/Users/jenkins/workspace/Lucene-Solr-trunk-MacOSX/solr/build/contrib/solr-clustering/test/J0/temp/solr.handler.clustering.DistributedClusteringComponentTest_501CD408E008B061-001/tempDir-001/shard0/cores/collection1/data/index' doesn't exist. Creating new index...
   [junit4]   2> 8807 T43 x:x:collection1 oasc.CachingDirectoryFactory.get return new directory for /Users/jenkins/workspace/Lucene-Solr-trunk-MacOSX/solr/build/contrib/solr-clustering/test/J0/temp/solr.handler.clustering.DistributedClusteringComponentTest_501CD408E008B061-001/tempDir-001/shard0/cores/collection1/data/index
   [junit4]   2> 8809 T43 x:x:collection1 oasc.SolrDeletionPolicy.onCommit SolrDeletionPolicy.onCommit: commits: num=1
   [junit4]   2> 		commit{dir=MockDirectoryWrapper(RAMDirectory@9889750 lockFactory=org.apache.lucene.store.SingleInstanceLockFactory@7b5a81b),segFN=segments_1,generation=1}
   [junit4]   2> 8809 T43 x:x:collection1 oasc.SolrDeletionPolicy.updateCommits newest commit generation = 1
   [junit4]   2> 8810 T47 x:x:collection1 oasc.SolrCore$12.run Looking for old index directories to cleanup for core collection1 in /Users/jenkins/workspace/Lucene-Solr-trunk-MacOSX/solr/build/contrib/solr-clustering/test/J0/temp/solr.handler.clustering.DistributedClusteringComponentTest_501CD408E008B061-001/tempDir-001/shard0/cores/collection1/data/
   [junit4]   2> 8810 T47 x:x:collection1 oasc.DirectoryFactory.cleanupOldIndexDirectories WARN /Users/jenkins/workspace/Lucene-Solr-trunk-MacOSX/solr/build/contrib/solr-clustering/test/J0/temp/solr.handler.clustering.DistributedClusteringComponentTest_501CD408E008B061-001/tempDir-001/shard0/cores/collection1/data/ does not point to a valid data directory; skipping clean-up of old index directories.
   [junit4]   2> 8811 T43 x:x:collection1 oasr.XSLTResponseWriter.init xsltCacheLifetimeSeconds=5
   [junit4]   2> 8814 T43 x:x:collection1 oasc.SolrCore.loadUpdateProcessorChains no updateRequestProcessorChain defined as default, creating implicit default
   [junit4]   2> 8821 T43 x:x:collection1 oashl.XMLLoader.init xsltCacheLifetimeSeconds=60
   [junit4]   2> 8827 T43 x:x:collection1 oashl.XMLLoader.init xsltCacheLifetimeSeconds=60
   [junit4]   2> 8828 T43 x:x:collection1 oashl.XMLLoader.init xsltCacheLifetimeSeconds=60
   [junit4]   2> 8829 T43 x:x:collection1 oashl.XMLLoader.init xsltCacheLifetimeSeconds=60
   [junit4]   2> 8839 T43 x:x:collection1 oasc.RequestHandlers.initHandlersFromConfig Registered paths: /admin/mbeans,standard,,/update/json/docs,/admin/luke,docClustering,/export,/get,/admin/properties,/update/json,/admin/threads,/update/csv,/sql,/admin/segments,/admin/system,/replication,/config,/stream,/schema,/admin/plugins,/admin/logging,/admin/ping,/update,/admin/file,/debug/dump
   [junit4]   2> 8841 T43 x:x:collection1 oasc.SolrCore.initStatsCache Using default statsCache cache: org.apache.solr.search.stats.LocalStatsCache
   [junit4]   2> 8842 T43 x:x:collection1 oasu.CommitTracker.<init> Hard AutoCommit: disabled
   [junit4]   2> 8842 T43 x:x:collection1 oasu.CommitTracker.<init> Soft AutoCommit: disabled
   [junit4]   2> 8844 T43 x:x:collection1 oasc.SolrDeletionPolicy.onInit SolrDeletionPolicy.onInit: commits: num=1
   [junit4]   2> 		commit{dir=MockDirectoryWrapper(RAMDirectory@9889750 lockFactory=org.apache.lucene.store.SingleInstanceLockFactory@7b5a81b),segFN=segments_1,generation=1}
   [junit4]   2> 8844 T43 x:x:collection1 oasc.SolrDeletionPolicy.updateCommits newest commit generation = 1
   [junit4]   2> 8844 T43 x:x:collection1 oass.SolrIndexSearcher.<init> Opening [Searcher@505496fb[collection1] main]
   [junit4]   2> 8845 T43 x:x:collection1 oasr.ManagedResourceStorage$FileStorageIO.configure File-based storage initialized to use dir: /Users/jenkins/workspace/Lucene-Solr-trunk-MacOSX/solr/build/contrib/solr-clustering/test/J0/temp/solr.handler.clustering.DistributedClusteringComponentTest_501CD408E008B061-001/tempDir-001/shard0/collection1/conf
   [junit4]   2> 8846 T43 x:x:collection1 oasr.RestManager.init Initializing RestManager with initArgs: {storageDir=/Users/jenkins/workspace/Lucene-Solr-trunk-MacOSX/solr/build/contrib/solr-clustering/test/J0/temp/solr.handler.clustering.DistributedClusteringComponentTest_501CD408E008B061-001/tempDir-001/shard0/collection1/conf}
   [junit4]   2> 8847 T43 x:x:collection1 oasr.ManagedResourceStorage.load Reading _rest_managed.json using file:dir=/Users/jenkins/workspace/Lucene-Solr-trunk-MacOSX/solr/build/contrib/solr-clustering/test/J0/temp/solr.handler.clustering.DistributedClusteringComponentTest_501CD408E008B061-001/tempDir-001/shard0/collection1/conf
   [junit4]   2> 8847 T43 x:x:collection1 oasr.RestManager.init Initializing 0 registered ManagedResources
   [junit4]   2> 8847 T43 x:x:collection1 oashc.ClusteringComponent.inform Initializing Clustering Engines
   [junit4]   2> 8849 T43 x:x:collection1 oashcc.CarrotClusteringEngine.init Initializing Clustering Engine 'default'
   [junit4]   2> 8857 T43 x:x:collection1 oashcc.CarrotClusteringEngine.init Initializing Clustering Engine 'stc'
   [junit4]   2> 8864 T43 x:x:collection1 oashcc.CarrotClusteringEngine.init Initializing Clustering Engine 'mock'
   [junit4]   2> 8872 T43 x:x:collection1 oashcc.CarrotClusteringEngine.init Initializing Clustering Engine 'mock-external-attrs'
   [junit4]   2> 8872 T43 x:x:collection1 oashcc.SolrResourceLocator.getAll Loaded Solr resource: clustering/carrot2/mock-external-attrs-attributes.xml
   [junit4]   2> 8888 T43 x:x:collection1 oashcc.CarrotClusteringEngine.init Initializing Clustering Engine 'echo'
   [junit4]   2> 8898 T43 x:x:collection1 oashcc.CarrotClusteringEngine.init Initializing Clustering Engine 'lexical-resource-check'
   [junit4]   2> 8908 T43 x:x:collection1 oashcc.CarrotClusteringEngine.init Initializing Clustering Engine 'lexical-resource-check-custom-resource-dir'
   [junit4]   2> 8915 T43 x:x:collection1 oashcc.CarrotClusteringEngine.init Initializing Clustering Engine 'lexical-resource-check-custom-resource-dir-deprecated'
   [junit4]   2> 8923 T43 x:x:collection1 oashcc.CarrotClusteringEngine.init Initializing Clustering Engine 'custom-duplicating-tokenizer'
   [junit4]   2> 8930 T43 x:x:collection1 oashcc.CarrotClusteringEngine.init Initializing Clustering Engine 'custom-duplicating-stemmer'
   [junit4]   2> 8936 T43 x:x:collection1 oashc.ClusteringComponent.setupDefaultEngine Default engine for search results clustering: default [CarrotClusteringEngine]
   [junit4]   2> 8936 T43 x:x:collection1 oashc.ClusteringComponent.setupDefaultEngine WARN No default engine for document clustering.
   [junit4]   2> 8936 T43 x:x:collection1 oashc.ClusteringComponent.inform Finished Initializing Clustering Engines
   [junit4]   2> 8936 T43 x:x:collection1 oashc.ClusteringComponent.inform Initializing Clustering Engines
   [junit4]   2> 8936 T43 x:x:collection1 oashc.ClusteringComponent.setupDefaultEngine WARN No default engine for search results clustering.
   [junit4]   2> 8936 T43 x:x:collection1 oashc.ClusteringComponent.setupDefaultEngine Default engine for document clustering: mock [MockDocumentClusteringEngine]
   [junit4]   2> 8936 T43 x:x:collection1 oashc.ClusteringComponent.inform Finished Initializing Clustering Engines
   [junit4]   2> 8937 T43 x:x:collection1 oashc.ClusteringComponent.inform Initializing Clustering Engines
   [junit4]   2> 8937 T43 x:x:collection1 oashcc.CarrotClusteringEngine.init Initializing Clustering Engine 'stc'
   [junit4]   2> 8943 T43 x:x:collection1 oashcc.CarrotClusteringEngine.init Initializing Clustering Engine 'default'
   [junit4]   2> 8951 T43 x:x:collection1 oashcc.CarrotClusteringEngine.init Initializing Clustering Engine 'mock'
   [junit4]   2> 8958 T43 x:x:collection1 oashc.ClusteringComponent.setupDefaultEngine Default engine for search results clustering: default [CarrotClusteringEngine]
   [junit4]   2> 8958 T43 x:x:collection1 oashc.ClusteringComponent.setupDefaultEngine WARN No default engine for document clustering.
   [junit4]   2> 8958 T43 x:x:collection1 oashc.ClusteringComponent.inform Finished Initializing Clustering Engines
   [junit4]   2> 8958 T43 x:x:collection1 oashc.ClusteringComponent.inform Initializing Clustering Engines
   [junit4]   2> 9047 T43 x:x:collection1 oashcc.CarrotClusteringEngine.init Initializing Clustering Engine 'unavailable'
   [junit4]   2> 9053 T43 x:x:collection1 oashc.ClusteringComponent.inform Optional clustering engine not available: unavailable
   [junit4]   2> 9054 T43 x:x:collection1 oashcc.CarrotClusteringEngine.init Initializing Clustering Engine 'lingo'
   [junit4]   2> 9060 T43 x:x:collection1 oashcc.CarrotClusteringEngine.init Initializing Clustering Engine 'stc'
   [junit4]   2> 9067 T43 x:x:collection1 oashcc.CarrotClusteringEngine.init Initializing Clustering Engine 'mock'
   [junit4]   2> 9073 T43 x:x:collection1 oashc.ClusteringComponent.setupDefaultEngine Default engine for search results clustering: lingo [CarrotClusteringEngine]
   [junit4]   2> 9073 T43 x:x:collection1 oashc.ClusteringComponent.setupDefaultEngine WARN No default engine for document clustering.
   [junit4]   2> 9074 T43 x:x:collection1 oashc.ClusteringComponent.inform Finished Initializing Clustering Engines
   [junit4]   2> 9074 T43 x:x:collection1 oashc.ClusteringComponent.inform Initializing Clustering Engines
   [junit4]   2> 9074 T43 x:x:collection1 oashcc.CarrotClusteringEngine.init Initializing Clustering Engine '<no 'name' attribute>'
   [junit4]   2> 9074 T43 x:x:collection1 oashcc.CarrotClusteringEngine.init Initializing Clustering Engine '<no 'name' attribute>'
   [junit4]   2> 9074 T43 x:x:collection1 oashc.ClusteringComponent.inform WARN Duplicate clustering engine component named ''.
   [junit4]   2> 9074 T43 x:x:collection1 oashcc.CarrotClusteringEngine.init Initializing Clustering Engine '<no 'name' attribute>'
   [junit4]   2> 9074 T43 x:x:collection1 oashc.ClusteringComponent.inform WARN Duplicate clustering engine component named ''.
   [junit4]   2> 9075 T43 x:x:collection1 oashc.ClusteringComponent.setupDefaultEngine Default engine for search results clustering:  [CarrotClusteringEngine]
   [junit4]   2> 9075 T43 x:x:collection1 oashc.ClusteringComponent.setupDefaultEngine WARN No default engine for document clustering.
   [junit4]   2> 9075 T43 x:x:collection1 oashc.ClusteringComponent.inform Finished Initializing Clustering Engines
   [junit4]   2> 9075 T43 x:x:collection1 oash.ReplicationHandler.inform Commits will be reserved for  10000
   [junit4]   2> 9075 T48 x:x:collection1 oasc.QuerySenderListener.newSearcher QuerySenderListener sending requests to Searcher@505496fb[collection1] main{ExitableDirectoryReader(UninvertingDirectoryReader())}
   [junit4]   2> 9075 T43 x:x:collection1 oasc.CoreContainer.registerCore registering core: collection1
   [junit4]   2> ASYNC  NEW_CORE C2 name=collection1 org.apache.solr.core.SolrCore@5f261b84
   [junit4]   2> 9076 T48 x:x:collection1 C2 oasc.SolrCore.execute [collection1]  webapp=null path=null params={q=fast_warm&distrib=false&start=0&rows=10&event=firstSearcher} hits=0 status=0 QTime=1
   [junit4]   2> 9080 T48 x:x:collection1 C2 oasc.SolrCore.execute [collection1]  webapp=null path=null params={q=static+firstSearcher+warming+query+from+solrconfig.xml&distrib=false&event=firstSearcher} hits=0 status=0 QTime=1
   [junit4]   2> 9080 T48 x:x:collection1 oasc.QuerySenderListener.newSearcher QuerySenderListener done.
   [junit4]   2> 9081 T48 x:x:collection1 oasc.SolrCore.registerSearcher [collection1] Registered new searcher Searcher@505496fb[collection1] main{ExitableDirectoryReader(UninvertingDirectoryReader())}
   [junit4]   2> 9509 T12 oas.SolrTestCaseJ4.setUp ###Starting test
   [junit4]   2> 10343 T12 oas.SolrTestCaseJ4.tearDown ###Ending test
   [junit4]   2> 10358 T12 oejs.AbstractConnector.doStop Stopped ServerConnector@d549136{HTTP/1.1,[http/1.1]}{127.0.0.1:0}
   [junit4]   2> 10358 T12 oasc.CoreContainer.shutdown Shutting down CoreContainer instance=2113959441
   [junit4]   2> 10364 T51 x:x:collection1 oasc.SolrCore.close [collection1]  CLOSING SolrCore org.apache.solr.core.SolrCore@c53df6
   [junit4]   2> 10366 T51 x:x:collection1 oasu.DirectUpdateHandler2.close closing DirectUpdateHandler2{commits=0,autocommits=0,soft autocommits=0,optimizes=0,rollbacks=0,expungeDeletes=0,docsPending=0,adds=0,deletesById=0,deletesByQuery=0,errors=0,cumulative_adds=0,cumulative_deletesById=0,cumulative_deletesByQuery=0,cumulative_errors=0}
   [junit4]   2> 10367 T51 x:x:collection1 oasu.SolrCoreState.decrefSolrCoreState Closing SolrCoreState
   [junit4]   2> 10367 T51 x:x:collection1 oasu.DefaultSolrCoreState.closeIndexWriter SolrCoreState ref count has reached 0 - closing IndexWriter
   [junit4]   2> 10368 T51 x:x:collection1 oasu.DefaultSolrCoreState.closeIndexWriter closing IndexWriter with IndexWriterCloser
   [junit4]   2> 10383 T51 x:x:collection1 oasc.SolrCore.closeSearcher [collection1] Closing main searcher on request.
   [junit4]   2> 10384 T51 x:x:collection1 oasc.CachingDirectoryFactory.close Closing MockDirectoryFactory - 2 directories currently being tracked
   [junit4]   2> 10385 T51 x:x:collection1 oasc.CachingDirectoryFactory.closeCacheValue looking to close /Users/jenkins/workspace/Lucene-Solr-trunk-MacOSX/solr/build/contrib/solr-clustering/test/J0/temp/solr.handler.clustering.DistributedClusteringComponentTest_501CD408E008B061-001/tempDir-001/control/cores/collection1/data [CachedDir<<refCount=0;path=/Users/jenkins/workspace/Lucene-Solr-trunk-MacOSX/solr/build/contrib/solr-clustering/test/J0/temp/solr.handler.clustering.DistributedClusteringComponentTest_501CD408E008B061-001/tempDir-001/control/cores/collection1/data;done=false>>]
   [junit4]   2> 10385 T51 x:x:collection1 oasc.CachingDirectoryFactory.close Closing directory: /Users/jenkins/workspace/Lucene-Solr-trunk-MacOSX/solr/build/contrib/solr-clustering/test/J0/temp/solr.handler.clustering.DistributedClusteringComponentTest_501CD408E008B061-001/tempDir-001/control/cores/collection1/data
   [junit4]   2> 10386 T51 x:x:collection1 oasc.CachingDirectoryFactory.closeCacheValue looking to close /Users/jenkins/workspace/Lucene-Solr-trunk-MacOSX/solr/build/contrib/solr-clustering/test/J0/temp/solr.handler.clustering.DistributedClusteringComponentTest_501CD408E008B061-001/tempDir-001/control/cores/collection1/data/index [CachedDir<<refCount=0;path=/Users/jenkins/workspace/Lucene-Solr-trunk-MacOSX/solr/build/contrib/solr-clustering/test/J0/temp/solr.handler.clustering.DistributedClusteringComponentTest_501CD408E008B061-001/tempDir-001/control/cores/collection1/data/index;done=false>>]
   [junit4]   2> 10386 T51 x:x:collection1 oasc.CachingDirectoryFactory.close Closing directory: /Users/jenkins/workspace/Lucene-Solr-trunk-MacOSX/solr/build/contrib/solr-clustering/test/J0/temp/solr.handler.clustering.DistributedClusteringComponentTest_501CD408E008B061-001/tempDir-001/control/cores/collection1/data/index
   [junit4]   2> 10392 T12 oejsh.ContextHandler.doStop Stopped o.e.j.s.ServletContextHandler@565b87aa{/_vnj/u,null,UNAVAILABLE}
   [junit4]   2> 10397 T12 oejs.AbstractConnector.doStop Stopped ServerConnector@2b6ecfd4{HTTP/1.1,[http/1.1]}{127.0.0.1:0}
   [junit4]   2> 10398 T12 oasc.CoreContainer.shutdown Shutting down CoreContainer instance=832181191
   [junit4]   2> 10401 T52 x:x:collection1 oasc.SolrCore.close [collection1]  CLOSING SolrCore org.apache.solr.core.SolrCore@5f261b84
   [junit4]   2> 10402 T52 x:x:collection1 oasu.DirectUpdateHandler2.close closing DirectUpdateHandler2{commits=0,autocommits=0,soft autocommits=0,optimizes=0,rollbacks=0,expungeDeletes=0,docsPending=0,adds=0,deletesById=0,deletesByQuery=0,errors=0,cumulative_adds=0,cumulative_deletesById=0,cumulative_deletesByQuery=0,cumulative_errors=0}
   [junit4]   2> 10403 T52 x:x:collection1 oasu.SolrCoreState.decrefSolrCoreState Closing SolrCoreState
   [junit4]   2> 10403 T52 x:x:collection1 oasu.DefaultSolrCoreState.closeIndexWriter SolrCoreState ref count has reached 0 - closing IndexWriter
   [junit4]   2> 10403 T52 x:x:collection1 oasu.DefaultSolrCoreState.closeIndexWriter closing IndexWriter with IndexWriterCloser
   [junit4]   2> 10405 T52 x:x:collection1 oasc.SolrCore.closeSearcher [collection1] Closing main searcher on request.
   [junit4]   2> 10405 T52 x:x:collection1 oasc.CachingDirectoryFactory.close Closing MockDirectoryFactory - 2 directories currently being tracked
   [junit4]   2> 10405 T52 x:x:collection1 oasc.CachingDirectoryFactory.closeCacheValue looking to close /Users/jenkins/workspace/Lucene-Solr-trunk-MacOSX/solr/build/contrib/solr-clustering/test/J0/temp/solr.handler.clustering.DistributedClusteringComponentTest_501CD408E008B061-001/tempDir-001/shard0/cores/collection1/data [CachedDir<<refCount=0;path=/Users/jenkins/workspace/Lucene-Solr-trunk-MacOSX/solr/build/contrib/solr-clustering/test/J0/temp/solr.handler.clustering.DistributedClusteringComponentTest_501CD408E008B061-001/tempDir-001/shard0/cores/collection1/data;done=false>>]
   [junit4]   2> 10406 T52 x:x:collection1 oasc.CachingDirectoryFactory.close Closing directory: /Users/jenkins/workspace/Lucene-Solr-trunk-MacOSX/solr/build/contrib/solr-clustering/test/J0/temp/solr.handler.clustering.DistributedClusteringComponentTest_501CD408E008B061-001/tempDir-001/shard0/cores/collection1/data
   [junit4]   2> 10406 T52 x:x:collection1 oasc.CachingDirectoryFactory.closeCacheValue looking to close /Users/jenkins/workspace/Lucene-Solr-trunk-MacOSX/solr/build/contrib/solr-clustering/test/J0/temp/solr.handler.clustering.DistributedClusteringComponentTest_501CD408E008B061-001/tempDir-001/shard0/cores/collection1/data/index [CachedDir<<refCount=0;path=/Users/jenkins/workspace/Lucene-Solr-trunk-MacOSX/solr/build/contrib/solr-clustering/test/J0/temp/solr.handler.clustering.DistributedClusteringComponentTest_501CD408E008B061-001/tempDir-001/shard0/cores/collection1/data/index;done=false>>]
   [junit4]   2> 10406 T52 x:x:collection1 oasc.CachingDirectoryFactory.close Closing directory: /Users/jenkins/workspace/Lucene-Solr-trunk-MacOSX/solr/build/contrib/solr-clustering/test/J0/temp/solr.handler.clustering.DistributedClusteringComponentTest_501CD408E008B061-001/tempDir-001/shard0/cores/collection1/data/index
   [junit4]   2> 10413 T12 oejsh.ContextHandler.doStop Stopped o.e.j.s.ServletContextHandler@468ba9fa{/_vnj/u,null,UNAVAILABLE}
   [junit4]   2> NOTE: reproduce with: ant test  -Dtestcase=DistributedClusteringComponentTest -Dtests.method=test -Dtests.seed=501CD408E008B061 -Dtests.slow=true -Dtests.locale=tr -Dtests.timezone=SystemV/AST4 -Dtests.asserts=true -Dtests.file.encoding=UTF-8
   [junit4] ERROR   8.83s J0 | DistributedClusteringComponentTest.test <<<
   [junit4]    > Throwable #1: org.apache.solr.client.solrj.SolrServerException: IOException occured when talking to server at: http://127.0.0.1:51185/_vnj/u/collection1
   [junit4]    > 	at __randomizedtesting.SeedInfo.seed([501CD408E008B061:D848EBD24EF4DD99]:0)
   [junit4]    > 	at org.apache.solr.client.solrj.impl.HttpSolrClient.executeMethod(HttpSolrClient.java:591)
   [junit4]    > 	at org.apache.solr.client.solrj.impl.HttpSolrClient.request(HttpSolrClient.java:241)
   [junit4]    > 	at org.apache.solr.client.solrj.impl.HttpSolrClient.request(HttpSolrClient.java:230)
   [junit4]    > 	at org.apache.solr.client.solrj.SolrRequest.process(SolrRequest.java:149)
   [junit4]    > 	at org.apache.solr.client.solrj.SolrClient.deleteByQuery(SolrClient.java:895)
   [junit4]    > 	at org.apache.solr.client.solrj.SolrClient.deleteByQuery(SolrClient.java:858)
   [junit4]    > 	at org.apache.solr.client.solrj.SolrClient.deleteByQuery(SolrClient.java:873)
   [junit4]    > 	at org.apache.solr.BaseDistributedSearchTestCase.del(BaseDistributedSearchTestCase.java:544)
   [junit4]    > 	at org.apache.solr.handler.clustering.DistributedClusteringComponentTest.test(DistributedClusteringComponentTest.java:35)
   [junit4]    > 	at org.apache.solr.BaseDistributedSearchTestCase$ShardsRepeatRule$ShardsRepeatStatement.callStatement(BaseDistributedSearchTestCase.java:990)
   [junit4]    > 	at org.apache.solr.BaseDistributedSearchTestCase$ShardsRepeatRule$ShardsStatement.evaluate(BaseDistributedSearchTestCase.java:939)
   [junit4]    > 	at java.lang.Thread.run(Thread.java:745)
   [junit4]    > Caused by: java.net.SocketException: Connection reset
   [junit4]    > 	at java.net.SocketInputStream.read(SocketInputStream.java:209)
   [junit4]    > 	at java.net.SocketInputStream.read(SocketInputStream.java:141)
   [junit4]    > 	at org.apache.http.impl.io.AbstractSessionInputBuffer.fillBuffer(AbstractSessionInputBuffer.java:160)
   [junit4]    > 	at org.apache.http.impl.io.SocketInputBuffer.fillBuffer(SocketInputBuffer.java:84)
   [junit4]    > 	at org.apache.http.impl.io.AbstractSessionInputBuffer.readLine(AbstractSessionInputBuffer.java:273)
   [junit4]    > 	at org.apache.http.impl.conn.DefaultHttpResponseParser.parseHead(DefaultHttpResponseParser.java:140)
   [junit4]    > 	at org.apache.http.impl.conn.DefaultHttpResponseParser.parseHead(DefaultHttpResponseParser.java:57)
   [junit4]    > 	at org.apache.http.impl.io.AbstractMessageParser.parse(AbstractMessageParser.java:261)
   [junit4]    > 	at org.apache.http.impl.AbstractHttpClientConnection.receiveResponseHeader(AbstractHttpClientConnection.java:283)
   [junit4]    > 	at org.apache.http.impl.conn.DefaultClientConnection.receiveResponseHeader(DefaultClientConnection.java:251)
   [junit4]    > 	at org.apache.http.impl.conn.ManagedClientConnectionImpl.receiveResponseHeader(ManagedClientConnectionImpl.java:197)
   [junit4]    > 	at org.apache.http.protocol.HttpRequestExecutor.doReceiveResponse(HttpRequestExecutor.java:272)
   [junit4]    > 	at org.apache.http.protocol.HttpRequestExecutor.execute(HttpRequestExecutor.java:124)
   [junit4]    > 	at org.apache.http.impl.client.DefaultRequestDirector.tryExecute(DefaultRequestDirector.java:685)
   [junit4]    > 	at org.apache.http.impl.client.DefaultRequestDirector.execute(DefaultRequestDirector.java:487)
   [junit4]    > 	at org.apache.http.impl.client.AbstractHttpClient.doExecute(AbstractHttpClient.java:882)
   [junit4]    > 	at org.apache.http.impl.client.CloseableHttpClient.execute(CloseableHttpClient.java:82)
   [junit4]    > 	at org.apache.http.impl.client.CloseableHttpClient.execute(CloseableHttpClient.java:107)
   [junit4]    > 	at org.apache.http.impl.client.CloseableHttpClient.execute(CloseableHttpClient.java:55)
   [junit4]    > 	at org.apache.solr.client.solrj.impl.HttpSolrClient.executeMethod(HttpSolrClient.java:482)
   [junit4]    > 	... 49 more
   [junit4]   2> 10434 T12 oas.SolrTestCaseJ4.deleteCore ###deleteCore
   [junit4]   2> NOTE: leaving temporary files on disk at: /Users/jenkins/workspace/Lucene-Solr-trunk-MacOSX/solr/build/contrib/solr-clustering/test/J0/temp/solr.handler.clustering.DistributedClusteringComponentTest_501CD408E008B061-001
   [junit4]   2> NOTE: test params are: codec=CheapBastard, sim=ClassicSimilarity, locale=tr, timezone=SystemV/AST4
   [junit4]   2> NOTE: Mac OS X 10.8.5 x86_64/Oracle Corporation 1.8.0_72 (64-bit)/cpus=3,threads=1,free=25839176,total=56623104
   [junit4]   2> NOTE: All tests run in this JVM: [DistributedClusteringComponentTest]
   [junit4] Completed [1/3 (1!)] on J0 in 11.11s, 1 test, 1 error <<< FAILURES!

[...truncated 16 lines...]
BUILD FAILED
/Users/jenkins/workspace/Lucene-Solr-trunk-MacOSX/build.xml:740: The following error occurred while executing this line:
/Users/jenkins/workspace/Lucene-Solr-trunk-MacOSX/build.xml:684: The following error occurred while executing this line:
/Users/jenkins/workspace/Lucene-Solr-trunk-MacOSX/build.xml:59: The following error occurred while executing this line:
/Users/jenkins/workspace/Lucene-Solr-trunk-MacOSX/solr/build.xml:253: The following error occurred while executing this line:
/Users/jenkins/workspace/Lucene-Solr-trunk-MacOSX/solr/common-build.xml:459: The following error occurred while executing this line:
/Users/jenkins/workspace/Lucene-Solr-trunk-MacOSX/solr/common-build.xml:524: The following error occurred while executing this line:
/Users/jenkins/workspace/Lucene-Solr-trunk-MacOSX/lucene/common-build.xml:1457: The following error occurred while executing this line:
/Users/jenkins/workspace/Lucene-Solr-trunk-MacOSX/lucene/common-build.xml:1014: There were test failures: 3 suites, 30 tests, 1 error [seed: 501CD408E008B061]

Total time: 82 minutes 25 seconds
Build step 'Invoke Ant' marked build as failure
Archiving artifacts
[WARNINGS] Skipping publisher since build result is FAILURE
Recording test results
Email was triggered for: Failure - Any
Sending email for trigger: Failure - Any



Mime
View raw message