lucene-dev mailing list archives

Site index · List index
Message view « Date » · « Thread »
Top « Date » · « Thread »
From Policeman Jenkins Server <jenk...@thetaphi.de>
Subject [JENKINS-EA] Lucene-Solr-5.x-Linux (32bit/jdk-9-ea+104) - Build # 15513 - Failure!
Date Mon, 08 Feb 2016 21:20:19 GMT
Build: http://jenkins.thetaphi.de/job/Lucene-Solr-5.x-Linux/15513/
Java: 32bit/jdk-9-ea+104 -server -XX:+UseParallelGC -XX:-CompactStrings -XX:-UseSuperWord

1 tests failed.
FAILED:  org.apache.solr.cloud.BasicDistributedZkTest.test

Error Message:
.response.numFound:1!=0

Stack Trace:
junit.framework.AssertionFailedError: .response.numFound:1!=0
	at __randomizedtesting.SeedInfo.seed([9B3E60D9B9E3A206:136A5F03171FCFFE]:0)
	at junit.framework.Assert.fail(Assert.java:50)
	at org.apache.solr.BaseDistributedSearchTestCase.compareSolrResponses(BaseDistributedSearchTestCase.java:892)
	at org.apache.solr.BaseDistributedSearchTestCase.compareResponses(BaseDistributedSearchTestCase.java:911)
	at org.apache.solr.BaseDistributedSearchTestCase.queryAndCompare(BaseDistributedSearchTestCase.java:654)
	at org.apache.solr.cloud.AbstractFullDistribZkTestBase.queryAndCompareReplicas(AbstractFullDistribZkTestBase.java:1041)
	at org.apache.solr.cloud.AbstractFullDistribZkTestBase.queryAndCompareShards(AbstractFullDistribZkTestBase.java:1058)
	at org.apache.solr.cloud.BasicDistributedZkTest.test(BasicDistributedZkTest.java:162)
	at sun.reflect.NativeMethodAccessorImpl.invoke0(Native Method)
	at sun.reflect.NativeMethodAccessorImpl.invoke(NativeMethodAccessorImpl.java:62)
	at sun.reflect.DelegatingMethodAccessorImpl.invoke(DelegatingMethodAccessorImpl.java:43)
	at java.lang.reflect.Method.invoke(Method.java:520)
	at com.carrotsearch.randomizedtesting.RandomizedRunner.invoke(RandomizedRunner.java:1764)
	at com.carrotsearch.randomizedtesting.RandomizedRunner$8.evaluate(RandomizedRunner.java:871)
	at com.carrotsearch.randomizedtesting.RandomizedRunner$9.evaluate(RandomizedRunner.java:907)
	at com.carrotsearch.randomizedtesting.RandomizedRunner$10.evaluate(RandomizedRunner.java:921)
	at org.apache.solr.BaseDistributedSearchTestCase$ShardsRepeatRule$ShardsFixedStatement.callStatement(BaseDistributedSearchTestCase.java:964)
	at org.apache.solr.BaseDistributedSearchTestCase$ShardsRepeatRule$ShardsStatement.evaluate(BaseDistributedSearchTestCase.java:939)
	at com.carrotsearch.randomizedtesting.rules.SystemPropertiesRestoreRule$1.evaluate(SystemPropertiesRestoreRule.java:57)
	at org.apache.lucene.util.TestRuleSetupTeardownChained$1.evaluate(TestRuleSetupTeardownChained.java:49)
	at org.apache.lucene.util.AbstractBeforeAfterRule$1.evaluate(AbstractBeforeAfterRule.java:45)
	at org.apache.lucene.util.TestRuleThreadAndTestName$1.evaluate(TestRuleThreadAndTestName.java:48)
	at org.apache.lucene.util.TestRuleIgnoreAfterMaxFailures$1.evaluate(TestRuleIgnoreAfterMaxFailures.java:64)
	at org.apache.lucene.util.TestRuleMarkFailure$1.evaluate(TestRuleMarkFailure.java:47)
	at com.carrotsearch.randomizedtesting.rules.StatementAdapter.evaluate(StatementAdapter.java:36)
	at com.carrotsearch.randomizedtesting.ThreadLeakControl$StatementRunner.run(ThreadLeakControl.java:367)
	at com.carrotsearch.randomizedtesting.ThreadLeakControl.forkTimeoutingTask(ThreadLeakControl.java:809)
	at com.carrotsearch.randomizedtesting.ThreadLeakControl$3.evaluate(ThreadLeakControl.java:460)
	at com.carrotsearch.randomizedtesting.RandomizedRunner.runSingleTest(RandomizedRunner.java:880)
	at com.carrotsearch.randomizedtesting.RandomizedRunner$5.evaluate(RandomizedRunner.java:781)
	at com.carrotsearch.randomizedtesting.RandomizedRunner$6.evaluate(RandomizedRunner.java:816)
	at com.carrotsearch.randomizedtesting.RandomizedRunner$7.evaluate(RandomizedRunner.java:827)
	at com.carrotsearch.randomizedtesting.rules.StatementAdapter.evaluate(StatementAdapter.java:36)
	at com.carrotsearch.randomizedtesting.rules.SystemPropertiesRestoreRule$1.evaluate(SystemPropertiesRestoreRule.java:57)
	at org.apache.lucene.util.AbstractBeforeAfterRule$1.evaluate(AbstractBeforeAfterRule.java:45)
	at com.carrotsearch.randomizedtesting.rules.StatementAdapter.evaluate(StatementAdapter.java:36)
	at org.apache.lucene.util.TestRuleStoreClassName$1.evaluate(TestRuleStoreClassName.java:41)
	at com.carrotsearch.randomizedtesting.rules.NoShadowingOrOverridesOnMethodsRule$1.evaluate(NoShadowingOrOverridesOnMethodsRule.java:40)
	at com.carrotsearch.randomizedtesting.rules.NoShadowingOrOverridesOnMethodsRule$1.evaluate(NoShadowingOrOverridesOnMethodsRule.java:40)
	at com.carrotsearch.randomizedtesting.rules.StatementAdapter.evaluate(StatementAdapter.java:36)
	at com.carrotsearch.randomizedtesting.rules.StatementAdapter.evaluate(StatementAdapter.java:36)
	at com.carrotsearch.randomizedtesting.rules.StatementAdapter.evaluate(StatementAdapter.java:36)
	at org.apache.lucene.util.TestRuleAssertionsRequired$1.evaluate(TestRuleAssertionsRequired.java:53)
	at org.apache.lucene.util.TestRuleMarkFailure$1.evaluate(TestRuleMarkFailure.java:47)
	at org.apache.lucene.util.TestRuleIgnoreAfterMaxFailures$1.evaluate(TestRuleIgnoreAfterMaxFailures.java:64)
	at org.apache.lucene.util.TestRuleIgnoreTestSuites$1.evaluate(TestRuleIgnoreTestSuites.java:54)
	at com.carrotsearch.randomizedtesting.rules.StatementAdapter.evaluate(StatementAdapter.java:36)
	at com.carrotsearch.randomizedtesting.ThreadLeakControl$StatementRunner.run(ThreadLeakControl.java:367)
	at java.lang.Thread.run(Thread.java:804)




Build Log:
[...truncated 36 lines...]
ERROR: Error fetching remote repo 'origin'
hudson.plugins.git.GitException: Failed to fetch from git://git.apache.org/lucene-solr.git
	at hudson.plugins.git.GitSCM.fetchFrom(GitSCM.java:766)
	at hudson.plugins.git.GitSCM.retrieveChanges(GitSCM.java:1022)
	at hudson.plugins.git.GitSCM.checkout(GitSCM.java:1053)
	at hudson.scm.SCM.checkout(SCM.java:485)
	at hudson.model.AbstractProject.checkout(AbstractProject.java:1269)
	at hudson.model.AbstractBuild$AbstractBuildExecution.defaultCheckout(AbstractBuild.java:607)
	at jenkins.scm.SCMCheckoutStrategy.checkout(SCMCheckoutStrategy.java:86)
	at hudson.model.AbstractBuild$AbstractBuildExecution.run(AbstractBuild.java:529)
	at hudson.model.Run.execute(Run.java:1738)
	at hudson.model.FreeStyleBuild.run(FreeStyleBuild.java:43)
	at hudson.model.ResourceController.execute(ResourceController.java:98)
	at hudson.model.Executor.run(Executor.java:410)
Caused by: hudson.plugins.git.GitException: org.eclipse.jgit.api.errors.TransportException: git://git.apache.org/lucene-solr.git: unknown host
	at org.jenkinsci.plugins.gitclient.JGitAPIImpl$2.execute(JGitAPIImpl.java:635)
	at hudson.plugins.git.GitSCM.fetchFrom(GitSCM.java:764)
	... 11 more
Caused by: org.eclipse.jgit.api.errors.TransportException: git://git.apache.org/lucene-solr.git: unknown host
	at org.eclipse.jgit.api.FetchCommand.call(FetchCommand.java:139)
	at org.jenkinsci.plugins.gitclient.JGitAPIImpl$2.execute(JGitAPIImpl.java:633)
	... 12 more
Caused by: org.eclipse.jgit.errors.TransportException: git://git.apache.org/lucene-solr.git: unknown host
	at org.eclipse.jgit.transport.TransportGitAnon.openConnection(TransportGitAnon.java:148)
	at org.eclipse.jgit.transport.TransportGitAnon$TcpFetchConnection.<init>(TransportGitAnon.java:179)
	at org.eclipse.jgit.transport.TransportGitAnon.openFetch(TransportGitAnon.java:120)
	at org.eclipse.jgit.transport.FetchProcess.executeImp(FetchProcess.java:136)
	at org.eclipse.jgit.transport.FetchProcess.execute(FetchProcess.java:122)
	at org.eclipse.jgit.transport.Transport.fetch(Transport.java:1138)
	at org.eclipse.jgit.api.FetchCommand.call(FetchCommand.java:130)
	... 13 more
ERROR: null
Retrying after 10 seconds
Fetching changes from the remote Git repository
Cleaning workspace
ERROR: Error fetching remote repo 'origin'
hudson.plugins.git.GitException: Failed to fetch from git://git.apache.org/lucene-solr.git
	at hudson.plugins.git.GitSCM.fetchFrom(GitSCM.java:766)
	at hudson.plugins.git.GitSCM.retrieveChanges(GitSCM.java:1022)
	at hudson.plugins.git.GitSCM.checkout(GitSCM.java:1053)
	at hudson.scm.SCM.checkout(SCM.java:485)
	at hudson.model.AbstractProject.checkout(AbstractProject.java:1269)
	at hudson.model.AbstractBuild$AbstractBuildExecution.defaultCheckout(AbstractBuild.java:607)
	at jenkins.scm.SCMCheckoutStrategy.checkout(SCMCheckoutStrategy.java:86)
	at hudson.model.AbstractBuild$AbstractBuildExecution.run(AbstractBuild.java:529)
	at hudson.model.Run.execute(Run.java:1738)
	at hudson.model.FreeStyleBuild.run(FreeStyleBuild.java:43)
	at hudson.model.ResourceController.execute(ResourceController.java:98)
	at hudson.model.Executor.run(Executor.java:410)
Caused by: hudson.plugins.git.GitException: org.eclipse.jgit.api.errors.TransportException: git://git.apache.org/lucene-solr.git: unknown host
	at org.jenkinsci.plugins.gitclient.JGitAPIImpl$2.execute(JGitAPIImpl.java:635)
	at hudson.plugins.git.GitSCM.fetchFrom(GitSCM.java:764)
	... 11 more
Caused by: org.eclipse.jgit.api.errors.TransportException: git://git.apache.org/lucene-solr.git: unknown host
	at org.eclipse.jgit.api.FetchCommand.call(FetchCommand.java:139)
	at org.jenkinsci.plugins.gitclient.JGitAPIImpl$2.execute(JGitAPIImpl.java:633)
	... 12 more
Caused by: org.eclipse.jgit.errors.TransportException: git://git.apache.org/lucene-solr.git: unknown host
	at org.eclipse.jgit.transport.TransportGitAnon.openConnection(TransportGitAnon.java:148)
	at org.eclipse.jgit.transport.TransportGitAnon$TcpFetchConnection.<init>(TransportGitAnon.java:179)
	at org.eclipse.jgit.transport.TransportGitAnon.openFetch(TransportGitAnon.java:120)
	at org.eclipse.jgit.transport.FetchProcess.executeImp(FetchProcess.java:136)
	at org.eclipse.jgit.transport.FetchProcess.execute(FetchProcess.java:122)
	at org.eclipse.jgit.transport.Transport.fetch(Transport.java:1138)
	at org.eclipse.jgit.api.FetchCommand.call(FetchCommand.java:130)
	... 13 more
ERROR: null
Retrying after 10 seconds
Fetching changes from the remote Git repository
Cleaning workspace
ERROR: Error fetching remote repo 'origin'
hudson.plugins.git.GitException: Failed to fetch from git://git.apache.org/lucene-solr.git
	at hudson.plugins.git.GitSCM.fetchFrom(GitSCM.java:766)
	at hudson.plugins.git.GitSCM.retrieveChanges(GitSCM.java:1022)
	at hudson.plugins.git.GitSCM.checkout(GitSCM.java:1053)
	at hudson.scm.SCM.checkout(SCM.java:485)
	at hudson.model.AbstractProject.checkout(AbstractProject.java:1269)
	at hudson.model.AbstractBuild$AbstractBuildExecution.defaultCheckout(AbstractBuild.java:607)
	at jenkins.scm.SCMCheckoutStrategy.checkout(SCMCheckoutStrategy.java:86)
	at hudson.model.AbstractBuild$AbstractBuildExecution.run(AbstractBuild.java:529)
	at hudson.model.Run.execute(Run.java:1738)
	at hudson.model.FreeStyleBuild.run(FreeStyleBuild.java:43)
	at hudson.model.ResourceController.execute(ResourceController.java:98)
	at hudson.model.Executor.run(Executor.java:410)
Caused by: hudson.plugins.git.GitException: org.eclipse.jgit.api.errors.TransportException: git://git.apache.org/lucene-solr.git: unknown host
	at org.jenkinsci.plugins.gitclient.JGitAPIImpl$2.execute(JGitAPIImpl.java:635)
	at hudson.plugins.git.GitSCM.fetchFrom(GitSCM.java:764)
	... 11 more
Caused by: org.eclipse.jgit.api.errors.TransportException: git://git.apache.org/lucene-solr.git: unknown host
	at org.eclipse.jgit.api.FetchCommand.call(FetchCommand.java:139)
	at org.jenkinsci.plugins.gitclient.JGitAPIImpl$2.execute(JGitAPIImpl.java:633)
	... 12 more
Caused by: org.eclipse.jgit.errors.TransportException: git://git.apache.org/lucene-solr.git: unknown host
	at org.eclipse.jgit.transport.TransportGitAnon.openConnection(TransportGitAnon.java:148)
	at org.eclipse.jgit.transport.TransportGitAnon$TcpFetchConnection.<init>(TransportGitAnon.java:179)
	at org.eclipse.jgit.transport.TransportGitAnon.openFetch(TransportGitAnon.java:120)
	at org.eclipse.jgit.transport.FetchProcess.executeImp(FetchProcess.java:136)
	at org.eclipse.jgit.transport.FetchProcess.execute(FetchProcess.java:122)
	at org.eclipse.jgit.transport.Transport.fetch(Transport.java:1138)
	at org.eclipse.jgit.api.FetchCommand.call(FetchCommand.java:130)
	... 13 more
ERROR: null
Retrying after 10 seconds
Fetching changes from the remote Git repository
Cleaning workspace
ERROR: Error fetching remote repo 'origin'
hudson.plugins.git.GitException: Failed to fetch from git://git.apache.org/lucene-solr.git
	at hudson.plugins.git.GitSCM.fetchFrom(GitSCM.java:766)
	at hudson.plugins.git.GitSCM.retrieveChanges(GitSCM.java:1022)
	at hudson.plugins.git.GitSCM.checkout(GitSCM.java:1053)
	at hudson.scm.SCM.checkout(SCM.java:485)
	at hudson.model.AbstractProject.checkout(AbstractProject.java:1269)
	at hudson.model.AbstractBuild$AbstractBuildExecution.defaultCheckout(AbstractBuild.java:607)
	at jenkins.scm.SCMCheckoutStrategy.checkout(SCMCheckoutStrategy.java:86)
	at hudson.model.AbstractBuild$AbstractBuildExecution.run(AbstractBuild.java:529)
	at hudson.model.Run.execute(Run.java:1738)
	at hudson.model.FreeStyleBuild.run(FreeStyleBuild.java:43)
	at hudson.model.ResourceController.execute(ResourceController.java:98)
	at hudson.model.Executor.run(Executor.java:410)
Caused by: hudson.plugins.git.GitException: org.eclipse.jgit.api.errors.TransportException: git://git.apache.org/lucene-solr.git: unknown host
	at org.jenkinsci.plugins.gitclient.JGitAPIImpl$2.execute(JGitAPIImpl.java:635)
	at hudson.plugins.git.GitSCM.fetchFrom(GitSCM.java:764)
	... 11 more
Caused by: org.eclipse.jgit.api.errors.TransportException: git://git.apache.org/lucene-solr.git: unknown host
	at org.eclipse.jgit.api.FetchCommand.call(FetchCommand.java:139)
	at org.jenkinsci.plugins.gitclient.JGitAPIImpl$2.execute(JGitAPIImpl.java:633)
	... 12 more
Caused by: org.eclipse.jgit.errors.TransportException: git://git.apache.org/lucene-solr.git: unknown host
	at org.eclipse.jgit.transport.TransportGitAnon.openConnection(TransportGitAnon.java:148)
	at org.eclipse.jgit.transport.TransportGitAnon$TcpFetchConnection.<init>(TransportGitAnon.java:179)
	at org.eclipse.jgit.transport.TransportGitAnon.openFetch(TransportGitAnon.java:120)
	at org.eclipse.jgit.transport.FetchProcess.executeImp(FetchProcess.java:136)
	at org.eclipse.jgit.transport.FetchProcess.execute(FetchProcess.java:122)
	at org.eclipse.jgit.transport.Transport.fetch(Transport.java:1138)
	at org.eclipse.jgit.api.FetchCommand.call(FetchCommand.java:130)
	... 13 more
ERROR: null
Retrying after 10 seconds
Fetching changes from the remote Git repository
Cleaning workspace
Checking out Revision 11afd639c38be1de15fce46c034b2c9a8fff3255 (refs/remotes/origin/branch_5x)
No emails were triggered.
[description-setter] Description set: Java: 32bit/jdk-9-ea+104 -server -XX:+UseParallelGC -XX:-CompactStrings -XX:-UseSuperWord
[Lucene-Solr-5.x-Linux] $ /var/lib/jenkins/tools/hudson.tasks.Ant_AntInstallation/ANT_1.8.2/bin/ant "-Dargs=-server -XX:+UseParallelGC -XX:-CompactStrings -XX:-UseSuperWord" jenkins-hourly
Buildfile: /home/jenkins/workspace/Lucene-Solr-5.x-Linux/build.xml

jenkins-hourly:

-print-java-info:
[java-info] java version "9-ea"
[java-info] Java(TM) SE Runtime Environment (9-ea+104-2016-02-03-214936.javare.4385.nc, Oracle Corporation)
[java-info] Java HotSpot(TM) Server VM (9-ea+104-2016-02-03-214936.javare.4385.nc, Oracle Corporation)
[java-info] Test args: [-server -XX:+UseParallelGC -XX:-CompactStrings -XX:-UseSuperWord]

clean:

clean:

clean:

ivy-availability-check:

ivy-fail:

ivy-configure:
[ivy:configure] :: Apache Ivy 2.3.0 - 20130110142753 :: http://ant.apache.org/ivy/ ::
[ivy:configure] :: loading settings :: file = /home/jenkins/workspace/Lucene-Solr-5.x-Linux/lucene/ivy-settings.xml

resolve-groovy:
[ivy:cachepath] :: resolving dependencies :: org.codehaus.groovy#groovy-all-caller;working
[ivy:cachepath] 	confs: [default]
[ivy:cachepath] 	found org.codehaus.groovy#groovy-all;2.4.4 in public
[ivy:cachepath] :: resolution report :: resolve 90ms :: artifacts dl 1ms
	---------------------------------------------------------------------
	|                  |            modules            ||   artifacts   |
	|       conf       | number| search|dwnlded|evicted|| number|dwnlded|
	---------------------------------------------------------------------
	|      default     |   1   |   0   |   0   |   0   ||   1   |   0   |
	---------------------------------------------------------------------

-test-with-heapdumps-enabled:
     [echo] Java HotSpot(TM) Server VM: Enabling heap dumps on OutOfMemoryError to dir '/home/jenkins/workspace/Lucene-Solr-5.x-Linux/heapdumps'.
    [mkdir] Created dir: /home/jenkins/workspace/Lucene-Solr-5.x-Linux/heapdumps

ivy-availability-check:

ivy-fail:

ivy-configure:
[ivy:configure] :: loading settings :: file = /home/jenkins/workspace/Lucene-Solr-5.x-Linux/lucene/ivy-settings.xml

resolve-groovy:

test:

ivy-availability-check:

ivy-fail:

ivy-configure:
[ivy:configure] :: loading settings :: file = /home/jenkins/workspace/Lucene-Solr-5.x-Linux/lucene/ivy-settings.xml

-clover.load:

resolve-groovy:

-init-totals:

test-core:

-clover.disable:

ivy-availability-check:

ivy-fail:

ivy-configure:
[ivy:configure] :: loading settings :: file = /home/jenkins/workspace/Lucene-Solr-5.x-Linux/lucene/ivy-settings.xml

-clover.load:

-clover.classpath:

-clover.setup:

clover:

-check-git-state:

-git-cleanroot:

-copy-git-state:
     [copy] Copying 1 file to /home/jenkins/workspace/Lucene-Solr-5.x-Linux/lucene/build

git-autoclean:

resolve:

init:

compile-core:
    [mkdir] Created dir: /home/jenkins/workspace/Lucene-Solr-5.x-Linux/lucene/build/core/classes/java
    [javac] Compiling 739 source files to /home/jenkins/workspace/Lucene-Solr-5.x-Linux/lucene/build/core/classes/java
    [javac] Note: Some input files use or override a deprecated API.
    [javac] Note: Recompile with -Xlint:deprecation for details.
    [javac] Creating empty /home/jenkins/workspace/Lucene-Solr-5.x-Linux/lucene/build/core/classes/java/org/apache/lucene/document/package-info.class
    [javac] Creating empty /home/jenkins/workspace/Lucene-Solr-5.x-Linux/lucene/build/core/classes/java/org/apache/lucene/package-info.class
    [javac] Creating empty /home/jenkins/workspace/Lucene-Solr-5.x-Linux/lucene/build/core/classes/java/org/apache/lucene/util/packed/package-info.class
    [javac] Creating empty /home/jenkins/workspace/Lucene-Solr-5.x-Linux/lucene/build/core/classes/java/org/apache/lucene/util/mutable/package-info.class
    [javac] Creating empty /home/jenkins/workspace/Lucene-Solr-5.x-Linux/lucene/build/core/classes/java/org/apache/lucene/codecs/compressing/package-info.class
    [javac] Creating empty /home/jenkins/workspace/Lucene-Solr-5.x-Linux/lucene/build/core/classes/java/org/apache/lucene/codecs/package-info.class
    [javac] Creating empty /home/jenkins/workspace/Lucene-Solr-5.x-Linux/lucene/build/core/classes/java/org/apache/lucene/codecs/perfield/package-info.class
    [javac] Creating empty /home/jenkins/workspace/Lucene-Solr-5.x-Linux/lucene/build/core/classes/java/org/apache/lucene/util/package-info.class
    [javac] Creating empty /home/jenkins/workspace/Lucene-Solr-5.x-Linux/lucene/build/core/classes/java/org/apache/lucene/analysis/package-info.class
    [javac] Creating empty /home/jenkins/workspace/Lucene-Solr-5.x-Linux/lucene/build/core/classes/java/org/apache/lucene/index/package-info.class
    [javac] Creating empty /home/jenkins/workspace/Lucene-Solr-5.x-Linux/lucene/build/core/classes/java/org/apache/lucene/store/package-info.class
    [javac] Creating empty /home/jenkins/workspace/Lucene-Solr-5.x-Linux/lucene/build/core/classes/java/org/apache/lucene/codecs/blocktree/package-info.class
    [javac] Creating empty /home/jenkins/workspace/Lucene-Solr-5.x-Linux/lucene/build/core/classes/java/org/apache/lucene/util/fst/package-info.class
    [javac] Creating empty /home/jenkins/workspace/Lucene-Solr-5.x-Linux/lucene/build/core/classes/java/org/apache/lucene/search/spans/package-info.class
    [javac] Creating empty /home/jenkins/workspace/Lucene-Solr-5.x-Linux/lucene/build/core/classes/java/org/apache/lucene/analysis/tokenattributes/package-info.class
    [javac] Creating empty /home/jenkins/workspace/Lucene-Solr-5.x-Linux/lucene/build/core/classes/java/org/apache/lucene/codecs/lucene54/package-info.class
    [javac] Creating empty /home/jenkins/workspace/Lucene-Solr-5.x-Linux/lucene/build/core/classes/java/org/apache/lucene/search/package-info.class
    [javac] Creating empty /home/jenkins/workspace/Lucene-Solr-5.x-Linux/lucene/build/core/classes/java/org/apache/lucene/search/similarities/package-info.class
    [javac] Creating empty /home/jenkins/workspace/Lucene-Solr-5.x-Linux/lucene/build/core/classes/java/org/apache/lucene/util/automaton/package-info.class
    [javac] Creating empty /home/jenkins/workspace/Lucene-Solr-5.x-Linux/lucene/build/core/classes/java/org/apache/lucene/codecs/lucene53/package-info.class
    [javac] Creating empty /home/jenkins/workspace/Lucene-Solr-5.x-Linux/lucene/build/core/classes/java/org/apache/lucene/codecs/lucene50/package-info.class
     [copy] Copying 3 files to /home/jenkins/workspace/Lucene-Solr-5.x-Linux/lucene/build/core/classes/java

compile-test-framework:

-check-git-state:

-git-cleanroot:

-copy-git-state:

git-autoclean:

ivy-availability-check:

ivy-fail:

ivy-configure:
[ivy:configure] :: loading settings :: file = /home/jenkins/workspace/Lucene-Solr-5.x-Linux/lucene/ivy-settings.xml

resolve:

init:

compile-lucene-core:

-check-git-state:

-git-cleanroot:

-copy-git-state:

git-autoclean:

ivy-availability-check:

ivy-fail:

ivy-configure:
[ivy:configure] :: loading settings :: file = /home/jenkins/workspace/Lucene-Solr-5.x-Linux/lucene/ivy-settings.xml

resolve:

init:

-clover.disable:

-clover.load:

-clover.classpath:

-clover.setup:

clover:

compile-core:

compile-codecs:

-check-git-state:

-git-cleanroot:

-copy-git-state:

git-autoclean:

ivy-availability-check:

ivy-fail:

ivy-configure:
[ivy:configure] :: loading settings :: file = /home/jenkins/workspace/Lucene-Solr-5.x-Linux/lucene/ivy-settings.xml

resolve:

common.init:

compile-lucene-core:

init:

-clover.disable:

-clover.load:

-clover.classpath:

-clover.setup:

clover:

compile-core:
    [mkdir] Created dir: /home/jenkins/workspace/Lucene-Solr-5.x-Linux/lucene/build/codecs/classes/java
    [javac] Compiling 64 source files to /home/jenkins/workspace/Lucene-Solr-5.x-Linux/lucene/build/codecs/classes/java
    [javac] Note: Some input files use or override a deprecated API.
    [javac] Note: Recompile with -Xlint:deprecation for details.
    [javac] Creating empty /home/jenkins/workspace/Lucene-Solr-5.x-Linux/lucene/build/codecs/classes/java/org/apache/lucene/codecs/bloom/package-info.class
    [javac] Creating empty /home/jenkins/workspace/Lucene-Solr-5.x-Linux/lucene/build/codecs/classes/java/org/apache/lucene/codecs/memory/package-info.class
    [javac] Creating empty /home/jenkins/workspace/Lucene-Solr-5.x-Linux/lucene/build/codecs/classes/java/org/apache/lucene/codecs/simpletext/package-info.class
    [javac] Creating empty /home/jenkins/workspace/Lucene-Solr-5.x-Linux/lucene/build/codecs/classes/java/org/apache/lucene/codecs/blockterms/package-info.class
    [javac] Creating empty /home/jenkins/workspace/Lucene-Solr-5.x-Linux/lucene/build/codecs/classes/java/org/apache/lucene/codecs/blocktreeords/package-info.class
    [javac] Creating empty /home/jenkins/workspace/Lucene-Solr-5.x-Linux/lucene/build/codecs/classes/java/org/apache/lucene/codecs/autoprefix/package-info.class
     [copy] Copying 3 files to /home/jenkins/workspace/Lucene-Solr-5.x-Linux/lucene/build/codecs/classes/java

-clover.disable:

-clover.load:

-clover.classpath:

-clover.setup:

clover:

common.compile-core:
    [mkdir] Created dir: /home/jenkins/workspace/Lucene-Solr-5.x-Linux/lucene/build/test-framework/classes/java
    [javac] Compiling 174 source files to /home/jenkins/workspace/Lucene-Solr-5.x-Linux/lucene/build/test-framework/classes/java
    [javac] Note: Some input files use or override a deprecated API.
    [javac] Note: Recompile with -Xlint:deprecation for details.
    [javac] Creating empty /home/jenkins/workspace/Lucene-Solr-5.x-Linux/lucene/build/test-framework/classes/java/org/apache/lucene/codecs/asserting/package-info.class
    [javac] Creating empty /home/jenkins/workspace/Lucene-Solr-5.x-Linux/lucene/build/test-framework/classes/java/org/apache/lucene/codecs/ramonly/package-info.class
    [javac] Creating empty /home/jenkins/workspace/Lucene-Solr-5.x-Linux/lucene/build/test-framework/classes/java/org/apache/lucene/mockfile/package-info.class
    [javac] Creating empty /home/jenkins/workspace/Lucene-Solr-5.x-Linux/lucene/build/test-framework/classes/java/org/apache/lucene/codecs/cheapbastard/package-info.class
    [javac] Creating empty /home/jenkins/workspace/Lucene-Solr-5.x-Linux/lucene/build/test-framework/classes/java/org/apache/lucene/codecs/mockrandom/package-info.class
    [javac] Creating empty /home/jenkins/workspace/Lucene-Solr-5.x-Linux/lucene/build/test-framework/classes/java/org/apache/lucene/codecs/cranky/package-info.class
    [javac] Creating empty /home/jenkins/workspace/Lucene-Solr-5.x-Linux/lucene/build/test-framework/classes/java/org/apache/lucene/codecs/compressing/dummy/package-info.class
     [copy] Copying 4 files to /home/jenkins/workspace/Lucene-Solr-5.x-Linux/lucene/build/test-framework/classes/java

compile-core:

compile-test:
    [mkdir] Created dir: /home/jenkins/workspace/Lucene-Solr-5.x-Linux/lucene/build/core/classes/test
    [javac] Compiling 430 source files to /home/jenkins/workspace/Lucene-Solr-5.x-Linux/lucene/build/core/classes/test
    [javac] Note: Some input files use or override a deprecated API.
    [javac] Note: Recompile with -Xlint:deprecation for details.
     [copy] Copying 3 files to /home/jenkins/workspace/Lucene-Solr-5.x-Linux/lucene/build/core/classes/test

install-junit4-taskdef:

validate:

resolve-groovy:

-init-totals:

-test:
    [mkdir] Created dir: /home/jenkins/workspace/Lucene-Solr-5.x-Linux/lucene/build/core/test
[loadresource] Do not set property tests.explicitclass as its length is 0.
    [mkdir] Created dir: /home/jenkins/workspace/Lucene-Solr-5.x-Linux/lucene/build/core/test/temp
    [mkdir] Created dir: /home/jenkins/workspace/Lucene-Solr-5.x-Linux/.caches/test-stats/core
   [junit4] <JUnit4> says 今日は! Master seed: AA80E4111329C401
   [junit4] Executing 422 suites with 3 JVMs.
   [junit4] 
   [junit4] Started J0 PID(24631@localhost).
   [junit4] Started J2 PID(24632@localhost).
   [junit4] Started J1 PID(24634@localhost).
   [junit4] Suite: org.apache.lucene.search.TestBlendedTermQuery
   [junit4] Completed [1/422] on J1 in 0.79s, 3 tests
   [junit4] 
   [junit4] Suite: org.apache.lucene.search.spans.TestSpanTermQuery
   [junit4] Completed [2/422] on J1 in 0.06s, 2 tests
   [junit4] 
   [junit4] Suite: org.apache.lucene.index.TestCrash
   [junit4] Completed [3/422] on J1 in 1.01s, 5 tests
   [junit4] 
   [junit4] Suite: org.apache.lucene.TestMergeSchedulerExternal
   [junit4] Completed [4/422] on J1 in 0.68s, 2 tests
   [junit4] 
   [junit4] Suite: org.apache.lucene.index.TestTermdocPerf
   [junit4] Completed [5/422] on J1 in 0.03s, 1 test
   [junit4] 
   [junit4] Suite: org.apache.lucene.search.TestBoostQuery
   [junit4] Completed [6/422] on J1 in 0.06s, 4 tests
   [junit4] 
   [junit4] Suite: org.apache.lucene.index.TestNorms
   [junit4] Completed [7/422] on J2 in 2.90s, 2 tests
   [junit4] 
   [junit4] Suite: org.apache.lucene.search.TestMultiCollector
   [junit4] Completed [8/422] on J1 in 0.82s, 2 tests
   [junit4] 
   [junit4] Suite: org.apache.lucene.search.TestReqExclBulkScorer
   [junit4] Completed [9/422] on J1 in 0.09s, 1 test
   [junit4] 
   [junit4] Suite: org.apache.lucene.index.TestMultiFields
   [junit4] Completed [10/422] on J0 in 3.87s, 3 tests
   [junit4] 
   [junit4] Suite: org.apache.lucene.index.TestFilterLeafReader
   [junit4] Completed [11/422] on J0 in 0.15s, 3 tests
   [junit4] 
   [junit4] Suite: org.apache.lucene.search.TestSimilarity
   [junit4] Completed [12/422] on J0 in 0.17s, 1 test
   [junit4] 
   [junit4] Suite: org.apache.lucene.search.TestSortRandom
   [junit4] Completed [13/422] on J0 in 1.06s, 2 tests
   [junit4] 
   [junit4] Suite: org.apache.lucene.util.TestLongBitSet
   [junit4] IGNOR/A 0.01s J0 | TestLongBitSet.testHugeCapacity
   [junit4]    > Assumption #1: 'nightly' test group is disabled (@Nightly())
   [junit4] Completed [14/422] on J0 in 0.77s, 9 tests, 1 skipped
   [junit4] 
   [junit4] Suite: org.apache.lucene.index.TestIndexReaderClose
   [junit4] Completed [15/422] on J0 in 0.38s, 3 tests
   [junit4] 
   [junit4] Suite: org.apache.lucene.index.TestCheckIndex
   [junit4] Completed [16/422] on J1 in 3.58s, 5 tests
   [junit4] 
   [junit4] Suite: org.apache.lucene.document.TestBinaryDocument
   [junit4] Completed [17/422] on J1 in 0.03s, 2 tests
   [junit4] 
   [junit4] Suite: org.apache.lucene.index.TestMixedCodecs
   [junit4] Completed [18/422] on J0 in 2.62s, 1 test
   [junit4] 
   [junit4] Suite: org.apache.lucene.index.TestForTooMuchCloning
   [junit4] Completed [19/422] on J0 in 0.31s, 1 test
   [junit4] 
   [junit4] Suite: org.apache.lucene.util.TestIntArrayDocIdSet
   [junit4] Completed [20/422] on J0 in 1.09s, 5 tests
   [junit4] 
   [junit4] Suite: org.apache.lucene.search.TestConjunctions
   [junit4] Completed [21/422] on J0 in 0.03s, 1 test
   [junit4] 
   [junit4] Suite: org.apache.lucene.index.TestExitableDirectoryReader
   [junit4] Completed [22/422] on J0 in 0.44s, 1 test
   [junit4] 
   [junit4] Suite: org.apache.lucene.search.TestNGramPhraseQuery
   [junit4] Completed [23/422] on J0 in 0.09s, 1 test
   [junit4] 
   [junit4] Suite: org.apache.lucene.index.TestStressNRT
   [junit4] Completed [24/422] on J0 in 2.95s, 1 test
   [junit4] 
   [junit4] Suite: org.apache.lucene.util.Test2BPagedBytes
   [junit4] IGNOR/A 0.00s J0 | Test2BPagedBytes.test
   [junit4]    > Assumption #1: 'monster' test group is disabled (@Monster(value=You must increase heap to > 2 G to run this))
   [junit4] Completed [25/422] on J0 in 0.00s, 1 test, 1 skipped
   [junit4] 
   [junit4] Suite: org.apache.lucene.index.TestSegmentInfos
   [junit4] Completed [26/422] on J0 in 0.02s, 3 tests
   [junit4] 
   [junit4] Suite: org.apache.lucene.search.TestRegexpQuery
   [junit4] Completed [27/422] on J0 in 0.09s, 7 tests
   [junit4] 
   [junit4] Suite: org.apache.lucene.index.TestPerSegmentDeletes
   [junit4] Completed [28/422] on J0 in 0.08s, 1 test
   [junit4] 
   [junit4] Suite: org.apache.lucene.util.TestBytesRefArray
   [junit4] Completed [29/422] on J0 in 0.08s, 2 tests
   [junit4] 
   [junit4] Suite: org.apache.lucene.search.TestMultiTermConstantScore
   [junit4] Completed [30/422] on J0 in 1.27s, 8 tests
   [junit4] 
   [junit4] Suite: org.apache.lucene.index.TestIndexWriterExceptions2
   [junit4] Completed [31/422] on J2 in 15.15s, 1 test
   [junit4] 
   [junit4] Suite: org.apache.lucene.search.TestSortedSetSortField
   [junit4] Completed [32/422] on J2 in 0.12s, 7 tests
   [junit4] 
   [junit4] Suite: org.apache.lucene.search.TestWildcard
   [junit4] Completed [33/422] on J2 in 0.24s, 8 tests
   [junit4] 
   [junit4] Suite: org.apache.lucene.util.TestQueryBuilder
   [junit4] Completed [34/422] on J2 in 0.05s, 20 tests
   [junit4] 
   [junit4] Suite: org.apache.lucene.index.TestIndexWriterOnJRECrash
   [junit4] IGNOR/A 0.01s J2 | TestIndexWriterOnJRECrash.testNRTThreads
   [junit4]    > Assumption #1: 'nightly' test group is disabled (@Nightly())
   [junit4] Completed [35/422] on J2 in 0.01s, 1 test, 1 skipped
   [junit4] 
   [junit4] Suite: org.apache.lucene.search.TestScorerPerf
   [junit4] Completed [36/422] on J1 in 11.40s, 1 test
   [junit4] 
   [junit4] Suite: org.apache.lucene.index.TestNoMergePolicy
   [junit4] Completed [37/422] on J1 in 0.05s, 4 tests
   [junit4] 
   [junit4] Suite: org.apache.lucene.util.TestArrayUtil
   [junit4] Completed [38/422] on J0 in 3.63s, 13 tests
   [junit4] 
   [junit4] Suite: org.apache.lucene.index.TestNoMergeScheduler
   [junit4] Completed [39/422] on J0 in 0.02s, 3 tests
   [junit4] 
   [junit4] Suite: org.apache.lucene.store.TestBufferedChecksum
   [junit4] Completed [40/422] on J0 in 0.13s, 2 tests
   [junit4] 
   [junit4] Suite: org.apache.lucene.TestSearch
   [junit4] Completed [41/422] on J0 in 0.07s, 2 tests
   [junit4] 
   [junit4] Suite: org.apache.lucene.index.TestTermsEnum2
   [junit4] Completed [42/422] on J1 in 1.84s, 4 tests
   [junit4] 
   [junit4] Suite: org.apache.lucene.search.similarities.TestBM25Similarity
   [junit4] Completed [43/422] on J1 in 0.07s, 3 tests
   [junit4] 
   [junit4] Suite: org.apache.lucene.index.TestNeverDelete
   [junit4] Completed [44/422] on J0 in 4.16s, 1 test
   [junit4] 
   [junit4] Suite: org.apache.lucene.TestDemo
   [junit4] Completed [45/422] on J0 in 0.05s, 1 test
   [junit4] 
   [junit4] Suite: org.apache.lucene.index.TestIndexWriterMaxDocs
   [junit4] IGNOR/A 0.01s J1 | TestIndexWriterMaxDocs.testExactlyAtTrueLimit
   [junit4]    > Assumption #1: 'monster' test group is disabled (@Monster(value=takes over two hours))
   [junit4] Completed [46/422] on J1 in 3.95s, 21 tests, 1 skipped
   [junit4] 
   [junit4] Suite: org.apache.lucene.codecs.compressing.TestHighCompressionMode
   [junit4] Completed [47/422] on J0 in 2.45s, 7 tests
   [junit4] 
   [junit4] Suite: org.apache.lucene.search.TestRegexpRandom
   [junit4] Completed [48/422] on J0 in 0.39s, 1 test
   [junit4] 
   [junit4] Suite: org.apache.lucene.index.TestAddIndexes
   [junit4] Completed [49/422] on J1 in 2.66s, 23 tests
   [junit4] 
   [junit4] Suite: org.apache.lucene.search.TestScoreCachingWrappingScorer
   [junit4] Completed [50/422] on J1 in 0.03s, 1 test
   [junit4] 
   [junit4] Suite: org.apache.lucene.store.TestLockFactory
   [junit4] Completed [51/422] on J1 in 0.05s, 2 tests
   [junit4] 
   [junit4] Suite: org.apache.lucene.util.packed.TestDirectPacked
   [junit4] Completed [52/422] on J0 in 2.15s, 4 tests
   [junit4] 
   [junit4] Suite: org.apache.lucene.index.TestSizeBoundedForceMerge
   [junit4] Completed [53/422] on J0 in 0.12s, 11 tests
   [junit4] 
   [junit4] Suite: org.apache.lucene.index.TestSumDocFreq
   [junit4] Completed [54/422] on J0 in 0.30s, 1 test
   [junit4] 
   [junit4] Suite: org.apache.lucene.index.TestNRTThreads
   [junit4] Completed [55/422] on J2 in 11.42s, 1 test
   [junit4] 
   [junit4] Suite: org.apache.lucene.codecs.lucene50.TestLucene50StoredFieldsFormat
   [junit4] IGNOR/A 0.00s J0 | TestLucene50StoredFieldsFormat.testBigDocuments
   [junit4]    > Assumption #1: 'nightly' test group is disabled (@Nightly())
   [junit4] Completed [56/422] on J0 in 3.05s, 17 tests, 1 skipped
   [junit4] 
   [junit4] Suite: org.apache.lucene.search.similarities.TestSimilarity2
   [junit4] Completed [57/422] on J0 in 0.13s, 7 tests
   [junit4] 
   [junit4] Suite: org.apache.lucene.index.TestIndexWriterMerging
   [junit4] Completed [58/422] on J2 in 4.82s, 6 tests
   [junit4] 
   [junit4] Suite: org.apache.lucene.util.automaton.TestMinimize
   [junit4] Completed [59/422] on J0 in 2.58s, 3 tests
   [junit4] 
   [junit4] Suite: org.apache.lucene.search.TestMinShouldMatch2
   [junit4] Completed [60/422] on J0 in 5.01s, 6 tests
   [junit4] 
   [junit4] Suite: org.apache.lucene.index.TestDocumentsWriterStallControl
   [junit4] Completed [61/422] on J1 in 12.71s, 3 tests
   [junit4] 
   [junit4] Suite: org.apache.lucene.index.TestTermVectorsReader
   [junit4] Completed [62/422] on J1 in 0.10s, 6 tests
   [junit4] 
   [junit4] Suite: org.apache.lucene.codecs.TestCodecLoadingDeadlock
   [junit4] Completed [63/422] on J0 in 0.25s, 1 test
   [junit4] 
   [junit4] Suite: org.apache.lucene.index.TestNoDeletionPolicy
   [junit4] Completed [64/422] on J0 in 0.06s, 4 tests
   [junit4] 
   [junit4] Suite: org.apache.lucene.index.TestFlex
   [junit4] Completed [65/422] on J1 in 0.16s, 2 tests
   [junit4] 
   [junit4] Suite: org.apache.lucene.index.TestSegmentReader
   [junit4] Completed [66/422] on J0 in 0.92s, 7 tests
   [junit4] 
   [junit4] Suite: org.apache.lucene.codecs.compressing.TestFastDecompressionMode
   [junit4] Completed [67/422] on J1 in 3.21s, 11 tests
   [junit4] 
   [junit4] Suite: org.apache.lucene.index.TestStressIndexing2
   [junit4] Completed [68/422] on J1 in 0.39s, 3 tests
   [junit4] 
   [junit4] Suite: org.apache.lucene.index.TestDeletionPolicy
   [junit4] Completed [69/422] on J0 in 4.09s, 6 tests
   [junit4] 
   [junit4] Suite: org.apache.lucene.index.TestDocumentsWriterDeleteQueue
   [junit4] Completed [70/422] on J0 in 0.16s, 5 tests
   [junit4] 
   [junit4] Suite: org.apache.lucene.util.TestPagedBytes
   [junit4] Completed [71/422] on J2 in 10.67s, 4 tests, 1 skipped
   [junit4] 
   [junit4] Suite: org.apache.lucene.search.TestComplexExplanations
   [junit4] Completed [72/422] on J2 in 1.59s, 21 tests
   [junit4] 
   [junit4] Suite: org.apache.lucene.index.TestIndexWriterConfig
   [junit4] Completed [73/422] on J2 in 0.03s, 8 tests
   [junit4] 
   [junit4] Suite: org.apache.lucene.search.TestPhraseQuery
   [junit4] Completed [74/422] on J2 in 1.33s, 23 tests
   [junit4] 
   [junit4] Suite: org.apache.lucene.index.TestTragicIndexWriterDeadlock
   [junit4] Completed [75/422] on J2 in 0.03s, 1 test
   [junit4] 
   [junit4] Suite: org.apache.lucene.util.TestFilterIterator
   [junit4] Completed [76/422] on J2 in 0.03s, 8 tests
   [junit4] 
   [junit4] Suite: org.apache.lucene.index.TestSwappedIndexFiles
   [junit4] Completed [77/422] on J2 in 0.14s, 1 test
   [junit4] 
   [junit4] Suite: org.apache.lucene.search.TestSimpleExplanations
   [junit4] Completed [78/422] on J2 in 1.02s, 72 tests
   [junit4] 
   [junit4] Suite: org.apache.lucene.util.automaton.TestAutomaton
   [junit4] Completed [79/422] on J1 in 6.58s, 56 tests
   [junit4] 
   [junit4] Suite: org.apache.lucene.index.TestPostingsOffsets
   [junit4] Completed [80/422] on J2 in 1.30s, 13 tests
   [junit4] 
   [junit4] Suite: org.apache.lucene.util.TestIntsRef
   [junit4] Completed [81/422] on J2 in 0.01s, 2 tests
   [junit4] 
   [junit4] Suite: org.apache.lucene.search.TestMultiPhraseEnum
   [junit4] Completed [82/422] on J2 in 0.03s, 2 tests
   [junit4] 
   [junit4] Suite: org.apache.lucene.util.TestIOUtils
   [junit4] Completed [83/422] on J2 in 0.14s, 18 tests
   [junit4] 
   [junit4] Suite: org.apache.lucene.index.TestParallelLeafReader
   [junit4] Completed [84/422] on J2 in 0.10s, 7 tests
   [junit4] 
   [junit4] Suite: org.apache.lucene.store.TestSleepingLockWrapper
   [junit4] Completed [85/422] on J0 in 8.40s, 6 tests
   [junit4] 
   [junit4] Suite: org.apache.lucene.search.spans.TestNearSpansOrdered
   [junit4] Completed [86/422] on J0 in 0.18s, 18 tests
   [junit4] 
   [junit4] Suite: org.apache.lucene.store.TestMultiMMap
   [junit4] Completed [87/422] on J2 in 2.77s, 54 tests
   [junit4] 
   [junit4] Suite: org.apache.lucene.TestExternalCodecs
   [junit4] Completed [88/422] on J2 in 0.25s, 1 test
   [junit4] 
   [junit4] Suite: org.apache.lucene.search.TestPrefixInBooleanQuery
   [junit4] Completed [89/422] on J0 in 0.54s, 4 tests
   [junit4] 
   [junit4] Suite: org.apache.lucene.index.TestOmitTf
   [junit4] Completed [90/422] on J2 in 0.17s, 6 tests
   [junit4] 
   [junit4] Suite: org.apache.lucene.TestAssertions
   [junit4] Completed [91/422] on J2 in 0.02s, 1 test
   [junit4] 
   [junit4] Suite: org.apache.lucene.codecs.lucene50.TestLucene50SegmentInfoFormat
   [junit4] Completed [92/422] on J2 in 0.31s, 15 tests
   [junit4] 
   [junit4] Suite: org.apache.lucene.search.TestSimpleExplanationsOfNonMatches
   [junit4] Completed [93/422] on J2 in 0.07s, 72 tests
   [junit4] 
   [junit4] Suite: org.apache.lucene.util.TestRoaringDocIdSet
   [junit4] Completed [94/422] on J0 in 0.88s, 5 tests
   [junit4] 
   [junit4] Suite: org.apache.lucene.store.TestNIOFSDirectory
   [junit4] Completed [95/422] on J0 in 0.89s, 42 tests
   [junit4] 
   [junit4] Suite: org.apache.lucene.util.packed.TestDirectMonotonic
   [junit4] Completed [96/422] on J2 in 4.97s, 4 tests
   [junit4] 
   [junit4] Suite: org.apache.lucene.index.TestTermVectorsWriter
   [junit4] Completed [97/422] on J2 in 0.19s, 15 tests
   [junit4] 
   [junit4] Suite: org.apache.lucene.index.TestTransactions
   [junit4] Completed [98/422] on J2 in 1.91s, 1 test
   [junit4] 
   [junit4] Suite: org.apache.lucene.codecs.perfield.TestPerFieldPostingsFormat2
   [junit4] Completed [99/422] on J2 in 0.61s, 5 tests
   [junit4] 
   [junit4] Suite: org.apache.lucene.search.spans.TestSpans
   [junit4] Completed [100/422] on J2 in 0.25s, 26 tests
   [junit4] 
   [junit4] Suite: org.apache.lucene.util.automaton.TestOperations
   [junit4] Completed [101/422] on J2 in 0.99s, 5 tests
   [junit4] 
   [junit4] Suite: org.apache.lucene.search.TestLiveFieldValues
   [junit4] Completed [102/422] on J2 in 0.94s, 1 test
   [junit4] 
   [junit4] Suite: org.apache.lucene.codecs.lucene50.TestForUtil
   [junit4] Completed [103/422] on J2 in 0.05s, 1 test
   [junit4] 
   [junit4] Suite: org.apache.lucene.index.TestParallelCompositeReader
   [junit4] Completed [104/422] on J2 in 0.22s, 16 tests
   [junit4] 
   [junit4] Suite: org.apache.lucene.index.TestTerm
   [junit4] Completed [105/422] on J2 in 0.01s, 1 test
   [junit4] 
   [junit4] Suite: org.apache.lucene.index.TestCrashCausesCorruptIndex
   [junit4] Completed [106/422] on J2 in 0.07s, 1 test
   [junit4] 
   [junit4] Suite: org.apache.lucene.index.TestIndexFileDeleter
   [junit4] Completed [107/422] on J2 in 0.20s, 9 tests
   [junit4] 
   [junit4] Suite: org.apache.lucene.search.TestSearcherManager
   [junit4] Completed [108/422] on J0 in 9.44s, 10 tests
   [junit4] 
   [junit4] Suite: org.apache.lucene.util.TestDocIdSetBuilder
   [junit4] Completed [109/422] on J2 in 1.62s, 5 tests
   [junit4] 
   [junit4] Suite: org.apache.lucene.search.spans.TestSpansEnum
   [junit4] Completed [110/422] on J2 in 0.06s, 7 tests
   [junit4] 
   [junit4] Suite: org.apache.lucene.search.TestQueryWrapperFilter
   [junit4] Completed [111/422] on J2 in 0.32s, 6 tests
   [junit4] 
   [junit4] Suite: org.apache.lucene.util.TestSloppyMath
   [junit4] Completed [112/422] on J2 in 0.11s, 3 tests
   [junit4] 
   [junit4] Suite: org.apache.lucene.store.TestWindowsMMap
   [junit4] Completed [113/422] on J2 in 0.12s, 1 test
   [junit4] 
   [junit4] Suite: org.apache.lucene.codecs.lucene50.TestBlockPostingsFormat2
   [junit4] Completed [114/422] on J0 in 2.17s, 4 tests
   [junit4] 
   [junit4] Suite: org.apache.lucene.index.TestPrefixCodedTerms
   [junit4] Completed [115/422] on J0 in 0.50s, 5 tests
   [junit4] 
   [junit4] Suite: org.apache.lucene.analysis.tokenattributes.TestSimpleAttributeImpl
   [junit4] Completed [116/422] on J0 in 0.01s, 1 test
   [junit4] 
   [junit4] Suite: org.apache.lucene.search.TestSimilarityProvider
   [junit4] Completed [117/422] on J0 in 0.02s, 1 test
   [junit4] 
   [junit4] Suite: org.apache.lucene.search.TestConstantScoreQuery
   [junit4] Completed [118/422] on J0 in 0.06s, 6 tests
   [junit4] 
   [junit4] Suite: org.apache.lucene.search.TestSloppyPhraseQuery
   [junit4] Completed [119/422] on J2 in 0.98s, 9 tests
   [junit4] 
   [junit4] Suite: org.apache.lucene.store.TestSimpleFSDirectory
   [junit4] Completed [120/422] on J0 in 1.01s, 42 tests
   [junit4] 
   [junit4] Suite: org.apache.lucene.index.TestMultiLevelSkipList
   [junit4] Completed [121/422] on J0 in 0.13s, 1 test
   [junit4] 
   [junit4] Suite: org.apache.lucene.util.TestFixedBitDocIdSet
   [junit4] Completed [122/422] on J0 in 1.42s, 5 tests
   [junit4] 
   [junit4] Suite: org.apache.lucene.index.TestIndexWriterCommit
   [junit4] Completed [123/422] on J0 in 1.78s, 13 tests
   [junit4] 
   [junit4] Suite: org.apache.lucene.index.TestCodecUtil
   [junit4] Completed [124/422] on J0 in 0.06s, 15 tests
   [junit4] 
   [junit4] Suite: org.apache.lucene.index.TestReaderClosed
   [junit4] Completed [125/422] on J0 in 0.04s, 2 tests
   [junit4] 
   [junit4] Suite: org.apache.lucene.search.TestSortedNumericSortField
   [junit4] Completed [126/422] on J0 in 0.08s, 9 tests
   [junit4] 
   [junit4] Suite: org.apache.lucene.util.automaton.LimitedFiniteStringsIteratorTest
   [junit4] Completed [127/422] on J0 in 0.16s, 6 tests
   [junit4] 
   [junit4] Suite: org.apache.lucene.analysis.tokenattributes.TestCharTermAttributeImpl
   [junit4] Completed [128/422] on J0 in 0.26s, 12 tests
   [junit4] 
   [junit4] Suite: org.apache.lucene.search.TestDateFilter
   [junit4] Completed [129/422] on J0 in 0.03s, 2 tests
   [junit4] 
   [junit4] Suite: org.apache.lucene.analysis.TestReusableStringReader
   [junit4] Completed [130/422] on J0 in 0.01s, 1 test
   [junit4] 
   [junit4] Suite: org.apache.lucene.search.TestShardSearching
   [junit4] Completed [131/422] on J0 in 13.37s, 1 test
   [junit4] 
   [junit4] Suite: org.apache.lucene.document.TestField
   [junit4] Completed [132/422] on J0 in 0.02s, 19 tests
   [junit4] 
   [junit4] Suite: org.apache.lucene.index.Test2BSortedDocValuesFixedSorted
   [junit4] IGNOR/A 0.00s J0 | Test2BSortedDocValuesFixedSorted.testFixedSorted
   [junit4]    > Assumption #1: 'monster' test group is disabled (@Monster(value=Takes ~ 6 hours if the heap is 5gb))
   [junit4] Completed [133/422] on J0 in 0.00s, 1 test, 1 skipped
   [junit4] 
   [junit4] Suite: org.apache.lucene.store.TestHugeRamFile
   [junit4] Completed [134/422] on J0 in 1.75s, 1 test
   [junit4] 
   [junit4] Suite: org.apache.lucene.index.TestTieredMergePolicy
   [junit4] Completed [135/422] on J0 in 2.65s, 6 tests
   [junit4] 
   [junit4] Suite: org.apache.lucene.index.TestSnapshotDeletionPolicy
   [junit4] Completed [136/422] on J0 in 1.18s, 7 tests
   [junit4] 
   [junit4] Suite: org.apache.lucene.codecs.lucene50.TestLucene50TermVectorsFormat
   [junit4] Completed [137/422] on J2 in 26.17s, 23 tests
   [junit4] 
   [junit4] Suite: org.apache.lucene.index.TestRollback
   [junit4] Completed [138/422] on J2 in 0.02s, 1 test
   [junit4] 
   [junit4] Suite: org.apache.lucene.search.TestRegexpRandom2
   [junit4] Completed [139/422] on J0 in 2.36s, 1 test
   [junit4] 
   [junit4] Suite: org.apache.lucene.search.TestUsageTrackingFilterCachingPolicy
   [junit4] Completed [140/422] on J0 in 0.01s, 2 tests
   [junit4] 
   [junit4] Suite: org.apache.lucene.index.TestParallelReaderEmptyIndex
   [junit4] Completed [141/422] on J0 in 0.03s, 2 tests
   [junit4] 
   [junit4] Suite: org.apache.lucene.util.automaton.TestRegExp
   [junit4] Completed [142/422] on J0 in 0.09s, 5 tests
   [junit4] 
   [junit4] Suite: org.apache.lucene.codecs.lucene50.TestBlockPostingsFormat
   [junit4] Completed [143/422] on J2 in 8.20s, 32 tests
   [junit4] 
   [junit4] Suite: org.apache.lucene.search.TestTopDocsCollector
   [junit4] Completed [144/422] on J2 in 0.03s, 8 tests
   [junit4] 
   [junit4] Suite: org.apache.lucene.search.TestComplexExplanationsOfNonMatches
   [junit4] Completed [145/422] on J2 in 0.03s, 21 tests
   [junit4] 
   [junit4] Suite: org.apache.lucene.util.TestByteBlockPool
   [junit4] Completed [146/422] on J2 in 0.05s, 1 test
   [junit4] 
   [junit4] Suite: org.apache.lucene.index.TestIndexWriter
   [junit4] Completed [147/422] on J0 in 7.82s, 70 tests
   [junit4] 
   [junit4] Suite: org.apache.lucene.index.TestNumericDocValuesUpdates
   [junit4] IGNOR/A 0.00s J2 | TestNumericDocValuesUpdates.testTonsOfUpdates
   [junit4]    > Assumption #1: 'nightly' test group is disabled (@Nightly())
   [junit4] Completed [148/422] on J2 in 3.71s, 29 tests, 1 skipped
   [junit4] 
   [junit4] Suite: org.apache.lucene.util.TestNamedSPILoader
   [junit4] Completed [149/422] on J2 in 0.01s, 3 tests
   [junit4] 
   [junit4] Suite: org.apache.lucene.index.TestIndexWriterReader
   [junit4] IGNOR/A 0.00s J2 | TestIndexWriterReader.testDuringAddIndexes
   [junit4]    > Assumption #1: 'nightly' test group is disabled (@Nightly())
   [junit4] Completed [150/422] on J2 in 3.29s, 23 tests, 1 skipped
   [junit4] 
   [junit4] Suite: org.apache.lucene.index.TestConcurrentMergeScheduler
   [junit4] Completed [151/422] on J2 in 2.27s, 16 tests
   [junit4] 
   [junit4] Suite: org.apache.lucene.index.TestRollingUpdates
   [junit4] Completed [152/422] on J2 in 1.27s, 2 tests
   [junit4] 
   [junit4] Suite: org.apache.lucene.search.similarities.TestDefaultSimilarity
   [junit4] Completed [153/422] on J2 in 0.02s, 2 tests
   [junit4] 
   [junit4] Suite: org.apache.lucene.util.automaton.TestDeterminism
   [junit4] Completed [154/422] on J2 in 0.71s, 2 tests
   [junit4] 
   [junit4] Suite: org.apache.lucene.codecs.compressing.TestFastCompressionMode
   [junit4] Completed [155/422] on J2 in 1.31s, 11 tests
   [junit4] 
   [junit4] Suite: org.apache.lucene.search.TestDocIdSet
   [junit4] Completed [156/422] on J2 in 0.02s, 3 tests
   [junit4] 
   [junit4] Suite: org.apache.lucene.TestSearchForDuplicates
   [junit4] Completed [157/422] on J2 in 0.04s, 1 test
   [junit4] 
   [junit4] Suite: org.apache.lucene.search.TestSortRescorer
   [junit4] Completed [158/422] on J2 in 0.65s, 2 tests
   [junit4] 
   [junit4] Suite: org.apache.lucene.index.Test2BBinaryDocValues
   [junit4] IGNOR/A 0.00s J2 | Test2BBinaryDocValues.testVariableBinary
   [junit4]    > Assumption #1: 'monster' test group is disabled (@Monster(value=takes ~ 6 hours if the heap is 5gb))
   [junit4] IGNOR/A 0.00s J2 | Test2BBinaryDocValues.testFixedBinary
   [junit4]    > Assumption #1: 'monster' test group is disabled (@Monster(value=takes ~ 6 hours if the heap is 5gb))
   [junit4] Completed [159/422] on J2 in 0.00s, 2 tests, 2 skipped
   [junit4] 
   [junit4] HEARTBEAT J1 PID(24634@localhost): 2016-02-08T20:32:22, stalled for 68.5s at: TestOfflineSorter.testThreadSafety
   [junit4] Suite: org.apache.lucene.index.TestAtomicUpdate
   [junit4] Completed [160/422] on J2 in 4.45s, 1 test
   [junit4] 
   [junit4] Suite: org.apache.lucene.store.TestSingleInstanceLockFactory
   [junit4] Completed [161/422] on J2 in 1.17s, 7 tests
   [junit4] 
   [junit4] Suite: org.apache.lucene.search.TestAutomatonQueryUnicode
   [junit4] Completed [162/422] on J2 in 0.01s, 1 test
   [junit4] 
   [junit4] Suite: org.apache.lucene.index.TestThreadedForceMerge
   [junit4] Completed [163/422] on J2 in 0.16s, 1 test
   [junit4] 
   [junit4] Suite: org.apache.lucene.search.TestSimpleSearchEquivalence
   [junit4] Completed [164/422] on J2 in 0.98s, 16 tests
   [junit4] 
   [junit4] Suite: org.apache.lucene.search.spans.TestSpanNotQuery
   [junit4] Completed [165/422] on J2 in 0.01s, 3 tests
   [junit4] 
   [junit4] Suite: org.apache.lucene.index.TestPayloadsOnVectors
   [junit4] Completed [166/422] on J2 in 0.02s, 3 tests
   [junit4] 
   [junit4] Suite: org.apache.lucene.util.fst.TestFSTs
   [junit4] IGNOR/A 0.00s J2 | TestFSTs.testBigSet
   [junit4]    > Assumption #1: 'nightly' test group is disabled (@Nightly())
   [junit4] Completed [168/422] on J2 in 7.64s, 20 tests, 1 skipped
   [junit4] 
   [junit4] Suite: org.apache.lucene.codecs.perfield.TestPerFieldDocValuesFormat
   [junit4] Completed [169/422] on J0 in 33.62s, 96 tests
   [junit4] 
   [junit4] Suite: org.apache.lucene.util.fst.TestBytesStore
   [junit4] Completed [170/422] on J0 in 0.88s, 1 test
   [junit4] 
   [junit4] Suite: org.apache.lucene.search.TestNumericRangeQuery64
   [junit4] Completed [171/422] on J2 in 11.38s, 29 tests
   [junit4] 
   [junit4] Suite: org.apache.lucene.util.TestOfflineSorter
   [junit4] IGNOR/A 0.00s J1 | TestOfflineSorter.testLargerRandom
   [junit4]    > Assumption #1: 'nightly' test group is disabled (@Nightly())
   [junit4] Completed [172/422] on J1 in 93.45s, 7 tests, 1 skipped
   [junit4] 
   [junit4] Suite: org.apache.lucene.search.TestFilteredSearch
   [junit4] Completed [173/422] on J1 in 0.04s, 1 test
   [junit4] 
   [junit4] Suite: org.apache.lucene.index.TestIndexWriterWithThreads
   [junit4] IGNOR/A 0.01s J2 | TestIndexWriterWithThreads.testOpenTwoIndexWritersOnDifferentThreads
   [junit4]    > Assumption #1: aborting test: timeout obtaining lock
   [junit4] Completed [174/422] on J2 in 1.12s, 12 tests, 1 skipped
   [junit4] 
   [junit4] Suite: org.apache.lucene.index.TestPayloads
   [junit4] Completed [175/422] on J1 in 0.18s, 7 tests
   [junit4] 
   [junit4] Suite: org.apache.lucene.index.TestDuelingCodecsAtNight
   [junit4] IGNOR/A 0.00s J1 | TestDuelingCodecsAtNight.testEquals
   [junit4]    > Assumption #1: 'nightly' test group is disabled (@Nightly())
   [junit4] IGNOR/A 0.00s J1 | TestDuelingCodecsAtNight.testBigEquals
   [junit4]    > Assumption #1: 'nightly' test group is disabled (@Nightly())
   [junit4] IGNOR/A 0.00s J1 | TestDuelingCodecsAtNight.testCrazyReaderEquals
   [junit4]    > Assumption #1: 'nightly' test group is disabled (@Nightly())
   [junit4] Completed [176/422] on J1 in 0.01s, 3 tests, 3 skipped
   [junit4] 
   [junit4] Suite: org.apache.lucene.util.packed.TestPackedInts
   [junit4] IGNOR/A 0.00s J0 | TestPackedInts.testBlockReaderOverflow
   [junit4]    > Assumption #1: 'nightly' test group is disabled (@Nightly())
   [junit4] Completed [177/422] on J0 in 11.46s, 28 tests, 3 skipped
   [junit4] 
   [junit4] Suite: org.apache.lucene.search.TestNumericRangeQuery32
   [junit4] Completed [178/422] on J2 in 5.62s, 23 tests
   [junit4] 
   [junit4] Suite: org.apache.lucene.search.TestBooleanOr
   [junit4] Completed [179/422] on J2 in 0.95s, 7 tests
   [junit4] 
   [junit4] Suite: org.apache.lucene.search.spans.TestBasics
   [junit4] Completed [180/422] on J2 in 2.18s, 25 tests
   [junit4] 
   [junit4] Suite: org.apache.lucene.index.TestFlushByRamOrCountsPolicy
   [junit4] Completed [181/422] on J2 in 1.66s, 5 tests
   [junit4] 
   [junit4] Suite: org.apache.lucene.index.TestIndexWriterDelete
   [junit4] IGNOR/A 0.00s J2 | TestIndexWriterDelete.testIndexingThenDeleting
   [junit4]    > Assumption #1: This test cannot run with Direct codec
   [junit4] IGNOR/A 0.00s J2 | TestIndexWriterDelete.testApplyDeletesOnFlush
   [junit4]    > Assumption #1: 'nightly' test group is disabled (@Nightly())
   [junit4] Completed [182/422] on J2 in 1.43s, 27 tests, 2 skipped
   [junit4] 
   [junit4] Suite: org.apache.lucene.index.TestIndexWriterMergePolicy
   [junit4] Completed [183/422] on J2 in 1.83s, 7 tests
   [junit4] 
   [junit4] Suite: org.apache.lucene.index.TestIndexWriterExceptions
   [junit4] IGNOR/A 0.00s J0 | TestIndexWriterExceptions.testTooManyTokens
   [junit4]    > Assumption #1: 'nightly' test group is disabled (@Nightly())
   [junit4] Completed [184/422] on J0 in 11.79s, 36 tests, 1 skipped
   [junit4] 
   [junit4] Suite: org.apache.lucene.search.TestBoolean2
   [junit4] Completed [185/422] on J0 in 4.03s, 11 tests
   [junit4] 
   [junit4] Suite: org.apache.lucene.index.TestPersistentSnapshotDeletionPolicy
   [junit4] Completed [186/422] on J0 in 1.35s, 13 tests
   [junit4] 
   [junit4] Suite: org.apache.lucene.index.TestStressAdvance
   [junit4] Completed [187/422] on J0 in 2.08s, 1 test
   [junit4] 
   [junit4] Suite: org.apache.lucene.index.TestDirectoryReaderReopen
   [junit4] Completed [188/422] on J0 in 1.30s, 9 tests
   [junit4] 
   [junit4] Suite: org.apache.lucene.search.TestTimeLimitingCollector
   [junit4] Completed [189/422] on J0 in 1.85s, 7 tests
   [junit4] 
   [junit4] Suite: org.apache.lucene.index.TestDuelingCodecs
   [junit4] Completed [190/422] on J2 in 20.35s, 2 tests
   [junit4] 
   [junit4] Suite: org.apache.lucene.search.TestSearchWithThreads
   [junit4] Completed [191/422] on J0 in 6.49s, 1 test
   [junit4] 
   [junit4] Suite: org.apache.lucene.search.TestSearchAfter
   [junit4] Completed [192/422] on J2 in 1.10s, 1 test
   [junit4] 
   [junit4] Suite: org.apache.lucene.search.TestTopDocsMerge
   [junit4] Completed [193/422] on J0 in 1.19s, 2 tests
   [junit4] 
   [junit4] Suite: org.apache.lucene.util.TestTimSorterWorstCase
   [junit4] Completed [194/422] on J1 in 37.48s, 1 test
   [junit4] 
   [junit4] Suite: org.apache.lucene.store.TestFilterDirectory
   [junit4] IGNOR/A 0.00s J1 | TestFilterDirectory.testFsyncDoesntCreateNewFiles
   [junit4]    > Assumption #1: test only works for FSDirectory subclasses
   [junit4] Completed [195/422] on J1 in 0.77s, 44 tests, 1 skipped
   [junit4] 
   [junit4] Suite: org.apache.lucene.index.TestLongPostings
   [junit4] Completed [196/422] on J2 in 2.56s, 2 tests
   [junit4] 
   [junit4] Suite: org.apache.lucene.search.TestDocTermOrdsRewriteMethod
   [junit4] Completed [197/422] on J0 in 2.93s, 2 tests
   [junit4] 
   [junit4] Suite: org.apache.lucene.index.TestNRTReaderWithThreads
   [junit4] Completed [198/422] on J0 in 1.59s, 1 test
   [junit4] 
   [junit4] Suite: org.apache.lucene.index.TestIndexWriterForceMerge
   [junit4] Completed [199/422] on J0 in 0.84s, 4 tests
   [junit4] 
   [junit4] Suite: org.apache.lucene.search.TestControlledRealTimeReopenThread
   [junit4] IGNOR/A 0.00s J1 | TestControlledRealTimeReopenThread.testCRTReopen
   [junit4]    > Assumption #1: 'awaitsfix' test group is disabled (@AwaitsFix(bugUrl=https://issues.apache.org/jira/browse/LUCENE-5737))
   [junit4] Completed [200/422] on J1 in 4.45s, 5 tests, 1 skipped
   [junit4] 
   [junit4] Suite: org.apache.lucene.search.TestSortedSetSelector
   [junit4] Completed [201/422] on J1 in 0.08s, 15 tests
   [junit4] 
   [junit4] Suite: org.apache.lucene.index.TestAllFilesHaveCodecHeader
   [junit4] Completed [202/422] on J1 in 0.28s, 1 test
   [junit4] 
   [junit4] Suite: org.apache.lucene.util.TestMathUtil
   [junit4] Completed [203/422] on J1 in 0.02s, 5 tests
   [junit4] 
   [junit4] Suite: org.apache.lucene.index.TestManyFields
   [junit4] Completed [204/422] on J1 in 0.65s, 3 tests
   [junit4] 
   [junit4] Suite: org.apache.lucene.util.automaton.TestCompiledAutomaton
   [junit4] Completed [205/422] on J1 in 0.33s, 6 tests
   [junit4] 
   [junit4] Suite: org.apache.lucene.index.TestIndexWriterUnicode
   [junit4] Completed [206/422] on J2 in 5.32s, 5 tests
   [junit4] 
   [junit4] Suite: org.apache.lucene.util.automaton.TestLevenshteinAutomata
   [junit4] Completed [207/422] on J2 in 2.03s, 4 tests
   [junit4] 
   [junit4] Suite: org.apache.lucene.index.TestStressIndexing
   [junit4] Completed [208/422] on J1 in 3.45s, 1 test
   [junit4] 
   [junit4] Suite: org.apache.lucene.analysis.TestCachingTokenFilter
   [junit4] Completed [209/422] on J1 in 0.02s, 2 tests
   [junit4] 
   [junit4] Suite: org.apache.lucene.document.TestDateTools
   [junit4] Completed [210/422] on J1 in 0.05s, 5 tests
   [junit4] 
   [junit4] Suite: org.apache.lucene.search.spans.TestSpanExplanationsOfNonMatches
   [junit4] Completed [211/422] on J1 in 0.07s, 30 tests
   [junit4] 
   [junit4] Suite: org.apache.lucene.util.TestSPIClassIterator
   [junit4] Completed [212/422] on J1 in 0.01s, 1 test
   [junit4] 
   [junit4] Suite: org.apache.lucene.index.TestAllFilesHaveChecksumFooter
   [junit4] Completed [213/422] on J1 in 0.20s, 1 test
   [junit4] 
   [junit4] Suite: org.apache.lucene.search.TestFieldCacheRewriteMethod
   [junit4] Completed [214/422] on J1 in 3.51s, 2 tests
   [junit4] 
   [junit4] Suite: org.apache.lucene.index.TestStressDeletes
   [junit4] Completed [215/422] on J1 in 0.59s, 1 test
   [junit4] 
   [junit4] Suite: org.apache.lucene.util.TestCloseableThreadLocal
   [junit4] Completed [216/422] on J1 in 0.01s, 3 tests
   [junit4] 
   [junit4] Suite: org.apache.lucene.search.spans.TestSpanNearQuery
   [junit4] Completed [217/422] on J1 in 0.02s, 4 tests
   [junit4] 
   [junit4] Suite: org.apache.lucene.codecs.perfield.TestPerFieldPostingsFormat
   [junit4] IGNOR/A 0.00s J0 | TestPerFieldPostingsFormat.testPostingsEnumReuse
   [junit4]    > Assumption #1: The MockRandom PF randomizes content on the fly, so we can't check it
   [junit4] IGNOR/A 0.00s J0 | TestPerFieldPostingsFormat.testMergeStability
   [junit4]    > Assumption #1: The MockRandom PF randomizes content on the fly, so we can't check it
   [junit4] Completed [218/422] on J0 in 9.97s, 30 tests, 2 skipped
   [junit4] 
   [junit4] Suite: org.apache.lucene.store.TestBufferedIndexInput
   [junit4] Completed [219/422] on J0 in 0.33s, 4 tests
   [junit4] 
   [junit4] Suite: org.apache.lucene.index.TestByteSlices
   [junit4] Completed [220/422] on J2 in 6.84s, 1 test
   [junit4] 
   [junit4] Suite: org.apache.lucene.index.TestConsistentFieldNumbers
   [junit4] Completed [221/422] on J2 in 2.40s, 4 tests
   [junit4] 
   [junit4] Suite: org.apache.lucene.index.TestDirectoryReader
   [junit4] Completed [222/422] on J2 in 0.57s, 24 tests
   [junit4] 
   [junit4] Suite: org.apache.lucene.index.TestSegmentMerger
   [junit4] Completed [223/422] on J2 in 0.44s, 3 tests
   [junit4] 
   [junit4] Suite: org.apache.lucene.index.TestDemoParallelLeafReader
   [junit4] Completed [224/422] on J1 in 8.46s, 5 tests
   [junit4] 
   [junit4] Suite: org.apache.lucene.index.TestIndexCommit
   [junit4] Completed [225/422] on J1 in 0.01s, 1 test
   [junit4] 
   [junit4] Suite: org.apache.lucene.util.TestCharsRefBuilder
   [junit4] Completed [226/422] on J1 in 0.01s, 2 tests
   [junit4] 
   [junit4] Suite: org.apache.lucene.util.TestCollectionUtil
   [junit4] Completed [227/422] on J2 in 7.11s, 4 tests
   [junit4] 
   [junit4] Suite: org.apache.lucene.index.TestBagOfPositions
   [junit4] Completed [228/422] on J2 in 3.35s, 1 test
   [junit4] 
   [junit4] Suite: org.apache.lucene.util.TestFixedBitSet
   [junit4] Completed [229/422] on J1 in 7.50s, 25 tests
   [junit4] 
   [junit4] Suite: org.apache.lucene.index.TestIsCurrent
   [junit4] Completed [230/422] on J1 in 0.01s, 2 tests
   [junit4] 
   [junit4] Suite: org.apache.lucene.index.TestUniqueTermCount
   [junit4] Completed [231/422] on J1 in 0.04s, 1 test
   [junit4] 
   [junit4] Suite: org.apache.lucene.index.TestOmitNorms
   [junit4] Completed [232/422] on J2 in 0.34s, 5 tests
   [junit4] 
   [junit4] Suite: org.apache.lucene.store.TestTrackingDirectoryWrapper
   [junit4] IGNOR/A 0.00s J1 | TestTrackingDirectoryWrapper.testFsyncDoesntCreateNewFiles
   [junit4]    > Assumption #1: test only works for FSDirectory subclasses
   [junit4] Completed [233/422] on J1 in 0.75s, 47 tests, 1 skipped
   [junit4] 
   [junit4] Suite: org.apache.lucene.search.TestPositiveScoresOnlyCollector
   [junit4] Completed [234/422] on J1 in 0.01s, 1 test
   [junit4] 
   [junit4] Suite: org.apache.lucene.store.TestNRTCachingDirectory
   [junit4] IGNOR/A 0.00s J2 | TestNRTCachingDirectory.testFsyncDoesntCreateNewFiles
   [junit4]    > Assumption #1: test only works for FSDirectory subclasses
   [junit4] Completed [235/422] on J2 in 0.90s, 43 tests, 1 skipped
   [junit4] 
   [junit4] Suite: org.apache.lucene.search.TestBooleanMinShouldMatch
   [junit4] Completed [236/422] on J1 in 3.13s, 17 tests
   [junit4] 
   [junit4] Suite: org.apache.lucene.index.TestIndexWriterNRTIsCurrent
   [junit4] Completed [237/422] on J2 in 5.31s, 1 test
   [junit4] 
   [junit4] Suite: org.apache.lucene.search.TestPrefixQuery
   [junit4] Completed [238/422] on J1 in 3.84s, 3 tests
   [junit4] 
   [junit4] Suite: org.apache.lucene.search.TestBooleanQueryVisitSubscorers
   [junit4] Completed [239/422] on J1 in 0.02s, 5 tests
   [junit4] 
   [junit4] Suite: org.apache.lucene.util.TestBytesRef
   [junit4] Completed [240/422] on J1 in 0.02s, 3 tests
   [junit4] 
   [junit4] Suite: org.apache.lucene.search.spans.TestSpansAdvanced2
   [junit4] Completed [241/422] on J1 in 0.09s, 4 tests
   [junit4] 
   [junit4] Suite: org.apache.lucene.util.TestRecyclingIntBlockAllocator
   [junit4] Completed [242/422] on J1 in 0.19s, 3 tests
   [junit4] 
   [junit4] Suite: org.apache.lucene.util.TestFrequencyTrackingRingBuffer
   [junit4] Completed [243/422] on J1 in 0.28s, 2 tests
   [junit4] 
   [junit4] Suite: org.apache.lucene.search.TestMultiThreadTermVectors
   [junit4] Completed [244/422] on J2 in 1.29s, 1 test
   [junit4] 
   [junit4] Suite: org.apache.lucene.search.TestMultiTermQueryRewrites
   [junit4] Completed [245/422] on J1 in 0.03s, 3 tests
   [junit4] 
   [junit4] Suite: org.apache.lucene.index.TestSegmentTermDocs
   [junit4] Completed [246/422] on J2 in 0.27s, 4 tests
   [junit4] 
   [junit4] Suite: org.apache.lucene.index.TestIntBlockPool
   [junit4] Completed [247/422] on J1 in 0.49s, 2 tests
   [junit4] 
   [junit4] Suite: org.apache.lucene.search.TestSort
   [junit4] Completed [248/422] on J2 in 0.07s, 25 tests
   [junit4] 
   [junit4] Suite: org.apache.lucene.index.TestMultiDocValues
   [junit4] Completed [249/422] on J2 in 0.21s, 8 tests
   [junit4] 
   [junit4] Suite: org.apache.lucene.analysis.TestToken
   [junit4] Completed [250/422] on J2 in 0.05s, 5 tests
   [junit4] 
   [junit4] Suite: org.apache.lucene.index.TestFieldsReader
   [junit4] Completed [251/422] on J2 in 0.57s, 2 tests
   [junit4] 
   [junit4] Suite: org.apache.lucene.search.TestCustomSearcherSort
   [junit4] Completed [252/422] on J2 in 2.13s, 2 tests
   [junit4] 
   [junit4] Suite: org.apache.lucene.index.TestDocValuesIndexing
   [junit4] Completed [253/422] on J2 in 0.11s, 34 tests
   [junit4] 
   [junit4] Suite: org.apache.lucene.util.TestWeakIdentityMap
   [junit4] Completed [254/422] on J1 in 4.79s, 2 tests
   [junit4] 
   [junit4] Suite: org.apache.lucene.analysis.tokenattributes.TestBytesRefAttImpl
   [junit4] Completed [255/422] on J1 in 0.01s, 1 test
   [junit4] 
   [junit4] Suite: org.apache.lucene.search.TestDateSort
   [junit4] Completed [256/422] on J1 in 0.02s, 1 test
   [junit4] 
   [junit4] Suite: org.apache.lucene.search.similarities.TestSimilarityBase
   [junit4] Completed [257/422] on J2 in 0.98s, 32 tests
   [junit4] 
   [junit4] Suite: org.apache.lucene.util.TestNumericUtils
   [junit4] Completed [258/422] on J2 in 3.30s, 12 tests
   [junit4] 
   [junit4] Suite: org.apache.lucene.util.automaton.TestDeterminizeLexicon
   [junit4] Completed [259/422] on J2 in 1.89s, 1 test
   [junit4] 
   [junit4] Suite: org.apache.lucene.index.TestIndexWriterOnDiskFull
   [junit4] Completed [260/422] on J2 in 0.41s, 4 tests
   [junit4] 
   [junit4] Suite: org.apache.lucene.util.TestSparseFixedBitSet
   [junit4] Completed [261/422] on J1 in 6.60s, 17 tests
   [junit4] 
   [junit4] Suite: org.apache.lucene.index.TestMergeRateLimiter
   [junit4] Completed [262/422] on J1 in 0.01s, 1 test
   [junit4] 
   [junit4] Suite: org.apache.lucene.search.TestDocValuesScoring
   [junit4] Completed [263/422] on J1 in 0.04s, 1 test
   [junit4] 
   [junit4] Suite: org.apache.lucene.search.TestTermScorer
   [junit4] Completed [264/422] on J1 in 0.02s, 4 tests
   [junit4] 
   [junit4] Suite: org.apache.lucene.index.TestTransactionRollback
   [junit4] Completed [265/422] on J1 in 0.14s, 2 tests
   [junit4] 
   [junit4] Suite: org.apache.lucene.index.TestCustomNorms
   [junit4] Completed [266/422] on J2 in 1.26s, 1 test
   [junit4] 
   [junit4] Suite: org.apache.lucene.search.spans.TestSpanExplanations
   [junit4] Completed [267/422] on J2 in 0.33s, 30 tests
   [junit4] 
   [junit4] Suite: org.apache.lucene.store.TestRAMDirectory
   [junit4] IGNOR/A 0.00s J2 | TestRAMDirectory.testFsyncDoesntCreateNewFiles
   [junit4]    > Assumption #1: test only works for FSDirectory subclasses
   [junit4] Completed [268/422] on J2 in 0.56s, 46 tests, 1 skipped
   [junit4] 
   [junit4] Suite: org.apache.lucene.search.TestMultiPhraseQuery
   [junit4] Completed [269/422] on J2 in 0.07s, 17 tests, 1 skipped
   [junit4] 
   [junit4] Suite: org.apache.lucene.index.TestLazyProxSkipping
   [junit4] Completed [270/422] on J2 in 0.14s, 2 tests
   [junit4] 
   [junit4] Suite: org.apache.lucene.index.TestDocsAndPositions
   [junit4] Completed [271/422] on J2 in 0.29s, 6 tests
   [junit4] 
   [junit4] Suite: org.apache.lucene.util.automaton.TestUTF32ToUTF8
   [junit4] Completed [272/422] on J1 in 4.93s, 6 tests
   [junit4] 
   [junit4] Suite: org.apache.lucene.index.TestCodecs
   [junit4] Completed [273/422] on J1 in 0.16s, 3 tests
   [junit4] 
   [junit4] Suite: org.apache.lucene.index.TestOmitPositions
   [junit4] Completed [274/422] on J1 in 0.12s, 4 tests
   [junit4] 
   [junit4] Suite: org.apache.lucene.index.TestBagOfPostings
   [junit4] Completed [275/422] on J2 in 2.41s, 1 test
   [junit4] 
   [junit4] Suite: org.apache.lucene.index.TestIndexInput
   [junit4] Completed [276/422] on J2 in 0.88s, 2 tests
   [junit4] 
   [junit4] Suite: org.apache.lucene.util.TestBytesRefHash
   [junit4] Completed [277/422] on J1 in 1.13s, 8 tests
   [junit4] 
   [junit4] Suite: org.apache.lucene.search.TestFilteredQuery
   [junit4] Completed [278/422] on J2 in 0.37s, 11 tests
   [junit4] 
   [junit4] Suite: org.apache.lucene.search.TestDisjunctionMaxQuery
   [junit4] Completed [279/422] on J2 in 0.19s, 12 tests
   [junit4] 
   [junit4] Suite: org.apache.lucene.index.TestForceMergeForever
   [junit4] Completed [280/422] on J2 in 0.50s, 1 test
   [junit4] 
   [junit4] Suite: org.apache.lucene.search.TestSameScoresWithThreads
   [junit4] Completed [281/422] on J2 in 0.87s, 1 test
   [junit4] 
   [junit4] Suite: org.apache.lucene.search.TestTermRangeQuery
   [junit4] Completed [282/422] on J2 in 0.06s, 7 tests
   [junit4] 
   [junit4] Suite: org.apache.lucene.index.TestDocumentWriter
   [junit4] Completed [283/422] on J2 in 0.16s, 6 tests
   [junit4] 
   [junit4] Suite: org.apache.lucene.search.TestSloppyPhraseQuery2
   [junit4] Completed [284/422] on J1 in 2.75s, 9 tests
   [junit4] 
   [junit4] Suite: org.apache.lucene.search.TestFuzzyQuery
   [junit4] Completed [285/422] on J1 in 0.12s, 10 tests
   [junit4] 
   [junit4] Suite: org.apache.lucene.index.TestDoc
   [junit4] Completed [286/422] on J1 in 0.11s, 1 test
   [junit4] 
   [junit4] Suite: org.apache.lucene.search.TestTermRangeFilter
   [junit4] Completed [287/422] on J1 in 0.76s, 3 tests
   [junit4] 
   [junit4] Suite: org.apache.lucene.search.spans.TestFieldMaskingSpanQuery
   [junit4] Completed [288/422] on J1 in 0.15s, 11 tests
   [junit4] 
   [junit4] Suite: org.apache.lucene.search.spans.TestSpanSearchEquivalence
   [junit4] Completed [289/422] on J2 in 2.53s, 33 tests
   [junit4] 
   [junit4] Suite: org.apache.lucene.search.TestMultiValuedNumericRangeQuery
   [junit4] Completed [290/422] on J1 in 0.96s, 1 test
   [junit4] 
   [junit4] Suite: org.apache.lucene.index.TestSegmentTermEnum
   [junit4] Completed [291/422] on J2 in 0.01s, 2 tests
   [junit4] 
   [junit4] Suite: org.apache.lucene.search.TestBooleanQuery
   [junit4] Completed [292/422] on J1 in 0.26s, 25 tests
   [junit4] 
   [junit4] Suite: org.apache.lucene.util.TestUnicodeUtil
   [junit4] Completed [293/422] on J2 in 0.54s, 5 tests
   [junit4] 
   [junit4] Suite: org.apache.lucene.document.TestDocument
   [junit4] Completed [294/422] on J2 in 0.03s, 11 tests
   [junit4] 
   [junit4] Suite: org.apache.lucene.index.TestMaxTermFrequency
   [junit4] Completed [295/422] on J2 in 0.12s, 1 test
   [junit4] 
   [junit4] Suite: org.apache.lucene.search.TestTopFieldCollector
   [junit4] Completed [296/422] on J2 in 0.07s, 7 tests
   [junit4] 
   [junit4] Suite: org.apache.lucene.search.TestAutomatonQuery
   [junit4] Completed [297/422] on J1 in 1.03s, 8 tests
   [junit4] 
   [junit4] Suite: org.apache.lucene.store.TestFileSwitchDirectory
   [junit4] IGNOR/A 0.00s J2 | TestFileSwitchDirectory.testFsyncDoesntCreateNewFiles
   [junit4]    > Assumption #1: test only works for FSDirectory subclasses
   [junit4] Completed [298/422] on J2 in 0.52s, 43 tests, 1 skipped
   [junit4] 
   [junit4] Suite: org.apache.lucene.util.TestSentinelIntSet
   [junit4] Completed [299/422] on J2 in 0.10s, 2 tests
   [junit4] 
   [junit4] Suite: org.apache.lucene.search.TestWildcardRandom
   [junit4] Completed [300/422] on J2 in 0.11s, 1 test
   [junit4] 
   [junit4] Suite: org.apache.lucene.index.TestIndexableField
   [junit4] Completed [301/422] on J1 in 1.02s, 2 tests
   [junit4] 
   [junit4] Suite: org.apache.lucene.store.TestDirectory
   [junit4] Completed [302/422] on J1 in 1.02s, 3 tests
   [junit4] 
   [junit4] Suite: org.apache.lucene.search.TestCachingWrapperFilter
   [junit4] Completed [303/422] on J1 in 0.26s, 11 tests
   [junit4] 
   [junit4] Suite: org.apache.lucene.search.TestFieldValueFilter
   [junit4] Completed [304/422] on J1 in 0.04s, 3 tests
   [junit4] 
   [junit4] Suite: org.apache.lucene.search.spans.TestSpanMultiTermQueryWrapper
   [junit4] Completed [305/422] on J1 in 0.05s, 9 tests
   [junit4] 
   [junit4] Suite: org.apache.lucene.search.TestPrefixRandom
   [junit4] Completed [306/422] on J2 in 2.38s, 1 test
   [junit4] 
   [junit4] Suite: org.apache.lucene.search.TestMatchAllDocsQuery
   [junit4] Completed [307/422] on J1 in 0.02s, 2 tests
   [junit4] 
   [junit4] Suite: org.apache.lucene.index.TestParallelTermEnum
   [junit4] Completed [308/422] on J2 in 0.01s, 1 test
   [junit4] 
   [junit4] Suite: org.apache.lucene.search.TestElevationComparator
   [junit4] Completed [309/422] on J1 in 0.02s, 1 test
   [junit4] 
   [junit4] Suite: org.apache.lucene.index.TestBinaryTerms
   [junit4] Completed [310/422] on J2 in 0.06s, 2 tests
   [junit4] 
   [junit4] Suite: org.apache.lucene.search.TestSubScorerFreqs
   [junit4] Completed [311/422] on J1 in 0.02s, 3 tests
   [junit4] 
   [junit4] Suite: org.apache.lucene.search.TestPositionIncrement
   [junit4] Completed [312/422] on J2 in 0.01s, 2 tests
   [junit4] 
   [junit4] Suite: org.apache.lucene.util.TestVirtualMethod
   [junit4] Completed [313/422] on J1 in 0.01s, 2 tests
   [junit4] 
   [junit4] Suite: org.apache.lucene.util.TestSmallFloat
   [junit4] Completed [314/422] on J1 in 0.10s, 2 tests
   [junit4] 
   [junit4] Suite: org.apache.lucene.util.TestRollingBuffer
   [junit4] Completed [315/422] on J2 in 0.36s, 1 test
   [junit4] 
   [junit4] Suite: org.apache.lucene.analysis.TestNumericTokenStream
   [junit4] Completed [316/422] on J1 in 0.01s, 5 tests
   [junit4] 
   [junit4] Suite: org.apache.lucene.util.TestSetOnce
   [junit4] Completed [317/422] on J2 in 0.02s, 4 tests
   [junit4] 
   [junit4] Suite: org.apache.lucene.search.spans.TestSpansAdvanced
   [junit4] Completed [318/422] on J1 in 0.02s, 1 test
   [junit4] 
   [junit4] Suite: org.apache.lucene.util.TestCharsRef
   [junit4] Completed [319/422] on J2 in 0.02s, 5 tests
   [junit4] 
   [junit4] Suite: org.apache.lucene.index.Test2BPostings
   [junit4] IGNOR/A 0.00s J2 | Test2BPostings.test
   [junit4]    > Assumption #1: 'nightly' test group is disabled (@Nightly())
   [junit4] Completed [320/422] on J2 in 0.00s, 1 test, 1 skipped
   [junit4] 
   [junit4] Suite: org.apache.lucene.util.TestPriorityQueue
   [junit4] Completed [321/422] on J1 in 0.34s, 7 tests
   [junit4] 
   [junit4] Suite: org.apache.lucene.index.TestSameTokenSamePosition
   [junit4] Completed [322/422] on J2 in 0.01s, 2 tests
   [junit4] 
   [junit4] Suite: org.apache.lucene.index.TestDocCount
   [junit4] Completed [323/422] on J1 in 0.05s, 1 test
   [junit4] 
   [junit4] Suite: org.apache.lucene.search.TestCachingCollector
   [junit4] Completed [324/422] on J2 in 0.02s, 4 tests
   [junit4] 
   [junit4] Suite: org.apache.lucene.util.TestAttributeSource
   [junit4] Completed [325/422] on J1 in 0.01s, 8 tests
   [junit4] 
   [junit4] Suite: org.apache.lucene.search.TestTotalHitCountCollector
   [junit4] Completed [326/422] on J2 in 0.01s, 1 test
   [junit4] 
   [junit4] Suite: org.apache.lucene.util.TestRecyclingByteBlockAllocator
   [junit4] Completed [327/422] on J1 in 0.03s, 3 tests
   [junit4] 
   [junit4] Suite: org.apache.lucene.util.TestRamUsageEstimator
   [junit4] IGNOR/A 0.00s J1 | TestRamUsageEstimator.testHotspotBean
   [junit4]    > Assumption #1: testHotspotBean only works on 64bit JVMs.
   [junit4] IGNOR/A 0.00s J1 | TestRamUsageEstimator.testPrintValues
   [junit4]    > Assumption #1: Specify -Dtests.verbose=true to print constants of RamUsageEstimator.
   [junit4] Completed [328/422] on J1 in 0.01s, 5 tests, 2 skipped
   [junit4] 
   [junit4] Suite: org.apache.lucene.search.spans.TestSpanFirstQuery
   [junit4] Completed [329/422] on J1 in 0.01s, 1 test
   [junit4] 
   [junit4] Suite: org.apache.lucene.index.TestIndexWriterLockRelease
   [junit4] Completed [330/422] on J1 in 0.01s, 1 test
   [junit4] 
   [junit4] Suite: org.apache.lucene.search.TestPhrasePrefixQuery
   [junit4] Completed [331/422] on J1 in 0.01s, 1 test
   [junit4] 
   [junit4] Suite: org.apache.lucene.analysis.TestCharFilter
   [junit4] Completed [332/422] on J1 in 0.01s, 4 tests
   [junit4] 
   [junit4] Suite: org.apache.lucene.index.TestTwoPhaseCommitTool
   [junit4] Completed [333/422] on J1 in 0.01s, 3 tests
   [junit4] 
   [junit4] Suite: org.apache.lucene.search.TestNot
   [junit4] Completed [334/422] on J1 in 0.01s, 1 test
   [junit4] 
   [junit4] Suite: org.apache.lucene.search.TestPrefixFilter
   [junit4] Completed [335/422] on J1 in 0.01s, 1 test
   [junit4] 
   [junit4] Suite: org.apache.lucene.util.TestVersion
   [junit4] Completed [336/422] on J1 in 0.02s, 11 tests
   [junit4] 
   [junit4] Suite: org.apache.lucene.search.TestBooleanScorer
   [junit4] Completed [337/422] on J2 in 2.36s, 5 tests
   [junit4] 
   [junit4] Suite: org.apache.lucene.index.Test4GBStoredFields
   [junit4] IGNOR/A 0.00s J1 | Test4GBStoredFields.test
   [junit4]    > Assumption #1: 'nightly' test group is disabled (@Nightly())
   [junit4] Completed [338/422] on J1 in 0.00s, 1 test, 1 skipped
   [junit4] 
   [junit4] Suite: org.apache.lucene.index.TestCodecHoldsOpenFiles
   [junit4] Completed [339/422] on J2 in 0.02s, 1 test
   [junit4] 
   [junit4] Suite: org.apache.lucene.search.MultiCollectorTest
   [junit4] Completed [340/422] on J1 in 0.01s, 4 tests
   [junit4] 
   [junit4] Suite: org.apache.lucene.search.TestDocBoost
   [junit4] Completed [341/422] on J2 in 0.01s, 1 test
   [junit4] 
   [junit4] Suite: org.apache.lucene.index.Test2BPositions
   [junit4] IGNOR/A 0.00s J1 | Test2BPositions.test
   [junit4]    > Assumption #1: 'monster' test group is disabled (@Monster(value=uses lots of space and takes a few minutes))
   [junit4] Completed [342/422] on J1 in 0.00s, 1 test, 1 skipped
   [junit4] 
   [junit4] Suite: org.apache.lucene.index.Test2BPostingsBytes
   [junit4] IGNOR/A 0.00s J2 | Test2BPostingsBytes.test
   [junit4]    > Assumption #1: 'monster' test group is disabled (@Monster(value=takes ~20GB-30GB of space and 10 minutes))
   [junit4] Completed [343/422] on J2 in 0.00s, 1 test, 1 skipped
   [junit4] 
   [junit4] Suite: org.apache.lucene.index.Test2BTerms
   [junit4] IGNOR/A 0.00s J1 | Test2BTerms.test2BTerms
   [junit4]    > Assumption #1: 'monster' test group is disabled (@Monster(value=very slow, use 5g minimum heap))
   [junit4] Completed [344/422] on J1 in 0.00s, 1 test, 1 skipped
   [junit4] 
   [junit4] Suite: org.apache.lucene.index.TestNewestSegment
   [junit4] Completed [345/422] on J2 in 0.01s, 1 test
   [junit4] 
   [junit4] Suite: org.apache.lucene.store.TestByteArrayDataInput
   [junit4] Completed [346/422] on J1 in 0.01s, 1 test
   [junit4] 
   [junit4] Suite: org.apache.lucene.index.Test2BNumericDocValues
   [junit4] IGNOR/A 0.00s J2 | Test2BNumericDocValues.testNumerics
   [junit4]    > Assumption #1: 'monster' test group is disabled (@Monster(value=takes ~ 2 hours if the heap is 5gb))
   [junit4] Completed [347/422] on J2 in 0.00s, 1 test, 1 skipped
   [junit4] 
   [junit4] Suite: org.apache.lucene.analysis.tokenattributes.TestPackedTokenAttributeImpl
   [junit4] Completed [348/422] on J1 in 0.01s, 4 tests
   [junit4] 
   [junit4] Suite: org.apache.lucene.codecs.lucene50.TestBlockPostingsFormat3
   [junit4] Completed [349/422] on J1 in 1.01s, 1 test
   [junit4] 
   [junit4] Suite: org.apache.lucene.codecs.lucene50.TestLucene50CompoundFormat
   [junit4] Completed [350/422] on J1 in 5.31s, 24 tests
   [junit4] 
   [junit4] Suite: org.apache.lucene.codecs.lucene50.TestLucene50FieldInfoFormat
   [junit4] Completed [351/422] on J1 in 0.21s, 11 tests
   [junit4] 
   [junit4] Suite: org.apache.lucene.index.TestTermsEnum
   [junit4] Completed [352/422] on J0 in 68.54s, 11 tests
   [junit4] 
   [junit4] Suite: org.apache.lucene.codecs.lucene50.TestLucene50StoredFieldsFormatHighCompression
   [junit4] IGNOR/A 0.00s J1 | TestLucene50StoredFieldsFormatHighCompression.testBigDocuments
   [junit4]    > Assumption #1: 'nightly' test group is disabled (@Nightly())
   [junit4] Completed [353/422] on J1 in 7.09s, 19 tests, 1 skipped
   [junit4] 
   [junit4] Suite: org.apache.lucene.codecs.lucene53.TestLucene53NormsFormat
   [junit4] IGNOR/A 0.00s J0 | TestLucene53NormsFormat.testNCommonBig
   [junit4]    > Assumption #1: 'nightly' test group is disabled (@Nightly())
   [junit4] IGNOR/A 0.00s J0 | TestLucene53NormsFormat.testMergeStability
   [junit4]    > Assumption #1: The MockRandom PF randomizes content on the fly, so we can't check it
   [junit4] Completed [354/422] on J0 in 8.92s, 17 tests, 2 skipped
   [junit4] 
   [junit4] Suite: org.apache.lucene.document.TestFieldType
   [junit4] Completed [355/422] on J0 in 0.01s, 2 tests
   [junit4] 
   [junit4] Suite: org.apache.lucene.index.Test2BSortedDocValuesOrds
   [junit4] IGNOR/A 0.00s J0 | Test2BSortedDocValuesOrds.test2BOrds
   [junit4]    > Assumption #1: 'monster' test group is disabled (@Monster(value=Takes ~ 6 hours if the heap is 5gb))
   [junit4] Completed [356/422] on J0 in 0.00s, 1 test, 1 skipped
   [junit4] 
   [junit4] Suite: org.apache.lucene.index.TestAllFilesCheckIndexHeader
   [junit4] Completed [357/422] on J0 in 0.27s, 1 test
   [junit4] 
   [junit4] Suite: org.apache.lucene.index.TestAllFilesDetectTruncation
   [junit4] Completed [358/422] on J0 in 0.29s, 1 test
   [junit4] 
   [junit4] Suite: org.apache.lucene.index.TestBinaryDocValuesUpdates
   [junit4] IGNOR/A 0.00s J0 | TestBinaryDocValuesUpdates.testTonsOfUpdates
   [junit4]    > Assumption #1: 'nightly' test group is disabled (@Nightly())
   [junit4] Completed [359/422] on J0 in 10.16s, 28 tests, 1 skipped
   [junit4] 
   [junit4] Suite: org.apache.lucene.index.TestDocInverterPerFieldErrorInfo
   [junit4] Completed [360/422] on J0 in 0.01s, 2 tests
   [junit4] 
   [junit4] Suite: org.apache.lucene.index.TestDocValues
   [junit4] Completed [361/422] on J0 in 0.02s, 7 tests
   [junit4] 
   [junit4] Suite: org.apache.lucene.index.TestExceedMaxTermLength
   [junit4] Completed [362/422] on J0 in 0.01s, 1 test
   [junit4] 
   [junit4] Suite: org.apache.lucene.index.TestFieldReuse
   [junit4] Completed [363/422] on J0 in 0.01s, 3 tests
   [junit4] 
   [junit4] Suite: org.apache.lucene.index.TestFilterDirectoryReader
   [junit4] Completed [364/422] on J0 in 0.01s, 1 test
   [junit4] 
   [junit4] Suite: org.apache.lucene.index.TestIndexWriterDeleteByQuery
   [junit4] Completed [365/422] on J0 in 0.01s, 1 test
   [junit4] 
   [junit4] Suite: org.apache.lucene.index.TestIndexWriterFromReader
   [junit4] Completed [366/422] on J0 in 0.22s, 12 tests
   [junit4] 
   [junit4] Suite: org.apache.lucene.index.TestIndexWriterOnVMError
   [junit4] IGNOR/A 0.00s J0 | TestIndexWriterOnVMError.testCheckpoint
   [junit4]    > Assumption #1: 'nightly' test group is disabled (@Nightly())
   [junit4] Completed [367/422] on J0 in 0.38s, 3 tests, 1 skipped
   [junit4] 
   [junit4] Suite: org.apache.lucene.index.TestIndexWriterOutOfFileDescriptors
   [junit4] Completed [368/422] on J0 in 3.69s, 1 test
   [junit4] 
   [junit4] Suite: org.apache.lucene.index.TestIndexWriterThreadsToSegments
   [junit4] Completed [369/422] on J0 in 1.72s, 4 tests
   [junit4] 
   [junit4] Suite: org.apache.lucene.index.TestInfoStream
   [junit4] Completed [370/422] on J0 in 0.01s, 2 tests
   [junit4] 
   [junit4] Suite: org.apache.lucene.index.TestLogMergePolicy
   [junit4] Completed [371/422] on J0 in 0.03s, 2 tests
   [junit4] 
   [junit4] Suite: org.apache.lucene.index.TestMaxPosition
   [junit4] Completed [372/422] on J0 in 0.01s, 2 tests
   [junit4] 
   [junit4] Suite: org.apache.lucene.index.TestMergePolicyWrapper
   [junit4] Completed [373/422] on J0 in 0.01s, 1 test
   [junit4] 
   [junit4] Suite: org.apache.lucene.index.TestMixedDocValuesUpdates
   [junit4] IGNOR/A 0.00s J0 | TestMixedDocValuesUpdates.testTonsOfUpdates
   [junit4]    > Assumption #1: 'nightly' test group is disabled (@Nightly())
   [junit4] Completed [374/422] on J0 in 2.19s, 4 tests, 1 skipped
   [junit4] 
   [junit4] Suite: org.apache.lucene.index.TestMultiTermsEnum
   [junit4] Completed [375/422] on J0 in 0.01s, 1 test
   [junit4] 
   [junit4] Suite: org.apache.lucene.index.TestNRTReaderCleanup
   [junit4] Completed [376/422] on J0 in 0.01s, 1 test
   [junit4] 
   [junit4] Suite: org.apache.lucene.index.TestOrdinalMap
   [junit4] Completed [377/422] on J0 in 0.07s, 1 test
   [junit4] 
   [junit4] Suite: org.apache.lucene.index.TestReadOnlyIndex
   [junit4] Completed [378/422] on J0 in 0.22s, 1 test
   [junit4] 
   [junit4] Suite: org.apache.lucene.index.TestReaderWrapperDVTypeCheck
   [junit4] Completed [379/422] on J0 in 0.01s, 1 test
   [junit4] 
   [junit4] Suite: org.apache.lucene.index.TestTermVectors
   [junit4] Completed [380/422] on J0 in 0.23s, 3 tests
   [junit4] 
   [junit4] Suite: org.apache.lucene.index.TestTerms
   [junit4] Completed [381/422] on J0 in 0.33s, 8 tests
   [junit4] 
   [junit4] Suite: org.apache.lucene.index.TestTryDelete
   [junit4] Completed [382/422] on J0 in 0.01s, 3 tests
   [junit4] 
   [junit4] Suite: org.apache.lucene.index.TestUpgradeIndexMergePolicy
   [junit4] Completed [383/422] on J0 in 0.02s, 1 test
   [junit4] 
   [junit4] Suite: org.apache.lucene.search.FuzzyTermOnShortTermsTest
   [junit4] Completed [384/422] on J0 in 0.04s, 1 test
   [junit4] 
   [junit4] Suite: org.apache.lucene.search.TestApproximationSearchEquivalence
   [junit4] Completed [385/422] on J0 in 0.78s, 10 tests
   [junit4] 
   [junit4] Suite: org.apache.lucene.search.TestBooleanCoord
   [junit4] Completed [386/422] on J0 in 0.09s, 76 tests
   [junit4] 
   [junit4] Suite: org.apache.lucene.search.TestBooleanRewrites
   [junit4] Completed [387/422] on J0 in 0.34s, 7 tests
   [junit4] 
   [junit4] Suite: org.apache.lucene.search.TestCachingWrapperQuery
   [junit4] Completed [388/422] on J0 in 0.14s, 7 tests
   [junit4] 
   [junit4] Suite: org.apache.lucene.search.TestConjunctionDISI
   [junit4] Completed [389/422] on J0 in 9.21s, 5 tests
   [junit4] 
   [junit4] Suite: org.apache.lucene.search.TestDocValuesRewriteMethod
   [junit4] Completed [390/422] on J0 in 2.47s, 2 tests
   [junit4] 
   [junit4] Suite: org.apache.lucene.search.TestEarlyTermination
   [junit4] Completed [391/422] on J0 in 0.04s, 1 test
   [junit4] 
   [junit4] Suite: org.apache.lucene.search.TestFieldValueQuery
   [junit4] Completed [392/422] on J0 in 1.65s, 6 tests
   [junit4] 
   [junit4] Suite: org.apache.lucene.search.TestIndexSearcher
   [junit4] Completed [393/422] on J0 in 0.09s, 5 tests
   [junit4] 
   [junit4] Suite: org.apache.lucene.search.TestLRUFilterCache
   [junit4] Completed [394/422] on J0 in 1.80s, 10 tests
   [junit4] 
   [junit4] Suite: org.apache.lucene.search.TestLRUQueryCache
   [junit4] Completed [395/422] on J0 in 3.22s, 17 tests
   [junit4] 
   [junit4] Suite: org.apache.lucene.search.TestMatchNoDocsQuery
   [junit4] Completed [396/422] on J0 in 0.02s, 2 tests
   [junit4] 
   [junit4] Suite: org.apache.lucene.search.TestMultiset
   [junit4] Completed [397/422] on J0 in 0.01s, 2 tests
   [junit4] 
   [junit4] Suite: org.apache.lucene.search.TestNeedsScores
   [junit4] Completed [398/422] on J0 in 0.02s, 5 tests
   [junit4] 
   [junit4] Suite: org.apache.lucene.search.TestQueryCachingPolicy
   [junit4] Completed [399/422] on J0 in 0.02s, 1 test
   [junit4] 
   [junit4] HEARTBEAT J2 PID(24632@localhost): 2016-02-08T20:35:46, stalled for 60.8s at: TestGrowableByteArrayDataOutput.testWriteLargeStrings
   [junit4] Suite: org.apache.lucene.search.TestQueryRescorer
   [junit4] Completed [400/422] on J0 in 1.54s, 6 tests
   [junit4] 
   [junit4] Suite: org.apache.lucene.search.spans.TestFilterSpans
   [junit4] Completed [401/422] on J0 in 0.01s, 1 test
   [junit4] 
   [junit4] Suite: org.apache.lucene.search.spans.TestSpanBoostQuery
   [junit4] Completed [402/422] on J0 in 0.01s, 2 tests
   [junit4] 
   [junit4] Suite: org.apache.lucene.search.spans.TestSpanCollection
   [junit4] Completed [403/422] on J0 in 0.01s, 3 tests
   [junit4] 
   [junit4] Suite: org.apache.lucene.search.spans.TestSpanContainQuery
   [junit4] Completed [404/422] on J0 in 0.02s, 4 tests
   [junit4] 
   [junit4] Suite: org.apache.lucene.search.spans.TestSpanOrQuery
   [junit4] Completed [405/422] on J0 in 0.01s, 3 tests
   [junit4] 
   [junit4] Suite: org.apache.lucene.store.TestMmapDirectory
   [junit4] Completed [406/422] on J0 in 0.87s, 42 tests
   [junit4] 
   [junit4] Suite: org.apache.lucene.store.TestNativeFSLockFactory
   [junit4] IGNOR/A 0.00s J0 | TestNativeFSLockFactory.testDeleteLockFile
   [junit4]    > Assumption #1: test requires the ability to delete a locked file(throwable: java.io.IOException: cannot delete file: test.lock, a virus scanner has it open)
   [junit4] Completed [407/422] on J0 in 7.07s, 10 tests, 1 skipped
   [junit4] 
   [junit4] Suite: org.apache.lucene.store.TestRateLimiter
   [junit4] Completed [408/422] on J0 in 0.31s, 2 tests
   [junit4] 
   [junit4] Suite: org.apache.lucene.store.TestSimpleFSLockFactory
   [junit4] IGNOR/A 0.00s J0 | TestSimpleFSLockFactory.testDeleteLockFile
   [junit4]    > Assumption #1: test requires the ability to delete a locked file(throwable: java.io.IOException: cannot delete file: test.lock, a virus scanner has it open)
   [junit4] Completed [409/422] on J0 in 4.72s, 7 tests, 1 skipped
   [junit4] 
   [junit4] Suite: org.apache.lucene.util.TestBitDocIdSetBuilder
   [junit4] Completed [410/422] on J0 in 0.09s, 6 tests
   [junit4] 
   [junit4] Suite: org.apache.lucene.util.TestInPlaceMergeSorter
   [junit4] Completed [411/422] on J0 in 0.07s, 9 tests
   [junit4] 
   [junit4] Suite: org.apache.lucene.util.TestIntroSorter
   [junit4] Completed [412/422] on J0 in 0.06s, 9 tests
   [junit4] 
   [junit4] Suite: org.apache.lucene.util.TestLSBRadixSorter
   [junit4] Completed [413/422] on J0 in 0.07s, 6 tests
   [junit4] 
   [junit4] Suite: org.apache.lucene.util.TestMergedIterator
   [junit4] Completed [414/422] on J0 in 0.24s, 25 tests
   [junit4] 
   [junit4] Suite: org.apache.lucene.util.TestNotDocIdSet
   [junit4] Completed [415/422] on J0 in 1.82s, 6 tests
   [junit4] 
   [junit4] Suite: org.apache.lucene.codecs.compressing.TestGrowableByteArrayDataOutput
   [junit4] C

[...truncated too long message...]

 test
   [junit4] 
   [junit4] Suite: org.apache.solr.search.SortSpecParsingTest
   [junit4] Completed [522/566 (1!)] on J2 in 0.54s, 2 tests
   [junit4] 
   [junit4] Suite: org.apache.solr.search.TestCollapseQParserPlugin
   [junit4] Completed [524/566 (1!)] on J2 in 1.90s, 9 tests
   [junit4] 
   [junit4] Suite: org.apache.solr.search.TestCustomSort
   [junit4] Completed [525/566 (1!)] on J2 in 0.25s, 1 test
   [junit4] 
   [junit4] Suite: org.apache.solr.search.TestFieldSortValues
   [junit4] Completed [526/566 (1!)] on J2 in 0.10s, 1 test
   [junit4] 
   [junit4] Suite: org.apache.solr.search.TestHashQParserPlugin
   [junit4] Completed [527/566 (1!)] on J2 in 0.36s, 1 test
   [junit4] 
   [junit4] Suite: org.apache.solr.search.TestMaxScoreQueryParser
   [junit4] Completed [528/566 (1!)] on J2 in 0.43s, 6 tests
   [junit4] 
   [junit4] Suite: org.apache.solr.schema.TestCloudSchemaless
   [junit4] Completed [529/566 (1!)] on J1 in 52.85s, 1 test
   [junit4] 
   [junit4] Suite: org.apache.solr.search.TestSimpleQParserPlugin
   [junit4] Completed [530/566 (1!)] on J1 in 0.28s, 17 tests
   [junit4] 
   [junit4] Suite: org.apache.solr.search.TestStandardQParsers
   [junit4] Completed [531/566 (1!)] on J1 in 0.02s, 1 test
   [junit4] 
   [junit4] Suite: org.apache.solr.search.TestTrieFacet
   [junit4] Completed [532/566 (1!)] on J1 in 0.56s, 12 tests
   [junit4] 
   [junit4] Suite: org.apache.solr.search.TestXmlQParser
   [junit4] Completed [533/566 (1!)] on J1 in 0.74s, 16 tests
   [junit4] 
   [junit4] Suite: org.apache.solr.search.function.TestMinMaxOnMultiValuedField
   [junit4] IGNOR/A 0.00s J1 | TestMinMaxOnMultiValuedField.testFloatFieldCache
   [junit4]    > Assumption #1: 'awaitsfix' test group is disabled (@AwaitsFix(bugUrl=https://issues.apache.org/jira/browse/LUCENE-6709))
   [junit4] IGNOR/A 0.00s J1 | TestMinMaxOnMultiValuedField.testIntFieldCache
   [junit4]    > Assumption #1: 'awaitsfix' test group is disabled (@AwaitsFix(bugUrl=https://issues.apache.org/jira/browse/LUCENE-6709))
   [junit4] IGNOR/A 0.00s J1 | TestMinMaxOnMultiValuedField.testLongFieldCache
   [junit4]    > Assumption #1: 'awaitsfix' test group is disabled (@AwaitsFix(bugUrl=https://issues.apache.org/jira/browse/LUCENE-6709))
   [junit4] IGNOR/A 0.00s J1 | TestMinMaxOnMultiValuedField.testDoubleFieldCache
   [junit4]    > Assumption #1: 'awaitsfix' test group is disabled (@AwaitsFix(bugUrl=https://issues.apache.org/jira/browse/LUCENE-6709))
   [junit4] Completed [534/566 (1!)] on J1 in 0.91s, 11 tests, 4 skipped
   [junit4] 
   [junit4] Suite: org.apache.solr.search.function.TestSortByMinMaxFunction
   [junit4] Completed [535/566 (1!)] on J1 in 0.69s, 3 tests
   [junit4] 
   [junit4] Suite: org.apache.solr.search.join.BlockJoinFacetDistribTest
   [junit4] Completed [536/566 (1!)] on J1 in 3.71s, 1 test
   [junit4] 
   [junit4] Suite: org.apache.solr.search.join.BlockJoinFacetRandomTest
   [junit4] Completed [537/566 (1!)] on J1 in 0.28s, 7 tests
   [junit4] 
   [junit4] Suite: org.apache.solr.search.join.BlockJoinFacetSimpleTest
   [junit4] Completed [538/566 (1!)] on J1 in 0.12s, 1 test
   [junit4] 
   [junit4] Suite: org.apache.solr.search.join.TestScoreJoinQPScore
   [junit4] Completed [539/566 (1!)] on J1 in 0.67s, 5 tests, 1 skipped
   [junit4] 
   [junit4] Suite: org.apache.solr.search.json.TestJsonRequest
   [junit4] Completed [540/566 (1!)] on J1 in 2.37s, 2 tests
   [junit4] 
   [junit4] Suite: org.apache.solr.search.similarities.TestDFISimilarityFactory
   [junit4] Completed [541/566 (1!)] on J1 in 0.15s, 2 tests
   [junit4] 
   [junit4] Suite: org.apache.solr.search.similarities.TestNonDefinedSimilarityFactory
   [junit4] Completed [542/566 (1!)] on J1 in 0.29s, 3 tests
   [junit4] 
   [junit4] HEARTBEAT J0 PID(10790@serv1): 2016-02-08T21:19:42, stalled for 68.3s at: TestCloudManagedSchemaConcurrent.test
   [junit4] Suite: org.apache.solr.search.stats.TestExactStatsCache
   [junit4] Completed [543/566 (1!)] on J1 in 8.58s, 1 test
   [junit4] 
   [junit4] Suite: org.apache.solr.search.TestRandomCollapseQParserPlugin
   [junit4] Completed [544/566 (1!)] on J2 in 70.78s, 2 tests
   [junit4] 
   [junit4] Suite: org.apache.solr.spelling.ConjunctionSolrSpellCheckerTest
   [junit4] Completed [545/566 (1!)] on J2 in 0.01s, 1 test
   [junit4] 
   [junit4] Suite: org.apache.solr.spelling.suggest.TestBlendedInfixSuggestions
   [junit4] Completed [546/566 (1!)] on J2 in 1.96s, 6 tests
   [junit4] 
   [junit4] Suite: org.apache.solr.spelling.suggest.TestFileDictionaryLookup
   [junit4] Completed [547/566 (1!)] on J2 in 0.98s, 1 test
   [junit4] 
   [junit4] Suite: org.apache.solr.store.blockcache.BufferStoreTest
   [junit4] Completed [548/566 (1!)] on J2 in 0.01s, 1 test
   [junit4] 
   [junit4] Suite: org.apache.solr.store.hdfs.HdfsDirectoryTest
   [junit4] Completed [549/566 (1!)] on J2 in 0.01s, 4 tests, 4 skipped
   [junit4] 
   [junit4] Suite: org.apache.solr.store.hdfs.HdfsLockFactoryTest
   [junit4] Completed [550/566 (1!)] on J2 in 0.01s, 1 test, 1 skipped
   [junit4] 
   [junit4] Suite: org.apache.solr.update.AddBlockUpdateTest
   [junit4] Completed [551/566 (1!)] on J2 in 0.68s, 6 tests
   [junit4] 
   [junit4] Suite: org.apache.solr.update.DataDrivenBlockJoinTest
   [junit4] Completed [552/566 (1!)] on J2 in 0.37s, 1 test
   [junit4] 
   [junit4] Suite: org.apache.solr.schema.TestCloudManagedSchemaConcurrent
   [junit4] Completed [553/566 (1!)] on J0 in 93.24s, 1 test
   [junit4] 
   [junit4] Suite: org.apache.solr.update.TestExceedMaxTermLength
   [junit4] Completed [554/566 (1!)] on J2 in 0.46s, 2 tests
   [junit4] 
   [junit4] Suite: org.apache.solr.update.processor.IgnoreCommitOptimizeUpdateProcessorFactoryTest
   [junit4] Completed [555/566 (1!)] on J2 in 0.27s, 1 test
   [junit4] 
   [junit4] Suite: org.apache.solr.update.processor.AddSchemaFieldsUpdateProcessorFactoryTest
   [junit4] Completed [556/566 (1!)] on J0 in 0.64s, 6 tests
   [junit4] 
   [junit4] Suite: org.apache.solr.update.processor.ParsingFieldUpdateProcessorsTest
   [junit4] Completed [557/566 (1!)] on J2 in 0.39s, 33 tests
   [junit4] 
   [junit4] Suite: org.apache.solr.update.processor.PreAnalyzedUpdateProcessorTest
   [junit4] Completed [558/566 (1!)] on J0 in 0.31s, 2 tests
   [junit4] 
   [junit4] Suite: org.apache.solr.util.DistanceUnitsTest
   [junit4] Completed [559/566 (1!)] on J2 in 0.01s, 1 test
   [junit4] 
   [junit4] Suite: org.apache.solr.util.TestRTimerTree
   [junit4] Completed [560/566 (1!)] on J0 in 0.01s, 1 test
   [junit4] 
   [junit4] Suite: org.apache.solr.util.hll.BigEndianAscendingWordDeserializerTest
   [junit4] Completed [561/566 (1!)] on J0 in 1.55s, 4 tests
   [junit4] 
   [junit4] Suite: org.apache.solr.util.hll.BigEndianAscendingWordSerializerTest
   [junit4] Completed [562/566 (1!)] on J0 in 0.01s, 5 tests
   [junit4] 
   [junit4] Suite: org.apache.solr.util.hll.BitVectorTest
   [junit4] Completed [563/566 (1!)] on J0 in 0.02s, 4 tests
   [junit4] 
   [junit4] Suite: org.apache.solr.util.hll.HLLSerializationTest
   [junit4] IGNOR/A 0.00s J0 | HLLSerializationTest.manyValuesHLLSerializationTest
   [junit4]    > Assumption #1: 'monster' test group is disabled (@Monster(value=may require as much as -Dtests.heapsize=4g depending on random values picked))
   [junit4] IGNOR/A 0.00s J0 | HLLSerializationTest.monsterHLLSerializationTest
   [junit4]    > Assumption #1: 'monster' test group is disabled (@Monster(value=needs roughly -Dtests.heapsize=8g because of the (multiple) massive data structs))
   [junit4] IGNOR/A 0.00s J0 | HLLSerializationTest.manyValuesMonsterHLLSerializationTest
   [junit4]    > Assumption #1: 'monster' test group is disabled (@Monster(value=can require as much as -Dtests.heapsize=4g because of the massive data structs))
   [junit4] IGNOR/A 0.00s J0 | HLLSerializationTest.serializationSmokeTest
   [junit4]    > Assumption #1: 'nightly' test group is disabled (@Nightly())
   [junit4] Completed [564/566 (1!)] on J0 in 0.00s, 4 tests, 4 skipped
   [junit4] 
   [junit4] Suite: org.apache.solr.security.BasicAuthIntegrationTest
   [junit4] Completed [565/566 (1!)] on J1 in 23.07s, 1 test
   [junit4] 
   [junit4] Suite: org.apache.solr.util.TestSolrCLIRunExample
   [junit4] Completed [566/566 (1!)] on J2 in 8.39s, 3 tests, 1 skipped
   [junit4] 
   [junit4] 
   [junit4] Tests with failures [seed: 9B3E60D9B9E3A206]:
   [junit4]   - org.apache.solr.cloud.BasicDistributedZkTest.test
   [junit4] 
   [junit4] 
   [junit4] JVM J0:     0.57 ..  1673.28 =  1672.71s
   [junit4] JVM J1:     0.57 ..  1675.04 =  1674.47s
   [junit4] JVM J2:     0.57 ..  1679.05 =  1678.48s
   [junit4] Execution time total: 27 minutes 59 seconds
   [junit4] Tests summary: 566 suites (7 ignored), 2268 tests, 1 failure, 86 ignored (41 assumptions)

BUILD FAILED
/home/jenkins/workspace/Lucene-Solr-5.x-Linux/build.xml:750: The following error occurred while executing this line:
/home/jenkins/workspace/Lucene-Solr-5.x-Linux/build.xml:694: The following error occurred while executing this line:
/home/jenkins/workspace/Lucene-Solr-5.x-Linux/build.xml:59: The following error occurred while executing this line:
/home/jenkins/workspace/Lucene-Solr-5.x-Linux/solr/build.xml:233: The following error occurred while executing this line:
/home/jenkins/workspace/Lucene-Solr-5.x-Linux/solr/common-build.xml:534: The following error occurred while executing this line:
/home/jenkins/workspace/Lucene-Solr-5.x-Linux/lucene/common-build.xml:1477: The following error occurred while executing this line:
/home/jenkins/workspace/Lucene-Solr-5.x-Linux/lucene/common-build.xml:1033: There were test failures: 566 suites (7 ignored), 2268 tests, 1 failure, 86 ignored (41 assumptions) [seed: 9B3E60D9B9E3A206]

Total time: 50 minutes 9 seconds
Build step 'Invoke Ant' marked build as failure
Archiving artifacts
[WARNINGS] Skipping publisher since build result is FAILURE
Recording test results
Email was triggered for: Failure - Any
Sending email for trigger: Failure - Any



Mime
View raw message