lucene-dev mailing list archives

Site index · List index
Message view « Date » · « Thread »
Top « Date » · « Thread »
From Policeman Jenkins Server <jenk...@thetaphi.de>
Subject [JENKINS] Lucene-Solr-5.x-MacOSX (64bit/jdk1.8.0) - Build # 3021 - Failure!
Date Tue, 09 Feb 2016 09:00:53 GMT
Build: http://jenkins.thetaphi.de/job/Lucene-Solr-5.x-MacOSX/3021/
Java: 64bit/jdk1.8.0 -XX:+UseCompressedOops -XX:+UseParallelGC

1 tests failed.
FAILED:  org.apache.solr.cloud.LeaderFailoverAfterPartitionTest.test

Error Message:
Expected 2 of 3 replicas to be active but only found 1; [core_node3:{"core":"c8n_1x3_lf_shard1_replica3","base_url":"http://127.0.0.1:50052/j_ra","node_name":"127.0.0.1:50052_j_ra","state":"active","leader":"true"}]; clusterState: DocCollection(c8n_1x3_lf)={   "replicationFactor":"3",   "shards":{"shard1":{       "range":"80000000-7fffffff",       "state":"active",       "replicas":{         "core_node1":{           "core":"c8n_1x3_lf_shard1_replica1",           "base_url":"http://127.0.0.1:50045/j_ra",           "node_name":"127.0.0.1:50045_j_ra",           "state":"down"},         "core_node2":{           "state":"down",           "base_url":"http://127.0.0.1:50067/j_ra",           "core":"c8n_1x3_lf_shard1_replica2",           "node_name":"127.0.0.1:50067_j_ra"},         "core_node3":{           "core":"c8n_1x3_lf_shard1_replica3",           "base_url":"http://127.0.0.1:50052/j_ra",           "node_name":"127.0.0.1:50052_j_ra",           "state":"active",           "leader":"true"}}}},   "router":{"name":"compositeId"},   "maxShardsPerNode":"1",   "autoAddReplicas":"false"}

Stack Trace:
java.lang.AssertionError: Expected 2 of 3 replicas to be active but only found 1; [core_node3:{"core":"c8n_1x3_lf_shard1_replica3","base_url":"http://127.0.0.1:50052/j_ra","node_name":"127.0.0.1:50052_j_ra","state":"active","leader":"true"}]; clusterState: DocCollection(c8n_1x3_lf)={
  "replicationFactor":"3",
  "shards":{"shard1":{
      "range":"80000000-7fffffff",
      "state":"active",
      "replicas":{
        "core_node1":{
          "core":"c8n_1x3_lf_shard1_replica1",
          "base_url":"http://127.0.0.1:50045/j_ra",
          "node_name":"127.0.0.1:50045_j_ra",
          "state":"down"},
        "core_node2":{
          "state":"down",
          "base_url":"http://127.0.0.1:50067/j_ra",
          "core":"c8n_1x3_lf_shard1_replica2",
          "node_name":"127.0.0.1:50067_j_ra"},
        "core_node3":{
          "core":"c8n_1x3_lf_shard1_replica3",
          "base_url":"http://127.0.0.1:50052/j_ra",
          "node_name":"127.0.0.1:50052_j_ra",
          "state":"active",
          "leader":"true"}}}},
  "router":{"name":"compositeId"},
  "maxShardsPerNode":"1",
  "autoAddReplicas":"false"}
	at __randomizedtesting.SeedInfo.seed([8CCFF33F59C43842:49BCCE5F73855BA]:0)
	at org.junit.Assert.fail(Assert.java:93)
	at org.junit.Assert.assertTrue(Assert.java:43)
	at org.apache.solr.cloud.LeaderFailoverAfterPartitionTest.testRf3WithLeaderFailover(LeaderFailoverAfterPartitionTest.java:170)
	at org.apache.solr.cloud.LeaderFailoverAfterPartitionTest.test(LeaderFailoverAfterPartitionTest.java:55)
	at sun.reflect.NativeMethodAccessorImpl.invoke0(Native Method)
	at sun.reflect.NativeMethodAccessorImpl.invoke(NativeMethodAccessorImpl.java:62)
	at sun.reflect.DelegatingMethodAccessorImpl.invoke(DelegatingMethodAccessorImpl.java:43)
	at java.lang.reflect.Method.invoke(Method.java:498)
	at com.carrotsearch.randomizedtesting.RandomizedRunner.invoke(RandomizedRunner.java:1764)
	at com.carrotsearch.randomizedtesting.RandomizedRunner$8.evaluate(RandomizedRunner.java:871)
	at com.carrotsearch.randomizedtesting.RandomizedRunner$9.evaluate(RandomizedRunner.java:907)
	at com.carrotsearch.randomizedtesting.RandomizedRunner$10.evaluate(RandomizedRunner.java:921)
	at org.apache.solr.BaseDistributedSearchTestCase$ShardsRepeatRule$ShardsFixedStatement.callStatement(BaseDistributedSearchTestCase.java:964)
	at org.apache.solr.BaseDistributedSearchTestCase$ShardsRepeatRule$ShardsStatement.evaluate(BaseDistributedSearchTestCase.java:939)
	at com.carrotsearch.randomizedtesting.rules.SystemPropertiesRestoreRule$1.evaluate(SystemPropertiesRestoreRule.java:57)
	at org.apache.lucene.util.TestRuleSetupTeardownChained$1.evaluate(TestRuleSetupTeardownChained.java:49)
	at org.apache.lucene.util.AbstractBeforeAfterRule$1.evaluate(AbstractBeforeAfterRule.java:45)
	at org.apache.lucene.util.TestRuleThreadAndTestName$1.evaluate(TestRuleThreadAndTestName.java:48)
	at org.apache.lucene.util.TestRuleIgnoreAfterMaxFailures$1.evaluate(TestRuleIgnoreAfterMaxFailures.java:64)
	at org.apache.lucene.util.TestRuleMarkFailure$1.evaluate(TestRuleMarkFailure.java:47)
	at com.carrotsearch.randomizedtesting.rules.StatementAdapter.evaluate(StatementAdapter.java:36)
	at com.carrotsearch.randomizedtesting.ThreadLeakControl$StatementRunner.run(ThreadLeakControl.java:367)
	at com.carrotsearch.randomizedtesting.ThreadLeakControl.forkTimeoutingTask(ThreadLeakControl.java:809)
	at com.carrotsearch.randomizedtesting.ThreadLeakControl$3.evaluate(ThreadLeakControl.java:460)
	at com.carrotsearch.randomizedtesting.RandomizedRunner.runSingleTest(RandomizedRunner.java:880)
	at com.carrotsearch.randomizedtesting.RandomizedRunner$5.evaluate(RandomizedRunner.java:781)
	at com.carrotsearch.randomizedtesting.RandomizedRunner$6.evaluate(RandomizedRunner.java:816)
	at com.carrotsearch.randomizedtesting.RandomizedRunner$7.evaluate(RandomizedRunner.java:827)
	at com.carrotsearch.randomizedtesting.rules.StatementAdapter.evaluate(StatementAdapter.java:36)
	at com.carrotsearch.randomizedtesting.rules.SystemPropertiesRestoreRule$1.evaluate(SystemPropertiesRestoreRule.java:57)
	at org.apache.lucene.util.AbstractBeforeAfterRule$1.evaluate(AbstractBeforeAfterRule.java:45)
	at com.carrotsearch.randomizedtesting.rules.StatementAdapter.evaluate(StatementAdapter.java:36)
	at org.apache.lucene.util.TestRuleStoreClassName$1.evaluate(TestRuleStoreClassName.java:41)
	at com.carrotsearch.randomizedtesting.rules.NoShadowingOrOverridesOnMethodsRule$1.evaluate(NoShadowingOrOverridesOnMethodsRule.java:40)
	at com.carrotsearch.randomizedtesting.rules.NoShadowingOrOverridesOnMethodsRule$1.evaluate(NoShadowingOrOverridesOnMethodsRule.java:40)
	at com.carrotsearch.randomizedtesting.rules.StatementAdapter.evaluate(StatementAdapter.java:36)
	at com.carrotsearch.randomizedtesting.rules.StatementAdapter.evaluate(StatementAdapter.java:36)
	at com.carrotsearch.randomizedtesting.rules.StatementAdapter.evaluate(StatementAdapter.java:36)
	at org.apache.lucene.util.TestRuleAssertionsRequired$1.evaluate(TestRuleAssertionsRequired.java:53)
	at org.apache.lucene.util.TestRuleMarkFailure$1.evaluate(TestRuleMarkFailure.java:47)
	at org.apache.lucene.util.TestRuleIgnoreAfterMaxFailures$1.evaluate(TestRuleIgnoreAfterMaxFailures.java:64)
	at org.apache.lucene.util.TestRuleIgnoreTestSuites$1.evaluate(TestRuleIgnoreTestSuites.java:54)
	at com.carrotsearch.randomizedtesting.rules.StatementAdapter.evaluate(StatementAdapter.java:36)
	at com.carrotsearch.randomizedtesting.ThreadLeakControl$StatementRunner.run(ThreadLeakControl.java:367)
	at java.lang.Thread.run(Thread.java:745)




Build Log:
[...truncated 11845 lines...]
   [junit4] Suite: org.apache.solr.cloud.LeaderFailoverAfterPartitionTest
   [junit4]   2> Creating dataDir: /Users/jenkins/workspace/Lucene-Solr-5.x-MacOSX/solr/build/solr-core/test/J0/temp/solr.cloud.LeaderFailoverAfterPartitionTest_8CCFF33F59C43842-001/init-core-data-001
   [junit4]   2> 2004582 INFO  (SUITE-LeaderFailoverAfterPartitionTest-seed#[8CCFF33F59C43842]-worker) [    ] o.a.s.BaseDistributedSearchTestCase Setting hostContext system property: /j_ra/
   [junit4]   2> 2004586 INFO  (TEST-LeaderFailoverAfterPartitionTest.test-seed#[8CCFF33F59C43842]) [    ] o.a.s.c.ZkTestServer STARTING ZK TEST SERVER
   [junit4]   2> 2004586 INFO  (Thread-4863) [    ] o.a.s.c.ZkTestServer client port:0.0.0.0/0.0.0.0:0
   [junit4]   2> 2004586 INFO  (Thread-4863) [    ] o.a.s.c.ZkTestServer Starting server
   [junit4]   2> 2004688 INFO  (TEST-LeaderFailoverAfterPartitionTest.test-seed#[8CCFF33F59C43842]) [    ] o.a.s.c.ZkTestServer start zk server on port:50038
   [junit4]   2> 2004688 INFO  (TEST-LeaderFailoverAfterPartitionTest.test-seed#[8CCFF33F59C43842]) [    ] o.a.s.c.c.SolrZkClient Using default ZkCredentialsProvider
   [junit4]   2> 2004689 INFO  (TEST-LeaderFailoverAfterPartitionTest.test-seed#[8CCFF33F59C43842]) [    ] o.a.s.c.c.ConnectionManager Waiting for client to connect to ZooKeeper
   [junit4]   2> 2004695 INFO  (zkCallback-2130-thread-1) [    ] o.a.s.c.c.ConnectionManager Watcher org.apache.solr.common.cloud.ConnectionManager@15c07164 name:ZooKeeperConnection Watcher:127.0.0.1:50038 got event WatchedEvent state:SyncConnected type:None path:null path:null type:None
   [junit4]   2> 2004696 INFO  (TEST-LeaderFailoverAfterPartitionTest.test-seed#[8CCFF33F59C43842]) [    ] o.a.s.c.c.ConnectionManager Client is connected to ZooKeeper
   [junit4]   2> 2004696 INFO  (TEST-LeaderFailoverAfterPartitionTest.test-seed#[8CCFF33F59C43842]) [    ] o.a.s.c.c.SolrZkClient Using default ZkACLProvider
   [junit4]   2> 2004696 INFO  (TEST-LeaderFailoverAfterPartitionTest.test-seed#[8CCFF33F59C43842]) [    ] o.a.s.c.c.SolrZkClient makePath: /solr
   [junit4]   2> 2004706 INFO  (TEST-LeaderFailoverAfterPartitionTest.test-seed#[8CCFF33F59C43842]) [    ] o.a.s.c.c.SolrZkClient Using default ZkCredentialsProvider
   [junit4]   2> 2004708 INFO  (TEST-LeaderFailoverAfterPartitionTest.test-seed#[8CCFF33F59C43842]) [    ] o.a.s.c.c.ConnectionManager Waiting for client to connect to ZooKeeper
   [junit4]   2> 2004712 INFO  (zkCallback-2131-thread-1) [    ] o.a.s.c.c.ConnectionManager Watcher org.apache.solr.common.cloud.ConnectionManager@2a67ad2 name:ZooKeeperConnection Watcher:127.0.0.1:50038/solr got event WatchedEvent state:SyncConnected type:None path:null path:null type:None
   [junit4]   2> 2004712 INFO  (TEST-LeaderFailoverAfterPartitionTest.test-seed#[8CCFF33F59C43842]) [    ] o.a.s.c.c.ConnectionManager Client is connected to ZooKeeper
   [junit4]   2> 2004713 INFO  (TEST-LeaderFailoverAfterPartitionTest.test-seed#[8CCFF33F59C43842]) [    ] o.a.s.c.c.SolrZkClient Using default ZkACLProvider
   [junit4]   2> 2004713 INFO  (TEST-LeaderFailoverAfterPartitionTest.test-seed#[8CCFF33F59C43842]) [    ] o.a.s.c.c.SolrZkClient makePath: /collections/collection1
   [junit4]   2> 2004715 INFO  (TEST-LeaderFailoverAfterPartitionTest.test-seed#[8CCFF33F59C43842]) [    ] o.a.s.c.c.SolrZkClient makePath: /collections/collection1/shards
   [junit4]   2> 2004718 INFO  (TEST-LeaderFailoverAfterPartitionTest.test-seed#[8CCFF33F59C43842]) [    ] o.a.s.c.c.SolrZkClient makePath: /collections/control_collection
   [junit4]   2> 2004720 INFO  (TEST-LeaderFailoverAfterPartitionTest.test-seed#[8CCFF33F59C43842]) [    ] o.a.s.c.c.SolrZkClient makePath: /collections/control_collection/shards
   [junit4]   2> 2004723 INFO  (TEST-LeaderFailoverAfterPartitionTest.test-seed#[8CCFF33F59C43842]) [    ] o.a.s.c.AbstractZkTestCase put /Users/jenkins/workspace/Lucene-Solr-5.x-MacOSX/solr/core/src/test-files/solr/collection1/conf/solrconfig-tlog.xml to /configs/conf1/solrconfig.xml
   [junit4]   2> 2004723 INFO  (TEST-LeaderFailoverAfterPartitionTest.test-seed#[8CCFF33F59C43842]) [    ] o.a.s.c.c.SolrZkClient makePath: /configs/conf1/solrconfig.xml
   [junit4]   2> 2004727 INFO  (TEST-LeaderFailoverAfterPartitionTest.test-seed#[8CCFF33F59C43842]) [    ] o.a.s.c.AbstractZkTestCase put /Users/jenkins/workspace/Lucene-Solr-5.x-MacOSX/solr/core/src/test-files/solr/collection1/conf/schema.xml to /configs/conf1/schema.xml
   [junit4]   2> 2004728 INFO  (TEST-LeaderFailoverAfterPartitionTest.test-seed#[8CCFF33F59C43842]) [    ] o.a.s.c.c.SolrZkClient makePath: /configs/conf1/schema.xml
   [junit4]   2> 2004731 INFO  (TEST-LeaderFailoverAfterPartitionTest.test-seed#[8CCFF33F59C43842]) [    ] o.a.s.c.AbstractZkTestCase put /Users/jenkins/workspace/Lucene-Solr-5.x-MacOSX/solr/core/src/test-files/solr/collection1/conf/solrconfig.snippet.randomindexconfig.xml to /configs/conf1/solrconfig.snippet.randomindexconfig.xml
   [junit4]   2> 2004731 INFO  (TEST-LeaderFailoverAfterPartitionTest.test-seed#[8CCFF33F59C43842]) [    ] o.a.s.c.c.SolrZkClient makePath: /configs/conf1/solrconfig.snippet.randomindexconfig.xml
   [junit4]   2> 2004735 INFO  (TEST-LeaderFailoverAfterPartitionTest.test-seed#[8CCFF33F59C43842]) [    ] o.a.s.c.AbstractZkTestCase put /Users/jenkins/workspace/Lucene-Solr-5.x-MacOSX/solr/core/src/test-files/solr/collection1/conf/stopwords.txt to /configs/conf1/stopwords.txt
   [junit4]   2> 2004735 INFO  (TEST-LeaderFailoverAfterPartitionTest.test-seed#[8CCFF33F59C43842]) [    ] o.a.s.c.c.SolrZkClient makePath: /configs/conf1/stopwords.txt
   [junit4]   2> 2004739 INFO  (TEST-LeaderFailoverAfterPartitionTest.test-seed#[8CCFF33F59C43842]) [    ] o.a.s.c.AbstractZkTestCase put /Users/jenkins/workspace/Lucene-Solr-5.x-MacOSX/solr/core/src/test-files/solr/collection1/conf/protwords.txt to /configs/conf1/protwords.txt
   [junit4]   2> 2004739 INFO  (TEST-LeaderFailoverAfterPartitionTest.test-seed#[8CCFF33F59C43842]) [    ] o.a.s.c.c.SolrZkClient makePath: /configs/conf1/protwords.txt
   [junit4]   2> 2004742 INFO  (TEST-LeaderFailoverAfterPartitionTest.test-seed#[8CCFF33F59C43842]) [    ] o.a.s.c.AbstractZkTestCase put /Users/jenkins/workspace/Lucene-Solr-5.x-MacOSX/solr/core/src/test-files/solr/collection1/conf/currency.xml to /configs/conf1/currency.xml
   [junit4]   2> 2004742 INFO  (TEST-LeaderFailoverAfterPartitionTest.test-seed#[8CCFF33F59C43842]) [    ] o.a.s.c.c.SolrZkClient makePath: /configs/conf1/currency.xml
   [junit4]   2> 2004745 INFO  (TEST-LeaderFailoverAfterPartitionTest.test-seed#[8CCFF33F59C43842]) [    ] o.a.s.c.AbstractZkTestCase put /Users/jenkins/workspace/Lucene-Solr-5.x-MacOSX/solr/core/src/test-files/solr/collection1/conf/enumsConfig.xml to /configs/conf1/enumsConfig.xml
   [junit4]   2> 2004745 INFO  (TEST-LeaderFailoverAfterPartitionTest.test-seed#[8CCFF33F59C43842]) [    ] o.a.s.c.c.SolrZkClient makePath: /configs/conf1/enumsConfig.xml
   [junit4]   2> 2004749 INFO  (TEST-LeaderFailoverAfterPartitionTest.test-seed#[8CCFF33F59C43842]) [    ] o.a.s.c.AbstractZkTestCase put /Users/jenkins/workspace/Lucene-Solr-5.x-MacOSX/solr/core/src/test-files/solr/collection1/conf/open-exchange-rates.json to /configs/conf1/open-exchange-rates.json
   [junit4]   2> 2004749 INFO  (TEST-LeaderFailoverAfterPartitionTest.test-seed#[8CCFF33F59C43842]) [    ] o.a.s.c.c.SolrZkClient makePath: /configs/conf1/open-exchange-rates.json
   [junit4]   2> 2004752 INFO  (TEST-LeaderFailoverAfterPartitionTest.test-seed#[8CCFF33F59C43842]) [    ] o.a.s.c.AbstractZkTestCase put /Users/jenkins/workspace/Lucene-Solr-5.x-MacOSX/solr/core/src/test-files/solr/collection1/conf/mapping-ISOLatin1Accent.txt to /configs/conf1/mapping-ISOLatin1Accent.txt
   [junit4]   2> 2004752 INFO  (TEST-LeaderFailoverAfterPartitionTest.test-seed#[8CCFF33F59C43842]) [    ] o.a.s.c.c.SolrZkClient makePath: /configs/conf1/mapping-ISOLatin1Accent.txt
   [junit4]   2> 2004755 INFO  (TEST-LeaderFailoverAfterPartitionTest.test-seed#[8CCFF33F59C43842]) [    ] o.a.s.c.AbstractZkTestCase put /Users/jenkins/workspace/Lucene-Solr-5.x-MacOSX/solr/core/src/test-files/solr/collection1/conf/old_synonyms.txt to /configs/conf1/old_synonyms.txt
   [junit4]   2> 2004755 INFO  (TEST-LeaderFailoverAfterPartitionTest.test-seed#[8CCFF33F59C43842]) [    ] o.a.s.c.c.SolrZkClient makePath: /configs/conf1/old_synonyms.txt
   [junit4]   2> 2004758 INFO  (TEST-LeaderFailoverAfterPartitionTest.test-seed#[8CCFF33F59C43842]) [    ] o.a.s.c.AbstractZkTestCase put /Users/jenkins/workspace/Lucene-Solr-5.x-MacOSX/solr/core/src/test-files/solr/collection1/conf/synonyms.txt to /configs/conf1/synonyms.txt
   [junit4]   2> 2004759 INFO  (TEST-LeaderFailoverAfterPartitionTest.test-seed#[8CCFF33F59C43842]) [    ] o.a.s.c.c.SolrZkClient makePath: /configs/conf1/synonyms.txt
   [junit4]   2> 2005107 INFO  (TEST-LeaderFailoverAfterPartitionTest.test-seed#[8CCFF33F59C43842]) [    ] o.a.s.SolrTestCaseJ4 Writing core.properties file to /Users/jenkins/workspace/Lucene-Solr-5.x-MacOSX/solr/build/solr-core/test/J0/temp/solr.cloud.LeaderFailoverAfterPartitionTest_8CCFF33F59C43842-001/control-001/cores/collection1
   [junit4]   2> 2005109 INFO  (TEST-LeaderFailoverAfterPartitionTest.test-seed#[8CCFF33F59C43842]) [    ] o.e.j.s.Server jetty-9.2.13.v20150730
   [junit4]   2> 2005112 INFO  (TEST-LeaderFailoverAfterPartitionTest.test-seed#[8CCFF33F59C43842]) [    ] o.e.j.s.h.ContextHandler Started o.e.j.s.ServletContextHandler@1da133ad{/j_ra,null,AVAILABLE}
   [junit4]   2> 2005113 INFO  (TEST-LeaderFailoverAfterPartitionTest.test-seed#[8CCFF33F59C43842]) [    ] o.e.j.s.ServerConnector Started ServerConnector@1affa17d{HTTP/1.1}{127.0.0.1:50046}
   [junit4]   2> 2005113 INFO  (TEST-LeaderFailoverAfterPartitionTest.test-seed#[8CCFF33F59C43842]) [    ] o.e.j.s.Server Started @2009475ms
   [junit4]   2> 2005113 INFO  (TEST-LeaderFailoverAfterPartitionTest.test-seed#[8CCFF33F59C43842]) [    ] o.a.s.c.s.e.JettySolrRunner Jetty properties: {solr.data.dir=/Users/jenkins/workspace/Lucene-Solr-5.x-MacOSX/solr/build/solr-core/test/J0/temp/solr.cloud.LeaderFailoverAfterPartitionTest_8CCFF33F59C43842-001/tempDir-001/control/data, hostContext=/j_ra, hostPort=50045, coreRootDirectory=/Users/jenkins/workspace/Lucene-Solr-5.x-MacOSX/solr/build/solr-core/test/J0/temp/solr.cloud.LeaderFailoverAfterPartitionTest_8CCFF33F59C43842-001/control-001/cores}
   [junit4]   2> 2005113 INFO  (TEST-LeaderFailoverAfterPartitionTest.test-seed#[8CCFF33F59C43842]) [    ] o.a.s.s.SolrDispatchFilter SolrDispatchFilter.init(): sun.misc.Launcher$AppClassLoader@1540e19d
   [junit4]   2> 2005113 INFO  (TEST-LeaderFailoverAfterPartitionTest.test-seed#[8CCFF33F59C43842]) [    ] o.a.s.c.SolrResourceLoader new SolrResourceLoader for directory: '/Users/jenkins/workspace/Lucene-Solr-5.x-MacOSX/solr/build/solr-core/test/J0/temp/solr.cloud.LeaderFailoverAfterPartitionTest_8CCFF33F59C43842-001/control-001'
   [junit4]   2> 2005113 INFO  (TEST-LeaderFailoverAfterPartitionTest.test-seed#[8CCFF33F59C43842]) [    ] o.a.s.c.SolrResourceLoader JNDI not configured for solr (NoInitialContextEx)
   [junit4]   2> 2005113 INFO  (TEST-LeaderFailoverAfterPartitionTest.test-seed#[8CCFF33F59C43842]) [    ] o.a.s.c.SolrResourceLoader solr home defaulted to 'solr/' (could not find system property or JNDI)
   [junit4]   2> 2005113 INFO  (TEST-LeaderFailoverAfterPartitionTest.test-seed#[8CCFF33F59C43842]) [    ] o.a.s.c.c.SolrZkClient Using default ZkCredentialsProvider
   [junit4]   2> 2005114 INFO  (TEST-LeaderFailoverAfterPartitionTest.test-seed#[8CCFF33F59C43842]) [    ] o.a.s.c.c.ConnectionManager Waiting for client to connect to ZooKeeper
   [junit4]   2> 2005116 INFO  (zkCallback-2132-thread-1) [    ] o.a.s.c.c.ConnectionManager Watcher org.apache.solr.common.cloud.ConnectionManager@72f6e8fe name:ZooKeeperConnection Watcher:127.0.0.1:50038/solr got event WatchedEvent state:SyncConnected type:None path:null path:null type:None
   [junit4]   2> 2005116 INFO  (TEST-LeaderFailoverAfterPartitionTest.test-seed#[8CCFF33F59C43842]) [    ] o.a.s.c.c.ConnectionManager Client is connected to ZooKeeper
   [junit4]   2> 2005116 INFO  (TEST-LeaderFailoverAfterPartitionTest.test-seed#[8CCFF33F59C43842]) [    ] o.a.s.c.c.SolrZkClient Using default ZkACLProvider
   [junit4]   2> 2005118 INFO  (TEST-LeaderFailoverAfterPartitionTest.test-seed#[8CCFF33F59C43842]) [    ] o.a.s.s.SolrDispatchFilter Loading solr.xml from SolrHome (not found in ZooKeeper)
   [junit4]   2> 2005118 INFO  (TEST-LeaderFailoverAfterPartitionTest.test-seed#[8CCFF33F59C43842]) [    ] o.a.s.c.SolrXmlConfig Loading container configuration from /Users/jenkins/workspace/Lucene-Solr-5.x-MacOSX/solr/build/solr-core/test/J0/temp/solr.cloud.LeaderFailoverAfterPartitionTest_8CCFF33F59C43842-001/control-001/solr.xml
   [junit4]   2> 2005164 INFO  (TEST-LeaderFailoverAfterPartitionTest.test-seed#[8CCFF33F59C43842]) [    ] o.a.s.c.CorePropertiesLocator Config-defined core root directory: /Users/jenkins/workspace/Lucene-Solr-5.x-MacOSX/solr/build/solr-core/test/J0/temp/solr.cloud.LeaderFailoverAfterPartitionTest_8CCFF33F59C43842-001/control-001/cores
   [junit4]   2> 2005164 INFO  (TEST-LeaderFailoverAfterPartitionTest.test-seed#[8CCFF33F59C43842]) [    ] o.a.s.c.CoreContainer New CoreContainer 1140491855
   [junit4]   2> 2005164 INFO  (TEST-LeaderFailoverAfterPartitionTest.test-seed#[8CCFF33F59C43842]) [    ] o.a.s.c.CoreContainer Loading cores into CoreContainer [instanceDir=/Users/jenkins/workspace/Lucene-Solr-5.x-MacOSX/solr/build/solr-core/test/J0/temp/solr.cloud.LeaderFailoverAfterPartitionTest_8CCFF33F59C43842-001/control-001]
   [junit4]   2> 2005165 WARN  (TEST-LeaderFailoverAfterPartitionTest.test-seed#[8CCFF33F59C43842]) [    ] o.a.s.c.CoreContainer Couldn't add files from /Users/jenkins/workspace/Lucene-Solr-5.x-MacOSX/solr/build/solr-core/test/J0/temp/solr.cloud.LeaderFailoverAfterPartitionTest_8CCFF33F59C43842-001/control-001/lib to classpath: /Users/jenkins/workspace/Lucene-Solr-5.x-MacOSX/solr/build/solr-core/test/J0/temp/solr.cloud.LeaderFailoverAfterPartitionTest_8CCFF33F59C43842-001/control-001/lib
   [junit4]   2> 2005165 INFO  (TEST-LeaderFailoverAfterPartitionTest.test-seed#[8CCFF33F59C43842]) [    ] o.a.s.h.c.HttpShardHandlerFactory created with socketTimeout : 90000,urlScheme : ,connTimeout : 15000,maxConnectionsPerHost : 20,maxConnections : 10000,corePoolSize : 0,maximumPoolSize : 2147483647,maxThreadIdleTime : 5,sizeOfQueue : -1,fairnessPolicy : false,useRetries : false,
   [junit4]   2> 2005169 INFO  (TEST-LeaderFailoverAfterPartitionTest.test-seed#[8CCFF33F59C43842]) [    ] o.a.s.u.UpdateShardHandler Creating UpdateShardHandler HTTP client with params: socketTimeout=340000&connTimeout=45000&retry=true
   [junit4]   2> 2005170 INFO  (TEST-LeaderFailoverAfterPartitionTest.test-seed#[8CCFF33F59C43842]) [    ] o.a.s.l.LogWatcher SLF4J impl is org.slf4j.impl.Log4jLoggerFactory
   [junit4]   2> 2005170 INFO  (TEST-LeaderFailoverAfterPartitionTest.test-seed#[8CCFF33F59C43842]) [    ] o.a.s.l.LogWatcher Registering Log Listener [Log4j (org.slf4j.impl.Log4jLoggerFactory)]
   [junit4]   2> 2005170 INFO  (TEST-LeaderFailoverAfterPartitionTest.test-seed#[8CCFF33F59C43842]) [    ] o.a.s.c.ZkContainer Zookeeper client=127.0.0.1:50038/solr
   [junit4]   2> 2005170 INFO  (TEST-LeaderFailoverAfterPartitionTest.test-seed#[8CCFF33F59C43842]) [    ] o.a.s.c.ZkController zkHost includes chroot
   [junit4]   2> 2005170 INFO  (TEST-LeaderFailoverAfterPartitionTest.test-seed#[8CCFF33F59C43842]) [    ] o.a.s.c.c.SolrZkClient Using default ZkCredentialsProvider
   [junit4]   2> 2005171 INFO  (TEST-LeaderFailoverAfterPartitionTest.test-seed#[8CCFF33F59C43842]) [    ] o.a.s.c.c.ConnectionManager Waiting for client to connect to ZooKeeper
   [junit4]   2> 2005172 INFO  (zkCallback-2135-thread-1) [    ] o.a.s.c.c.ConnectionManager Watcher org.apache.solr.common.cloud.ConnectionManager@1fadcd51 name:ZooKeeperConnection Watcher:127.0.0.1:50038 got event WatchedEvent state:SyncConnected type:None path:null path:null type:None
   [junit4]   2> 2005172 INFO  (TEST-LeaderFailoverAfterPartitionTest.test-seed#[8CCFF33F59C43842]) [    ] o.a.s.c.c.ConnectionManager Client is connected to ZooKeeper
   [junit4]   2> 2005173 INFO  (TEST-LeaderFailoverAfterPartitionTest.test-seed#[8CCFF33F59C43842]) [    ] o.a.s.c.c.SolrZkClient Using default ZkACLProvider
   [junit4]   2> 2005175 INFO  (TEST-LeaderFailoverAfterPartitionTest.test-seed#[8CCFF33F59C43842]) [n:127.0.0.1:50045_j_ra    ] o.a.s.c.c.ConnectionManager Waiting for client to connect to ZooKeeper
   [junit4]   2> 2005177 INFO  (zkCallback-2136-thread-1-processing-n:127.0.0.1:50045_j_ra) [n:127.0.0.1:50045_j_ra    ] o.a.s.c.c.ConnectionManager Watcher org.apache.solr.common.cloud.ConnectionManager@15686dc4 name:ZooKeeperConnection Watcher:127.0.0.1:50038/solr got event WatchedEvent state:SyncConnected type:None path:null path:null type:None
   [junit4]   2> 2005177 INFO  (TEST-LeaderFailoverAfterPartitionTest.test-seed#[8CCFF33F59C43842]) [n:127.0.0.1:50045_j_ra    ] o.a.s.c.c.ConnectionManager Client is connected to ZooKeeper
   [junit4]   2> 2005179 INFO  (TEST-LeaderFailoverAfterPartitionTest.test-seed#[8CCFF33F59C43842]) [n:127.0.0.1:50045_j_ra    ] o.a.s.c.c.SolrZkClient makePath: /overseer/queue
   [junit4]   2> 2005184 INFO  (TEST-LeaderFailoverAfterPartitionTest.test-seed#[8CCFF33F59C43842]) [n:127.0.0.1:50045_j_ra    ] o.a.s.c.c.SolrZkClient makePath: /overseer/collection-queue-work
   [junit4]   2> 2005191 INFO  (TEST-LeaderFailoverAfterPartitionTest.test-seed#[8CCFF33F59C43842]) [n:127.0.0.1:50045_j_ra    ] o.a.s.c.c.SolrZkClient makePath: /overseer/collection-map-running
   [junit4]   2> 2005196 INFO  (TEST-LeaderFailoverAfterPartitionTest.test-seed#[8CCFF33F59C43842]) [n:127.0.0.1:50045_j_ra    ] o.a.s.c.c.SolrZkClient makePath: /overseer/collection-map-completed
   [junit4]   2> 2005201 INFO  (TEST-LeaderFailoverAfterPartitionTest.test-seed#[8CCFF33F59C43842]) [n:127.0.0.1:50045_j_ra    ] o.a.s.c.c.SolrZkClient makePath: /overseer/collection-map-failure
   [junit4]   2> 2005206 INFO  (TEST-LeaderFailoverAfterPartitionTest.test-seed#[8CCFF33F59C43842]) [n:127.0.0.1:50045_j_ra    ] o.a.s.c.c.SolrZkClient makePath: /live_nodes
   [junit4]   2> 2005208 INFO  (TEST-LeaderFailoverAfterPartitionTest.test-seed#[8CCFF33F59C43842]) [n:127.0.0.1:50045_j_ra    ] o.a.s.c.c.SolrZkClient makePath: /aliases.json
   [junit4]   2> 2005211 INFO  (TEST-LeaderFailoverAfterPartitionTest.test-seed#[8CCFF33F59C43842]) [n:127.0.0.1:50045_j_ra    ] o.a.s.c.c.SolrZkClient makePath: /clusterstate.json
   [junit4]   2> 2005213 INFO  (TEST-LeaderFailoverAfterPartitionTest.test-seed#[8CCFF33F59C43842]) [n:127.0.0.1:50045_j_ra    ] o.a.s.c.c.SolrZkClient makePath: /security.json
   [junit4]   2> 2005215 INFO  (TEST-LeaderFailoverAfterPartitionTest.test-seed#[8CCFF33F59C43842]) [n:127.0.0.1:50045_j_ra    ] o.a.s.c.ZkController Register node as live in ZooKeeper:/live_nodes/127.0.0.1:50045_j_ra
   [junit4]   2> 2005216 INFO  (TEST-LeaderFailoverAfterPartitionTest.test-seed#[8CCFF33F59C43842]) [n:127.0.0.1:50045_j_ra    ] o.a.s.c.c.SolrZkClient makePath: /live_nodes/127.0.0.1:50045_j_ra
   [junit4]   2> 2005220 INFO  (TEST-LeaderFailoverAfterPartitionTest.test-seed#[8CCFF33F59C43842]) [n:127.0.0.1:50045_j_ra    ] o.a.s.c.c.SolrZkClient makePath: /overseer_elect
   [junit4]   2> 2005222 INFO  (TEST-LeaderFailoverAfterPartitionTest.test-seed#[8CCFF33F59C43842]) [n:127.0.0.1:50045_j_ra    ] o.a.s.c.c.SolrZkClient makePath: /overseer_elect/election
   [junit4]   2> 2005225 INFO  (TEST-LeaderFailoverAfterPartitionTest.test-seed#[8CCFF33F59C43842]) [n:127.0.0.1:50045_j_ra    ] o.a.s.c.Overseer Overseer (id=null) closing
   [junit4]   2> 2005226 INFO  (TEST-LeaderFailoverAfterPartitionTest.test-seed#[8CCFF33F59C43842]) [n:127.0.0.1:50045_j_ra    ] o.a.s.c.LeaderElector Joined leadership election with path: /overseer_elect/election/95355367799193604-127.0.0.1:50045_j_ra-n_0000000000
   [junit4]   2> 2005228 INFO  (TEST-LeaderFailoverAfterPartitionTest.test-seed#[8CCFF33F59C43842]) [n:127.0.0.1:50045_j_ra    ] o.a.s.c.OverseerElectionContext I am going to be the leader 127.0.0.1:50045_j_ra
   [junit4]   2> 2005228 INFO  (TEST-LeaderFailoverAfterPartitionTest.test-seed#[8CCFF33F59C43842]) [n:127.0.0.1:50045_j_ra    ] o.a.s.c.c.SolrZkClient makePath: /overseer_elect/leader
   [junit4]   2> 2005230 INFO  (TEST-LeaderFailoverAfterPartitionTest.test-seed#[8CCFF33F59C43842]) [n:127.0.0.1:50045_j_ra    ] o.a.s.c.Overseer Overseer (id=95355367799193604-127.0.0.1:50045_j_ra-n_0000000000) starting
   [junit4]   2> 2005234 INFO  (TEST-LeaderFailoverAfterPartitionTest.test-seed#[8CCFF33F59C43842]) [n:127.0.0.1:50045_j_ra    ] o.a.s.c.c.SolrZkClient makePath: /overseer/queue-work
   [junit4]   2> 2005249 INFO  (TEST-LeaderFailoverAfterPartitionTest.test-seed#[8CCFF33F59C43842]) [n:127.0.0.1:50045_j_ra    ] o.a.s.c.OverseerAutoReplicaFailoverThread Starting OverseerAutoReplicaFailoverThread autoReplicaFailoverWorkLoopDelay=10000 autoReplicaFailoverWaitAfterExpiration=30000 autoReplicaFailoverBadNodeExpiration=60000
   [junit4]   2> 2005250 INFO  (OverseerCollectionConfigSetProcessor-95355367799193604-127.0.0.1:50045_j_ra-n_0000000000) [n:127.0.0.1:50045_j_ra    ] o.a.s.c.OverseerTaskProcessor Process current queue of overseer operations
   [junit4]   2> 2005250 INFO  (TEST-LeaderFailoverAfterPartitionTest.test-seed#[8CCFF33F59C43842]) [n:127.0.0.1:50045_j_ra    ] o.a.s.c.c.ZkStateReader Updating cluster state from ZooKeeper... 
   [junit4]   2> 2005250 INFO  (OverseerStateUpdate-95355367799193604-127.0.0.1:50045_j_ra-n_0000000000) [n:127.0.0.1:50045_j_ra    ] o.a.s.c.Overseer Starting to work on the main queue
   [junit4]   2> 2005289 INFO  (TEST-LeaderFailoverAfterPartitionTest.test-seed#[8CCFF33F59C43842]) [n:127.0.0.1:50045_j_ra    ] o.a.s.c.CoreContainer Security conf doesn't exist. Skipping setup for authorization module.
   [junit4]   2> 2005289 INFO  (TEST-LeaderFailoverAfterPartitionTest.test-seed#[8CCFF33F59C43842]) [n:127.0.0.1:50045_j_ra    ] o.a.s.c.CoreContainer No authentication plugin used.
   [junit4]   2> 2005293 INFO  (TEST-LeaderFailoverAfterPartitionTest.test-seed#[8CCFF33F59C43842]) [n:127.0.0.1:50045_j_ra    ] o.a.s.c.CorePropertiesLocator Looking for core definitions underneath /Users/jenkins/workspace/Lucene-Solr-5.x-MacOSX/solr/build/solr-core/test/J0/temp/solr.cloud.LeaderFailoverAfterPartitionTest_8CCFF33F59C43842-001/control-001/cores
   [junit4]   2> 2005295 INFO  (TEST-LeaderFailoverAfterPartitionTest.test-seed#[8CCFF33F59C43842]) [n:127.0.0.1:50045_j_ra    ] o.a.s.c.CoreDescriptor Created CoreDescriptor: {name=collection1, config=solrconfig.xml, transient=false, schema=schema.xml, loadOnStartup=true, configSetProperties=configsetprops.json, collection=control_collection, coreNodeName=, dataDir=data/, shard=}
   [junit4]   2> 2005295 INFO  (TEST-LeaderFailoverAfterPartitionTest.test-seed#[8CCFF33F59C43842]) [n:127.0.0.1:50045_j_ra    ] o.a.s.c.CorePropertiesLocator Found core collection1 in /Users/jenkins/workspace/Lucene-Solr-5.x-MacOSX/solr/build/solr-core/test/J0/temp/solr.cloud.LeaderFailoverAfterPartitionTest_8CCFF33F59C43842-001/control-001/cores/collection1
   [junit4]   2> 2005295 INFO  (TEST-LeaderFailoverAfterPartitionTest.test-seed#[8CCFF33F59C43842]) [n:127.0.0.1:50045_j_ra    ] o.a.s.c.CorePropertiesLocator Found 1 core definitions
   [junit4]   2> 2005297 INFO  (TEST-LeaderFailoverAfterPartitionTest.test-seed#[8CCFF33F59C43842]) [n:127.0.0.1:50045_j_ra    ] o.a.s.s.SolrDispatchFilter user.dir=/Users/jenkins/workspace/Lucene-Solr-5.x-MacOSX/solr/build/solr-core/test/J0
   [junit4]   2> 2005297 INFO  (TEST-LeaderFailoverAfterPartitionTest.test-seed#[8CCFF33F59C43842]) [n:127.0.0.1:50045_j_ra    ] o.a.s.s.SolrDispatchFilter SolrDispatchFilter.init() done
   [junit4]   2> 2005298 INFO  (coreLoadExecutor-6648-thread-1-processing-n:127.0.0.1:50045_j_ra) [n:127.0.0.1:50045_j_ra c:control_collection   x:collection1] o.a.s.c.ZkController publishing state=down
   [junit4]   2> 2005298 INFO  (coreLoadExecutor-6648-thread-1-processing-n:127.0.0.1:50045_j_ra) [n:127.0.0.1:50045_j_ra c:control_collection   x:collection1] o.a.s.c.ZkController numShards not found on descriptor - reading it from system property
   [junit4]   2> 2005303 INFO  (OverseerStateUpdate-95355367799193604-127.0.0.1:50045_j_ra-n_0000000000) [n:127.0.0.1:50045_j_ra    ] o.a.s.c.Overseer processMessage: queueSize: 1, message = {
   [junit4]   2>   "core":"collection1",
   [junit4]   2>   "roles":null,
   [junit4]   2>   "base_url":"http://127.0.0.1:50045/j_ra",
   [junit4]   2>   "node_name":"127.0.0.1:50045_j_ra",
   [junit4]   2>   "numShards":"1",
   [junit4]   2>   "state":"down",
   [junit4]   2>   "shard":null,
   [junit4]   2>   "collection":"control_collection",
   [junit4]   2>   "operation":"state"} current state version: 0
   [junit4]   2> 2005303 INFO  (coreLoadExecutor-6648-thread-1-processing-n:127.0.0.1:50045_j_ra) [n:127.0.0.1:50045_j_ra c:control_collection   x:collection1] o.a.s.c.ZkController look for our core node name
   [junit4]   2> 2005304 INFO  (OverseerStateUpdate-95355367799193604-127.0.0.1:50045_j_ra-n_0000000000) [n:127.0.0.1:50045_j_ra    ] o.a.s.c.o.ReplicaMutator Update state numShards=1 message={
   [junit4]   2>   "core":"collection1",
   [junit4]   2>   "roles":null,
   [junit4]   2>   "base_url":"http://127.0.0.1:50045/j_ra",
   [junit4]   2>   "node_name":"127.0.0.1:50045_j_ra",
   [junit4]   2>   "numShards":"1",
   [junit4]   2>   "state":"down",
   [junit4]   2>   "shard":null,
   [junit4]   2>   "collection":"control_collection",
   [junit4]   2>   "operation":"state"}
   [junit4]   2> 2005304 INFO  (OverseerStateUpdate-95355367799193604-127.0.0.1:50045_j_ra-n_0000000000) [n:127.0.0.1:50045_j_ra    ] o.a.s.c.o.ClusterStateMutator building a new cName: control_collection
   [junit4]   2> 2005305 INFO  (OverseerStateUpdate-95355367799193604-127.0.0.1:50045_j_ra-n_0000000000) [n:127.0.0.1:50045_j_ra    ] o.a.s.c.o.ReplicaMutator Assigning new node to shard shard=shard1
   [junit4]   2> 2005309 INFO  (zkCallback-2136-thread-1-processing-n:127.0.0.1:50045_j_ra) [n:127.0.0.1:50045_j_ra    ] o.a.s.c.c.ZkStateReader A cluster state change: [WatchedEvent state:SyncConnected type:NodeDataChanged path:/clusterstate.json], has occurred - updating... (live nodes size: [1])
   [junit4]   2> 2006311 INFO  (coreLoadExecutor-6648-thread-1-processing-n:127.0.0.1:50045_j_ra) [n:127.0.0.1:50045_j_ra c:control_collection   x:collection1] o.a.s.c.ZkController waiting to find shard id in clusterstate for collection1
   [junit4]   2> 2006311 INFO  (coreLoadExecutor-6648-thread-1-processing-n:127.0.0.1:50045_j_ra) [n:127.0.0.1:50045_j_ra c:control_collection   x:collection1] o.a.s.c.ZkController Check for collection zkNode:control_collection
   [junit4]   2> 2006317 INFO  (coreLoadExecutor-6648-thread-1-processing-n:127.0.0.1:50045_j_ra) [n:127.0.0.1:50045_j_ra c:control_collection   x:collection1] o.a.s.c.ZkController Collection zkNode exists
   [junit4]   2> 2006317 INFO  (coreLoadExecutor-6648-thread-1-processing-n:127.0.0.1:50045_j_ra) [n:127.0.0.1:50045_j_ra c:control_collection   x:collection1] o.a.s.c.c.ZkStateReader Load collection config from: [/collections/control_collection]
   [junit4]   2> 2006340 INFO  (coreLoadExecutor-6648-thread-1-processing-n:127.0.0.1:50045_j_ra) [n:127.0.0.1:50045_j_ra c:control_collection   x:collection1] o.a.s.c.c.ZkStateReader path=[/collections/control_collection] [configName]=[conf1] specified config exists in ZooKeeper
   [junit4]   2> 2006340 INFO  (coreLoadExecutor-6648-thread-1-processing-n:127.0.0.1:50045_j_ra) [n:127.0.0.1:50045_j_ra c:control_collection   x:collection1] o.a.s.c.SolrResourceLoader new SolrResourceLoader for directory: '/Users/jenkins/workspace/Lucene-Solr-5.x-MacOSX/solr/build/solr-core/test/J0/temp/solr.cloud.LeaderFailoverAfterPartitionTest_8CCFF33F59C43842-001/control-001/cores/collection1'
   [junit4]   2> 2006340 INFO  (coreLoadExecutor-6648-thread-1-processing-n:127.0.0.1:50045_j_ra) [n:127.0.0.1:50045_j_ra c:control_collection   x:collection1] o.a.s.c.SolrResourceLoader JNDI not configured for solr (NoInitialContextEx)
   [junit4]   2> 2006341 INFO  (coreLoadExecutor-6648-thread-1-processing-n:127.0.0.1:50045_j_ra) [n:127.0.0.1:50045_j_ra c:control_collection   x:collection1] o.a.s.c.SolrResourceLoader solr home defaulted to 'solr/' (could not find system property or JNDI)
   [junit4]   2> 2006378 INFO  (coreLoadExecutor-6648-thread-1-processing-n:127.0.0.1:50045_j_ra) [n:127.0.0.1:50045_j_ra c:control_collection   x:collection1] o.a.s.c.Config loaded config solrconfig.xml with version 0 
   [junit4]   2> 2006389 INFO  (coreLoadExecutor-6648-thread-1-processing-n:127.0.0.1:50045_j_ra) [n:127.0.0.1:50045_j_ra c:control_collection   x:collection1] o.a.s.c.SolrConfig current version of requestparams : -1
   [junit4]   2> 2006393 INFO  (coreLoadExecutor-6648-thread-1-processing-n:127.0.0.1:50045_j_ra) [n:127.0.0.1:50045_j_ra c:control_collection   x:collection1] o.a.s.c.SolrConfig Using Lucene MatchVersion: 5.5.0
   [junit4]   2> 2006404 INFO  (coreLoadExecutor-6648-thread-1-processing-n:127.0.0.1:50045_j_ra) [n:127.0.0.1:50045_j_ra c:control_collection   x:collection1] o.a.s.c.SolrConfig Loaded SolrConfig: solrconfig.xml
   [junit4]   2> 2006421 INFO  (coreLoadExecutor-6648-thread-1-processing-n:127.0.0.1:50045_j_ra) [n:127.0.0.1:50045_j_ra c:control_collection   x:collection1] o.a.s.s.IndexSchema [collection1] Schema name=test
   [junit4]   2> 2006526 INFO  (coreLoadExecutor-6648-thread-1-processing-n:127.0.0.1:50045_j_ra) [n:127.0.0.1:50045_j_ra c:control_collection   x:collection1] o.a.s.s.OpenExchangeRatesOrgProvider Initialized with rates=open-exchange-rates.json, refreshInterval=1440.
   [junit4]   2> 2006540 INFO  (coreLoadExecutor-6648-thread-1-processing-n:127.0.0.1:50045_j_ra) [n:127.0.0.1:50045_j_ra c:control_collection   x:collection1] o.a.s.s.IndexSchema default search field in schema is text
   [junit4]   2> 2006541 INFO  (coreLoadExecutor-6648-thread-1-processing-n:127.0.0.1:50045_j_ra) [n:127.0.0.1:50045_j_ra c:control_collection   x:collection1] o.a.s.s.IndexSchema unique key field: id
   [junit4]   2> 2006586 INFO  (coreLoadExecutor-6648-thread-1-processing-n:127.0.0.1:50045_j_ra) [n:127.0.0.1:50045_j_ra c:control_collection   x:collection1] o.a.s.s.FileExchangeRateProvider Reloading exchange rates from file currency.xml
   [junit4]   2> 2006589 INFO  (coreLoadExecutor-6648-thread-1-processing-n:127.0.0.1:50045_j_ra) [n:127.0.0.1:50045_j_ra c:control_collection   x:collection1] o.a.s.s.FileExchangeRateProvider Reloading exchange rates from file currency.xml
   [junit4]   2> 2006592 INFO  (coreLoadExecutor-6648-thread-1-processing-n:127.0.0.1:50045_j_ra) [n:127.0.0.1:50045_j_ra c:control_collection   x:collection1] o.a.s.s.OpenExchangeRatesOrgProvider Reloading exchange rates from open-exchange-rates.json
   [junit4]   2> 2006594 INFO  (coreLoadExecutor-6648-thread-1-processing-n:127.0.0.1:50045_j_ra) [n:127.0.0.1:50045_j_ra c:control_collection   x:collection1] o.a.s.s.OpenExchangeRatesOrgProvider Reloading exchange rates from open-exchange-rates.json
   [junit4]   2> 2006598 INFO  (coreLoadExecutor-6648-thread-1-processing-n:127.0.0.1:50045_j_ra) [n:127.0.0.1:50045_j_ra c:control_collection   x:collection1] o.a.s.c.ConfigSetProperties Did not find ConfigSet properties, assuming default properties: Can't find resource 'configsetprops.json' in classpath or '/configs/conf1', cwd=/Users/jenkins/workspace/Lucene-Solr-5.x-MacOSX/solr/build/solr-core/test/J0
   [junit4]   2> 2006598 INFO  (coreLoadExecutor-6648-thread-1-processing-n:127.0.0.1:50045_j_ra) [n:127.0.0.1:50045_j_ra c:control_collection   x:collection1] o.a.s.c.CoreContainer Creating SolrCore 'collection1' using configuration from collection control_collection
   [junit4]   2> 2006598 INFO  (coreLoadExecutor-6648-thread-1-processing-n:127.0.0.1:50045_j_ra) [n:127.0.0.1:50045_j_ra c:control_collection s:shard1 r:core_node1 x:collection1] o.a.s.c.SolrCore org.apache.solr.core.MockDirectoryFactory
   [junit4]   2> 2006599 INFO  (coreLoadExecutor-6648-thread-1-processing-n:127.0.0.1:50045_j_ra) [n:127.0.0.1:50045_j_ra c:control_collection s:shard1 r:core_node1 x:collection1] o.a.s.c.SolrCore [[collection1] ] Opening new SolrCore at [/Users/jenkins/workspace/Lucene-Solr-5.x-MacOSX/solr/build/solr-core/test/J0/temp/solr.cloud.LeaderFailoverAfterPartitionTest_8CCFF33F59C43842-001/control-001/cores/collection1], dataDir=[/Users/jenkins/workspace/Lucene-Solr-5.x-MacOSX/solr/build/solr-core/test/J0/temp/solr.cloud.LeaderFailoverAfterPartitionTest_8CCFF33F59C43842-001/control-001/cores/collection1/data/]
   [junit4]   2> 2006599 INFO  (coreLoadExecutor-6648-thread-1-processing-n:127.0.0.1:50045_j_ra) [n:127.0.0.1:50045_j_ra c:control_collection s:shard1 r:core_node1 x:collection1] o.a.s.c.JmxMonitoredMap JMX monitoring is enabled. Adding Solr mbeans to JMX Server: com.sun.jmx.mbeanserver.JmxMBeanServer@709bd4d7
   [junit4]   2> 2006599 INFO  (coreLoadExecutor-6648-thread-1-processing-n:127.0.0.1:50045_j_ra) [n:127.0.0.1:50045_j_ra c:control_collection s:shard1 r:core_node1 x:collection1] o.a.s.c.CachingDirectoryFactory return new directory for /Users/jenkins/workspace/Lucene-Solr-5.x-MacOSX/solr/build/solr-core/test/J0/temp/solr.cloud.LeaderFailoverAfterPartitionTest_8CCFF33F59C43842-001/control-001/cores/collection1/data
   [junit4]   2> 2006599 INFO  (coreLoadExecutor-6648-thread-1-processing-n:127.0.0.1:50045_j_ra) [n:127.0.0.1:50045_j_ra c:control_collection s:shard1 r:core_node1 x:collection1] o.a.s.c.SolrCore New index directory detected: old=null new=/Users/jenkins/workspace/Lucene-Solr-5.x-MacOSX/solr/build/solr-core/test/J0/temp/solr.cloud.LeaderFailoverAfterPartitionTest_8CCFF33F59C43842-001/control-001/cores/collection1/data/index/
   [junit4]   2> 2006599 WARN  (coreLoadExecutor-6648-thread-1-processing-n:127.0.0.1:50045_j_ra) [n:127.0.0.1:50045_j_ra c:control_collection s:shard1 r:core_node1 x:collection1] o.a.s.c.SolrCore [collection1] Solr index directory '/Users/jenkins/workspace/Lucene-Solr-5.x-MacOSX/solr/build/solr-core/test/J0/temp/solr.cloud.LeaderFailoverAfterPartitionTest_8CCFF33F59C43842-001/control-001/cores/collection1/data/index' doesn't exist. Creating new index...
   [junit4]   2> 2006600 INFO  (coreLoadExecutor-6648-thread-1-processing-n:127.0.0.1:50045_j_ra) [n:127.0.0.1:50045_j_ra c:control_collection s:shard1 r:core_node1 x:collection1] o.a.s.c.CachingDirectoryFactory return new directory for /Users/jenkins/workspace/Lucene-Solr-5.x-MacOSX/solr/build/solr-core/test/J0/temp/solr.cloud.LeaderFailoverAfterPartitionTest_8CCFF33F59C43842-001/control-001/cores/collection1/data/index
   [junit4]   2> 2006600 INFO  (coreLoadExecutor-6648-thread-1-processing-n:127.0.0.1:50045_j_ra) [n:127.0.0.1:50045_j_ra c:control_collection s:shard1 r:core_node1 x:collection1] o.a.s.u.RandomMergePolicy RandomMergePolicy wrapping class org.apache.lucene.index.TieredMergePolicy: [TieredMergePolicy: maxMergeAtOnce=11, maxMergeAtOnceExplicit=39, maxMergedSegmentMB=14.529296875, floorSegmentMB=1.5859375, forceMergeDeletesPctAllowed=28.969031329858645, segmentsPerTier=39.0, maxCFSSegmentSizeMB=8.796093022207999E12, noCFSRatio=0.0
   [junit4]   2> 2006601 INFO  (coreLoadExecutor-6648-thread-1-processing-n:127.0.0.1:50045_j_ra) [n:127.0.0.1:50045_j_ra c:control_collection s:shard1 r:core_node1 x:collection1] o.a.s.c.SolrDeletionPolicy SolrDeletionPolicy.onCommit: commits: num=1
   [junit4]   2> 	commit{dir=MockDirectoryWrapper(RAMDirectory@a4f1e08 lockFactory=org.apache.lucene.store.SingleInstanceLockFactory@656a256b),segFN=segments_1,generation=1}
   [junit4]   2> 2006601 INFO  (coreLoadExecutor-6648-thread-1-processing-n:127.0.0.1:50045_j_ra) [n:127.0.0.1:50045_j_ra c:control_collection s:shard1 r:core_node1 x:collection1] o.a.s.c.SolrDeletionPolicy newest commit generation = 1
   [junit4]   2> 2006601 INFO  (OldIndexDirectoryCleanupThreadForCore-collection1) [n:127.0.0.1:50045_j_ra c:control_collection s:shard1 r:core_node1 x:collection1] o.a.s.c.SolrCore Looking for old index directories to cleanup for core collection1 in /Users/jenkins/workspace/Lucene-Solr-5.x-MacOSX/solr/build/solr-core/test/J0/temp/solr.cloud.LeaderFailoverAfterPartitionTest_8CCFF33F59C43842-001/control-001/cores/collection1/data/
   [junit4]   2> 2006602 WARN  (OldIndexDirectoryCleanupThreadForCore-collection1) [n:127.0.0.1:50045_j_ra c:control_collection s:shard1 r:core_node1 x:collection1] o.a.s.c.DirectoryFactory /Users/jenkins/workspace/Lucene-Solr-5.x-MacOSX/solr/build/solr-core/test/J0/temp/solr.cloud.LeaderFailoverAfterPartitionTest_8CCFF33F59C43842-001/control-001/cores/collection1/data/ does not point to a valid data directory; skipping clean-up of old index directories.
   [junit4]   2> 2006603 INFO  (coreLoadExecutor-6648-thread-1-processing-n:127.0.0.1:50045_j_ra) [n:127.0.0.1:50045_j_ra c:control_collection s:shard1 r:core_node1 x:collection1] o.a.s.u.p.UpdateRequestProcessorChain creating updateRequestProcessorChain "nodistrib"
   [junit4]   2> 2006603 INFO  (coreLoadExecutor-6648-thread-1-processing-n:127.0.0.1:50045_j_ra) [n:127.0.0.1:50045_j_ra c:control_collection s:shard1 r:core_node1 x:collection1] o.a.s.u.p.UpdateRequestProcessorChain creating updateRequestProcessorChain "dedupe"
   [junit4]   2> 2006604 INFO  (coreLoadExecutor-6648-thread-1-processing-n:127.0.0.1:50045_j_ra) [n:127.0.0.1:50045_j_ra c:control_collection s:shard1 r:core_node1 x:collection1] o.a.s.u.p.UpdateRequestProcessorChain inserting DistributedUpdateProcessorFactory into updateRequestProcessorChain "dedupe"
   [junit4]   2> 2006604 INFO  (coreLoadExecutor-6648-thread-1-processing-n:127.0.0.1:50045_j_ra) [n:127.0.0.1:50045_j_ra c:control_collection s:shard1 r:core_node1 x:collection1] o.a.s.u.p.UpdateRequestProcessorChain creating updateRequestProcessorChain "stored_sig"
   [junit4]   2> 2006604 INFO  (coreLoadExecutor-6648-thread-1-processing-n:127.0.0.1:50045_j_ra) [n:127.0.0.1:50045_j_ra c:control_collection s:shard1 r:core_node1 x:collection1] o.a.s.u.p.UpdateRequestProcessorChain inserting DistributedUpdateProcessorFactory into updateRequestProcessorChain "stored_sig"
   [junit4]   2> 2006604 INFO  (coreLoadExecutor-6648-thread-1-processing-n:127.0.0.1:50045_j_ra) [n:127.0.0.1:50045_j_ra c:control_collection s:shard1 r:core_node1 x:collection1] o.a.s.u.p.UpdateRequestProcessorChain creating updateRequestProcessorChain "distrib-dup-test-chain-explicit"
   [junit4]   2> 2006604 INFO  (coreLoadExecutor-6648-thread-1-processing-n:127.0.0.1:50045_j_ra) [n:127.0.0.1:50045_j_ra c:control_collection s:shard1 r:core_node1 x:collection1] o.a.s.u.p.UpdateRequestProcessorChain creating updateRequestProcessorChain "distrib-dup-test-chain-implicit"
   [junit4]   2> 2006604 INFO  (coreLoadExecutor-6648-thread-1-processing-n:127.0.0.1:50045_j_ra) [n:127.0.0.1:50045_j_ra c:control_collection s:shard1 r:core_node1 x:collection1] o.a.s.u.p.UpdateRequestProcessorChain inserting DistributedUpdateProcessorFactory into updateRequestProcessorChain "distrib-dup-test-chain-implicit"
   [junit4]   2> 2006604 INFO  (coreLoadExecutor-6648-thread-1-processing-n:127.0.0.1:50045_j_ra) [n:127.0.0.1:50045_j_ra c:control_collection s:shard1 r:core_node1 x:collection1] o.a.s.c.SolrCore no updateRequestProcessorChain defined as default, creating implicit default
   [junit4]   2> 2006604 WARN  (coreLoadExecutor-6648-thread-1-processing-n:127.0.0.1:50045_j_ra) [n:127.0.0.1:50045_j_ra c:control_collection s:shard1 r:core_node1 x:collection1] o.a.s.c.RequestHandlers INVALID paramSet a in requestHandler {type = requestHandler,name = /dump,class = DumpRequestHandler,args = {defaults={a=A,b=B}}}
   [junit4]   2> 2006608 INFO  (coreLoadExecutor-6648-thread-1-processing-n:127.0.0.1:50045_j_ra) [n:127.0.0.1:50045_j_ra c:control_collection s:shard1 r:core_node1 x:collection1] o.a.s.h.l.XMLLoader xsltCacheLifetimeSeconds=60
   [junit4]   2> 2006609 INFO  (coreLoadExecutor-6648-thread-1-processing-n:127.0.0.1:50045_j_ra) [n:127.0.0.1:50045_j_ra c:control_collection s:shard1 r:core_node1 x:collection1] o.a.s.h.l.XMLLoader xsltCacheLifetimeSeconds=60
   [junit4]   2> 2006609 INFO  (coreLoadExecutor-6648-thread-1-processing-n:127.0.0.1:50045_j_ra) [n:127.0.0.1:50045_j_ra c:control_collection s:shard1 r:core_node1 x:collection1] o.a.s.h.l.XMLLoader xsltCacheLifetimeSeconds=60
   [junit4]   2> 2006610 INFO  (coreLoadExecutor-6648-thread-1-processing-n:127.0.0.1:50045_j_ra) [n:127.0.0.1:50045_j_ra c:control_collection s:shard1 r:core_node1 x:collection1] o.a.s.h.l.XMLLoader xsltCacheLifetimeSeconds=60
   [junit4]   2> 2006613 INFO  (coreLoadExecutor-6648-thread-1-processing-n:127.0.0.1:50045_j_ra) [n:127.0.0.1:50045_j_ra c:control_collection s:shard1 r:core_node1 x:collection1] o.a.s.c.RequestHandlers Registered paths: /admin/mbeans,standard,/dump,/update/csv,/update/json/docs,/admin/luke,/admin/segments,/get,/admin/system,/replication,/admin/properties,/config,/schema,/admin/plugins,/admin/logging,/update/json,/admin/threads,/admin/ping,/update,/admin/file
   [junit4]   2> 2006613 INFO  (coreLoadExecutor-6648-thread-1-processing-n:127.0.0.1:50045_j_ra) [n:127.0.0.1:50045_j_ra c:control_collection s:shard1 r:core_node1 x:collection1] o.a.s.c.SolrCore Using default statsCache cache: org.apache.solr.search.stats.LocalStatsCache
   [junit4]   2> 2006614 INFO  (coreLoadExecutor-6648-thread-1-processing-n:127.0.0.1:50045_j_ra) [n:127.0.0.1:50045_j_ra c:control_collection s:shard1 r:core_node1 x:collection1] o.a.s.u.UpdateHandler Using UpdateLog implementation: org.apache.solr.update.UpdateLog
   [junit4]   2> 2006614 INFO  (coreLoadExecutor-6648-thread-1-processing-n:127.0.0.1:50045_j_ra) [n:127.0.0.1:50045_j_ra c:control_collection s:shard1 r:core_node1 x:collection1] o.a.s.u.UpdateLog Initializing UpdateLog: dataDir= defaultSyncLevel=FLUSH numRecordsToKeep=100 maxNumLogsToKeep=10 numVersionBuckets=65536
   [junit4]   2> 2006615 INFO  (coreLoadExecutor-6648-thread-1-processing-n:127.0.0.1:50045_j_ra) [n:127.0.0.1:50045_j_ra c:control_collection s:shard1 r:core_node1 x:collection1] o.a.s.u.CommitTracker Hard AutoCommit: disabled
   [junit4]   2> 2006615 INFO  (coreLoadExecutor-6648-thread-1-processing-n:127.0.0.1:50045_j_ra) [n:127.0.0.1:50045_j_ra c:control_collection s:shard1 r:core_node1 x:collection1] o.a.s.u.CommitTracker Soft AutoCommit: disabled
   [junit4]   2> 2006615 INFO  (coreLoadExecutor-6648-thread-1-processing-n:127.0.0.1:50045_j_ra) [n:127.0.0.1:50045_j_ra c:control_collection s:shard1 r:core_node1 x:collection1] o.a.s.u.RandomMergePolicy RandomMergePolicy wrapping class org.apache.lucene.index.TieredMergePolicy: [TieredMergePolicy: maxMergeAtOnce=13, maxMergeAtOnceExplicit=21, maxMergedSegmentMB=47.4267578125, floorSegmentMB=1.9482421875, forceMergeDeletesPctAllowed=9.543829376643462, segmentsPerTier=18.0, maxCFSSegmentSizeMB=8.796093022207999E12, noCFSRatio=0.2606129839578002
   [junit4]   2> 2006616 INFO  (coreLoadExecutor-6648-thread-1-processing-n:127.0.0.1:50045_j_ra) [n:127.0.0.1:50045_j_ra c:control_collection s:shard1 r:core_node1 x:collection1] o.a.s.c.SolrDeletionPolicy SolrDeletionPolicy.onInit: commits: num=1
   [junit4]   2> 	commit{dir=MockDirectoryWrapper(RAMDirectory@a4f1e08 lockFactory=org.apache.lucene.store.SingleInstanceLockFactory@656a256b),segFN=segments_1,generation=1}
   [junit4]   2> 2006616 INFO  (coreLoadExecutor-6648-thread-1-processing-n:127.0.0.1:50045_j_ra) [n:127.0.0.1:50045_j_ra c:control_collection s:shard1 r:core_node1 x:collection1] o.a.s.c.SolrDeletionPolicy newest commit generation = 1
   [junit4]   2> 2006616 INFO  (coreLoadExecutor-6648-thread-1-processing-n:127.0.0.1:50045_j_ra) [n:127.0.0.1:50045_j_ra c:control_collection s:shard1 r:core_node1 x:collection1] o.a.s.s.SolrIndexSearcher Opening Searcher@4eeba34e[collection1] main
   [junit4]   2> 2006616 INFO  (coreLoadExecutor-6648-thread-1-processing-n:127.0.0.1:50045_j_ra) [n:127.0.0.1:50045_j_ra c:control_collection s:shard1 r:core_node1 x:collection1] o.a.s.c.c.ZkStateReader Load collection config from: [/collections/control_collection]
   [junit4]   2> 2006617 INFO  (coreLoadExecutor-6648-thread-1-processing-n:127.0.0.1:50045_j_ra) [n:127.0.0.1:50045_j_ra c:control_collection s:shard1 r:core_node1 x:collection1] o.a.s.c.c.ZkStateReader path=[/collections/control_collection] [configName]=[conf1] specified config exists in ZooKeeper
   [junit4]   2> 2006617 INFO  (coreLoadExecutor-6648-thread-1-processing-n:127.0.0.1:50045_j_ra) [n:127.0.0.1:50045_j_ra c:control_collection s:shard1 r:core_node1 x:collection1] o.a.s.r.ManagedResourceStorage Setting up ZooKeeper-based storage for the RestManager with znodeBase: /configs/conf1
   [junit4]   2> 2006619 INFO  (coreLoadExecutor-6648-thread-1-processing-n:127.0.0.1:50045_j_ra) [n:127.0.0.1:50045_j_ra c:control_collection s:shard1 r:core_node1 x:collection1] o.a.s.r.ManagedResourceStorage Configured ZooKeeperStorageIO with znodeBase: /configs/conf1
   [junit4]   2> 2006619 INFO  (coreLoadExecutor-6648-thread-1-processing-n:127.0.0.1:50045_j_ra) [n:127.0.0.1:50045_j_ra c:control_collection s:shard1 r:core_node1 x:collection1] o.a.s.r.RestManager Initializing RestManager with initArgs: {}
   [junit4]   2> 2006619 INFO  (coreLoadExecutor-6648-thread-1-processing-n:127.0.0.1:50045_j_ra) [n:127.0.0.1:50045_j_ra c:control_collection s:shard1 r:core_node1 x:collection1] o.a.s.r.ManagedResourceStorage Reading _rest_managed.json using ZooKeeperStorageIO:path=/configs/conf1
   [junit4]   2> 2006620 INFO  (coreLoadExecutor-6648-thread-1-processing-n:127.0.0.1:50045_j_ra) [n:127.0.0.1:50045_j_ra c:control_collection s:shard1 r:core_node1 x:collection1] o.a.s.r.ManagedResourceStorage No data found for znode /configs/conf1/_rest_managed.json
   [junit4]   2> 2006620 INFO  (coreLoadExecutor-6648-thread-1-processing-n:127.0.0.1:50045_j_ra) [n:127.0.0.1:50045_j_ra c:control_collection s:shard1 r:core_node1 x:collection1] o.a.s.r.ManagedResourceStorage Loaded null at path _rest_managed.json using ZooKeeperStorageIO:path=/configs/conf1
   [junit4]   2> 2006620 INFO  (coreLoadExecutor-6648-thread-1-processing-n:127.0.0.1:50045_j_ra) [n:127.0.0.1:50045_j_ra c:control_collection s:shard1 r:core_node1 x:collection1] o.a.s.r.RestManager Initializing 0 registered ManagedResources
   [junit4]   2> 2006620 INFO  (coreLoadExecutor-6648-thread-1-processing-n:127.0.0.1:50045_j_ra) [n:127.0.0.1:50045_j_ra c:control_collection s:shard1 r:core_node1 x:collection1] o.a.s.h.ReplicationHandler Commits will be reserved for  10000
   [junit4]   2> 2006621 INFO  (searcherExecutor-6649-thread-1-processing-n:127.0.0.1:50045_j_ra x:collection1 s:shard1 c:control_collection r:core_node1) [n:127.0.0.1:50045_j_ra c:control_collection s:shard1 r:core_node1 x:collection1] o.a.s.c.SolrCore [collection1] Registered new searcher Searcher@4eeba34e[collection1] main{ExitableDirectoryReader(UninvertingDirectoryReader())}
   [junit4]   2> 2006621 INFO  (coreLoadExecutor-6648-thread-1-processing-n:127.0.0.1:50045_j_ra) [n:127.0.0.1:50045_j_ra c:control_collection s:shard1 r:core_node1 x:collection1] o.a.s.u.UpdateLog Looking up max value of version field to seed version buckets
   [junit4]   2> 2006621 INFO  (coreLoadExecutor-6648-thread-1-processing-n:127.0.0.1:50045_j_ra) [n:127.0.0.1:50045_j_ra c:control_collection s:shard1 r:core_node1 x:collection1] o.a.s.u.VersionInfo Refreshing highest value of _version_ for 65536 version buckets from index
   [junit4]   2> 2006621 INFO  (coreLoadExecutor-6648-thread-1-processing-n:127.0.0.1:50045_j_ra) [n:127.0.0.1:50045_j_ra c:control_collection s:shard1 r:core_node1 x:collection1] o.a.s.u.VersionInfo No terms found for _version_, cannot seed version bucket highest value from index
   [junit4]   2> 2006621 INFO  (coreLoadExecutor-6648-thread-1-processing-n:127.0.0.1:50045_j_ra) [n:127.0.0.1:50045_j_ra c:control_collection s:shard1 r:core_node1 x:collection1] o.a.s.u.UpdateLog Could not find max version in index or recent updates, using new clock 1525685886917804032
   [junit4]   2> 2006623 INFO  (coreLoadExecutor-6648-thread-1-processing-n:127.0.0.1:50045_j_ra) [n:127.0.0.1:50045_j_ra c:control_collection s:shard1 r:core_node1 x:collection1] o.a.s.u.UpdateLog Took 2.0ms to seed version buckets with highest version 1525685886917804032
   [junit4]   2> 2006624 INFO  (coreLoadExecutor-6648-thread-1-processing-n:127.0.0.1:50045_j_ra) [n:127.0.0.1:50045_j_ra c:control_collection s:shard1 r:core_node1 x:collection1] o.a.s.c.ZkController watch zkdir /configs/conf1
   [junit4]   2> 2006625 INFO  (coreLoadExecutor-6648-thread-1-processing-n:127.0.0.1:50045_j_ra) [n:127.0.0.1:50045_j_ra c:control_collection s:shard1 r:core_node1 x:collection1] o.a.s.c.CoreContainer registering core: collection1
   [junit4]   2> 2006626 INFO  (coreZkRegister-6642-thread-1-processing-n:127.0.0.1:50045_j_ra x:collection1 s:shard1 c:control_collection r:core_node1) [n:127.0.0.1:50045_j_ra c:control_collection s:shard1 r:core_node1 x:collection1] o.a.s.c.ZkController Register replica - core:collection1 address:http://127.0.0.1:50045/j_ra collection:control_collection shard:shard1
   [junit4]   2> 2006627 INFO  (coreZkRegister-6642-thread-1-processing-n:127.0.0.1:50045_j_ra x:collection1 s:shard1 c:control_collection r:core_node1) [n:127.0.0.1:50045_j_ra c:control_collection s:shard1 r:core_node1 x:collection1] o.a.s.c.c.SolrZkClient makePath: /collections/control_collection/leader_elect/shard1/election
   [junit4]   2> 2006634 INFO  (coreZkRegister-6642-thread-1-processing-n:127.0.0.1:50045_j_ra x:collection1 s:shard1 c:control_collection r:core_node1) [n:127.0.0.1:50045_j_ra c:control_collection s:shard1 r:core_node1 x:collection1] o.a.s.c.LeaderElector Joined leadership election with path: /collections/control_collection/leader_elect/shard1/election/95355367799193604-core_node1-n_0000000000
   [junit4]   2> 2006635 INFO  (coreZkRegister-6642-thread-1-processing-n:127.0.0.1:50045_j_ra x:collection1 s:shard1 c:control_collection r:core_node1) [n:127.0.0.1:50045_j_ra c:control_collection s:shard1 r:core_node1 x:collection1] o.a.s.c.ShardLeaderElectionContext Running the leader process for shard=shard1 and weAreReplacement=false and leaderVoteWait=10000
   [junit4]   2> 2006638 INFO  (coreZkRegister-6642-thread-1-processing-n:127.0.0.1:50045_j_ra x:collection1 s:shard1 c:control_collection r:core_node1) [n:127.0.0.1:50045_j_ra c:control_collection s:shard1 r:core_node1 x:collection1] o.a.s.c.ShardLeaderElectionContext Enough replicas found to continue.
   [junit4]   2> 2006638 INFO  (coreZkRegister-6642-thread-1-processing-n:127.0.0.1:50045_j_ra x:collection1 s:shard1 c:control_collection r:core_node1) [n:127.0.0.1:50045_j_ra c:control_collection s:shard1 r:core_node1 x:collection1] o.a.s.c.ShardLeaderElectionContext I may be the new leader - try and sync
   [junit4]   2> 2006638 INFO  (coreZkRegister-6642-thread-1-processing-n:127.0.0.1:50045_j_ra x:collection1 s:shard1 c:control_collection r:core_node1) [n:127.0.0.1:50045_j_ra c:control_collection s:shard1 r:core_node1 x:collection1] o.a.s.c.SyncStrategy Sync replicas to http://127.0.0.1:50045/j_ra/collection1/
   [junit4]   2> 2006638 INFO  (coreZkRegister-6642-thread-1-processing-n:127.0.0.1:50045_j_ra x:collection1 s:shard1 c:control_collection r:core_node1) [n:127.0.0.1:50045_j_ra c:control_collection s:shard1 r:core_node1 x:collection1] o.a.s.c.SyncStrategy Sync Success - now sync replicas to me
   [junit4]   2> 2006639 INFO  (coreZkRegister-6642-thread-1-processing-n:127.0.0.1:50045_j_ra x:collection1 s:shard1 c:control_collection r:core_node1) [n:127.0.0.1:50045_j_ra c:control_collection s:shard1 r:core_node1 x:collection1] o.a.s.c.SyncStrategy http://127.0.0.1:50045/j_ra/collection1/ has no replicas
   [junit4]   2> 2006639 INFO  (OverseerStateUpdate-95355367799193604-127.0.0.1:50045_j_ra-n_0000000000) [n:127.0.0.1:50045_j_ra    ] o.a.s.c.Overseer processMessage: queueSize: 1, message = {
   [junit4]   2>   "operation":"leader",
   [junit4]   2>   "shard":"shard1",
   [junit4]   2>   "collection":"control_collection"} current state version: 1
   [junit4]   2> 2006640 INFO  (coreZkRegister-6642-thread-1-processing-n:127.0.0.1:50045_j_ra x:collection1 s:shard1 c:control_collection r:core_node1) [n:127.0.0.1:50045_j_ra c:control_collection s:shard1 r:core_node1 x:collection1] o.a.s.c.c.SolrZkClient makePath: /collections/control_collection/leaders/shard1
   [junit4]   2> 2006645 INFO  (coreZkRegister-6642-thread-1-processing-n:127.0.0.1:50045_j_ra x:collection1 s:shard1 c:control_collection r:core_node1) [n:127.0.0.1:50045_j_ra c:control_collection s:shard1 r:core_node1 x:collection1] o.a.s.c.ShardLeaderElectionContextBase Creating leader registration node
   [junit4]   2> 2006649 INFO  (coreZkRegister-6642-thread-1-processing-n:127.0.0.1:50045_j_ra x:collection1 s:shard1 c:control_collection r:core_node1) [n:127.0.0.1:50045_j_ra c:control_collection s:shard1 r:core_node1 x:collection1] o.a.s.c.ShardLeaderElectionContext I am the new leader: http://127.0.0.1:50045/j_ra/collection1/ shard1
   [junit4]   2> 2006650 INFO  (OverseerStateUpdate-95355367799193604-127.0.0.1:50045_j_ra-n_0000000000) [n:127.0.0.1:50045_j_ra    ] o.a.s.c.Overseer processMessage: queueSize: 1, message = {
   [junit4]   2>   "operation":"leader",
   [junit4]   2>   "shard":"shard1",
   [junit4]   2>   "collection":"control_collection",
   [junit4]   2>   "base_url":"http://127.0.0.1:50045/j_ra",
   [junit4]   2>   "core":"collection1",
   [junit4]   2>   "state":"active"} current state version: 1
   [junit4]   2> 2006755 INFO  (zkCallback-2136-thread-1-processing-n:127.0.0.1:50045_j_ra) [n:127.0.0.1:50045_j_ra    ] o.a.s.c.c.ZkStateReader A cluster state change: [WatchedEvent state:SyncConnected type:NodeDataChanged path:/clusterstate.json], has occurred - updating... (live nodes size: [1])
   [junit4]   2> 2006803 INFO  (coreZkRegister-6642-thread-1-processing-n:127.0.0.1:50045_j_ra x:collection1 s:shard1 c:control_collection r:core_node1) [n:127.0.0.1:50045_j_ra c:control_collection s:shard1 r:core_node1 x:collection1] o.a.s.c.ZkController We are http://127.0.0.1:50045/j_ra/collection1/ and leader is http://127.0.0.1:50045/j_ra/collection1/
   [junit4]   2> 2006804 INFO  (coreZkRegister-6642-thread-1-processing-n:127.0.0.1:50045_j_ra x:collection1 s:shard1 c:control_collection r:core_node1) [n:127.0.0.1:50045_j_ra c:control_collection s:shard1 r:core_node1 x:collection1] o.a.s.c.ZkController No LogReplay needed for core=collection1 baseURL=http://127.0.0.1:50045/j_ra
   [junit4]   2> 2006804 INFO  (coreZkRegister-6642-thread-1-processing-n:127.0.0.1:50045_j_ra x:collection1 s:shard1 c:control_collection r:core_node1) [n:127.0.0.1:50045_j_ra c:control_collection s:shard1 r:core_node1 x:collection1] o.a.s.c.ZkController I am the leader, no recovery necessary
   [junit4]   2> 2006804 INFO  (coreZkRegister-6642-thread-1-processing-n:127.0.0.1:50045_j_ra x:collection1 s:shard1 c:control_collection r:core_node1) [n:127.0.0.1:50045_j_ra c:control_collection s:shard1 r:core_node1 x:collection1] o.a.s.c.ZkController publishing state=active
   [junit4]   2> 2006804 INFO  (coreZkRegister-6642-thread-1-processing-n:127.0.0.1:50045_j_ra x:collection1 s:shard1 c:control_collection r:core_node1) [n:127.0.0.1:50045_j_ra c:control_collection s:shard1 r:core_node1 x:collection1] o.a.s.c.ZkController numShards not found on descriptor - reading it from system property
   [junit4]   2> 2006807 INFO  (OverseerStateUpdate-95355367799193604-127.0.0.1:50045_j_ra-n_0000000000) [n:127.0.0.1:50045_j_ra    ] o.a.s.c.Overseer processMessage: queueSize: 1, message = {
   [junit4]   2>   "core":"collection1",
   [junit4]   2>   "core_node_name":"core_node1",
   [junit4]   2>   "roles":null,
   [junit4]   2>   "base_url":"http://127.0.0.1:50045/j_ra",
   [junit4]   2>   "node_name":"127.0.0.1:50045_j_ra",
   [junit4]   2>   "numShards":"1",
   [junit4]   2>   "state":"active",
   [junit4]   2>   "shard":"shard1",
   [junit4]   2>   "collection":"control_collection",
   [junit4]   2>   "operation":"state"} current state version: 2
   [junit4]   2> 2006808 INFO  (OverseerStateUpdate-95355367799193604-127.0.0.1:50045_j_ra-n_0000000000) [n:127.0.0.1:50045_j_ra    ] o.a.s.c.o.ReplicaMutator Update state numShards=1 message={
   [junit4]   2>   "core":"collection1",
   [junit4]   2>   "core_node_name":"core_node1",
   [junit4]   2>   "roles":null,
   [junit4]   2>   "base_url":"http://127.0.0.1:50045/j_ra",
   [junit4]   2>   "node_name":"127.0.0.1:50045_j_ra",
   [junit4]   2>   "numShards":"1",
   [junit4]   2>   "state":"active",
   [junit4]   2>   "shard":"shard1",
   [junit4]   2>   "collection":"control_collection",
   [junit4]   2>   "operation":"state"}
   [junit4]   2> 2006808 INFO  (TEST-LeaderFailoverAfterPartitionTest.test-seed#[8CCFF33F59C43842]) [    ] o.a.s.c.c.SolrZkClient Using default ZkCredentialsProvider
   [junit4]   2> 2006809 INFO  (TEST-LeaderFailoverAfterPartitionTest.test-seed#[8CCFF33F59C43842]) [    ] o.a.s.c.c.ConnectionManager Waiting for client to connect to ZooKeeper
   [junit4]   2> 2006810 INFO  (zkCallback-2138-thread-1) [    ] o.a.s.c.c.ConnectionManager Watcher org.apache.solr.common.cloud.ConnectionManager@1904694a name:ZooKeeperConnection Watcher:127.0.0.1:50038/solr got event WatchedEvent state:SyncConnected type:None path:null path:null type:None
   [junit4]   2> 2006811 INFO  (TEST-LeaderFailoverAfterPartitionTest.test-seed#[8CCFF33F59C43842]) [    ] o.a.s.c.c.ConnectionManager Client is connected to ZooKeeper
   [junit4]   2> 2006811 INFO  (TEST-LeaderFailoverAfterPartitionTest.test-seed#[8CCFF33F59C43842]) [    ] o.a.s.c.c.SolrZkClient Using default ZkACLProvider
   [junit4]   2> 2006811 INFO  (TEST-LeaderFailoverAfterPartitionTest.test-seed#[8CCFF33F59C43842]) [    ] o.a.s.c.c.ZkStateReader Updating cluster state from ZooKeeper... 
   [junit4]   2> 2006816 INFO  (TEST-LeaderFailoverAfterPartitionTest.test-seed#[8CCFF33F59C43842]) [    ] o.a.s.c.ChaosMonkey monkey: init - expire sessions:false cause connection loss:false
   [junit4]   2> 2006914 INFO  (zkCallback-2136-thread-1-processing-n:127.0.0.1:50045_j_ra) [n:127.0.0.1:50045_j_ra    ] o.a.s.c.c.ZkStateReader A cluster state change: [WatchedEvent state:SyncConnected type:NodeDataChanged path:/clusterstate.json], has occurred - updating... (live nodes size: [1])
   [junit4]   2> 2006914 INFO  (zkCallback-2138-thread-1) [    ] o.a.s.c.c.ZkStateReader A cluster state change: [WatchedEvent state:SyncConnected type:NodeDataChanged path:/clusterstate.json], has occurred - updating... (live nodes size: [1])
   [junit4]   2> 2007097 INFO  (TEST-LeaderFailoverAfterPartitionTest.test-seed#[8CCFF33F59C43842]) [    ] o.a.s.SolrTestCaseJ4 Writing core.properties file to /Users/jenkins/workspace/Lucene-Solr-5.x-MacOSX/solr/build/solr-core/test/J0/temp/solr.cloud.LeaderFailoverAfterPartitionTest_8CCFF33F59C43842-001/shard-1-001/cores/collection1
   [junit4]   2> 2007099 INFO  (TEST-LeaderFailoverAfterPartitionTest.test-seed#[8CCFF33F59C43842]) [    ] o.a.s.c.AbstractFullDistribZkTestBase create jetty 1 in directory /Users/jenkins/workspace/Lucene-Solr-5.x-MacOSX/solr/build/solr-core/test/J0/temp/solr.cloud.LeaderFailoverAfterPartitionTest_8CCFF33F59C43842-001/shard-1-001
   [junit4]   2> 2007100 INFO  (TEST-LeaderFailoverAfterPartitionTest.test-seed#[8CCFF33F59C43842]) [    ] o.e.j.s.Server jetty-9.2.13.v20150730
   [junit4]   2> 2007104 INFO  (TEST-LeaderFailoverAfterPartitionTest.test-seed#[8CCFF33F59C43842]) [    ] o.e.j.s.h.ContextHandler Started o.e.j.s.ServletContextHandler@25f71c5b{/j_ra,null,AVAILABLE}
   [junit4]   2> 2007105 INFO  (TEST-LeaderFailoverAfterPartitionTest.test-seed#[8CCFF33F59C43842]) [    ] o.e.j.s.ServerConnector Started ServerConnector@23b26bee{HTTP/1.1}{127.0.0.1:50053}
   [junit4]   2> 2007105 INFO  (TEST-LeaderFailoverAfterPartitionTest.test-seed#[8CCFF33F59C43842]) [    ] o.e.j.s.Server Started @2011467ms
   [junit4]   2> 2007105 INFO  (TEST-LeaderFailoverAfterPartitionTest.test-seed#[8CCFF33F59C43842]) [    ] o.a.s.c.s.e.JettySolrRunner Jetty properties: {solr.data.dir=/Users/jenkins/workspace/Lucene-Solr-5.x-MacOSX/solr/build/solr-core/test/J0/temp/solr.cloud.LeaderFailoverAfterPartitionTest_8CCFF33F59C43842-001/tempDir-001/jetty1, solrconfig=solrconfig.xml, hostContext=/j_ra, hostPort=50052, coreRootDirectory=/Users/jenkins/workspace/Lucene-Solr-5.x-MacOSX/solr/build/solr-core/test/J0/temp/solr.cloud.LeaderFailoverAfterPartitionTest_8CCFF33F59C43842-001/shard-1-001/cores}
   [junit4]   2> 2007105 INFO  (TEST-LeaderFailoverAfterPartitionTest.test-seed#[8CCFF33F59C43842]) [    ] o.a.s.s.SolrDispatchFilter SolrDispatchFilter.init(): sun.misc.Launcher$AppClassLoader@1540e19d
   [junit4]   2> 2007105 INFO  (TEST-LeaderFailoverAfterPartitionTest.test-seed#[8CCFF33F59C43842]) [    ] o.a.s.c.SolrResourceLoader new SolrResourceLoader for directory: '/Users/jenkins/workspace/Lucene-Solr-5.x-MacOSX/solr/build/solr-core/test/J0/temp/solr.cloud.LeaderFailoverAfterPartitionTest_8CCFF33F59C43842-001/shard-1-001'
   [junit4]   2> 2007106 INFO  (TEST-LeaderFailoverAfterPartitionTest.test-seed#[8CCFF33F59C43842]) [    ] o.a.s.c.SolrResourceLoader JNDI not configured for solr (NoInitialContextEx)
   [junit4]   2> 2007106 INFO  (TEST-LeaderFailoverAfterPartitionTest.test-seed#[8CCFF33F59C43842]) [    ] o.a.s.c.SolrResourceLoader solr home defaulted to 'solr/' (could not find system property or JNDI)
   [junit4]   2> 2007106 INFO  (TEST-LeaderFailoverAfterPartitionTest.test-seed#[8CCFF33F59C43842]) [    ] o.a.s.c.c.SolrZkClient Using default ZkCredentialsProvider
   [junit4]   2> 2007107 INFO  (TEST-LeaderFailoverAfterPartitionTest.test-seed#[8CCFF33F59C43842]) [    ] o.a.s.c.c.ConnectionManager Waiting for client to connect to ZooKeeper
   [junit4]   2> 2007109 INFO  (zkCallback-2139-thread-1) [    ] o.a.s.c.c.ConnectionManager Watcher org.apache.solr.common.cloud.ConnectionManager@32ee5b5d name:ZooKeeperConnection Watcher:127.0.0.1:50038/solr got event WatchedEvent state:SyncConnected type:None path:null path:null type:None
   [junit4]   2> 2007109 INFO  (TEST-LeaderFailoverAfterPartitionTest.test-seed#[8CCFF33F59C43842]) [    ] o.a.s.c.c.ConnectionManager Client is connected to ZooKeeper
   [junit4]   2> 2007109 INFO  (TEST-LeaderFailoverAfterPartitionTest.test-seed#[8CCFF33F59C43842]) [    ] o.a.s.c.c.SolrZkClient Using default ZkACLProvider
   [junit4]   2> 2007112 INFO  (TEST-LeaderFailoverAfterPartitionTest.test-seed#[8CCFF33F59C43842]) [    ] o.a.s.s.SolrDispatchFilter Loading solr.xml from SolrHome (not found in ZooKeeper)
   [junit4]   2> 2007112 INFO  (TEST-LeaderFailoverAfterPartitionTest.test-seed#[8CCFF33F59C43842]) [    ] o.a.s.c.SolrXmlConfig Loading container configuration from /Users/jenkins/workspace/Lucene-Solr-5.x-MacOSX/solr/build/solr-core/test/J0/temp/solr.cloud.LeaderFailoverAfterPartitionTest_8CCFF33F59C43842-001/shard-1-001/solr.xml
   [junit4]   2> 2007119 INFO  (TEST-LeaderFailoverAfterPartitionTest.test-seed#[8CCFF33F59C43842]) [    ] o.a.s.c.CorePropertiesLocator Config-defined core root directory: /Users/jenkins/workspace/Lucene-Solr-5.x-MacOSX/solr/build/solr-core/test/J0/temp/solr.cloud.LeaderFailoverAfterPartitionTest_8CCFF33F59C43842-001/shard-1-001/cores
   [junit4]   2> 2007119 INFO  (TEST-LeaderFailoverAfterPartitionTest.test-seed#[8CCFF33F59C43842]) [    ] o.a.s.c.CoreContainer New CoreContainer 1467334419
   [junit4]   2> 2007119 INFO  (TEST-LeaderFailoverAfterPartitionTest.test-seed#[8CCFF33F59C43842]) [    ] o.a.s.c.CoreContainer Loading cores into CoreContainer [instanceDir=/Users/jenkins/workspace/Lucene-Solr-5.x-MacOSX/solr/build/solr-core/test/J0/temp/solr.cloud.LeaderFailoverAfterPartitionTest_8CCFF33F59C43842-001/shard-1-001]
   [junit4]   2> 2007119 WARN  (TEST-LeaderFailoverAfterPartitionTest.test-seed#[8CCFF33F59C43842]) [    ] o.a.s.c.CoreContainer Couldn't add files from /Users/jenkins/workspace/Lucene-Solr-5.x-MacOSX/solr/build/solr-core/test/J0/temp/solr.cloud.LeaderFailoverAfterPartitionTest_8CCFF33F59C43842-001/shard-1-001/lib to classpath: /Users/jenkins/workspace/Lucene-Solr-5.x-MacOSX/solr/build/solr-core/test/J0/temp/solr.cloud.LeaderFailoverAfterPartitionTest_8CCFF33F59C43842-001/shard-1-001/lib
   [junit4]   2> 2007119 INFO  (TEST-LeaderFailoverAfterPartitionTest.test-seed#[8CCFF33F59C43842]) [    ] o.a.s.h.c.HttpShardHandlerFactory created with socketTimeout : 90000,urlScheme : ,connTimeout : 15000,maxConnectionsPerHost : 20,maxConnections : 10000,corePoolSize : 0,maximumPoolSize : 2147483647,maxThreadIdleTime : 5,sizeOfQueue : -1,fairnessPolicy : false,useRetries : false,
   [junit4]   2> 2007121 INFO  (TEST-LeaderFailoverAfterPartitionTest.test-seed#[8CCFF33F59C43842]) [    ] o.a.s.u.UpdateShardHandler Creating UpdateShardHandler HTTP client with params: socketTimeout=340000&connTimeout=45000&retry=true
   [junit4]   2> 2007122 INFO  (TEST-LeaderFailoverAfterPartitionTest.test-seed#[8CCFF33F59C43842]) [    ] o.a.s.l.LogWatcher SLF4J impl is org.slf4j.impl.Log4jLoggerFactory
   [junit4]   2> 2007122 INFO  (TEST-LeaderFailoverAfterPartitionTest.test-seed#[8CCFF33F59C43842]) [    ] o.a.s.l.LogWatcher Registering Log Listener [Log4j (org.slf4j.impl.Log4jLoggerFactory)]
   [junit4]   2> 2007122 INFO  (TEST-LeaderFailoverAfterPartitionTest.test-seed#[8CCFF33F59C43842]) [    ] o.a.s.c.ZkContainer Zookeeper client=127.0.0.1:50038/solr
   [junit4]   2> 2007122 INFO  (TEST-LeaderFailoverAfterPartitionTest.test-seed#[8CCFF33F59C43842]) [    ] o.a.s.c.ZkController zkHost includes chroot
   [junit4]   2> 2007122 INFO  (TEST-LeaderFailoverAfterPartitionTest.test-seed#[8CCFF33F59C43842]) [    ] o.a.s.c.c.SolrZkClient Using default ZkCredentialsProvider
   [junit4]   2> 2007123 INFO  (TEST-LeaderFailoverAfterPartitionTest.test-seed#[8CCFF33F59C43842]) [    ] o.a.s.c.c.ConnectionManager Waiting for client to connect to ZooKeeper
   [junit4]   2> 2007125 INFO  (zkCallback-2142-thread-1) [    ] o.a.s.c.c.ConnectionManager Watcher org.apache.solr.common.cloud.ConnectionManager@309b8c75 name:ZooKeeperConnection Watcher:127.0.0.1:50038 got event WatchedEvent state:SyncConnected type:None path:null path:null type:None
   [junit4]   2> 2007125 INFO  (TEST-LeaderFailoverAfterPartitionTest.test-seed#[8CCFF33F59C43842]) [    ] o.a.s.c.c.ConnectionManager Client is connected to ZooKeeper
   [junit4]   2> 2007125 INFO  (TEST-LeaderFailoverAfterPartitionTest.test-seed#[8CCFF33F59C43842]) [    ] o.a.s.c.c.SolrZkClient Using default ZkACLProvider
   [junit4]   2> 2007128 INFO  (TEST-LeaderFailoverAfterPartitionTest.test-seed#[8CCFF33F59C43842]) [n:127.0.0.1:50052_j_ra    ] o.a.s.c.c.ConnectionManager Waiting for client to connect to ZooKeeper
   [junit4]   2> 2007130 INFO  (zkCallback-2143-thread-1-processing-n:127.0.0.1:50052_j_ra) [n:127.0.0.1:50052_j_ra    ] o.a.s.c.c.ConnectionManager Watcher org.apache.solr.common.cloud.ConnectionManager@51d7fcc0 name:ZooKeeperConnection Watcher:127.0.0.1:50038/solr got event WatchedEvent state:SyncConnected type:None path:null path:null type:None
   [junit4]   2> 2007130 INFO  (TEST-LeaderFailoverAfterPartitionTest.test-seed#[8CCFF33F59C43842]) [n:127.0.0.1:50052_j_ra    ] o.a.s.c.c.ConnectionManager Client is connected to ZooKeeper
   [junit4]   2> 2007141 INFO  (TEST-LeaderFailoverAfterPartitionTest.test-seed#[8CCFF33F59C43842]) [n:127.0.0.1:50052_j_ra    ] o.a.s.c.c.ZkStateReader Updating cluster state from ZooKeeper... 
   [junit4]   2> 2008155 INFO  (TEST-LeaderFailoverAfterPartitionTest.test-seed#[8CCFF33F59C43842]) [n:127.0.0.1:50052_j_ra    ] o.a.s.c.ZkController Register node as live in ZooKeeper:/live_nodes/127.0.0.1:50052_j_ra
   [junit4]   2> 2008156 INFO  (TEST-LeaderFailoverAfterPartitionTest.test-seed#[8CCFF33F59C43842]) [n:127.0.0.1:50052_j_ra    ] o.a.s.c.c.SolrZkClient makePath: /live_nodes/127.0.0.1:50052_j_ra
   [junit4]   2> 2008159 INFO  (zkCallback-2136-thread-1-processing-n:127.0.0.1:50045_j_ra) [n:127.0.0.1:50045_j_ra    ] o.a.s.c.c.ZkStateReader A live node change: [WatchedEvent state:SyncConnected type:NodeChildrenChanged path:/live_nodes], has occurred - updating... (live nodes size: [1])
   [junit4]   2> 2008159 INFO  (zkCallback-2138-thread-1) [    ] o.a.s.c.c.ZkStateReader A live node change: [WatchedEvent state:SyncConnected type:NodeChildrenChanged path:/live_nodes], has occurred - updating... (live nodes size: [1])
   [junit4]   2> 2008159 INFO  (zkCallback-2143-thread-1-processing-n:127.0.0.1:50052_j_ra) [n:127.0.0.1:50052_j_ra    ] o.a.s.c.c.ZkStateReader A live node change: [WatchedEvent state:SyncConnected type:NodeChildrenChanged path:/live_nodes], has occurred - updating... (live nodes size: [1])
   [junit4]   2> 2008162 INFO  (TEST-LeaderFailoverAfterPartitionTest.test-seed#[8CCFF33F59C43842]) [n:127.0.0.1:50052_j_ra    ] o.a.s.c.Overseer Overseer (id=null) closing
   [junit4]   2> 2008163 INFO  (TEST-LeaderFailoverAfterPartitionTest.test-seed#[8CCFF33F59C43842]) [n:127.0.0.1:50052_j_ra    ] o.a.s.c.LeaderElector Joined leadership election with path: /overseer_elect/election/95355367799193608-127.0.0.1:50052_j_ra-n_0000000001
   [junit4]   2> 2008165 INFO  (TEST-LeaderFailoverAfterPartitionTest.test-seed#[8CCFF33F59C43842]) [n:127.0.0.1:50052_j_ra    ] o.a.s.c.LeaderElector Watching path /overseer_elect/election/95355367799193604-127.0.0.1:50045_j_ra-n_0000000000 to know if I could be the leader
   [junit4]   2> 2008179 INFO  (TEST-LeaderFailoverAfterPartitionTest.test-seed#[8CCFF33F59C43842]) [n:127.0.0.1:50052_j_ra    ] o.a.s.c.CoreContainer Security conf doesn't exist. Skipping setup for authorization module.
   [junit4]   2> 2008179 INFO  (TEST-LeaderFailoverAfterPartitionTest.test-seed#[8CCFF33F59C43842]) [n:127.0.0.1:50052_j_ra    ] o.a.s.c.CoreContainer No authentication plugin used.
   [junit4]   2> 2008180 INFO  (TEST-LeaderFailoverAfterPartitionTest.test-seed#[8CCFF33F59C43842]) [n:127.0.0.1:50052_j_ra    ] o.a.s.c.CorePropertiesLocator Looking for core definitions underneath /Users/jenkins/workspace/Lucene-Solr-5.x-MacOSX/solr/build/solr-core/test/J0/temp/solr.cloud.LeaderFailoverAfterPartitionTest_8CCFF33F59C43842-001/shard-1-001/cores
   [junit4]   2> 2008181 INFO  (TEST-LeaderFailoverAfterPartitionTest.test-seed#[8CCFF33F59C43842]) [n:127.0.0.1:50052_j_ra    ] o.a.s.c.CoreDescriptor Created CoreDescriptor: {name=collection1, config=solrconfig.xml, transient=false, schema=schema.xml, loadOnStartup=true, configSetProperties=configsetprops.json, collection=collection1, coreNodeName=, dataDir=data/, shard=}
   [junit4]   2> 2008181 INFO  (TEST-LeaderFailoverAfterPartitionTest.test-seed#[8CCFF33F59C43842]) [n:127.0.0.1:50052_j_ra    ] o.a.s.c.CorePropertiesLocator Found core collection1 in /Users/jenkins/workspace/Lucene-Solr-5.x-MacOSX/solr/build/solr-core/test/J0/temp/solr.cloud.LeaderFailoverAfterPartitionTest_8CCFF33F59C43842-001/shard-1-001/cores/collection1
   [junit4]   2> 2008181 INFO  (TEST-LeaderFailoverAfterPartitionTest.test-seed#[8CCFF33F59C43842]) [n:127.0.0.1:50052_j_ra    ] o.a.s.c.CorePropertiesLocator Found 1 core definitions
   [junit4]   2> 2008183 INFO  (TEST-LeaderFailoverAfterPartitionTest.test-seed#[8CCFF33F59C43842]) [n:127.0.0.1:50052_j_ra    ] o.a.s.s.SolrDispatchFilter user.dir=/Users/jenkins/workspace/Lucene-Solr-5.x-MacOSX/solr/build/solr-core/test/J0
   [junit4]   2> 2008183 INFO  (TEST-LeaderFailoverAfterPartitionTest.test-seed#[8CCFF33F59C43842]) [n:127.0.0.1:50052_j_ra    ] o.a.s.s.SolrDispatchFilter SolrDispatchFilter.init() done
   [junit4]   2> 2008184 INFO  (coreLoadExecutor-6659-thread-1-processing-n:127.0.0.1:50052_j_ra) [n:127.0.0.1:50052_j_ra c:collection1   x:collection1] o.a.s.c.ZkController publishing state=down
   [junit4]   2> 2008184 INFO  (coreLoadExecutor-6659-thread-1-processing-n:127.0.0.1:50052_j_ra) [n:127.0.0.1:50052_j_ra c:collection1   x:collection1] o.a.s.c.ZkController numShards not found on descriptor - reading it from system property
   [junit4]   2> 2008187 INFO  (coreLoadExecutor-6659-thread-1-processing-n:127.0.0.1:50052_j_ra) [n:127.0.0.1:50052_j_ra c:collection1   x:collection1] o.a.s.c.ZkController look for our core node name
   [junit4]   2> 2008187 INFO  (OverseerStateUpdate-95355367799193604-127.0.0.1:50045_j_ra-n_0000000000) [n:127.0.0.1:50045_j_ra    ] o.a.s.c.Overseer processMessage: queueSize: 1, message = {
   [junit4]   2>   "core":"collection1",
   [junit4]   2>   "roles":null,
   [junit4]   2>   "base_url":"http://127.0.0.1:50052/j_ra",
   [junit4]   2>   "node_name":"127.0.0.1:50052_j_ra",
   [junit4]   2>   "numShards":"2",
   [junit4]   2>   "state":"down",
   [junit4]   2>   "shard":null,
   [junit4]   2>   "collection":"collection1",
   [junit4]   2>   "operation":"state"} current state version: 3
   [junit4]   2> 2008188 INFO  (OverseerStateUpdate-95355367799193604-127.0.0.1:50045_j_ra-n_0000000000) [n:127.0.0.1:50045_j_ra    ] o.a.s.c.o.ReplicaMutator Update state numShards=2 message={
   [junit4]   2>   "core":"collection1",
   [junit4]   2>   "roles":null,
   [junit4]   2>   "base_url":"http://127.0.0.1:50052/j_ra",
   [junit4]   2>   "node_name":"127.0.0.1:50052_j_ra",
   [junit4]   2>   "numShards":"2",
   [junit4]   2>   "state":"down",
   [junit4]   2>   "shard":null,
   [junit4]   2>   "collection":"collection1",
   [junit4]   2>   "operation":"state"}
   [junit4]   2> 2008188 INFO  (OverseerStateUpdate-95355367799193604-127.0.0.1:50045_j_ra-n_0000000000) [n:127.0.0.1:50045_j_ra    ] o.a.s.c.o.ClusterStateMutator building a new cName: collection1
   [junit4]   2> 2008188 INFO  (OverseerStateUpdate-95355367799193604-127.0.0.1:50045_j_ra-n_0000000000) [n:127.0.0.1:50045_j_ra    ] o.a.s.c.o.ReplicaMutator Assigning new node to shard shard=shard2
   [junit4]   2> 2008294 INFO  (zkCallback-2143-thread-1-processing-n:127.0.0.1:50052_j_ra) [n:127.0.0.1:50052_j_ra    ] o.a.s.c.c.ZkStateReader A cluster state change: [WatchedEvent state:SyncConnected type:NodeDataChanged path:/clusterstate.json], has occurred - updating... (live nodes size: [2])
   [junit4]   2> 2008295 INFO  (zkCallback-2136-thread-1-processing-n:127.0.0.1:50045_j_ra) [n:127.0.0.1:50045_j_ra    ] o.a.s.c.c.ZkStateReader A cluster state change: [WatchedEvent state:SyncConnected type:NodeDataChanged path:/clusterstate.json], has occurred - updating... (live nodes size: [2])
   [junit4]   2> 2008295 INFO  (zkCallback-2138-thread-1) [    ] o.a.s.c.c.ZkStateReader A cluster state change: [WatchedEvent state:SyncConnected type:NodeDataChanged path:/clusterstate.json], has occurred - updating... (live nodes size: [2])
   [junit4]   2> 2009189 INFO  (coreLoadExecutor-6659-thread-1-processing-n:127.0.0.1:50052_j_ra) [n:127.0.0.1:50052_j_ra c:collection1   x:collection1] o.a.s.c.ZkController waiting to find shard id in clusterstate for collection1
   [junit4]   2> 2009189 INFO  (coreLoadExecutor-6659-thread-1-processing-n:127.0.0.1:50052_j_ra) [n:127.0.0.1:50052_j_ra c:collection1   x:collection1] o.a.s.c.ZkController Check for collection zkNode:collection1
   [junit4]   2> 2009190 INFO  (coreLoadExecutor-6659-thread-1-processing-n:127.0.0.1:50052_j_ra) [n:127.0.0.1:50052_j_ra c:collection1   x:collection1] o.a.s.c.ZkController Collection zkNode exists
   [junit4]   2> 2009190 INFO  (coreLoadExecutor-6659-thread-1-processing-n:127.0.0.1:50052_j_ra) [n:127.0.0.1:50052_j_ra c:collection1   x:collection1] o.a.s.c.c.ZkStateReader Load collection config from: [/collections/collection1]
   [junit4]   2> 2009192 INFO  (coreLoadExecutor-6659-thread-1-processing-n:127.0.0.1:50052_j_ra) [n:127.0.0.1:50052_j_ra c:collection1   x:collection1] o.a.s.c.c.ZkStateReader path=[/collections/collection1] [configName]=[conf1] specified config exists in ZooKeeper
   [junit4]   2> 2009192 INFO  (coreLoadExecutor-6659-thread-1-processing-n:127.0.0.1:50052_j_ra) [n:127.0.0.1:50052_j_ra c:collection1   x:collection1] o.a.s.c.SolrResourceLoader new SolrResourceLoader for directory: '/Users/jenkins/workspace/Lucene-Solr-5.x-MacOSX/solr/build/solr-core/test/J0/temp/solr.cloud.LeaderFailoverAfterPartitionTest_8CCFF33F59C43842-001/shard-1-001/cores/collection1'
   [junit4]   2> 2009192 INFO  (coreLoadExecutor-6659-thread-1-processing-n:127.0.0.1:50052_j_ra) [n:127.0.0.1:50052_j_ra c:collection1   x:collection1] o.a.s.c.SolrResourceLoader JNDI not configured for solr (NoInitialContextEx)
   [junit4]   2> 2009192 INFO  (coreLoadExecutor-6659-thread-1-processing-n:127.0.0.1:50052_j_ra) [n:127.0.0.1:50052_j_ra c:collection1   x:collection1] o.a.s.c.SolrResourceLoader solr home defaulted to 'solr/' (could not find system property or JNDI)
   [junit4]   2> 2009194 INFO  (coreLoadExecutor-6659-thread-1-processing-n:127.0.0.1:50052_j_ra) [n:127.0.0.1:50052_j_ra c:collection1   x:collection1] o.a.s.c.Config loaded config solrconfig.xml with version 0 
   [junit4]   2> 2009202 INFO  (coreLoadExecutor-6659-thread-1-processing-n:127.0.0.1:50052_j_ra) [n:127.0.0.1:50052_j_ra c:collection1   x:collection1] o.a.s.c.SolrConfig current version of requestparams : -1
   [junit4]   2> 2009206 INFO  (coreLoadExecutor-6659-thread-1-processing-n:127.0.0.1:50052_j_ra) [n:127.0.0.1:50052_j_ra c:collection1   x:collection1] o.a.s.c.SolrConfig Using Lucene MatchVersion: 5.5.0
   [junit4]   2> 2009215 INFO  (coreLoadExecutor-6659-thread-1-processing-n:127.0.0.1:50052_j_ra) [n:127.0.0.1:50052_j_ra c:collection1   x:collection1] o.a.s.c.SolrConfig Loaded SolrConfig: solrconfig.xml
   [junit4]   2> 2009223 INFO  (coreLoadExecutor-6659-thread-1-processing-n:127.0.0.1:50052_j_ra) [n:127.0.0.1:50052_j_ra c:collection1   x:collection1] o.a.s.s.IndexSchema [collection1] Schema name=test
   [junit4]   2> 2009315 INFO  (coreLoadExecutor-6659-thread-1-processing-n:127.0.0.1:50052_j_ra) [n:127.0.0.1:50052_j_ra c:collection1   x:collection1] o.a.s.s.OpenExchangeRatesOrgProvider Initialized with rates=open-exchange-rates.json, refreshInterval=1440.
   [junit4]   2> 2009322 INFO  (coreLoadExecutor-6659-thread-1-processing-n:127.0.0.1:50052_j_ra) [n:127.0.0.1:50052_j_ra c:collection1   x:collection1] o.a.s.s.IndexSchema default search field in schema is text
   [junit4]   2> 2009322 INFO  (coreLoadExecutor-6659-thread-1-processing-n:127.0.0.1:50052_j_ra) [n:127.0.0.1:50052_j_ra c:collection1   x:collection1] o.a.s.s.IndexSchema unique key field: id
   [junit4]   2> 2009338 INFO  (coreLoadExecutor-6659-thread-1-processing-n:127.0.0.1:50052_j_ra) [n:127.0.0.1:50052_j_ra c:collection1   x:collection1] o.a.s.s.FileExchangeRateProvider Reloading exchange rates from file currency.xml
   [junit4]   2> 2009340 INFO  (coreLoadExecutor-6659-thread-1-processing-n:127.0.0.1:50052_j_ra) [n:127.0.0.1:50052_j_ra c:collection1   x:collection1] o.a.s.s.FileExchangeRateProvider Reloading exchange rates from file currency.xml
   [junit4]   2> 2009344 INFO  (coreLoadExecutor-6659-thread-1-processing-n:127.0.0.1:50052_j_ra) [n:127.0.0.1:50052_j_ra c:collection1   x:collection1] o.a.s.s.OpenExchangeRatesOrgProvider Reloading exchange rates from open-exchange-rates.json
   [junit4]   2> 2009345 INFO  (coreLoadExecutor-6659-thread-1-processing-n:127.0.0.1:50052_j_ra) [n:127.0.0.1:50052_j_ra c:collection1   x:collection1] o.a.s.s.OpenExchangeRatesOrgProvider Reloading exchange rates from open-exchange-rates.json
   [junit4]   2> 2009349 INFO  (coreLoadExecutor-6659-thread-1-processing-n:127.0.0.1:50052_j_ra) [n:127.0.0.1:50052_j_ra c:collection1   x:collection1] o.a.s.c.ConfigSetProperties Did not find ConfigSet properties, assuming default properties: Can't find resource 'configsetprops.json' in classpath or '/configs/conf1', cwd=/Users/jenkins/workspace/Lucene-Solr-5.x-MacOSX/solr/build/solr-core/test/J0
   [junit4]   2> 2009349 INFO  (coreLoadExecutor-6659-thread-1-processing-n:127.0.0.1:50052_j_ra) [n:127.0.0.1:50052_j_ra c:collection1   x:collection1] o.a.s.c.CoreContainer Creating SolrCore 'collection1' using configuration from collection collection1
   [junit4]   2> 2009349 INFO  (coreLoadExecutor-6659-thread-1-processing-n:127.0.0.1:50052_j_ra) [n:127.0.0.1:50052_j_ra c:collection1 s:shard2 r:core_node1 x:collection1] o.a.s.c.SolrCore org.apache.solr.core.MockDirectoryFactory
   [junit4]   2> 2009350 INFO  (coreLoadExecutor-6659-thread-1-processing-n:127.0.0.1:50052_j_ra) [n:127.0.0.1:50052_j_ra c:collection1 s:shard2 r:core_node1 x:collection1] o.a.s.c.SolrCore [[collection1] ] Opening new SolrCore at [/Users/jenkins/workspace/Lucene-Solr-5.x-MacOSX/solr/build/solr-core/test/J0/temp/solr.cloud.LeaderFailoverAfterPartitionTest_8CCFF33F59C43842-001/shard-1-001/cores/collection1], dataDir=[/Users/jenkins/workspace/Lucene-Solr-5.x-MacOSX/solr/build/solr-core/test/J0/temp/solr.cloud.LeaderFailoverAfterPartitionTest_8CCFF33F59C43842-001/shard-1-001/cores/collection1/data/]
   [junit4]   2> 2009350 INFO  (coreLoadExecutor-6659-thread-1-processing-n:127.0.0.1:50052_j_ra) [n:127.0.0.1:50052_j_ra c:collection1 s:shard2 r:core_node1 x:collection1] o.a.s.c.JmxMonitoredMap JMX monitoring is enabled. Adding Solr mbeans to JMX Server: com.sun.jmx.mbeanserver.JmxMBeanServer@709bd4d7
   [junit4]   2> 2009350 INFO  (coreLoadExecutor-6659-thread-1-processing-n:127.0.0.1:50052_j_ra) [n:127.0.0.1:50052_j_ra c:collection1 s:shard2 r:core_node1 x:collection1] o.a.s.c.CachingDirectoryFactory return new directory for /Users/jenkins/workspace/Lucene-Solr-5.x-MacOSX/solr/build/solr-core/test/J0/temp/solr.cloud.LeaderFailoverAfterPartitionTest_8CCFF33F59C43842-001/shard-1-001/cores/collection1/data
   [junit4]   2> 2009350 INFO  (coreLoadExecutor-6659-thread-1-processing-n:127.0.0.1:50052_j_ra) [n:127.0.0.1:50052_j_ra c:collection1 s:shard2 r:core_node1 x:collection1] o.a.s.c.SolrCore New index directory detected: old=null new=/Users/jenkins/workspace/Lucene-Solr-5.x-MacOSX/solr/build/solr-core/test/J0/temp/solr.cloud.LeaderFailoverAfterPartitionTest_8CCFF33F59C43842-001/shard-1-001/cores/collection1/data/index/
   [junit4]   2> 2009350 WARN  (coreLoadExecutor-6659-thread-1-processing-n:127.0.0.1:50052_j_ra) [n:127.0.0.1:50052_j_ra c:collection1 s:shard2 r:core_node1 x:collection1] o.a.s.c.SolrCore [collection1] Solr index directory '/Users/jenkins/workspace/Lucene-Solr-5.x-MacOSX/solr/build/solr-core/test/J0/temp/solr.cloud.LeaderFailoverAfterPartitionTest_8CCFF33F59C43842-001/shard-1-001/cores/collection1/data/index' doesn't exist. Creating new index...
   [junit4]   2> 2009351 INFO  (coreLoadExecutor-6659-thread-1-processing-n:127.0.0.1:50052_j_ra) [n:127.0.0.1:50052_j_ra c:collection1 s:shard2 r:core_node1 x:collection1] o.a.s.c.CachingDirectoryFactory return new directory for /Users/jenkins/workspace/Lucene-Solr-5.x-MacOSX/solr/build/solr-core/test/J0/temp/solr.cloud.LeaderFailoverAfterPartitionTest_8CCFF33F59C43842-001/shard-1-001/cores/collection1/data/index
   [junit4]   2> 2009351 INFO  

[...truncated too long message...]

FF33F59C43842 -Dtests.slow=true -Dtests.locale=pt-PT -Dtests.timezone=CNT -Dtests.asserts=true -Dtests.file.encoding=US-ASCII
   [junit4] FAILURE  130s J0 | LeaderFailoverAfterPartitionTest.test <<<
   [junit4]    > Throwable #1: java.lang.AssertionError: Expected 2 of 3 replicas to be active but only found 1; [core_node3:{"core":"c8n_1x3_lf_shard1_replica3","base_url":"http://127.0.0.1:50052/j_ra","node_name":"127.0.0.1:50052_j_ra","state":"active","leader":"true"}]; clusterState: DocCollection(c8n_1x3_lf)={
   [junit4]    >   "replicationFactor":"3",
   [junit4]    >   "shards":{"shard1":{
   [junit4]    >       "range":"80000000-7fffffff",
   [junit4]    >       "state":"active",
   [junit4]    >       "replicas":{
   [junit4]    >         "core_node1":{
   [junit4]    >           "core":"c8n_1x3_lf_shard1_replica1",
   [junit4]    >           "base_url":"http://127.0.0.1:50045/j_ra",
   [junit4]    >           "node_name":"127.0.0.1:50045_j_ra",
   [junit4]    >           "state":"down"},
   [junit4]    >         "core_node2":{
   [junit4]    >           "state":"down",
   [junit4]    >           "base_url":"http://127.0.0.1:50067/j_ra",
   [junit4]    >           "core":"c8n_1x3_lf_shard1_replica2",
   [junit4]    >           "node_name":"127.0.0.1:50067_j_ra"},
   [junit4]    >         "core_node3":{
   [junit4]    >           "core":"c8n_1x3_lf_shard1_replica3",
   [junit4]    >           "base_url":"http://127.0.0.1:50052/j_ra",
   [junit4]    >           "node_name":"127.0.0.1:50052_j_ra",
   [junit4]    >           "state":"active",
   [junit4]    >           "leader":"true"}}}},
   [junit4]    >   "router":{"name":"compositeId"},
   [junit4]    >   "maxShardsPerNode":"1",
   [junit4]    >   "autoAddReplicas":"false"}
   [junit4]    > 	at __randomizedtesting.SeedInfo.seed([8CCFF33F59C43842:49BCCE5F73855BA]:0)
   [junit4]    > 	at org.apache.solr.cloud.LeaderFailoverAfterPartitionTest.testRf3WithLeaderFailover(LeaderFailoverAfterPartitionTest.java:170)
   [junit4]    > 	at org.apache.solr.cloud.LeaderFailoverAfterPartitionTest.test(LeaderFailoverAfterPartitionTest.java:55)
   [junit4]    > 	at org.apache.solr.BaseDistributedSearchTestCase$ShardsRepeatRule$ShardsFixedStatement.callStatement(BaseDistributedSearchTestCase.java:964)
   [junit4]    > 	at org.apache.solr.BaseDistributedSearchTestCase$ShardsRepeatRule$ShardsStatement.evaluate(BaseDistributedSearchTestCase.java:939)
   [junit4]    > 	at java.lang.Thread.run(Thread.java:745)
   [junit4]   2> 2134296 INFO  (SUITE-LeaderFailoverAfterPartitionTest-seed#[8CCFF33F59C43842]-worker) [    ] o.a.s.SolrTestCaseJ4 ###deleteCore
   [junit4]   2> NOTE: leaving temporary files on disk at: /Users/jenkins/workspace/Lucene-Solr-5.x-MacOSX/solr/build/solr-core/test/J0/temp/solr.cloud.LeaderFailoverAfterPartitionTest_8CCFF33F59C43842-001
   [junit4]   2> NOTE: test params are: codec=Asserting(Lucene54): {range_facet_l_dv=PostingsFormat(name=LuceneVarGapFixedInterval), _version_=PostingsFormat(name=MockRandom), multiDefault=PostingsFormat(name=Memory doPackFST= true), a_t=PostingsFormat(name=Memory doPackFST= true), intDefault=PostingsFormat(name=MockRandom), id=PostingsFormat(name=LuceneVarGapFixedInterval), range_facet_i_dv=PostingsFormat(name=Memory doPackFST= true), text=Lucene50(blocksize=128), range_facet_l=PostingsFormat(name=Memory doPackFST= true), timestamp=PostingsFormat(name=Memory doPackFST= true)}, docValues:{range_facet_l_dv=DocValuesFormat(name=Asserting), range_facet_i_dv=DocValuesFormat(name=Lucene54), timestamp=DocValuesFormat(name=Lucene54)}, sim=RandomSimilarity(queryNorm=true,coord=crazy): {}, locale=pt-PT, timezone=CNT
   [junit4]   2> NOTE: Mac OS X 10.8.5 x86_64/Oracle Corporation 1.8.0_72 (64-bit)/cpus=3,threads=1,free=117635832,total=423100416
   [junit4]   2> NOTE: All tests run in this JVM: [SolrCloudExampleTest, PathHierarchyTokenizerFactoryTest, CoreMergeIndexesAdminHandlerTest, VersionInfoTest, TestSort, TestFaceting, SOLR749Test, ClusterStateTest, TestConfigSetProperties, TestEmbeddedSolrServerConstructors, HardAutoCommitTest, SolrIndexConfigTest, CloudMLTQParserTest, DOMUtilTest, DistanceUnitsTest, DistributedFacetPivotLargeTest, DeleteStatusTest, TestAuthenticationFramework, TestJmxIntegration, SpatialRPTFieldTypeTest, SolrCoreTest, DistributedQueryComponentOptimizationTest, TestCoreContainer, LeaderElectionTest, TestUpdate, TestManagedResource, BlockJoinFacetDistribTest, TestFieldTypeResource, TestWordDelimiterFilterFactory, CollectionTooManyReplicasTest, TestSweetSpotSimilarityFactory, TestRemoveLastDynamicCopyField, TestLFUCache, TestReRankQParserPlugin, TestHighFrequencyDictionaryFactory, SchemaVersionSpecificBehaviorTest, DocumentAnalysisRequestHandlerTest, ConnectionManagerTest, TestPseudoReturnFields, TestComponentsName, DistributedQueueTest, TestAnalyzedSuggestions, TestSolrQueryResponse, TestAnalyzeInfixSuggestions, TestDynamicLoading, TestRandomCollapseQParserPlugin, BlockJoinFacetSimpleTest, PrimitiveFieldTypeTest, HdfsDirectoryTest, TestMergePolicyConfig, ForceLeaderTest, TestStressLucene, TestDistributedSearch, HdfsBasicDistributedZkTest, ResponseHeaderTest, TestReplicationHandler, AddBlockUpdateTest, HdfsSyncSliceTest, UUIDFieldTest, LeaderInitiatedRecoveryOnShardRestartTest, SharedFSAutoReplicaFailoverUtilsTest, DistributedDebugComponentTest, DeleteReplicaTest, TestPhraseSuggestions, TestReqParamsAPI, StatelessScriptUpdateProcessorFactoryTest, DirectSolrSpellCheckerTest, OverriddenZkACLAndCredentialsProvidersTest, TestCollapseQParserPlugin, TestQuerySenderNoQuery, CursorMarkTest, ShardSplitTest, RegexBoostProcessorTest, UnloadDistributedZkTest, TestNonDefinedSimilarityFactory, VMParamsZkACLAndCredentialsProvidersTest, HdfsTlogReplayBufferedWhileIndexingTest, MultiThreadedOCPTest, TestNRTOpen, TestTestInjection, TestSearchPerf, DocValuesTest, ExplicitHLLTest, PreAnalyzedFieldTest, TestSolrDeletionPolicy1, HdfsDirectoryFactoryTest, TestUseDocValuesAsStored, TestRTimerTree, TestRandomDVFaceting, ZkStateWriterTest, StandardRequestHandlerTest, TestPostingsSolrHighlighter, SampleTest, TestAuthorizationFramework, TestStressVersions, OverseerTest, TestConfigSetsAPI, TestScoreJoinQPScore, TestExactStatsCache, PrimUtilsTest, TestDistribDocBasedVersion, SuggestComponentContextFilterQueryTest, TestJmxMonitoredMap, TestMaxScoreQueryParser, TestConfigOverlay, DirectUpdateHandlerTest, TlogReplayBufferedWhileIndexingTest, RankQueryTest, TestFileDictionaryLookup, XsltUpdateRequestHandlerTest, TestFunctionQuery, TestDefaultSearchFieldResource, DistributedQueryElevationComponentTest, ScriptEngineTest, FacetPivotSmallTest, CleanupOldIndexTest, AsyncMigrateRouteKeyTest, TestManagedSchema, TestRawResponseWriter, TestTolerantSearch, JSONWriterTest, TestDFRSimilarityFactory, TestSolrDynamicMBean, TestSortByMinMaxFunction, TestSolr4Spatial2, HdfsWriteToMultipleCollectionsTest, CircularListTest, XmlUpdateRequestHandlerTest, WrapperMergePolicyFactoryTest, ChangedSchemaMergeTest, BadComponentTest, TestRequestForwarding, SSLMigrationTest, TestGroupingSearch, ReturnFieldsTest, TestElisionMultitermQuery, DistribDocExpirationUpdateProcessorTest, DistributedSpellCheckComponentTest, TestStressReorder, SimpleFacetsTest, StatsComponentTest, ConvertedLegacyTest, TestFiltering, TestLazyCores, HighlighterTest, CurrencyFieldOpenExchangeTest, CurrencyFieldXmlFileTest, SolrIndexSplitterTest, SimplePostToolTest, AnalysisAfterCoreReloadTest, TestExtendedDismaxParser, SpellCheckCollatorTest, CoreAdminHandlerTest, SpatialFilterTest, TestCSVLoader, WordBreakSolrSpellCheckerTest, FieldMutatingUpdateProcessorTest, TestAtomicUpdateErrorCases, DirectUpdateHandlerOptimizeTest, DefaultValueUpdateProcessorTest, TestRemoteStreaming, DebugComponentTest, TestSurroundQueryParser, DisMaxRequestHandlerTest, TestQueryUtils, TestWriterPerf, TermsComponentTest, MoreLikeThisHandlerTest, TestArbitraryIndexDir, LoggingHandlerTest, UpdateRequestProcessorFactoryTest, MBeansHandlerTest, JsonLoaderTest, TestPHPSerializedResponseWriter, UpdateParamsTest, AlternateDirectoryTest, CopyFieldTest, TestDocSet, TestBinaryField, NumericFieldsTest, MinimalSchemaTest, TestConfig, OutputWriterTest, ExternalFileFieldSortTest, TestSolrCoreProperties, DirectSolrConnectionTest, NotRequiredUniqueKeyTest, TestLuceneMatchVersion, TestCodecSupport, TestIBSimilarityFactory, ResourceLoaderTest, URLClassifyProcessorTest, TestFastLRUCache, ChaosMonkeyNothingIsSafeTest, TestHighlightDedupGrouping, ConnectionReuseTest, AssignTest, AsyncCallRequestStatusResponseTest, CollectionReloadTest, ConcurrentDeleteAndCreateCollectionTest, DeleteInactiveReplicaTest, LeaderFailoverAfterPartitionTest]
   [junit4] Completed [424/568 (1!)] on J0 in 130.47s, 1 test, 1 failure <<< FAILURES!

[...truncated 472 lines...]
BUILD FAILED
/Users/jenkins/workspace/Lucene-Solr-5.x-MacOSX/build.xml:750: The following error occurred while executing this line:
/Users/jenkins/workspace/Lucene-Solr-5.x-MacOSX/build.xml:694: The following error occurred while executing this line:
/Users/jenkins/workspace/Lucene-Solr-5.x-MacOSX/build.xml:59: The following error occurred while executing this line:
/Users/jenkins/workspace/Lucene-Solr-5.x-MacOSX/solr/build.xml:233: The following error occurred while executing this line:
/Users/jenkins/workspace/Lucene-Solr-5.x-MacOSX/solr/common-build.xml:534: The following error occurred while executing this line:
/Users/jenkins/workspace/Lucene-Solr-5.x-MacOSX/lucene/common-build.xml:1477: The following error occurred while executing this line:
/Users/jenkins/workspace/Lucene-Solr-5.x-MacOSX/lucene/common-build.xml:1033: There were test failures: 568 suites (7 ignored), 2273 tests, 1 failure, 90 ignored (40 assumptions) [seed: 8CCFF33F59C43842]

Total time: 71 minutes 32 seconds
Build step 'Invoke Ant' marked build as failure
Archiving artifacts
[WARNINGS] Skipping publisher since build result is FAILURE
Recording test results
Email was triggered for: Failure - Any
Sending email for trigger: Failure - Any



Mime
View raw message