lucene-dev mailing list archives

Site index · List index
Message view « Date » · « Thread »
Top « Date » · « Thread »
From Policeman Jenkins Server <jenk...@thetaphi.de>
Subject [JENKINS] Lucene-Solr-5.x-Solaris (64bit/jdk1.8.0) - Build # 383 - Failure!
Date Tue, 09 Feb 2016 03:21:05 GMT
Build: http://jenkins.thetaphi.de/job/Lucene-Solr-5.x-Solaris/383/
Java: 64bit/jdk1.8.0 -XX:+UseCompressedOops -XX:+UseSerialGC

1 tests failed.
FAILED:  org.apache.solr.client.solrj.impl.CloudSolrClientTest.test

Error Message:
There should be one document because overwrite=true expected:<1> but was:<0>

Stack Trace:
java.lang.AssertionError: There should be one document because overwrite=true expected:<1> but was:<0>
	at __randomizedtesting.SeedInfo.seed([4C49404629846E7C:C41D7F9C87780384]:0)
	at org.junit.Assert.fail(Assert.java:93)
	at org.junit.Assert.failNotEquals(Assert.java:647)
	at org.junit.Assert.assertEquals(Assert.java:128)
	at org.junit.Assert.assertEquals(Assert.java:472)
	at org.apache.solr.client.solrj.impl.CloudSolrClientTest.testOverwriteOption(CloudSolrClientTest.java:156)
	at org.apache.solr.client.solrj.impl.CloudSolrClientTest.test(CloudSolrClientTest.java:120)
	at sun.reflect.NativeMethodAccessorImpl.invoke0(Native Method)
	at sun.reflect.NativeMethodAccessorImpl.invoke(NativeMethodAccessorImpl.java:62)
	at sun.reflect.DelegatingMethodAccessorImpl.invoke(DelegatingMethodAccessorImpl.java:43)
	at java.lang.reflect.Method.invoke(Method.java:498)
	at com.carrotsearch.randomizedtesting.RandomizedRunner.invoke(RandomizedRunner.java:1764)
	at com.carrotsearch.randomizedtesting.RandomizedRunner$8.evaluate(RandomizedRunner.java:871)
	at com.carrotsearch.randomizedtesting.RandomizedRunner$9.evaluate(RandomizedRunner.java:907)
	at com.carrotsearch.randomizedtesting.RandomizedRunner$10.evaluate(RandomizedRunner.java:921)
	at org.junit.rules.ExpectedException$ExpectedExceptionStatement.evaluate(ExpectedException.java:110)
	at org.apache.solr.BaseDistributedSearchTestCase$ShardsRepeatRule$ShardsFixedStatement.callStatement(BaseDistributedSearchTestCase.java:964)
	at org.apache.solr.BaseDistributedSearchTestCase$ShardsRepeatRule$ShardsStatement.evaluate(BaseDistributedSearchTestCase.java:939)
	at com.carrotsearch.randomizedtesting.rules.SystemPropertiesRestoreRule$1.evaluate(SystemPropertiesRestoreRule.java:57)
	at org.apache.lucene.util.TestRuleSetupTeardownChained$1.evaluate(TestRuleSetupTeardownChained.java:49)
	at org.apache.lucene.util.AbstractBeforeAfterRule$1.evaluate(AbstractBeforeAfterRule.java:45)
	at org.apache.lucene.util.TestRuleThreadAndTestName$1.evaluate(TestRuleThreadAndTestName.java:48)
	at org.apache.lucene.util.TestRuleIgnoreAfterMaxFailures$1.evaluate(TestRuleIgnoreAfterMaxFailures.java:64)
	at org.apache.lucene.util.TestRuleMarkFailure$1.evaluate(TestRuleMarkFailure.java:47)
	at com.carrotsearch.randomizedtesting.rules.StatementAdapter.evaluate(StatementAdapter.java:36)
	at com.carrotsearch.randomizedtesting.ThreadLeakControl$StatementRunner.run(ThreadLeakControl.java:367)
	at com.carrotsearch.randomizedtesting.ThreadLeakControl.forkTimeoutingTask(ThreadLeakControl.java:809)
	at com.carrotsearch.randomizedtesting.ThreadLeakControl$3.evaluate(ThreadLeakControl.java:460)
	at com.carrotsearch.randomizedtesting.RandomizedRunner.runSingleTest(RandomizedRunner.java:880)
	at com.carrotsearch.randomizedtesting.RandomizedRunner$5.evaluate(RandomizedRunner.java:781)
	at com.carrotsearch.randomizedtesting.RandomizedRunner$6.evaluate(RandomizedRunner.java:816)
	at com.carrotsearch.randomizedtesting.RandomizedRunner$7.evaluate(RandomizedRunner.java:827)
	at com.carrotsearch.randomizedtesting.rules.StatementAdapter.evaluate(StatementAdapter.java:36)
	at com.carrotsearch.randomizedtesting.rules.SystemPropertiesRestoreRule$1.evaluate(SystemPropertiesRestoreRule.java:57)
	at org.apache.lucene.util.AbstractBeforeAfterRule$1.evaluate(AbstractBeforeAfterRule.java:45)
	at com.carrotsearch.randomizedtesting.rules.StatementAdapter.evaluate(StatementAdapter.java:36)
	at org.apache.lucene.util.TestRuleStoreClassName$1.evaluate(TestRuleStoreClassName.java:41)
	at com.carrotsearch.randomizedtesting.rules.NoShadowingOrOverridesOnMethodsRule$1.evaluate(NoShadowingOrOverridesOnMethodsRule.java:40)
	at com.carrotsearch.randomizedtesting.rules.NoShadowingOrOverridesOnMethodsRule$1.evaluate(NoShadowingOrOverridesOnMethodsRule.java:40)
	at com.carrotsearch.randomizedtesting.rules.StatementAdapter.evaluate(StatementAdapter.java:36)
	at com.carrotsearch.randomizedtesting.rules.StatementAdapter.evaluate(StatementAdapter.java:36)
	at com.carrotsearch.randomizedtesting.rules.StatementAdapter.evaluate(StatementAdapter.java:36)
	at org.apache.lucene.util.TestRuleAssertionsRequired$1.evaluate(TestRuleAssertionsRequired.java:53)
	at org.apache.lucene.util.TestRuleMarkFailure$1.evaluate(TestRuleMarkFailure.java:47)
	at org.apache.lucene.util.TestRuleIgnoreAfterMaxFailures$1.evaluate(TestRuleIgnoreAfterMaxFailures.java:64)
	at org.apache.lucene.util.TestRuleIgnoreTestSuites$1.evaluate(TestRuleIgnoreTestSuites.java:54)
	at com.carrotsearch.randomizedtesting.rules.StatementAdapter.evaluate(StatementAdapter.java:36)
	at com.carrotsearch.randomizedtesting.ThreadLeakControl$StatementRunner.run(ThreadLeakControl.java:367)
	at java.lang.Thread.run(Thread.java:745)




Build Log:
[...truncated 12964 lines...]
   [junit4] Suite: org.apache.solr.client.solrj.impl.CloudSolrClientTest
   [junit4]   2> Creating dataDir: /export/home/jenkins/workspace/Lucene-Solr-5.x-Solaris/solr/build/solr-solrj/test/J1/temp/solr.client.solrj.impl.CloudSolrClientTest_4C49404629846E7C-001/init-core-data-001
   [junit4]   2> 93245 INFO  (SUITE-CloudSolrClientTest-seed#[4C49404629846E7C]-worker) [    ] o.a.s.SolrTestCaseJ4 Randomized ssl (false) and clientAuth (false)
   [junit4]   2> 93245 INFO  (SUITE-CloudSolrClientTest-seed#[4C49404629846E7C]-worker) [    ] o.a.s.BaseDistributedSearchTestCase Setting hostContext system property: /
   [junit4]   2> 93247 WARN  (SUITE-CloudSolrClientTest-seed#[4C49404629846E7C]-worker) [    ] o.a.s.c.AbstractZkTestCase TEST_HOME() does not exist - solrj test?
   [junit4]   2> 93255 INFO  (TEST-CloudSolrClientTest.test-seed#[4C49404629846E7C]) [    ] o.a.s.c.ZkTestServer STARTING ZK TEST SERVER
   [junit4]   2> 93257 INFO  (Thread-298) [    ] o.a.s.c.ZkTestServer client port:0.0.0.0/0.0.0.0:0
   [junit4]   2> 93257 INFO  (Thread-298) [    ] o.a.s.c.ZkTestServer Starting server
   [junit4]   2> 93355 INFO  (TEST-CloudSolrClientTest.test-seed#[4C49404629846E7C]) [    ] o.a.s.c.ZkTestServer start zk server on port:56967
   [junit4]   2> 93356 INFO  (TEST-CloudSolrClientTest.test-seed#[4C49404629846E7C]) [    ] o.a.s.c.c.SolrZkClient Using default ZkCredentialsProvider
   [junit4]   2> 93356 INFO  (TEST-CloudSolrClientTest.test-seed#[4C49404629846E7C]) [    ] o.a.s.c.c.ConnectionManager Waiting for client to connect to ZooKeeper
   [junit4]   2> 93362 INFO  (zkCallback-81-thread-1) [    ] o.a.s.c.c.ConnectionManager Watcher org.apache.solr.common.cloud.ConnectionManager@7934060b name:ZooKeeperConnection Watcher:127.0.0.1:56967 got event WatchedEvent state:SyncConnected type:None path:null path:null type:None
   [junit4]   2> 93363 INFO  (TEST-CloudSolrClientTest.test-seed#[4C49404629846E7C]) [    ] o.a.s.c.c.ConnectionManager Client is connected to ZooKeeper
   [junit4]   2> 93363 INFO  (TEST-CloudSolrClientTest.test-seed#[4C49404629846E7C]) [    ] o.a.s.c.c.SolrZkClient Using default ZkACLProvider
   [junit4]   2> 93363 INFO  (TEST-CloudSolrClientTest.test-seed#[4C49404629846E7C]) [    ] o.a.s.c.c.SolrZkClient makePath: /solr
   [junit4]   2> 93375 INFO  (TEST-CloudSolrClientTest.test-seed#[4C49404629846E7C]) [    ] o.a.s.c.c.SolrZkClient Using default ZkCredentialsProvider
   [junit4]   2> 93376 INFO  (TEST-CloudSolrClientTest.test-seed#[4C49404629846E7C]) [    ] o.a.s.c.c.ConnectionManager Waiting for client to connect to ZooKeeper
   [junit4]   2> 93407 INFO  (zkCallback-82-thread-1) [    ] o.a.s.c.c.ConnectionManager Watcher org.apache.solr.common.cloud.ConnectionManager@4516b5b2 name:ZooKeeperConnection Watcher:127.0.0.1:56967/solr got event WatchedEvent state:SyncConnected type:None path:null path:null type:None
   [junit4]   2> 93408 INFO  (TEST-CloudSolrClientTest.test-seed#[4C49404629846E7C]) [    ] o.a.s.c.c.ConnectionManager Client is connected to ZooKeeper
   [junit4]   2> 93408 INFO  (TEST-CloudSolrClientTest.test-seed#[4C49404629846E7C]) [    ] o.a.s.c.c.SolrZkClient Using default ZkACLProvider
   [junit4]   2> 93408 INFO  (TEST-CloudSolrClientTest.test-seed#[4C49404629846E7C]) [    ] o.a.s.c.c.SolrZkClient makePath: /collections/collection1
   [junit4]   2> 93446 INFO  (TEST-CloudSolrClientTest.test-seed#[4C49404629846E7C]) [    ] o.a.s.c.c.SolrZkClient makePath: /collections/collection1/shards
   [junit4]   2> 93450 INFO  (TEST-CloudSolrClientTest.test-seed#[4C49404629846E7C]) [    ] o.a.s.c.c.SolrZkClient makePath: /collections/control_collection
   [junit4]   2> 93452 INFO  (TEST-CloudSolrClientTest.test-seed#[4C49404629846E7C]) [    ] o.a.s.c.c.SolrZkClient makePath: /collections/control_collection/shards
   [junit4]   2> 93460 INFO  (TEST-CloudSolrClientTest.test-seed#[4C49404629846E7C]) [    ] o.a.s.c.AbstractZkTestCase put /export/home/jenkins/workspace/Lucene-Solr-5.x-Solaris/solr/solrj/src/test-files/solrj/solr/collection1/conf/solrconfig.xml to /configs/conf1/solrconfig.xml
   [junit4]   2> 93461 INFO  (TEST-CloudSolrClientTest.test-seed#[4C49404629846E7C]) [    ] o.a.s.c.c.SolrZkClient makePath: /configs/conf1/solrconfig.xml
   [junit4]   2> 93470 INFO  (TEST-CloudSolrClientTest.test-seed#[4C49404629846E7C]) [    ] o.a.s.c.AbstractZkTestCase put /export/home/jenkins/workspace/Lucene-Solr-5.x-Solaris/solr/solrj/src/test-files/solrj/solr/collection1/conf/schema.xml to /configs/conf1/schema.xml
   [junit4]   2> 93470 INFO  (TEST-CloudSolrClientTest.test-seed#[4C49404629846E7C]) [    ] o.a.s.c.c.SolrZkClient makePath: /configs/conf1/schema.xml
   [junit4]   2> 93475 INFO  (TEST-CloudSolrClientTest.test-seed#[4C49404629846E7C]) [    ] o.a.s.c.AbstractZkTestCase skipping /export/home/jenkins/workspace/Lucene-Solr-5.x-Solaris/solr/solrj/src/test-files/solrj/solr/collection1/conf/solrconfig.snippet.randomindexconfig.xml because it doesn't exist
   [junit4]   2> 93475 INFO  (TEST-CloudSolrClientTest.test-seed#[4C49404629846E7C]) [    ] o.a.s.c.AbstractZkTestCase skipping /export/home/jenkins/workspace/Lucene-Solr-5.x-Solaris/solr/solrj/src/test-files/solrj/solr/collection1/conf/stopwords.txt because it doesn't exist
   [junit4]   2> 93475 INFO  (TEST-CloudSolrClientTest.test-seed#[4C49404629846E7C]) [    ] o.a.s.c.AbstractZkTestCase skipping /export/home/jenkins/workspace/Lucene-Solr-5.x-Solaris/solr/solrj/src/test-files/solrj/solr/collection1/conf/protwords.txt because it doesn't exist
   [junit4]   2> 93475 INFO  (TEST-CloudSolrClientTest.test-seed#[4C49404629846E7C]) [    ] o.a.s.c.AbstractZkTestCase skipping /export/home/jenkins/workspace/Lucene-Solr-5.x-Solaris/solr/solrj/src/test-files/solrj/solr/collection1/conf/currency.xml because it doesn't exist
   [junit4]   2> 93475 INFO  (TEST-CloudSolrClientTest.test-seed#[4C49404629846E7C]) [    ] o.a.s.c.AbstractZkTestCase skipping /export/home/jenkins/workspace/Lucene-Solr-5.x-Solaris/solr/solrj/src/test-files/solrj/solr/collection1/conf/enumsConfig.xml because it doesn't exist
   [junit4]   2> 93475 INFO  (TEST-CloudSolrClientTest.test-seed#[4C49404629846E7C]) [    ] o.a.s.c.AbstractZkTestCase skipping /export/home/jenkins/workspace/Lucene-Solr-5.x-Solaris/solr/solrj/src/test-files/solrj/solr/collection1/conf/open-exchange-rates.json because it doesn't exist
   [junit4]   2> 93475 INFO  (TEST-CloudSolrClientTest.test-seed#[4C49404629846E7C]) [    ] o.a.s.c.AbstractZkTestCase skipping /export/home/jenkins/workspace/Lucene-Solr-5.x-Solaris/solr/solrj/src/test-files/solrj/solr/collection1/conf/mapping-ISOLatin1Accent.txt because it doesn't exist
   [junit4]   2> 93475 INFO  (TEST-CloudSolrClientTest.test-seed#[4C49404629846E7C]) [    ] o.a.s.c.AbstractZkTestCase skipping /export/home/jenkins/workspace/Lucene-Solr-5.x-Solaris/solr/solrj/src/test-files/solrj/solr/collection1/conf/old_synonyms.txt because it doesn't exist
   [junit4]   2> 93476 INFO  (TEST-CloudSolrClientTest.test-seed#[4C49404629846E7C]) [    ] o.a.s.c.AbstractZkTestCase skipping /export/home/jenkins/workspace/Lucene-Solr-5.x-Solaris/solr/solrj/src/test-files/solrj/solr/collection1/conf/synonyms.txt because it doesn't exist
   [junit4]   2> 93546 INFO  (TEST-CloudSolrClientTest.test-seed#[4C49404629846E7C]) [    ] o.a.s.SolrTestCaseJ4 Writing core.properties file to /export/home/jenkins/workspace/Lucene-Solr-5.x-Solaris/solr/build/solr-solrj/test/J1/temp/solr.client.solrj.impl.CloudSolrClientTest_4C49404629846E7C-001/control-001/cores/collection1
   [junit4]   2> 93548 INFO  (TEST-CloudSolrClientTest.test-seed#[4C49404629846E7C]) [    ] o.e.j.s.Server jetty-9.2.13.v20150730
   [junit4]   2> 93550 INFO  (TEST-CloudSolrClientTest.test-seed#[4C49404629846E7C]) [    ] o.e.j.s.h.ContextHandler Started o.e.j.s.ServletContextHandler@65e9a148{/,null,AVAILABLE}
   [junit4]   2> 93552 INFO  (TEST-CloudSolrClientTest.test-seed#[4C49404629846E7C]) [    ] o.e.j.s.ServerConnector Started ServerConnector@74458075{HTTP/1.1}{127.0.0.1:34781}
   [junit4]   2> 93552 INFO  (TEST-CloudSolrClientTest.test-seed#[4C49404629846E7C]) [    ] o.e.j.s.Server Started @96469ms
   [junit4]   2> 93552 INFO  (TEST-CloudSolrClientTest.test-seed#[4C49404629846E7C]) [    ] o.a.s.c.s.e.JettySolrRunner Jetty properties: {solr.data.dir=/export/home/jenkins/workspace/Lucene-Solr-5.x-Solaris/solr/build/solr-solrj/test/J1/temp/solr.client.solrj.impl.CloudSolrClientTest_4C49404629846E7C-001/tempDir-001/control/data, hostContext=/, hostPort=34781, coreRootDirectory=/export/home/jenkins/workspace/Lucene-Solr-5.x-Solaris/solr/build/solr-solrj/test/J1/../../../../../../../../../../export/home/jenkins/workspace/Lucene-Solr-5.x-Solaris/solr/build/solr-solrj/test/J1/temp/solr.client.solrj.impl.CloudSolrClientTest_4C49404629846E7C-001/control-001/cores}
   [junit4]   2> 93553 INFO  (TEST-CloudSolrClientTest.test-seed#[4C49404629846E7C]) [    ] o.a.s.s.SolrDispatchFilter SolrDispatchFilter.init(): sun.misc.Launcher$AppClassLoader@6d06d69c
   [junit4]   2> 93553 INFO  (TEST-CloudSolrClientTest.test-seed#[4C49404629846E7C]) [    ] o.a.s.c.SolrResourceLoader new SolrResourceLoader for directory: '/export/home/jenkins/workspace/Lucene-Solr-5.x-Solaris/solr/build/solr-solrj/test/J1/temp/solr.client.solrj.impl.CloudSolrClientTest_4C49404629846E7C-001/control-001'
   [junit4]   2> 93553 INFO  (TEST-CloudSolrClientTest.test-seed#[4C49404629846E7C]) [    ] o.a.s.c.SolrResourceLoader JNDI not configured for solr (NoInitialContextEx)
   [junit4]   2> 93553 INFO  (TEST-CloudSolrClientTest.test-seed#[4C49404629846E7C]) [    ] o.a.s.c.SolrResourceLoader solr home defaulted to 'solr/' (could not find system property or JNDI)
   [junit4]   2> 93553 INFO  (TEST-CloudSolrClientTest.test-seed#[4C49404629846E7C]) [    ] o.a.s.c.c.SolrZkClient Using default ZkCredentialsProvider
   [junit4]   2> 93554 INFO  (TEST-CloudSolrClientTest.test-seed#[4C49404629846E7C]) [    ] o.a.s.c.c.ConnectionManager Waiting for client to connect to ZooKeeper
   [junit4]   2> 93569 INFO  (zkCallback-83-thread-1) [    ] o.a.s.c.c.ConnectionManager Watcher org.apache.solr.common.cloud.ConnectionManager@b07d62e name:ZooKeeperConnection Watcher:127.0.0.1:56967/solr got event WatchedEvent state:SyncConnected type:None path:null path:null type:None
   [junit4]   2> 93570 INFO  (TEST-CloudSolrClientTest.test-seed#[4C49404629846E7C]) [    ] o.a.s.c.c.ConnectionManager Client is connected to ZooKeeper
   [junit4]   2> 93570 INFO  (TEST-CloudSolrClientTest.test-seed#[4C49404629846E7C]) [    ] o.a.s.c.c.SolrZkClient Using default ZkACLProvider
   [junit4]   2> 93576 INFO  (TEST-CloudSolrClientTest.test-seed#[4C49404629846E7C]) [    ] o.a.s.s.SolrDispatchFilter Loading solr.xml from SolrHome (not found in ZooKeeper)
   [junit4]   2> 93576 INFO  (TEST-CloudSolrClientTest.test-seed#[4C49404629846E7C]) [    ] o.a.s.c.SolrXmlConfig Loading container configuration from /export/home/jenkins/workspace/Lucene-Solr-5.x-Solaris/solr/build/solr-solrj/test/J1/temp/solr.client.solrj.impl.CloudSolrClientTest_4C49404629846E7C-001/control-001/solr.xml
   [junit4]   2> 93581 INFO  (TEST-CloudSolrClientTest.test-seed#[4C49404629846E7C]) [    ] o.a.s.c.CorePropertiesLocator Config-defined core root directory: /export/home/jenkins/workspace/Lucene-Solr-5.x-Solaris/solr/build/solr-solrj/test/J1/../../../../../../../../../../export/home/jenkins/workspace/Lucene-Solr-5.x-Solaris/solr/build/solr-solrj/test/J1/temp/solr.client.solrj.impl.CloudSolrClientTest_4C49404629846E7C-001/control-001/cores
   [junit4]   2> 93581 INFO  (TEST-CloudSolrClientTest.test-seed#[4C49404629846E7C]) [    ] o.a.s.c.CoreContainer New CoreContainer 2046669487
   [junit4]   2> 93581 INFO  (TEST-CloudSolrClientTest.test-seed#[4C49404629846E7C]) [    ] o.a.s.c.CoreContainer Loading cores into CoreContainer [instanceDir=/export/home/jenkins/workspace/Lucene-Solr-5.x-Solaris/solr/build/solr-solrj/test/J1/temp/solr.client.solrj.impl.CloudSolrClientTest_4C49404629846E7C-001/control-001]
   [junit4]   2> 93581 WARN  (TEST-CloudSolrClientTest.test-seed#[4C49404629846E7C]) [    ] o.a.s.c.CoreContainer Couldn't add files from /export/home/jenkins/workspace/Lucene-Solr-5.x-Solaris/solr/build/solr-solrj/test/J1/temp/solr.client.solrj.impl.CloudSolrClientTest_4C49404629846E7C-001/control-001/lib to classpath: /export/home/jenkins/workspace/Lucene-Solr-5.x-Solaris/solr/build/solr-solrj/test/J1/temp/solr.client.solrj.impl.CloudSolrClientTest_4C49404629846E7C-001/control-001/lib
   [junit4]   2> 93581 INFO  (TEST-CloudSolrClientTest.test-seed#[4C49404629846E7C]) [    ] o.a.s.h.c.HttpShardHandlerFactory created with socketTimeout : 90000,urlScheme : ,connTimeout : 15000,maxConnectionsPerHost : 20,maxConnections : 10000,corePoolSize : 0,maximumPoolSize : 2147483647,maxThreadIdleTime : 5,sizeOfQueue : -1,fairnessPolicy : false,useRetries : false,
   [junit4]   2> 93582 INFO  (TEST-CloudSolrClientTest.test-seed#[4C49404629846E7C]) [    ] o.a.s.u.UpdateShardHandler Creating UpdateShardHandler HTTP client with params: socketTimeout=340000&connTimeout=45000&retry=true
   [junit4]   2> 93583 INFO  (TEST-CloudSolrClientTest.test-seed#[4C49404629846E7C]) [    ] o.a.s.l.LogWatcher SLF4J impl is org.slf4j.impl.Log4jLoggerFactory
   [junit4]   2> 93583 INFO  (TEST-CloudSolrClientTest.test-seed#[4C49404629846E7C]) [    ] o.a.s.l.LogWatcher Registering Log Listener [Log4j (org.slf4j.impl.Log4jLoggerFactory)]
   [junit4]   2> 93583 INFO  (TEST-CloudSolrClientTest.test-seed#[4C49404629846E7C]) [    ] o.a.s.c.ZkContainer Zookeeper client=127.0.0.1:56967/solr
   [junit4]   2> 93583 INFO  (TEST-CloudSolrClientTest.test-seed#[4C49404629846E7C]) [    ] o.a.s.c.ZkController zkHost includes chroot
   [junit4]   2> 93583 INFO  (TEST-CloudSolrClientTest.test-seed#[4C49404629846E7C]) [    ] o.a.s.c.c.SolrZkClient Using default ZkCredentialsProvider
   [junit4]   2> 93583 INFO  (TEST-CloudSolrClientTest.test-seed#[4C49404629846E7C]) [    ] o.a.s.c.c.ConnectionManager Waiting for client to connect to ZooKeeper
   [junit4]   2> 93586 INFO  (zkCallback-86-thread-1) [    ] o.a.s.c.c.ConnectionManager Watcher org.apache.solr.common.cloud.ConnectionManager@35e9b0bf name:ZooKeeperConnection Watcher:127.0.0.1:56967 got event WatchedEvent state:SyncConnected type:None path:null path:null type:None
   [junit4]   2> 93593 INFO  (TEST-CloudSolrClientTest.test-seed#[4C49404629846E7C]) [    ] o.a.s.c.c.ConnectionManager Client is connected to ZooKeeper
   [junit4]   2> 93593 INFO  (TEST-CloudSolrClientTest.test-seed#[4C49404629846E7C]) [    ] o.a.s.c.c.SolrZkClient Using default ZkACLProvider
   [junit4]   2> 93632 INFO  (TEST-CloudSolrClientTest.test-seed#[4C49404629846E7C]) [n:127.0.0.1:34781_    ] o.a.s.c.c.ConnectionManager Waiting for client to connect to ZooKeeper
   [junit4]   2> 93636 INFO  (zkCallback-87-thread-1-processing-n:127.0.0.1:34781_) [n:127.0.0.1:34781_    ] o.a.s.c.c.ConnectionManager Watcher org.apache.solr.common.cloud.ConnectionManager@23393db9 name:ZooKeeperConnection Watcher:127.0.0.1:56967/solr got event WatchedEvent state:SyncConnected type:None path:null path:null type:None
   [junit4]   2> 93636 INFO  (TEST-CloudSolrClientTest.test-seed#[4C49404629846E7C]) [n:127.0.0.1:34781_    ] o.a.s.c.c.ConnectionManager Client is connected to ZooKeeper
   [junit4]   2> 93640 INFO  (TEST-CloudSolrClientTest.test-seed#[4C49404629846E7C]) [n:127.0.0.1:34781_    ] o.a.s.c.c.SolrZkClient makePath: /overseer/queue
   [junit4]   2> 93676 INFO  (TEST-CloudSolrClientTest.test-seed#[4C49404629846E7C]) [n:127.0.0.1:34781_    ] o.a.s.c.c.SolrZkClient makePath: /overseer/collection-queue-work
   [junit4]   2> 93697 INFO  (TEST-CloudSolrClientTest.test-seed#[4C49404629846E7C]) [n:127.0.0.1:34781_    ] o.a.s.c.c.SolrZkClient makePath: /overseer/collection-map-running
   [junit4]   2> 93699 INFO  (TEST-CloudSolrClientTest.test-seed#[4C49404629846E7C]) [n:127.0.0.1:34781_    ] o.a.s.c.c.SolrZkClient makePath: /overseer/collection-map-completed
   [junit4]   2> 93702 INFO  (TEST-CloudSolrClientTest.test-seed#[4C49404629846E7C]) [n:127.0.0.1:34781_    ] o.a.s.c.c.SolrZkClient makePath: /overseer/collection-map-failure
   [junit4]   2> 93721 INFO  (TEST-CloudSolrClientTest.test-seed#[4C49404629846E7C]) [n:127.0.0.1:34781_    ] o.a.s.c.c.SolrZkClient makePath: /live_nodes
   [junit4]   2> 93723 INFO  (TEST-CloudSolrClientTest.test-seed#[4C49404629846E7C]) [n:127.0.0.1:34781_    ] o.a.s.c.c.SolrZkClient makePath: /aliases.json
   [junit4]   2> 93725 INFO  (TEST-CloudSolrClientTest.test-seed#[4C49404629846E7C]) [n:127.0.0.1:34781_    ] o.a.s.c.c.SolrZkClient makePath: /clusterstate.json
   [junit4]   2> 93728 INFO  (TEST-CloudSolrClientTest.test-seed#[4C49404629846E7C]) [n:127.0.0.1:34781_    ] o.a.s.c.c.SolrZkClient makePath: /security.json
   [junit4]   2> 93729 INFO  (TEST-CloudSolrClientTest.test-seed#[4C49404629846E7C]) [n:127.0.0.1:34781_    ] o.a.s.c.ZkController Register node as live in ZooKeeper:/live_nodes/127.0.0.1:34781_
   [junit4]   2> 93730 INFO  (TEST-CloudSolrClientTest.test-seed#[4C49404629846E7C]) [n:127.0.0.1:34781_    ] o.a.s.c.c.SolrZkClient makePath: /live_nodes/127.0.0.1:34781_
   [junit4]   2> 93733 INFO  (TEST-CloudSolrClientTest.test-seed#[4C49404629846E7C]) [n:127.0.0.1:34781_    ] o.a.s.c.c.SolrZkClient makePath: /overseer_elect
   [junit4]   2> 93734 INFO  (TEST-CloudSolrClientTest.test-seed#[4C49404629846E7C]) [n:127.0.0.1:34781_    ] o.a.s.c.c.SolrZkClient makePath: /overseer_elect/election
   [junit4]   2> 93738 INFO  (TEST-CloudSolrClientTest.test-seed#[4C49404629846E7C]) [n:127.0.0.1:34781_    ] o.a.s.c.Overseer Overseer (id=null) closing
   [junit4]   2> 93743 INFO  (TEST-CloudSolrClientTest.test-seed#[4C49404629846E7C]) [n:127.0.0.1:34781_    ] o.a.s.c.LeaderElector Joined leadership election with path: /overseer_elect/election/95354090838491140-127.0.0.1:34781_-n_0000000000
   [junit4]   2> 93744 INFO  (TEST-CloudSolrClientTest.test-seed#[4C49404629846E7C]) [n:127.0.0.1:34781_    ] o.a.s.c.OverseerElectionContext I am going to be the leader 127.0.0.1:34781_
   [junit4]   2> 93744 INFO  (TEST-CloudSolrClientTest.test-seed#[4C49404629846E7C]) [n:127.0.0.1:34781_    ] o.a.s.c.c.SolrZkClient makePath: /overseer_elect/leader
   [junit4]   2> 93746 INFO  (TEST-CloudSolrClientTest.test-seed#[4C49404629846E7C]) [n:127.0.0.1:34781_    ] o.a.s.c.Overseer Overseer (id=95354090838491140-127.0.0.1:34781_-n_0000000000) starting
   [junit4]   2> 93748 INFO  (TEST-CloudSolrClientTest.test-seed#[4C49404629846E7C]) [n:127.0.0.1:34781_    ] o.a.s.c.c.SolrZkClient makePath: /overseer/queue-work
   [junit4]   2> 93759 INFO  (TEST-CloudSolrClientTest.test-seed#[4C49404629846E7C]) [n:127.0.0.1:34781_    ] o.a.s.c.OverseerAutoReplicaFailoverThread Starting OverseerAutoReplicaFailoverThread autoReplicaFailoverWorkLoopDelay=10000 autoReplicaFailoverWaitAfterExpiration=30000 autoReplicaFailoverBadNodeExpiration=60000
   [junit4]   2> 93759 INFO  (TEST-CloudSolrClientTest.test-seed#[4C49404629846E7C]) [n:127.0.0.1:34781_    ] o.a.s.c.c.ZkStateReader Updating cluster state from ZooKeeper... 
   [junit4]   2> 93775 INFO  (OverseerCollectionConfigSetProcessor-95354090838491140-127.0.0.1:34781_-n_0000000000) [n:127.0.0.1:34781_    ] o.a.s.c.OverseerTaskProcessor Process current queue of overseer operations
   [junit4]   2> 93782 INFO  (OverseerStateUpdate-95354090838491140-127.0.0.1:34781_-n_0000000000) [n:127.0.0.1:34781_    ] o.a.s.c.Overseer Starting to work on the main queue
   [junit4]   2> 93790 INFO  (TEST-CloudSolrClientTest.test-seed#[4C49404629846E7C]) [n:127.0.0.1:34781_    ] o.a.s.c.CoreContainer Security conf doesn't exist. Skipping setup for authorization module.
   [junit4]   2> 93790 INFO  (TEST-CloudSolrClientTest.test-seed#[4C49404629846E7C]) [n:127.0.0.1:34781_    ] o.a.s.c.CoreContainer No authentication plugin used.
   [junit4]   2> 93791 INFO  (TEST-CloudSolrClientTest.test-seed#[4C49404629846E7C]) [n:127.0.0.1:34781_    ] o.a.s.c.CorePropertiesLocator Looking for core definitions underneath /export/home/jenkins/workspace/Lucene-Solr-5.x-Solaris/solr/build/solr-solrj/test/J1/../../../../../../../../../../export/home/jenkins/workspace/Lucene-Solr-5.x-Solaris/solr/build/solr-solrj/test/J1/temp/solr.client.solrj.impl.CloudSolrClientTest_4C49404629846E7C-001/control-001/cores
   [junit4]   2> 93795 INFO  (TEST-CloudSolrClientTest.test-seed#[4C49404629846E7C]) [n:127.0.0.1:34781_    ] o.a.s.c.CoreDescriptor Created CoreDescriptor: {name=collection1, config=solrconfig.xml, transient=false, schema=schema.xml, loadOnStartup=true, configSetProperties=configsetprops.json, collection=control_collection, coreNodeName=, dataDir=data/, shard=}
   [junit4]   2> 93795 INFO  (TEST-CloudSolrClientTest.test-seed#[4C49404629846E7C]) [n:127.0.0.1:34781_    ] o.a.s.c.CorePropertiesLocator Found core collection1 in /export/home/jenkins/workspace/Lucene-Solr-5.x-Solaris/solr/build/solr-solrj/test/J1/../../../../../../../../../../export/home/jenkins/workspace/Lucene-Solr-5.x-Solaris/solr/build/solr-solrj/test/J1/temp/solr.client.solrj.impl.CloudSolrClientTest_4C49404629846E7C-001/control-001/cores/collection1
   [junit4]   2> 93795 INFO  (TEST-CloudSolrClientTest.test-seed#[4C49404629846E7C]) [n:127.0.0.1:34781_    ] o.a.s.c.CorePropertiesLocator Found 1 core definitions
   [junit4]   2> 93796 INFO  (TEST-CloudSolrClientTest.test-seed#[4C49404629846E7C]) [n:127.0.0.1:34781_    ] o.a.s.s.SolrDispatchFilter user.dir=/export/home/jenkins/workspace/Lucene-Solr-5.x-Solaris/solr/build/solr-solrj/test/J1
   [junit4]   2> 93796 INFO  (TEST-CloudSolrClientTest.test-seed#[4C49404629846E7C]) [n:127.0.0.1:34781_    ] o.a.s.s.SolrDispatchFilter SolrDispatchFilter.init() done
   [junit4]   2> 93798 INFO  (coreLoadExecutor-374-thread-1-processing-n:127.0.0.1:34781_) [n:127.0.0.1:34781_ c:control_collection   x:collection1] o.a.s.c.ZkController publishing state=down
   [junit4]   2> 93798 INFO  (coreLoadExecutor-374-thread-1-processing-n:127.0.0.1:34781_) [n:127.0.0.1:34781_ c:control_collection   x:collection1] o.a.s.c.ZkController numShards not found on descriptor - reading it from system property
   [junit4]   2> 93804 INFO  (OverseerStateUpdate-95354090838491140-127.0.0.1:34781_-n_0000000000) [n:127.0.0.1:34781_    ] o.a.s.c.Overseer processMessage: queueSize: 1, message = {
   [junit4]   2>   "core":"collection1",
   [junit4]   2>   "roles":null,
   [junit4]   2>   "base_url":"http://127.0.0.1:34781",
   [junit4]   2>   "node_name":"127.0.0.1:34781_",
   [junit4]   2>   "numShards":"1",
   [junit4]   2>   "state":"down",
   [junit4]   2>   "shard":null,
   [junit4]   2>   "collection":"control_collection",
   [junit4]   2>   "operation":"state"} current state version: 0
   [junit4]   2> 93805 INFO  (coreLoadExecutor-374-thread-1-processing-n:127.0.0.1:34781_) [n:127.0.0.1:34781_ c:control_collection   x:collection1] o.a.s.c.ZkController look for our core node name
   [junit4]   2> 93816 INFO  (OverseerStateUpdate-95354090838491140-127.0.0.1:34781_-n_0000000000) [n:127.0.0.1:34781_    ] o.a.s.c.o.ReplicaMutator Update state numShards=1 message={
   [junit4]   2>   "core":"collection1",
   [junit4]   2>   "roles":null,
   [junit4]   2>   "base_url":"http://127.0.0.1:34781",
   [junit4]   2>   "node_name":"127.0.0.1:34781_",
   [junit4]   2>   "numShards":"1",
   [junit4]   2>   "state":"down",
   [junit4]   2>   "shard":null,
   [junit4]   2>   "collection":"control_collection",
   [junit4]   2>   "operation":"state"}
   [junit4]   2> 93817 INFO  (OverseerStateUpdate-95354090838491140-127.0.0.1:34781_-n_0000000000) [n:127.0.0.1:34781_    ] o.a.s.c.o.ClusterStateMutator building a new cName: control_collection
   [junit4]   2> 93829 INFO  (OverseerStateUpdate-95354090838491140-127.0.0.1:34781_-n_0000000000) [n:127.0.0.1:34781_    ] o.a.s.c.o.ReplicaMutator Assigning new node to shard shard=shard1
   [junit4]   2> 93836 INFO  (zkCallback-87-thread-1-processing-n:127.0.0.1:34781_) [n:127.0.0.1:34781_    ] o.a.s.c.c.ZkStateReader A cluster state change: [WatchedEvent state:SyncConnected type:NodeDataChanged path:/clusterstate.json], has occurred - updating... (live nodes size: [1])
   [junit4]   2> 94808 INFO  (coreLoadExecutor-374-thread-1-processing-n:127.0.0.1:34781_) [n:127.0.0.1:34781_ c:control_collection   x:collection1] o.a.s.c.ZkController waiting to find shard id in clusterstate for collection1
   [junit4]   2> 94808 INFO  (coreLoadExecutor-374-thread-1-processing-n:127.0.0.1:34781_) [n:127.0.0.1:34781_ c:control_collection   x:collection1] o.a.s.c.ZkController Check for collection zkNode:control_collection
   [junit4]   2> 94809 INFO  (coreLoadExecutor-374-thread-1-processing-n:127.0.0.1:34781_) [n:127.0.0.1:34781_ c:control_collection   x:collection1] o.a.s.c.ZkController Collection zkNode exists
   [junit4]   2> 94809 INFO  (coreLoadExecutor-374-thread-1-processing-n:127.0.0.1:34781_) [n:127.0.0.1:34781_ c:control_collection   x:collection1] o.a.s.c.c.ZkStateReader Load collection config from: [/collections/control_collection]
   [junit4]   2> 94810 INFO  (coreLoadExecutor-374-thread-1-processing-n:127.0.0.1:34781_) [n:127.0.0.1:34781_ c:control_collection   x:collection1] o.a.s.c.c.ZkStateReader path=[/collections/control_collection] [configName]=[conf1] specified config exists in ZooKeeper
   [junit4]   2> 94811 INFO  (coreLoadExecutor-374-thread-1-processing-n:127.0.0.1:34781_) [n:127.0.0.1:34781_ c:control_collection   x:collection1] o.a.s.c.SolrResourceLoader new SolrResourceLoader for directory: '/export/home/jenkins/workspace/Lucene-Solr-5.x-Solaris/solr/build/solr-solrj/test/J1/temp/solr.client.solrj.impl.CloudSolrClientTest_4C49404629846E7C-001/control-001/cores/collection1'
   [junit4]   2> 94811 INFO  (coreLoadExecutor-374-thread-1-processing-n:127.0.0.1:34781_) [n:127.0.0.1:34781_ c:control_collection   x:collection1] o.a.s.c.SolrResourceLoader JNDI not configured for solr (NoInitialContextEx)
   [junit4]   2> 94811 INFO  (coreLoadExecutor-374-thread-1-processing-n:127.0.0.1:34781_) [n:127.0.0.1:34781_ c:control_collection   x:collection1] o.a.s.c.SolrResourceLoader solr home defaulted to 'solr/' (could not find system property or JNDI)
   [junit4]   2> 94813 INFO  (coreLoadExecutor-374-thread-1-processing-n:127.0.0.1:34781_) [n:127.0.0.1:34781_ c:control_collection   x:collection1] o.a.s.c.Config loaded config solrconfig.xml with version 0 
   [junit4]   2> 94818 INFO  (coreLoadExecutor-374-thread-1-processing-n:127.0.0.1:34781_) [n:127.0.0.1:34781_ c:control_collection   x:collection1] o.a.s.c.SolrConfig current version of requestparams : -1
   [junit4]   2> 94820 WARN  (coreLoadExecutor-374-thread-1-processing-n:127.0.0.1:34781_) [n:127.0.0.1:34781_ c:control_collection   x:collection1] o.a.s.c.Config Beginning with Solr 5.5, <maxMergeDocs> is deprecated, configure it on the relevant <mergePolicyFactory> instead.
   [junit4]   2> 94820 WARN  (coreLoadExecutor-374-thread-1-processing-n:127.0.0.1:34781_) [n:127.0.0.1:34781_ c:control_collection   x:collection1] o.a.s.c.Config Beginning with Solr 5.5, <mergeFactor> is deprecated, configure it on the relevant <mergePolicyFactory> instead.
   [junit4]   2> 94820 INFO  (coreLoadExecutor-374-thread-1-processing-n:127.0.0.1:34781_) [n:127.0.0.1:34781_ c:control_collection   x:collection1] o.a.s.c.SolrConfig Using Lucene MatchVersion: 5.5.0
   [junit4]   2> 94829 INFO  (coreLoadExecutor-374-thread-1-processing-n:127.0.0.1:34781_) [n:127.0.0.1:34781_ c:control_collection   x:collection1] o.a.s.c.SolrConfig Loaded SolrConfig: solrconfig.xml
   [junit4]   2> 94835 INFO  (coreLoadExecutor-374-thread-1-processing-n:127.0.0.1:34781_) [n:127.0.0.1:34781_ c:control_collection   x:collection1] o.a.s.s.IndexSchema [collection1] Schema name=test
   [junit4]   2> 94895 INFO  (coreLoadExecutor-374-thread-1-processing-n:127.0.0.1:34781_) [n:127.0.0.1:34781_ c:control_collection   x:collection1] o.a.s.s.IndexSchema default search field in schema is text
   [junit4]   2> 94896 INFO  (coreLoadExecutor-374-thread-1-processing-n:127.0.0.1:34781_) [n:127.0.0.1:34781_ c:control_collection   x:collection1] o.a.s.s.IndexSchema unique key field: id
   [junit4]   2> 94896 WARN  (coreLoadExecutor-374-thread-1-processing-n:127.0.0.1:34781_) [n:127.0.0.1:34781_ c:control_collection   x:collection1] o.a.s.s.IndexSchema Field lowerfilt1and2 is not multivalued and destination for multiple copyFields (2)
   [junit4]   2> 94896 WARN  (coreLoadExecutor-374-thread-1-processing-n:127.0.0.1:34781_) [n:127.0.0.1:34781_ c:control_collection   x:collection1] o.a.s.s.IndexSchema Field text is not multivalued and destination for multiple copyFields (3)
   [junit4]   2> 94898 INFO  (coreLoadExecutor-374-thread-1-processing-n:127.0.0.1:34781_) [n:127.0.0.1:34781_ c:control_collection   x:collection1] o.a.s.c.ConfigSetProperties Did not find ConfigSet properties, assuming default properties: Can't find resource 'configsetprops.json' in classpath or '/configs/conf1', cwd=/export/home/jenkins/workspace/Lucene-Solr-5.x-Solaris/solr/build/solr-solrj/test/J1
   [junit4]   2> 94898 INFO  (coreLoadExecutor-374-thread-1-processing-n:127.0.0.1:34781_) [n:127.0.0.1:34781_ c:control_collection   x:collection1] o.a.s.c.CoreContainer Creating SolrCore 'collection1' using configuration from collection control_collection
   [junit4]   2> 94898 INFO  (coreLoadExecutor-374-thread-1-processing-n:127.0.0.1:34781_) [n:127.0.0.1:34781_ c:control_collection s:shard1 r:core_node1 x:collection1] o.a.s.c.SolrCore org.apache.solr.core.MockDirectoryFactory
   [junit4]   2> 94898 INFO  (coreLoadExecutor-374-thread-1-processing-n:127.0.0.1:34781_) [n:127.0.0.1:34781_ c:control_collection s:shard1 r:core_node1 x:collection1] o.a.s.c.SolrCore [[collection1] ] Opening new SolrCore at [/export/home/jenkins/workspace/Lucene-Solr-5.x-Solaris/solr/build/solr-solrj/test/J1/temp/solr.client.solrj.impl.CloudSolrClientTest_4C49404629846E7C-001/control-001/cores/collection1], dataDir=[/export/home/jenkins/workspace/Lucene-Solr-5.x-Solaris/solr/build/solr-solrj/test/J1/../../../../../../../../../../export/home/jenkins/workspace/Lucene-Solr-5.x-Solaris/solr/build/solr-solrj/test/J1/temp/solr.client.solrj.impl.CloudSolrClientTest_4C49404629846E7C-001/control-001/cores/collection1/data/]
   [junit4]   2> 94899 INFO  (coreLoadExecutor-374-thread-1-processing-n:127.0.0.1:34781_) [n:127.0.0.1:34781_ c:control_collection s:shard1 r:core_node1 x:collection1] o.a.s.c.SolrCore JMX monitoring not detected for core: collection1
   [junit4]   2> 94899 INFO  (coreLoadExecutor-374-thread-1-processing-n:127.0.0.1:34781_) [n:127.0.0.1:34781_ c:control_collection s:shard1 r:core_node1 x:collection1] o.a.s.c.CachingDirectoryFactory return new directory for /export/home/jenkins/workspace/Lucene-Solr-5.x-Solaris/solr/build/solr-solrj/test/J1/../../../../../../../../../../export/home/jenkins/workspace/Lucene-Solr-5.x-Solaris/solr/build/solr-solrj/test/J1/temp/solr.client.solrj.impl.CloudSolrClientTest_4C49404629846E7C-001/control-001/cores/collection1/data
   [junit4]   2> 94899 INFO  (coreLoadExecutor-374-thread-1-processing-n:127.0.0.1:34781_) [n:127.0.0.1:34781_ c:control_collection s:shard1 r:core_node1 x:collection1] o.a.s.c.SolrCore New index directory detected: old=null new=/export/home/jenkins/workspace/Lucene-Solr-5.x-Solaris/solr/build/solr-solrj/test/J1/../../../../../../../../../../export/home/jenkins/workspace/Lucene-Solr-5.x-Solaris/solr/build/solr-solrj/test/J1/temp/solr.client.solrj.impl.CloudSolrClientTest_4C49404629846E7C-001/control-001/cores/collection1/data/index/
   [junit4]   2> 94899 WARN  (coreLoadExecutor-374-thread-1-processing-n:127.0.0.1:34781_) [n:127.0.0.1:34781_ c:control_collection s:shard1 r:core_node1 x:collection1] o.a.s.c.SolrCore [collection1] Solr index directory '/export/home/jenkins/workspace/Lucene-Solr-5.x-Solaris/solr/build/solr-solrj/test/J1/../../../../../../../../../../export/home/jenkins/workspace/Lucene-Solr-5.x-Solaris/solr/build/solr-solrj/test/J1/temp/solr.client.solrj.impl.CloudSolrClientTest_4C49404629846E7C-001/control-001/cores/collection1/data/index' doesn't exist. Creating new index...
   [junit4]   2> 94899 INFO  (coreLoadExecutor-374-thread-1-processing-n:127.0.0.1:34781_) [n:127.0.0.1:34781_ c:control_collection s:shard1 r:core_node1 x:collection1] o.a.s.c.CachingDirectoryFactory return new directory for /export/home/jenkins/workspace/Lucene-Solr-5.x-Solaris/solr/build/solr-solrj/test/J1/../../../../../../../../../../export/home/jenkins/workspace/Lucene-Solr-5.x-Solaris/solr/build/solr-solrj/test/J1/temp/solr.client.solrj.impl.CloudSolrClientTest_4C49404629846E7C-001/control-001/cores/collection1/data/index
   [junit4]   2> 94900 INFO  (coreLoadExecutor-374-thread-1-processing-n:127.0.0.1:34781_) [n:127.0.0.1:34781_ c:control_collection s:shard1 r:core_node1 x:collection1] o.a.s.c.SolrDeletionPolicy SolrDeletionPolicy.onCommit: commits: num=1
   [junit4]   2> 	commit{dir=MockDirectoryWrapper(RAMDirectory@4c213a5c lockFactory=org.apache.lucene.store.SingleInstanceLockFactory@54141a57),segFN=segments_1,generation=1}
   [junit4]   2> 94900 INFO  (coreLoadExecutor-374-thread-1-processing-n:127.0.0.1:34781_) [n:127.0.0.1:34781_ c:control_collection s:shard1 r:core_node1 x:collection1] o.a.s.c.SolrDeletionPolicy newest commit generation = 1
   [junit4]   2> 94901 INFO  (OldIndexDirectoryCleanupThreadForCore-collection1) [n:127.0.0.1:34781_ c:control_collection s:shard1 r:core_node1 x:collection1] o.a.s.c.SolrCore Looking for old index directories to cleanup for core collection1 in /export/home/jenkins/workspace/Lucene-Solr-5.x-Solaris/solr/build/solr-solrj/test/J1/../../../../../../../../../../export/home/jenkins/workspace/Lucene-Solr-5.x-Solaris/solr/build/solr-solrj/test/J1/temp/solr.client.solrj.impl.CloudSolrClientTest_4C49404629846E7C-001/control-001/cores/collection1/data/
   [junit4]   2> 94901 WARN  (OldIndexDirectoryCleanupThreadForCore-collection1) [n:127.0.0.1:34781_ c:control_collection s:shard1 r:core_node1 x:collection1] o.a.s.c.DirectoryFactory /export/home/jenkins/workspace/Lucene-Solr-5.x-Solaris/solr/build/solr-solrj/test/J1/../../../../../../../../../../export/home/jenkins/workspace/Lucene-Solr-5.x-Solaris/solr/build/solr-solrj/test/J1/temp/solr.client.solrj.impl.CloudSolrClientTest_4C49404629846E7C-001/control-001/cores/collection1/data/ does not point to a valid data directory; skipping clean-up of old index directories.
   [junit4]   2> 94904 INFO  (coreLoadExecutor-374-thread-1-processing-n:127.0.0.1:34781_) [n:127.0.0.1:34781_ c:control_collection s:shard1 r:core_node1 x:collection1] o.a.s.c.SolrCore no updateRequestProcessorChain defined as default, creating implicit default
   [junit4]   2> 94906 INFO  (coreLoadExecutor-374-thread-1-processing-n:127.0.0.1:34781_) [n:127.0.0.1:34781_ c:control_collection s:shard1 r:core_node1 x:collection1] o.a.s.h.l.XMLLoader xsltCacheLifetimeSeconds=60
   [junit4]   2> 94907 INFO  (coreLoadExecutor-374-thread-1-processing-n:127.0.0.1:34781_) [n:127.0.0.1:34781_ c:control_collection s:shard1 r:core_node1 x:collection1] o.a.s.h.l.XMLLoader xsltCacheLifetimeSeconds=60
   [junit4]   2> 94907 INFO  (coreLoadExecutor-374-thread-1-processing-n:127.0.0.1:34781_) [n:127.0.0.1:34781_ c:control_collection s:shard1 r:core_node1 x:collection1] o.a.s.h.l.XMLLoader xsltCacheLifetimeSeconds=60
   [junit4]   2> 94908 INFO  (coreLoadExecutor-374-thread-1-processing-n:127.0.0.1:34781_) [n:127.0.0.1:34781_ c:control_collection s:shard1 r:core_node1 x:collection1] o.a.s.h.l.XMLLoader xsltCacheLifetimeSeconds=60
   [junit4]   2> 94910 INFO  (coreLoadExecutor-374-thread-1-processing-n:127.0.0.1:34781_) [n:127.0.0.1:34781_ c:control_collection s:shard1 r:core_node1 x:collection1] o.a.s.c.RequestHandlers Registered paths: /admin/mbeans,standard,,/update/csv,/update/json/docs,/admin/luke,/admin/segments,/get,/admin/system,/replication,/admin/properties,/config,/schema,/admin/plugins,/admin/logging,/update/json,/admin/threads,/admin/ping,/update,/admin/file
   [junit4]   2> 94910 INFO  (coreLoadExecutor-374-thread-1-processing-n:127.0.0.1:34781_) [n:127.0.0.1:34781_ c:control_collection s:shard1 r:core_node1 x:collection1] o.a.s.c.SolrCore Using default statsCache cache: org.apache.solr.search.stats.LocalStatsCache
   [junit4]   2> 94911 INFO  (coreLoadExecutor-374-thread-1-processing-n:127.0.0.1:34781_) [n:127.0.0.1:34781_ c:control_collection s:shard1 r:core_node1 x:collection1] o.a.s.u.UpdateHandler Using UpdateLog implementation: org.apache.solr.update.UpdateLog
   [junit4]   2> 94911 INFO  (coreLoadExecutor-374-thread-1-processing-n:127.0.0.1:34781_) [n:127.0.0.1:34781_ c:control_collection s:shard1 r:core_node1 x:collection1] o.a.s.u.UpdateLog Initializing UpdateLog: dataDir= defaultSyncLevel=FLUSH numRecordsToKeep=100 maxNumLogsToKeep=10 numVersionBuckets=65536
   [junit4]   2> 94912 INFO  (coreLoadExecutor-374-thread-1-processing-n:127.0.0.1:34781_) [n:127.0.0.1:34781_ c:control_collection s:shard1 r:core_node1 x:collection1] o.a.s.u.CommitTracker Hard AutoCommit: disabled
   [junit4]   2> 94912 INFO  (coreLoadExecutor-374-thread-1-processing-n:127.0.0.1:34781_) [n:127.0.0.1:34781_ c:control_collection s:shard1 r:core_node1 x:collection1] o.a.s.u.CommitTracker Soft AutoCommit: disabled
   [junit4]   2> 94913 INFO  (coreLoadExecutor-374-thread-1-processing-n:127.0.0.1:34781_) [n:127.0.0.1:34781_ c:control_collection s:shard1 r:core_node1 x:collection1] o.a.s.c.SolrDeletionPolicy SolrDeletionPolicy.onInit: commits: num=1
   [junit4]   2> 	commit{dir=MockDirectoryWrapper(RAMDirectory@4c213a5c lockFactory=org.apache.lucene.store.SingleInstanceLockFactory@54141a57),segFN=segments_1,generation=1}
   [junit4]   2> 94913 INFO  (coreLoadExecutor-374-thread-1-processing-n:127.0.0.1:34781_) [n:127.0.0.1:34781_ c:control_collection s:shard1 r:core_node1 x:collection1] o.a.s.c.SolrDeletionPolicy newest commit generation = 1
   [junit4]   2> 94913 INFO  (coreLoadExecutor-374-thread-1-processing-n:127.0.0.1:34781_) [n:127.0.0.1:34781_ c:control_collection s:shard1 r:core_node1 x:collection1] o.a.s.s.SolrIndexSearcher Opening Searcher@782a6f91[collection1] main
   [junit4]   2> 94913 INFO  (coreLoadExecutor-374-thread-1-processing-n:127.0.0.1:34781_) [n:127.0.0.1:34781_ c:control_collection s:shard1 r:core_node1 x:collection1] o.a.s.c.c.ZkStateReader Load collection config from: [/collections/control_collection]
   [junit4]   2> 94915 INFO  (coreLoadExecutor-374-thread-1-processing-n:127.0.0.1:34781_) [n:127.0.0.1:34781_ c:control_collection s:shard1 r:core_node1 x:collection1] o.a.s.c.c.ZkStateReader path=[/collections/control_collection] [configName]=[conf1] specified config exists in ZooKeeper
   [junit4]   2> 94915 INFO  (coreLoadExecutor-374-thread-1-processing-n:127.0.0.1:34781_) [n:127.0.0.1:34781_ c:control_collection s:shard1 r:core_node1 x:collection1] o.a.s.r.ManagedResourceStorage Setting up ZooKeeper-based storage for the RestManager with znodeBase: /configs/conf1
   [junit4]   2> 94919 INFO  (coreLoadExecutor-374-thread-1-processing-n:127.0.0.1:34781_) [n:127.0.0.1:34781_ c:control_collection s:shard1 r:core_node1 x:collection1] o.a.s.r.ManagedResourceStorage Configured ZooKeeperStorageIO with znodeBase: /configs/conf1
   [junit4]   2> 94920 INFO  (coreLoadExecutor-374-thread-1-processing-n:127.0.0.1:34781_) [n:127.0.0.1:34781_ c:control_collection s:shard1 r:core_node1 x:collection1] o.a.s.r.RestManager Initializing RestManager with initArgs: {}
   [junit4]   2> 94920 INFO  (coreLoadExecutor-374-thread-1-processing-n:127.0.0.1:34781_) [n:127.0.0.1:34781_ c:control_collection s:shard1 r:core_node1 x:collection1] o.a.s.r.ManagedResourceStorage Reading _rest_managed.json using ZooKeeperStorageIO:path=/configs/conf1
   [junit4]   2> 94921 INFO  (coreLoadExecutor-374-thread-1-processing-n:127.0.0.1:34781_) [n:127.0.0.1:34781_ c:control_collection s:shard1 r:core_node1 x:collection1] o.a.s.r.ManagedResourceStorage No data found for znode /configs/conf1/_rest_managed.json
   [junit4]   2> 94921 INFO  (coreLoadExecutor-374-thread-1-processing-n:127.0.0.1:34781_) [n:127.0.0.1:34781_ c:control_collection s:shard1 r:core_node1 x:collection1] o.a.s.r.ManagedResourceStorage Loaded null at path _rest_managed.json using ZooKeeperStorageIO:path=/configs/conf1
   [junit4]   2> 94921 INFO  (coreLoadExecutor-374-thread-1-processing-n:127.0.0.1:34781_) [n:127.0.0.1:34781_ c:control_collection s:shard1 r:core_node1 x:collection1] o.a.s.r.RestManager Initializing 0 registered ManagedResources
   [junit4]   2> 94921 INFO  (coreLoadExecutor-374-thread-1-processing-n:127.0.0.1:34781_) [n:127.0.0.1:34781_ c:control_collection s:shard1 r:core_node1 x:collection1] o.a.s.h.ReplicationHandler Commits will be reserved for  10000
   [junit4]   2> 94921 INFO  (coreLoadExecutor-374-thread-1-processing-n:127.0.0.1:34781_) [n:127.0.0.1:34781_ c:control_collection s:shard1 r:core_node1 x:collection1] o.a.s.u.UpdateLog Looking up max value of version field to seed version buckets
   [junit4]   2> 94922 INFO  (coreLoadExecutor-374-thread-1-processing-n:127.0.0.1:34781_) [n:127.0.0.1:34781_ c:control_collection s:shard1 r:core_node1 x:collection1] o.a.s.u.VersionInfo Refreshing highest value of _version_ for 65536 version buckets from index
   [junit4]   2> 94922 INFO  (coreLoadExecutor-374-thread-1-processing-n:127.0.0.1:34781_) [n:127.0.0.1:34781_ c:control_collection s:shard1 r:core_node1 x:collection1] o.a.s.u.VersionInfo No terms found for _version_, cannot seed version bucket highest value from index
   [junit4]   2> 94922 INFO  (searcherExecutor-376-thread-1-processing-n:127.0.0.1:34781_ x:collection1 s:shard1 c:control_collection r:core_node1) [n:127.0.0.1:34781_ c:control_collection s:shard1 r:core_node1 x:collection1] o.a.s.c.SolrCore [collection1] Registered new searcher Searcher@782a6f91[collection1] main{ExitableDirectoryReader(UninvertingDirectoryReader())}
   [junit4]   2> 94922 INFO  (coreLoadExecutor-374-thread-1-processing-n:127.0.0.1:34781_) [n:127.0.0.1:34781_ c:control_collection s:shard1 r:core_node1 x:collection1] o.a.s.u.UpdateLog Could not find max version in index or recent updates, using new clock 1525665455158591488
   [junit4]   2> 94924 INFO  (coreLoadExecutor-374-thread-1-processing-n:127.0.0.1:34781_) [n:127.0.0.1:34781_ c:control_collection s:shard1 r:core_node1 x:collection1] o.a.s.u.UpdateLog Took 2.0ms to seed version buckets with highest version 1525665455158591488
   [junit4]   2> 94926 INFO  (coreLoadExecutor-374-thread-1-processing-n:127.0.0.1:34781_) [n:127.0.0.1:34781_ c:control_collection s:shard1 r:core_node1 x:collection1] o.a.s.c.ZkController watch zkdir /configs/conf1
   [junit4]   2> 94928 INFO  (coreLoadExecutor-374-thread-1-processing-n:127.0.0.1:34781_) [n:127.0.0.1:34781_ c:control_collection s:shard1 r:core_node1 x:collection1] o.a.s.c.CoreContainer registering core: collection1
   [junit4]   2> 94929 INFO  (coreZkRegister-369-thread-1-processing-n:127.0.0.1:34781_ x:collection1 s:shard1 c:control_collection r:core_node1) [n:127.0.0.1:34781_ c:control_collection s:shard1 r:core_node1 x:collection1] o.a.s.c.ZkController Register replica - core:collection1 address:http://127.0.0.1:34781 collection:control_collection shard:shard1
   [junit4]   2> 94951 INFO  (coreZkRegister-369-thread-1-processing-n:127.0.0.1:34781_ x:collection1 s:shard1 c:control_collection r:core_node1) [n:127.0.0.1:34781_ c:control_collection s:shard1 r:core_node1 x:collection1] o.a.s.c.c.SolrZkClient makePath: /collections/control_collection/leader_elect/shard1/election
   [junit4]   2> 94959 INFO  (coreZkRegister-369-thread-1-processing-n:127.0.0.1:34781_ x:collection1 s:shard1 c:control_collection r:core_node1) [n:127.0.0.1:34781_ c:control_collection s:shard1 r:core_node1 x:collection1] o.a.s.c.LeaderElector Joined leadership election with path: /collections/control_collection/leader_elect/shard1/election/95354090838491140-core_node1-n_0000000000
   [junit4]   2> 94960 INFO  (coreZkRegister-369-thread-1-processing-n:127.0.0.1:34781_ x:collection1 s:shard1 c:control_collection r:core_node1) [n:127.0.0.1:34781_ c:control_collection s:shard1 r:core_node1 x:collection1] o.a.s.c.ShardLeaderElectionContext Running the leader process for shard=shard1 and weAreReplacement=false and leaderVoteWait=0
   [junit4]   2> 94964 INFO  (coreZkRegister-369-thread-1-processing-n:127.0.0.1:34781_ x:collection1 s:shard1 c:control_collection r:core_node1) [n:127.0.0.1:34781_ c:control_collection s:shard1 r:core_node1 x:collection1] o.a.s.c.ShardLeaderElectionContext Enough replicas found to continue.
   [junit4]   2> 94964 INFO  (coreZkRegister-369-thread-1-processing-n:127.0.0.1:34781_ x:collection1 s:shard1 c:control_collection r:core_node1) [n:127.0.0.1:34781_ c:control_collection s:shard1 r:core_node1 x:collection1] o.a.s.c.ShardLeaderElectionContext I may be the new leader - try and sync
   [junit4]   2> 94964 INFO  (OverseerStateUpdate-95354090838491140-127.0.0.1:34781_-n_0000000000) [n:127.0.0.1:34781_    ] o.a.s.c.Overseer processMessage: queueSize: 1, message = {
   [junit4]   2>   "operation":"leader",
   [junit4]   2>   "shard":"shard1",
   [junit4]   2>   "collection":"control_collection"} current state version: 1
   [junit4]   2> 94965 INFO  (coreZkRegister-369-thread-1-processing-n:127.0.0.1:34781_ x:collection1 s:shard1 c:control_collection r:core_node1) [n:127.0.0.1:34781_ c:control_collection s:shard1 r:core_node1 x:collection1] o.a.s.c.SyncStrategy Sync replicas to http://127.0.0.1:34781/collection1/
   [junit4]   2> 94965 INFO  (coreZkRegister-369-thread-1-processing-n:127.0.0.1:34781_ x:collection1 s:shard1 c:control_collection r:core_node1) [n:127.0.0.1:34781_ c:control_collection s:shard1 r:core_node1 x:collection1] o.a.s.c.SyncStrategy Sync Success - now sync replicas to me
   [junit4]   2> 94965 INFO  (coreZkRegister-369-thread-1-processing-n:127.0.0.1:34781_ x:collection1 s:shard1 c:control_collection r:core_node1) [n:127.0.0.1:34781_ c:control_collection s:shard1 r:core_node1 x:collection1] o.a.s.c.SyncStrategy http://127.0.0.1:34781/collection1/ has no replicas
   [junit4]   2> 94972 INFO  (coreZkRegister-369-thread-1-processing-n:127.0.0.1:34781_ x:collection1 s:shard1 c:control_collection r:core_node1) [n:127.0.0.1:34781_ c:control_collection s:shard1 r:core_node1 x:collection1] o.a.s.c.c.SolrZkClient makePath: /collections/control_collection/leaders/shard1
   [junit4]   2> 94980 INFO  (coreZkRegister-369-thread-1-processing-n:127.0.0.1:34781_ x:collection1 s:shard1 c:control_collection r:core_node1) [n:127.0.0.1:34781_ c:control_collection s:shard1 r:core_node1 x:collection1] o.a.s.c.ShardLeaderElectionContextBase Creating leader registration node
   [junit4]   2> 94999 INFO  (coreZkRegister-369-thread-1-processing-n:127.0.0.1:34781_ x:collection1 s:shard1 c:control_collection r:core_node1) [n:127.0.0.1:34781_ c:control_collection s:shard1 r:core_node1 x:collection1] o.a.s.c.ShardLeaderElectionContext I am the new leader: http://127.0.0.1:34781/collection1/ shard1
   [junit4]   2> 95001 INFO  (OverseerStateUpdate-95354090838491140-127.0.0.1:34781_-n_0000000000) [n:127.0.0.1:34781_    ] o.a.s.c.Overseer processMessage: queueSize: 1, message = {
   [junit4]   2>   "operation":"leader",
   [junit4]   2>   "shard":"shard1",
   [junit4]   2>   "collection":"control_collection",
   [junit4]   2>   "base_url":"http://127.0.0.1:34781",
   [junit4]   2>   "core":"collection1",
   [junit4]   2>   "state":"active"} current state version: 1
   [junit4]   2> 95107 INFO  (zkCallback-87-thread-1-processing-n:127.0.0.1:34781_) [n:127.0.0.1:34781_    ] o.a.s.c.c.ZkStateReader A cluster state change: [WatchedEvent state:SyncConnected type:NodeDataChanged path:/clusterstate.json], has occurred - updating... (live nodes size: [1])
   [junit4]   2> 95152 INFO  (coreZkRegister-369-thread-1-processing-n:127.0.0.1:34781_ x:collection1 s:shard1 c:control_collection r:core_node1) [n:127.0.0.1:34781_ c:control_collection s:shard1 r:core_node1 x:collection1] o.a.s.c.ZkController We are http://127.0.0.1:34781/collection1/ and leader is http://127.0.0.1:34781/collection1/
   [junit4]   2> 95152 INFO  (coreZkRegister-369-thread-1-processing-n:127.0.0.1:34781_ x:collection1 s:shard1 c:control_collection r:core_node1) [n:127.0.0.1:34781_ c:control_collection s:shard1 r:core_node1 x:collection1] o.a.s.c.ZkController No LogReplay needed for core=collection1 baseURL=http://127.0.0.1:34781
   [junit4]   2> 95152 INFO  (coreZkRegister-369-thread-1-processing-n:127.0.0.1:34781_ x:collection1 s:shard1 c:control_collection r:core_node1) [n:127.0.0.1:34781_ c:control_collection s:shard1 r:core_node1 x:collection1] o.a.s.c.ZkController I am the leader, no recovery necessary
   [junit4]   2> 95152 INFO  (coreZkRegister-369-thread-1-processing-n:127.0.0.1:34781_ x:collection1 s:shard1 c:control_collection r:core_node1) [n:127.0.0.1:34781_ c:control_collection s:shard1 r:core_node1 x:collection1] o.a.s.c.ZkController publishing state=active
   [junit4]   2> 95152 INFO  (coreZkRegister-369-thread-1-processing-n:127.0.0.1:34781_ x:collection1 s:shard1 c:control_collection r:core_node1) [n:127.0.0.1:34781_ c:control_collection s:shard1 r:core_node1 x:collection1] o.a.s.c.ZkController numShards not found on descriptor - reading it from system property
   [junit4]   2> 95156 INFO  (OverseerStateUpdate-95354090838491140-127.0.0.1:34781_-n_0000000000) [n:127.0.0.1:34781_    ] o.a.s.c.Overseer processMessage: queueSize: 1, message = {
   [junit4]   2>   "core":"collection1",
   [junit4]   2>   "core_node_name":"core_node1",
   [junit4]   2>   "roles":null,
   [junit4]   2>   "base_url":"http://127.0.0.1:34781",
   [junit4]   2>   "node_name":"127.0.0.1:34781_",
   [junit4]   2>   "numShards":"1",
   [junit4]   2>   "state":"active",
   [junit4]   2>   "shard":"shard1",
   [junit4]   2>   "collection":"control_collection",
   [junit4]   2>   "operation":"state"} current state version: 2
   [junit4]   2> 95157 INFO  (OverseerStateUpdate-95354090838491140-127.0.0.1:34781_-n_0000000000) [n:127.0.0.1:34781_    ] o.a.s.c.o.ReplicaMutator Update state numShards=1 message={
   [junit4]   2>   "core":"collection1",
   [junit4]   2>   "core_node_name":"core_node1",
   [junit4]   2>   "roles":null,
   [junit4]   2>   "base_url":"http://127.0.0.1:34781",
   [junit4]   2>   "node_name":"127.0.0.1:34781_",
   [junit4]   2>   "numShards":"1",
   [junit4]   2>   "state":"active",
   [junit4]   2>   "shard":"shard1",
   [junit4]   2>   "collection":"control_collection",
   [junit4]   2>   "operation":"state"}
   [junit4]   2> 95261 INFO  (zkCallback-87-thread-1-processing-n:127.0.0.1:34781_) [n:127.0.0.1:34781_    ] o.a.s.c.c.ZkStateReader A cluster state change: [WatchedEvent state:SyncConnected type:NodeDataChanged path:/clusterstate.json], has occurred - updating... (live nodes size: [1])
   [junit4]   2> 95312 INFO  (TEST-CloudSolrClientTest.test-seed#[4C49404629846E7C]) [    ] o.a.s.c.c.SolrZkClient Using default ZkCredentialsProvider
   [junit4]   2> 95313 INFO  (TEST-CloudSolrClientTest.test-seed#[4C49404629846E7C]) [    ] o.a.s.c.c.ConnectionManager Waiting for client to connect to ZooKeeper
   [junit4]   2> 95316 INFO  (zkCallback-89-thread-1) [    ] o.a.s.c.c.ConnectionManager Watcher org.apache.solr.common.cloud.ConnectionManager@4b71273d name:ZooKeeperConnection Watcher:127.0.0.1:56967/solr got event WatchedEvent state:SyncConnected type:None path:null path:null type:None
   [junit4]   2> 95317 INFO  (TEST-CloudSolrClientTest.test-seed#[4C49404629846E7C]) [    ] o.a.s.c.c.ConnectionManager Client is connected to ZooKeeper
   [junit4]   2> 95317 INFO  (TEST-CloudSolrClientTest.test-seed#[4C49404629846E7C]) [    ] o.a.s.c.c.SolrZkClient Using default ZkACLProvider
   [junit4]   2> 95317 INFO  (TEST-CloudSolrClientTest.test-seed#[4C49404629846E7C]) [    ] o.a.s.c.c.ZkStateReader Updating cluster state from ZooKeeper... 
   [junit4]   2> 95324 INFO  (TEST-CloudSolrClientTest.test-seed#[4C49404629846E7C]) [    ] o.a.s.c.ChaosMonkey monkey: init - expire sessions:false cause connection loss:false
   [junit4]   2> 95362 INFO  (TEST-CloudSolrClientTest.test-seed#[4C49404629846E7C]) [    ] o.a.s.SolrTestCaseJ4 Writing core.properties file to /export/home/jenkins/workspace/Lucene-Solr-5.x-Solaris/solr/build/solr-solrj/test/J1/temp/solr.client.solrj.impl.CloudSolrClientTest_4C49404629846E7C-001/shard-1-001/cores/collection1
   [junit4]   2> 95363 INFO  (TEST-CloudSolrClientTest.test-seed#[4C49404629846E7C]) [    ] o.a.s.c.AbstractFullDistribZkTestBase create jetty 1 in directory /export/home/jenkins/workspace/Lucene-Solr-5.x-Solaris/solr/build/solr-solrj/test/J1/temp/solr.client.solrj.impl.CloudSolrClientTest_4C49404629846E7C-001/shard-1-001
   [junit4]   2> 95364 INFO  (TEST-CloudSolrClientTest.test-seed#[4C49404629846E7C]) [    ] o.e.j.s.Server jetty-9.2.13.v20150730
   [junit4]   2> 95367 INFO  (TEST-CloudSolrClientTest.test-seed#[4C49404629846E7C]) [    ] o.e.j.s.h.ContextHandler Started o.e.j.s.ServletContextHandler@204172eb{/,null,AVAILABLE}
   [junit4]   2> 95368 INFO  (TEST-CloudSolrClientTest.test-seed#[4C49404629846E7C]) [    ] o.e.j.s.ServerConnector Started ServerConnector@c773a04{HTTP/1.1}{127.0.0.1:34231}
   [junit4]   2> 95368 INFO  (TEST-CloudSolrClientTest.test-seed#[4C49404629846E7C]) [    ] o.e.j.s.Server Started @98286ms
   [junit4]   2> 95368 INFO  (TEST-CloudSolrClientTest.test-seed#[4C49404629846E7C]) [    ] o.a.s.c.s.e.JettySolrRunner Jetty properties: {solr.data.dir=/export/home/jenkins/workspace/Lucene-Solr-5.x-Solaris/solr/build/solr-solrj/test/J1/temp/solr.client.solrj.impl.CloudSolrClientTest_4C49404629846E7C-001/tempDir-001/jetty1, solrconfig=solrconfig.xml, hostContext=/, hostPort=34231, coreRootDirectory=/export/home/jenkins/workspace/Lucene-Solr-5.x-Solaris/solr/build/solr-solrj/test/J1/../../../../../../../../../../export/home/jenkins/workspace/Lucene-Solr-5.x-Solaris/solr/build/solr-solrj/test/J1/temp/solr.client.solrj.impl.CloudSolrClientTest_4C49404629846E7C-001/shard-1-001/cores}
   [junit4]   2> 95369 INFO  (TEST-CloudSolrClientTest.test-seed#[4C49404629846E7C]) [    ] o.a.s.s.SolrDispatchFilter SolrDispatchFilter.init(): sun.misc.Launcher$AppClassLoader@6d06d69c
   [junit4]   2> 95369 INFO  (TEST-CloudSolrClientTest.test-seed#[4C49404629846E7C]) [    ] o.a.s.c.SolrResourceLoader new SolrResourceLoader for directory: '/export/home/jenkins/workspace/Lucene-Solr-5.x-Solaris/solr/build/solr-solrj/test/J1/temp/solr.client.solrj.impl.CloudSolrClientTest_4C49404629846E7C-001/shard-1-001'
   [junit4]   2> 95369 INFO  (TEST-CloudSolrClientTest.test-seed#[4C49404629846E7C]) [    ] o.a.s.c.SolrResourceLoader JNDI not configured for solr (NoInitialContextEx)
   [junit4]   2> 95369 INFO  (TEST-CloudSolrClientTest.test-seed#[4C49404629846E7C]) [    ] o.a.s.c.SolrResourceLoader solr home defaulted to 'solr/' (could not find system property or JNDI)
   [junit4]   2> 95369 INFO  (TEST-CloudSolrClientTest.test-seed#[4C49404629846E7C]) [    ] o.a.s.c.c.SolrZkClient Using default ZkCredentialsProvider
   [junit4]   2> 95369 INFO  (TEST-CloudSolrClientTest.test-seed#[4C49404629846E7C]) [    ] o.a.s.c.c.ConnectionManager Waiting for client to connect to ZooKeeper
   [junit4]   2> 95372 INFO  (zkCallback-90-thread-1) [    ] o.a.s.c.c.ConnectionManager Watcher org.apache.solr.common.cloud.ConnectionManager@51a1c76 name:ZooKeeperConnection Watcher:127.0.0.1:56967/solr got event WatchedEvent state:SyncConnected type:None path:null path:null type:None
   [junit4]   2> 95372 INFO  (TEST-CloudSolrClientTest.test-seed#[4C49404629846E7C]) [    ] o.a.s.c.c.ConnectionManager Client is connected to ZooKeeper
   [junit4]   2> 95373 INFO  (TEST-CloudSolrClientTest.test-seed#[4C49404629846E7C]) [    ] o.a.s.c.c.SolrZkClient Using default ZkACLProvider
   [junit4]   2> 95375 INFO  (TEST-CloudSolrClientTest.test-seed#[4C49404629846E7C]) [    ] o.a.s.s.SolrDispatchFilter Loading solr.xml from SolrHome (not found in ZooKeeper)
   [junit4]   2> 95375 INFO  (TEST-CloudSolrClientTest.test-seed#[4C49404629846E7C]) [    ] o.a.s.c.SolrXmlConfig Loading container configuration from /export/home/jenkins/workspace/Lucene-Solr-5.x-Solaris/solr/build/solr-solrj/test/J1/temp/solr.client.solrj.impl.CloudSolrClientTest_4C49404629846E7C-001/shard-1-001/solr.xml
   [junit4]   2> 95379 INFO  (TEST-CloudSolrClientTest.test-seed#[4C49404629846E7C]) [    ] o.a.s.c.CorePropertiesLocator Config-defined core root directory: /export/home/jenkins/workspace/Lucene-Solr-5.x-Solaris/solr/build/solr-solrj/test/J1/../../../../../../../../../../export/home/jenkins/workspace/Lucene-Solr-5.x-Solaris/solr/build/solr-solrj/test/J1/temp/solr.client.solrj.impl.CloudSolrClientTest_4C49404629846E7C-001/shard-1-001/cores
   [junit4]   2> 95380 INFO  (TEST-CloudSolrClientTest.test-seed#[4C49404629846E7C]) [    ] o.a.s.c.CoreContainer New CoreContainer 1069049905
   [junit4]   2> 95380 INFO  (TEST-CloudSolrClientTest.test-seed#[4C49404629846E7C]) [    ] o.a.s.c.CoreContainer Loading cores into CoreContainer [instanceDir=/export/home/jenkins/workspace/Lucene-Solr-5.x-Solaris/solr/build/solr-solrj/test/J1/temp/solr.client.solrj.impl.CloudSolrClientTest_4C49404629846E7C-001/shard-1-001]
   [junit4]   2> 95380 WARN  (TEST-CloudSolrClientTest.test-seed#[4C49404629846E7C]) [    ] o.a.s.c.CoreContainer Couldn't add files from /export/home/jenkins/workspace/Lucene-Solr-5.x-Solaris/solr/build/solr-solrj/test/J1/temp/solr.client.solrj.impl.CloudSolrClientTest_4C49404629846E7C-001/shard-1-001/lib to classpath: /export/home/jenkins/workspace/Lucene-Solr-5.x-Solaris/solr/build/solr-solrj/test/J1/temp/solr.client.solrj.impl.CloudSolrClientTest_4C49404629846E7C-001/shard-1-001/lib
   [junit4]   2> 95380 INFO  (TEST-CloudSolrClientTest.test-seed#[4C49404629846E7C]) [    ] o.a.s.h.c.HttpShardHandlerFactory created with socketTimeout : 90000,urlScheme : ,connTimeout : 15000,maxConnectionsPerHost : 20,maxConnections : 10000,corePoolSize : 0,maximumPoolSize : 2147483647,maxThreadIdleTime : 5,sizeOfQueue : -1,fairnessPolicy : false,useRetries : false,
   [junit4]   2> 95380 INFO  (TEST-CloudSolrClientTest.test-seed#[4C49404629846E7C]) [    ] o.a.s.u.UpdateShardHandler Creating UpdateShardHandler HTTP client with params: socketTimeout=340000&connTimeout=45000&retry=true
   [junit4]   2> 95381 INFO  (TEST-CloudSolrClientTest.test-seed#[4C49404629846E7C]) [    ] o.a.s.l.LogWatcher SLF4J impl is org.slf4j.impl.Log4jLoggerFactory
   [junit4]   2> 95381 INFO  (TEST-CloudSolrClientTest.test-seed#[4C49404629846E7C]) [    ] o.a.s.l.LogWatcher Registering Log Listener [Log4j (org.slf4j.impl.Log4jLoggerFactory)]
   [junit4]   2> 95381 INFO  (TEST-CloudSolrClientTest.test-seed#[4C49404629846E7C]) [    ] o.a.s.c.ZkContainer Zookeeper client=127.0.0.1:56967/solr
   [junit4]   2> 95381 INFO  (TEST-CloudSolrClientTest.test-seed#[4C49404629846E7C]) [    ] o.a.s.c.ZkController zkHost includes chroot
   [junit4]   2> 95381 INFO  (TEST-CloudSolrClientTest.test-seed#[4C49404629846E7C]) [    ] o.a.s.c.c.SolrZkClient Using default ZkCredentialsProvider
   [junit4]   2> 95381 INFO  (TEST-CloudSolrClientTest.test-seed#[4C49404629846E7C]) [    ] o.a.s.c.c.ConnectionManager Waiting for client to connect to ZooKeeper
   [junit4]   2> 95385 INFO  (zkCallback-93-thread-1) [    ] o.a.s.c.c.ConnectionManager Watcher org.apache.solr.common.cloud.ConnectionManager@36e4d45d name:ZooKeeperConnection Watcher:127.0.0.1:56967 got event WatchedEvent state:SyncConnected type:None path:null path:null type:None
   [junit4]   2> 95386 INFO  (TEST-CloudSolrClientTest.test-seed#[4C49404629846E7C]) [    ] o.a.s.c.c.ConnectionManager Client is connected to ZooKeeper
   [junit4]   2> 95386 INFO  (TEST-CloudSolrClientTest.test-seed#[4C49404629846E7C]) [    ] o.a.s.c.c.SolrZkClient Using default ZkACLProvider
   [junit4]   2> 95389 INFO  (TEST-CloudSolrClientTest.test-seed#[4C49404629846E7C]) [n:127.0.0.1:34231_    ] o.a.s.c.c.ConnectionManager Waiting for client to connect to ZooKeeper
   [junit4]   2> 95390 WARN  (NIOServerCxn.Factory:0.0.0.0/0.0.0.0:0) [    ] o.a.z.s.NIOServerCnxn caught end of stream exception
   [junit4]   2> EndOfStreamException: Unable to read additional data from client sessionid 0x152c40a584f0007, likely client has closed socket
   [junit4]   2> 	at org.apache.zookeeper.server.NIOServerCnxn.doIO(NIOServerCnxn.java:228)
   [junit4]   2> 	at org.apache.zookeeper.server.NIOServerCnxnFactory.run(NIOServerCnxnFactory.java:208)
   [junit4]   2> 	at java.lang.Thread.run(Thread.java:745)
   [junit4]   2> 95393 INFO  (zkCallback-94-thread-1-processing-n:127.0.0.1:34231_) [n:127.0.0.1:34231_    ] o.a.s.c.c.ConnectionManager Watcher org.apache.solr.common.cloud.ConnectionManager@9135147 name:ZooKeeperConnection Watcher:127.0.0.1:56967/solr got event WatchedEvent state:SyncConnected type:None path:null path:null type:None
   [junit4]   2> 95393 INFO  (TEST-CloudSolrClientTest.test-seed#[4C49404629846E7C]) [n:127.0.0.1:34231_    ] o.a.s.c.c.ConnectionManager Client is connected to ZooKeeper
   [junit4]   2> 95409 INFO  (TEST-CloudSolrClientTest.test-seed#[4C49404629846E7C]) [n:127.0.0.1:34231_    ] o.a.s.c.c.ZkStateReader Updating cluster state from ZooKeeper... 
   [junit4]   2> 96424 INFO  (TEST-CloudSolrClientTest.test-seed#[4C49404629846E7C]) [n:127.0.0.1:34231_    ] o.a.s.c.ZkController Register node as live in ZooKeeper:/live_nodes/127.0.0.1:34231_
   [junit4]   2> 96425 INFO  (TEST-CloudSolrClientTest.test-seed#[4C49404629846E7C]) [n:127.0.0.1:34231_    ] o.a.s.c.c.SolrZkClient makePath: /live_nodes/127.0.0.1:34231_
   [junit4]   2> 96428 INFO  (zkCallback-89-thread-1) [    ] o.a.s.c.c.ZkStateReader A live node change: [WatchedEvent state:SyncConnected type:NodeChildrenChanged path:/live_nodes], has occurred - updating... (live nodes size: [1])
   [junit4]   2> 96428 INFO  (zkCallback-94-thread-1-processing-n:127.0.0.1:34231_) [n:127.0.0.1:34231_    ] o.a.s.c.c.ZkStateReader A live node change: [WatchedEvent state:SyncConnected type:NodeChildrenChanged path:/live_nodes], has occurred - updating... (live nodes size: [1])
   [junit4]   2> 96428 INFO  (zkCallback-87-thread-1-processing-n:127.0.0.1:34781_) [n:127.0.0.1:34781_    ] o.a.s.c.c.ZkStateReader A live node change: [WatchedEvent state:SyncConnected type:NodeChildrenChanged path:/live_nodes], has occurred - updating... (live nodes size: [1])
   [junit4]   2> 96430 INFO  (TEST-CloudSolrClientTest.test-seed#[4C49404629846E7C]) [n:127.0.0.1:34231_    ] o.a.s.c.Overseer Overseer (id=null) closing
   [junit4]   2> 96431 INFO  (TEST-CloudSolrClientTest.test-seed#[4C49404629846E7C]) [n:127.0.0.1:34231_    ] o.a.s.c.LeaderElector Joined leadership election with path: /overseer_elect/election/95354090838491144-127.0.0.1:34231_-n_0000000001
   [junit4]   2> 96434 INFO  (TEST-CloudSolrClientTest.test-seed#[4C49404629846E7C]) [n:127.0.0.1:34231_    ] o.a.s.c.LeaderElector Watching path /overseer_elect/election/95354090838491140-127.0.0.1:34781_-n_0000000000 to know if I could be the leader
   [junit4]   2> 96449 INFO  (TEST-CloudSolrClientTest.test-seed#[4C49404629846E7C]) [n:127.0.0.1:34231_    ] o.a.s.c.CoreContainer Security conf doesn't exist. Skipping setup for authorization module.
   [junit4]   2> 96449 INFO  (TEST-CloudSolrClientTest.test-seed#[4C49404629846E7C]) [n:127.0.0.1:34231_    ] o.a.s.c.CoreContainer No authentication plugin used.
   [junit4]   2> 96450 INFO  (TEST-CloudSolrClientTest.test-seed#[4C49404629846E7C]) [n:127.0.0.1:34231_    ] o.a.s.c.CorePropertiesLocator Looking for core definitions underneath /export/home/jenkins/workspace/Lucene-Solr-5.x-Solaris/solr/build/solr-solrj/test/J1/../../../../../../../../../../export/home/jenkins/workspace/Lucene-Solr-5.x-Solaris/solr/build/solr-solrj/test/J1/temp/solr.client.solrj.impl.CloudSolrClientTest_4C49404629846E7C-001/shard-1-001/cores
   [junit4]   2> 96452 INFO  (TEST-CloudSolrClientTest.test-seed#[4C49404629846E7C]) [n:127.0.0.1:34231_    ] o.a.s.c.CoreDescriptor Created CoreDescriptor: {name=collection1, config=solrconfig.xml, transient=false, schema=schema.xml, loadOnStartup=true, configSetProperties=configsetprops.json, collection=collection1, coreNodeName=, dataDir=data/, shard=}
   [junit4]   2> 96452 INFO  (TEST-CloudSolrClientTest.test-seed#[4C49404629846E7C]) [n:127.0.0.1:34231_    ] o.a.s.c.CorePropertiesLocator Found core collection1 in /export/home/jenkins/workspace/Lucene-Solr-5.x-Solaris/solr/build/solr-solrj/test/J1/../../../../../../../../../../export/home/jenkins/workspace/Lucene-Solr-5.x-Solaris/solr/build/solr-solrj/test/J1/temp/solr.client.solrj.impl.CloudSolrClientTest_4C49404629846E7C-001/shard-1-001/cores/collection1
   [junit4]   2> 96452 INFO  (TEST-CloudSolrClientTest.test-seed#[4C49404629846E7C]) [n:127.0.0.1:34231_    ] o.a.s.c.CorePropertiesLocator Found 1 core definitions
   [junit4]   2> 96454 INFO  (TEST-CloudSolrClientTest.test-seed#[4C49404629846E7C]) [n:127.0.0.1:34231_    ] o.a.s.s.SolrDispatchFilter user.dir=/export/home/jenkins/workspace/Lucene-Solr-5.x-Solaris/solr/build/solr-solrj/test/J1
   [junit4]   2> 96454 INFO  (TEST-CloudSolrClientTest.test-seed#[4C49404629846E7C]) [n:127.0.0.1:34231_    ] o.a.s.s.SolrDispatchFilter SolrDispatchFilter.init() done
   [junit4]   2> 96454 INFO  (coreLoadExecutor-386-thread-1-processing-n:127.0.0.1:34231_) [n:127.0.0.1:34231_ c:collection1   x:collection1] o.a.s.c.ZkController publishing state=down
   [junit4]   2> 96454 INFO  (coreLoadExecutor-386-thread-1-processing-n:127.0.0.1:34231_) [n:127.0.0.1:34231_ c:collection1   x:collection1] o.a.s.c.ZkController numShards not found on descriptor - reading it from system property
   [junit4]   2> 96456 INFO  (coreLoadExecutor-386-thread-1-processing-n:127.0.0.1:34231_) [n:127.0.0.1:34231_ c:collection1   x:collection1] o.a.s.c.ZkController look for our core node name
   [junit4]   2> 96458 INFO  (OverseerStateUpdate-95354090838491140-127.0.0.1:34781_-n_0000000000) [n:127.0.0.1:34781_    ] o.a.s.c.Overseer processMessage: queueSize: 1, message = {
   [junit4]   2>   "core":"collection1",
   [junit4]   2>   "roles":null,
   [junit4]   2>   "base_url":"http://127.0.0.1:34231",
   [junit4]   2>   "node_name":"127.0.0.1:34231_",
   [junit4]   2>   "numShards":"2",
   [junit4]   2>   "state":"down",
   [junit4]   2>   "shard":null,
   [junit4]   2>   "collection":"collection1",
   [junit4]   2>   "operation":"state"} current state version: 3
   [junit4]   2> 96459 INFO  (OverseerStateUpdate-95354090838491140-127.0.0.1:34781_-n_0000000000) [n:127.0.0.1:34781_    ] o.a.s.c.o.ReplicaMutator Update state numShards=2 message={
   [junit4]   2>   "core":"collection1",
   [junit4]   2>   "roles":null,
   [junit4]   2>   "base_url":"http://127.0.0.1:34231",
   [junit4]   2>   "node_name":"127.0.0.1:34231_",
   [junit4]   2>   "numShards":"2",
   [junit4]   2>   "state":"down",
   [junit4]   2>   "shard":null,
   [junit4]   2>   "collection":"collection1",
   [junit4]   2>   "operation":"state"}
   [junit4]   2> 96459 INFO  (OverseerStateUpdate-95354090838491140-127.0.0.1:34781_-n_0000000000) [n:127.0.0.1:34781_    ] o.a.s.c.o.ClusterStateMutator building a new cName: collection1
   [junit4]   2> 96459 INFO  (OverseerStateUpdate-95354090838491140-127.0.0.1:34781_-n_0000000000) [n:127.0.0.1:34781_    ] o.a.s.c.o.ReplicaMutator Assigning new node to shard shard=shard2
   [junit4]   2> 96564 INFO  (zkCallback-89-thread-1) [    ] o.a.s.c.c.ZkStateReader A cluster state change: [WatchedEvent state:SyncConnected type:NodeDataChanged path:/clusterstate.json], has occurred - updating... (live nodes size: [2])
   [junit4]   2> 96564 INFO  (zkCallback-87-thread-1-processing-n:127.0.0.1:34781_) [n:127.0.0.1:34781_    ] o.a.s.c.c.ZkStateReader A cluster state change: [WatchedEvent state:SyncConnected type:NodeDataChanged path:/clusterstate.json], has occurred - updating... (live nodes size: [2])
   [junit4]   2> 96564 INFO  (zkCallback-94-thread-1-processing-n:127.0.0.1:34231_) [n:127.0.0.1:34231_    ] o.a.s.c.c.ZkStateReader A cluster state change: [WatchedEvent state:SyncConnected type:NodeDataChanged path:/clusterstate.json], has occurred - updating... (live nodes size: [2])
   [junit4]   2> 97457 INFO  (coreLoadExecutor-386-thread-1-processing-n:127.0.0.1:34231_) [n:127.0.0.1:34231_ c:collection1   x:collection1] o.a.s.c.ZkController waiting to find shard id in clusterstate for collection1
   [junit4]   2> 97457 INFO  (coreLoadExecutor-386-thread-1-processing-n:127.0.0.1:34231_) [n:127.0.0.1:34231_ c:collection1   x:collection1] o.a.s.c.ZkController Check for collection zkNode:collection1
   [junit4]   2> 97458 INFO  (coreLoadExecutor-386-thread-1-processing-n:127.0.0.1:34231_) [n:127.0.0.1:34231_ c:collection1   x:collection1] o.a.s.c.ZkController Collection zkNode exists
   [junit4]   2> 97458 INFO  (coreLoadExecutor-386-thread-1-processing-n:127.0.0.1:34231_) [n:127.0.0.1:34231_ c:collection1   x:collection1] o.a.s.c.c.ZkStateReader Load collection config from: [/collections/collection1]
   [junit4]   2> 97459 INFO  (coreLoadExecutor-386-thread-1-processing-n:127.0.0.1:34231_) [n:127.0.0.1:34231_ c:collection1   x:collection1] o.a.s.c.c.ZkStateReader path=[/collections/collection1] [configName]=[conf1] specified config exists in ZooKeeper
   [junit4]   2> 97459 INFO  (coreLoadExecutor-386-thread-1-processing-n:127.0.0.1:34231_) [n:127.0.0.1:34231_ c:collection1   x:collection1] o.a.s.c.SolrResourceLoader new SolrResourceLoader for directory: '/export/home/jenkins/workspace/Lucene-Solr-5.x-Solaris/solr/build/solr-solrj/test/J1/temp/solr.client.solrj.impl.CloudSolrClientTest_4C49404629846E7C-001/shard-1-001/cores/collection1'
   [junit4]   2> 97459 INFO  (coreLoadExecutor-386-thread-1-processing-n:127.0.0.1:34231_) [n:127.0.0.1:34231_ c:collection1   x:collection1] o.a.s.c.SolrResourceLoader JNDI not configured for solr (NoInitialContextEx)
   [junit4]   2> 97459 INFO  (coreLoadExecutor-386-thread-1-processing-n:127.0.0.1:34231_) [n:127.0.0.1:34231_ c:collection1   x:collection1] o.a.s.c.SolrResourceLoader solr home defaulted to 'solr/' (could not find system property or JNDI)
   [junit4]   2> 97461 INFO  (coreLoadExecutor-386-thread-1-processing-n:127.0.0.1:34231_) [n:127.0.0.1:34231_ c:collection1   x:collection1] o.a.s.c.Config loaded config solrconfig.xml with version 0 
   [junit4]   2> 97466 INFO  (coreLoadExecutor-386-thread-1-processing-n:127.0.0.1:34231_) [n:127.0.0.1:34231_ c:collection1   x:collection1] o.a.s.c.SolrConfig current version of requestparams : -1
   [junit4]   2> 97467 WARN  (coreLoadExecutor-386-thread-1-processing-n:127.0.0.1:34231_) [n:127.0.0.1:34231_ c:collection1   x:collection1] o.a.s.c.Config Beginning with Solr 5.5, <maxMergeDocs> is deprecated, configure it on the relevant <mergePolicyFactory> instead.
   [junit4]   2> 97467 WARN  (coreLoadExecutor-386-thread-1-processing-n:127.0.0.1:34231_) [n:127.0.0.1:34231_ c:collection1   x:collection1] o.a.s.c.Config Beginning with Solr 5.5, <mergeFactor> is deprecated, configure it on the relevant <mergePolicyFactory> instead.
   [junit4]   2> 97468 INFO  (coreLoadExecutor-386-thread-1-processing-n:127.0.0.1:34231_) [n:127.0.0.1:34231_ c:collection1   x:collection1] o.a.s.c.SolrConfig Using Lucene MatchVersion: 5.5.0
   [junit4]   2> 97480 INFO  (coreLoadExecutor-386-thread-1-processing-n:127.0.0.1:34231_) [n:127.0.0.1:34231_ c:collection1   x:collection1] o.a.s.c.SolrConfig Loaded SolrConfig: solrconfig.xml
   [junit4]   2> 97486 INFO  (coreLoadExecutor-386-thread-1-processing-n:127.0.0.1:34231_) [n:127.0.0.1:34231_ c:collection1   x:collection1] o.a.s.s.IndexSchema [collection1] Schema name=test
   [junit4]   2> 97543 INFO  (coreLoadExecutor-386-thread-1-processing-n:127.0.0.1:34231_) [n:127.0.0.1:34231_ c:collection1   x:collection1] o.a.s.s.IndexSchema default search field in schema is text
   [junit4]   2> 97544 INFO  (coreLoadExecutor-386-thread-1-processing-n:127.0.0.1:34231_) [n:127.0.0.1:34231_ c:collection1   x:collection1] o.a.s.s.IndexSchema unique key field: id
   [junit4]   2> 97545 WARN  (coreLoadExecutor-386-thread-1-processing-n:127.0.0.1:34231_) [n:127.0.0.1:34231_ c:collection1   x:collection1] o.a.s.s.IndexSchema Field lowerfilt1and2 is not multivalued and destination for multiple copyFields (2)
   [junit4]   2> 97545 WARN  (coreLoadExecutor-386-thread-1-processing-n:127.0.0.1:34231_) [n:127.0.0.1:34231_ c:collection1   x:collection1] o.a.s.s.IndexSchema Field text is not multivalued and destination for multiple copyFields (3)
   [junit4]   2> 97547 INFO  (coreLoadExecutor-386-thread-1-processing-n:127.0.0.1:34231_) [n:127.0.0.1:34231_ c:collection1   x:collection1] o.a.s.c.ConfigSetProperties Did not find ConfigSet properties, assuming default properties: Can't find resource 'configsetprops.json' in classpath or '/configs/conf1', cwd=/export/home/jenkins/workspace/Lucene-Solr-5.x-Solaris/solr/build/solr-solrj/test/J1
   [junit4]   2> 97547 INFO  (coreLoadExecutor-386-thread-1-processing-n:127.0.0.1:34231_) [n:127.0.0.1:34231_ c:collection1   x:collection1] o.a.s.c.CoreContainer Creating SolrCore 'collection1' using configuration from collection collection1
   [junit4]   2> 97547 INFO  (coreLoadExecutor-386-thread-1-processing-n:127.0.0.1:34231_) [n:127.0.0.1:34231_ c:collection1 s:shard2 r:core_node1 x:collection1] o.a.s.c.SolrCore org.apache.solr.core.MockDirectoryFactory
   [junit4]   2> 97547 INFO  (coreLoadExecutor-386-thread-1-processing-n:127.0.0.1:34231_) [n:127.0.0.1:34231_ c:collection1 s:shard2 r:core_node1 x:collection1] o.a.s.c.SolrCore [[collection1] ] Opening new SolrCore at [/export/home/jenkins/workspace/Lucene-Solr-5.x-Solaris/solr/build/solr-solrj/test/J1/temp/solr.client.solrj.impl.CloudSolrClientTest_4C49404629846E7C-001/shard-1-001/cores/collection1], dataDir=[/export/home/jenkins/workspace/Lucene-Solr-5.x-Solaris/solr/build/solr-solrj/test/J1/../../../../../../../../../../export/home/jenkins/workspace/Lucene-Solr-5.x-Solaris/solr/build/solr-solrj/test/J1/temp/solr.client.solrj.impl.CloudSolrClientTest_4C49404629846E7C-001/shard-1-001/cores/collection1/data/]
   [junit4]   2> 97547 INFO  (coreLoadExecutor-386-thread-1-processing-n:127.0.0.1:34231_) [n:127.0.0.1:34231_ c:collection1 s:shard2 r:core_node1 x:collection1] o.a.s.c.SolrCore JMX monitoring not detected for core: collection1
   [junit4]   2> 97548 INFO  (coreLoadExecutor-386-thread-1-processing-n:127.0.0.1:34231_) [n:127.0.0.1:34231_ c:collection1 s:shard2 r:core_node1 x:collection1] o.a.s.c.CachingDirectoryFactory return new directory for /export/home/jenkins/workspace/Lucene-Solr-5.x-Solaris/solr/build/solr-solrj/test/J1/../../../../../../../../../../export/home/jenkins/workspace/Lucene-Solr-5.x-Solaris/solr/build/solr-solrj/test/J1/temp/solr.client.solrj.impl.CloudSolrClientTest_4C49404629846E7C-001/shard-1-001/cores/collection1/data
   [junit4]   2> 97548 INFO  (coreLoadExecutor-386-thread-1-processing-n:127.0.0.1:34231_) [n:127.0.0.1:34231_ c:collection1 s:shard2 r:core_node1 x:collection1] o.a.s.c.SolrCore New index directory detected: old=null new=/export/home/jenkins/workspace/Lucene-Solr-5.x-Solaris/solr/build/solr-solrj/test/J1/../../../../../../../../../../export/home/jenkins/workspace/Lucene-Solr-5.x-Solaris/solr/build/solr-solrj/test/J1/temp/solr.client.solrj.impl.CloudSolrClientTest_4C49404629846E7C-001/shard-1-001/cores/collection1/data/index/
   [junit4]   2> 97548 WARN  (coreLoadExecutor-386-thread-1-processing-n:127.0.0.1:34231_) [n:127.0.0.1:34231_ c:collection1 s:shard2 r:core_node1 x:collection1] o.a.s.c.SolrCore [collection1] Solr index directory '/export/home/jenkins/workspace/Lucene-Solr-5.x-Solaris/solr/build/solr-solrj/test/J1/../../../../../../../../../../export/home/jenkins/workspace/Lucene-Solr-5.x-Solaris/solr/build/solr-solrj/test/J1/temp/solr.client.solrj.impl.CloudSolrClientTest_4C49404629846E7C-001/shard-1-001/cores/collection1/data/index' doesn't exist. Creating new index...
   [junit4]   2> 97548 INFO  (coreLoadExecutor-386-thread-1-processing-n:127.0.0.1:34231_) [n:127.0.0.1:34231_ c:collection1 s:shard2 r:core_node1 x:collection1] o.a.s.c.CachingDirectoryFactory return new directory for /export/home/jenkins/workspace/Lucene-Solr-5.x-Solaris/solr/build/solr-solrj/test/J1/../../../../../../../../../../export/home/jenkins/workspace/Lucene-Solr-5.x-Solaris/solr/build/solr-solrj/test/J1/temp/solr.client.solrj.impl.CloudSolrClientTest_4C49404629846E7C-001/shard-1-001/cores/collection1/data/index
   [junit4]   2> 97548 INFO  (coreLoadExecutor-386-thread-1-processing-n:127.0.0.1:34231_) [n:127.0.0.1:34231_ c:collection1 s:shard2 r:core_node1 x:collection1] o.a.s.c.SolrDeletionPolicy SolrDeletionPolicy.onCommit: commits: num=1
   [junit4]   2> 	commit{dir=MockDirectoryWrapper(RAMDirectory@1b74db3c lockFactory=org.apache.lucene.store.SingleInstanceLockFactory@24a1ed28),segFN=segments_1,generation=1}
   [junit4]   2> 97548 INFO  (coreLoadExecutor-386-thread-1-processing-n:127.0.0.1:34231_) [n:127.0.0.1:34231_ c:collection1 s:shard2 r:core_node1 x:collection1] o.a.s.c.SolrDeletionPolicy newest commit generation = 1
   [junit4]   2> 97549 INFO  (OldIndexDirectoryCleanupThreadForCore-collection1) [n:127.0.0.1:34231_ c:collection1 s:shard2 r:core_node1 x:collection1] o.a.s.c.SolrCore Looking for old index directories to cleanup for core collection1 in /export/home/jenkins/workspace/Lucene-Solr-5.x-Solaris/solr/build/solr-solrj/test/J1/../../../../../../../../../../export/home/jenkins/workspace/Lucene-Solr-5.x-Solaris/solr/build/solr-solrj/test/J1/temp/solr.client.solrj.impl.CloudSolrClientTest_4C49404629846E7C-001/shard-1-001/cores/collection1/data/
   [junit4]   2> 97549 WARN  (OldIndexDirectoryCleanupThreadForCore-collection1) [n:127.0.0.1:34231_ c:collection1 s:shard2 r:core_node1 x:collection1] o.a.s.c.DirectoryFactory /export/home/jenkins/workspace/Lucene-Solr-5.x-Solaris/solr/build/solr-solrj/test/J1/../../../../../../../../../../export/home/jenkins/workspace/Lucene-Solr-5.x-Solaris/solr/build/solr-solrj/test/J1/temp/solr.client.solrj.impl.CloudSolrClientTest_4C49404629846E7C-001/shard-1-001/cores/collection1/data/ does not point to a valid data directory; skipping clean-up of old index directories.
   [junit4]   2> 97550 INFO  (coreLoadExecutor-386-thread-1-processing-n:127.0.0.1:34231_) [n:127.0.0.1:34231_ c:collection1 s:shard2 r:core_node1 x:collection1] o.a.s.c.SolrCore no updateRequestProcessorChain defined as default, creating implicit default
   [junit4]   2> 97552 INFO  (coreLoadExecutor-386-thread-1-processing-n:127.0.0.1:34231_) [n:127.0.0.1:34231_ c:collection1 s:shard2 r:core_node1 x:collection1] o.a.s.h.l.XMLLoader xsltCacheLifetimeSeconds=60
   [junit4]   2> 97553 INFO  (coreLoadExecutor-386-thread-1-processing-n:127.0.0.1:34231_) [n:127.0.0.1:34231_ c:collection1 s:shard2 r:core_node1 x:collection1] o.a.s.h.l.XMLLoader xsltCacheLifetimeSeconds=60
   [junit4]   2> 97554 INFO  (coreLoadExecutor-386-thread-1-processing-n:127.0.0.1:34231_) [n:127.0.0.1:34231_ c:collection1 s:shard2 r:core_node1 x:collection1] o.a.s.h.l.XMLLoader xsltCacheLifetimeSeconds=60
   [junit4]   2> 97555 INFO  (coreLoadExecutor-386-thread-1-processing-n:127.0.0.1:34231_) [n:127.0.0.1:34231_ c:collection1 s:shard2 r:core_node1 x:collection1] o.a.s.h.l.XMLLoader xsltCacheLifetimeSeconds=60
   [junit4]   2> 97557 INFO  (coreLoadExecutor-386-thread-1-processing-n:127.0.0.1:34231_) [n:127.0.0.1:34231_ c:collection1 s:shard2 r:core_node1 x:collection1] o.a.s.c.RequestHandlers Registered paths: /admin/mbeans,standard,,/update/csv,/update/json/docs,/admin/luke,/admin/segments,/get,/admin/system,/replication,/admin/properties,/config,/schema,/admin/plugins,/admin/logging,/update/json,/admin/threads,/admin/ping,/update,/admin/file
   [junit4]   2> 97557 INFO  (coreLoadExecutor-386-thread-1-processing-n:127.0.0.1:34231_) [n:127.0.0.1:34231_ c:collection1 s:shard2 r:core_node1 x:collection1] o.a.s.c.SolrCore Using default statsCache cache: org.apache.solr.search.stats.LocalStatsCache
   [junit4]   2> 97557 INFO  (coreLoadExecutor-386-thread-1-processing-n:127.0.0.1:34231_) [n:127.0.0.1:34231_ c:collection1 s:shard2 r:core_node1 x:collection1] o.a.s.u.UpdateHandler Using UpdateLog implementation: org.apache.solr.update.UpdateLog
   [junit4]   2> 97557 INFO  (coreLoadExecutor-386-thread-1-processing-n:127.0.0.1:34231_) [n:127.0.0.1:34231_ c:collection1 s:shard2 r:core_node1 x:collection1] o.a.s.u.UpdateLog Initializing UpdateLog: dataDir= defaultSyncLevel=FLUSH numRecordsToKeep=100 maxNumLogsToKeep=10 numVersionBuckets=65536
   [junit4]   2> 97558 INFO  (coreLoadExecutor-386-thread-1-processing-n:127.0.0.1:34231_) [n:127.0.0.1:34231_ c:collection1 s:shard2 r:core_node1 x:collection1] o.a.s.u.CommitTracker Hard AutoCommit: disabled
   [junit4]   2> 97558 INFO  (coreLoadExecutor-386-thread-1-processing-n:127.0.0.1:34231_) [n:127.0.0.1:34231_ c:collection1 s:shard2 r:core_node1 x:collection1] o.a.s.u.CommitTracker Soft AutoCommit: disabled
   [junit4]   2> 97559 INFO  (coreLoadExecutor-386-thread-1-processing-n:127.0.0.1:34231_) [n:127.0.0.1:34231_ c:collection1 s:shard2 r:core_node1 x:collection1] o.a.s.c.SolrDeletionPolicy SolrDeletionPolicy.onInit: commits: num=1
   [junit4]   2> 	commit{dir=MockDirectoryWrapper(RAMDirectory@1b74db3c lockFactory=org.apache.lucene.store.SingleInstanceLockFactory@24a1ed28),segFN=segments_1,generation=1}
   [junit4]   2> 97559 INFO  (coreLoadExecutor-386-thread-1-processing-n:127.0.0.1:34231_) [n:127.0.0.1:34231_ c:collection1 s:shard2 r:core_node1 x:collection1] o.a.s.c.SolrDeletionPolicy newest commit generation = 1
   [junit4]   2> 97559 INFO  (coreLoadExecutor-386-thread-1-processing-n:127.0.0.1:34231_) [n:127.0.0.1:34231_ c:collection1 s:shard2 r:core_node1 x:collection1] o.a.s.s.SolrIndexSearcher Opening Searcher@625ac102[collection1] main
   [junit4]   2> 97559 INFO  (coreLoadExecutor-386-thread-1-processing-n:127.0.0.1:34231_) [n:127.0.0.1:34231_ c:collection1 s:shard2 r:core_node1 x:collection1] o.a.s.c.c.ZkStateReader Load collection config from: [/collections/collection1]
   [junit4]   2> 97560 INFO  (coreLoadExecutor-386-thread-1-processing-n:127.0.0.1:34231_) [n:127.0.0.1:34231_ c:collection1 s:shard2 r:core_node1 x:collection1] o.a.s.c.c.ZkStateReader path=[/collections/collection1] [configName]=[conf1] specified config exists in ZooKeeper
   [junit4]   2> 97560 INFO  (coreLoadExecutor-386-thread-1-processing-n:127.0.0.1:34231_) [n:127.0.0.1:34231_ c:collection1 s:shard2 r:core_node1 x:collection1] o.a.s.r.ManagedResourceStorage Setting up ZooKeeper-based storage for the RestManager with znodeBase: /configs/conf1
   [junit4]   2> 97561 INFO  (coreLoadExecutor-386-thread-1-processing-n:127.0.0.1:34231_) [n:127.0.0.1:34231_ c:collection1 s:shard2 r:core_node1 x:collection1] o.a.s.r.ManagedResourceStorage Configured ZooKeeperStorageIO with znodeBase: /configs/conf1
   [junit4]   2> 97561 INFO  (coreLoadExecutor-386-thread-1-processing-n:127.0.0.1:34231_) [n:127.0.0.1:34231_ c:collection1 s:shard2 r:core_node1 x:collection1] o.a.s.r.RestManager Initializing RestManager with initArgs: {}
   [junit4]   2> 97561 INFO  (coreLoadExecutor-386-thread-1-processing-n:127.0.0.1:34231_) [n:127.0.0.1:34231_ c:collection1 s:shard2 r:core_node1 x:collection1] o.a.s.r.ManagedResourceStorage Reading _rest_managed.json using ZooKeeperStorageIO:path=/configs/conf1
   [junit4]   2> 97561 INFO  (coreLoadExecutor-386-thread-1-processing-n:127.0.0.1:34231_) [n:127.0.0.1:34231_ c:collection1 s:shard2 r:core_node1 x:collection1] o.a.s.r.ManagedResourceStorage No data found for znode /configs/conf1/_rest_managed.json
   [junit4]   2> 97561 INFO  (coreLoadExecutor-386-thread-1-processing-n:127.0.0.1:34231_) [n:127.0.0.1:34231_ c:collection1 s:shard2 r:core_node1 x:collection1] o.a.s.r.ManagedResourceStorage Loaded null at path _rest_managed.json using ZooKeeperStorageIO:path=/configs/conf1
   [junit4]   2> 97561 INFO  (coreLoadExecutor-386-thread-1-processing-n:127.0.0.1:34231_) [n:127.0.0.1:34231_ c:collection1 s:shard2 r:core_node1 x:collection1] o.a.s.r.RestManager Initializing 0 registered ManagedResources
   [junit4]   2> 97562 INFO  (coreLoadExecutor-386-thread-1-processing-n:127.0.0.1:34231_) [n:127.0.0.1:34231_ c:collection1 s:shard2 r:core_node1 x:collection1] o.a.s.h.ReplicationHandler Commits will be reserved for  10000
   [junit4]   2> 97562 INFO  (coreLoadExecutor-386-thread-1-processing-n:127.0.0.1:34231_) [n:127.0.0.1:34231_ c:collection1 s:shard2 r:core_node1 x:collection1] o.a.s.u.UpdateLog Looking up max value of version field to seed version buckets
   [junit4]   2> 97562 INFO  (coreLoadExecutor-386-thread-1-processing-n:127.0.0.1:34231_) [n:127.0.0.1:34231_ c:collection1 s:shard2 r:core_node1 x:collection1] o.a.s.u.VersionInfo Refreshing highest value of _version_ for 65536 version buckets from index
   [junit4]   2> 97562 INFO  (coreLoadExe

[...truncated too long message...]

mp/solr.client.solrj.impl.CloudSolrClientTest_4C49404629846E7C-001/shard-3-003/cores/collection1/data [CachedDir<<refCount=0;path=/export/home/jenkins/workspace/Lucene-Solr-5.x-Solaris/solr/build/solr-solrj/test/J1/temp/solr.client.solrj.impl.CloudSolrClientTest_4C49404629846E7C-001/shard-3-003/cores/collection1/data;done=false>>]
   [junit4]   2> 175361 INFO  (zkCallback-176-thread-2-processing-n:127.0.0.1:37325_) [n:127.0.0.1:37325_ c:collection1 s:shard2 r:core_node3 x:collection1] o.a.s.c.CachingDirectoryFactory Closing directory: /export/home/jenkins/workspace/Lucene-Solr-5.x-Solaris/solr/build/solr-solrj/test/J1/temp/solr.client.solrj.impl.CloudSolrClientTest_4C49404629846E7C-001/shard-3-003/cores/collection1/data
   [junit4]   2> 175362 INFO  (zkCallback-176-thread-2-processing-n:127.0.0.1:37325_) [n:127.0.0.1:37325_ c:collection1 s:shard2 r:core_node3 x:collection1] o.a.s.c.CachingDirectoryFactory looking to close /export/home/jenkins/workspace/Lucene-Solr-5.x-Solaris/solr/build/solr-solrj/test/J1/temp/solr.client.solrj.impl.CloudSolrClientTest_4C49404629846E7C-001/shard-3-003/cores/collection1/data/index [CachedDir<<refCount=0;path=/export/home/jenkins/workspace/Lucene-Solr-5.x-Solaris/solr/build/solr-solrj/test/J1/temp/solr.client.solrj.impl.CloudSolrClientTest_4C49404629846E7C-001/shard-3-003/cores/collection1/data/index;done=false>>]
   [junit4]   2> 175362 INFO  (zkCallback-176-thread-2-processing-n:127.0.0.1:37325_) [n:127.0.0.1:37325_ c:collection1 s:shard2 r:core_node3 x:collection1] o.a.s.c.CachingDirectoryFactory Closing directory: /export/home/jenkins/workspace/Lucene-Solr-5.x-Solaris/solr/build/solr-solrj/test/J1/temp/solr.client.solrj.impl.CloudSolrClientTest_4C49404629846E7C-001/shard-3-003/cores/collection1/data/index
   [junit4]   2> 175362 WARN  (zkCallback-176-thread-2-processing-n:127.0.0.1:37325_) [n:127.0.0.1:37325_ c:collection1 s:shard2 r:core_node3 x:collection1] o.a.s.c.LeaderElector 
   [junit4]   2> java.lang.RuntimeException: org.apache.zookeeper.KeeperException$SessionExpiredException: KeeperErrorCode = Session expired for /overseer
   [junit4]   2> 	at org.apache.solr.cloud.Overseer.createOverseerNode(Overseer.java:957)
   [junit4]   2> 	at org.apache.solr.cloud.Overseer.getInQueue(Overseer.java:896)
   [junit4]   2> 	at org.apache.solr.cloud.Overseer.getInQueue(Overseer.java:892)
   [junit4]   2> 	at org.apache.solr.cloud.ShardLeaderElectionContext.runLeaderProcess(ElectionContext.java:303)
   [junit4]   2> 	at org.apache.solr.cloud.LeaderElector.runIamLeaderProcess(LeaderElector.java:197)
   [junit4]   2> 	at org.apache.solr.cloud.LeaderElector.checkIfIamLeader(LeaderElector.java:157)
   [junit4]   2> 	at org.apache.solr.cloud.LeaderElector.joinElection(LeaderElector.java:346)
   [junit4]   2> 	at org.apache.solr.cloud.LeaderElector.joinElection(LeaderElector.java:255)
   [junit4]   2> 	at org.apache.solr.cloud.ShardLeaderElectionContext.rejoinLeaderElection(ElectionContext.java:657)
   [junit4]   2> 	at org.apache.solr.cloud.ShardLeaderElectionContext.runLeaderProcess(ElectionContext.java:329)
   [junit4]   2> 	at org.apache.solr.cloud.LeaderElector.runIamLeaderProcess(LeaderElector.java:197)
   [junit4]   2> 	at org.apache.solr.cloud.LeaderElector.checkIfIamLeader(LeaderElector.java:157)
   [junit4]   2> 	at org.apache.solr.cloud.LeaderElector.access$200(LeaderElector.java:58)
   [junit4]   2> 	at org.apache.solr.cloud.LeaderElector$ElectionWatcher.process(LeaderElector.java:388)
   [junit4]   2> 	at org.apache.solr.common.cloud.SolrZkClient$3$1.run(SolrZkClient.java:264)
   [junit4]   2> 	at java.util.concurrent.Executors$RunnableAdapter.call(Executors.java:511)
   [junit4]   2> 	at java.util.concurrent.FutureTask.run(FutureTask.java:266)
   [junit4]   2> 	at org.apache.solr.common.util.ExecutorUtil$MDCAwareThreadPoolExecutor$1.run(ExecutorUtil.java:231)
   [junit4]   2> 	at java.util.concurrent.ThreadPoolExecutor.runWorker(ThreadPoolExecutor.java:1142)
   [junit4]   2> 	at java.util.concurrent.ThreadPoolExecutor$Worker.run(ThreadPoolExecutor.java:617)
   [junit4]   2> 	at java.lang.Thread.run(Thread.java:745)
   [junit4]   2> Caused by: org.apache.zookeeper.KeeperException$SessionExpiredException: KeeperErrorCode = Session expired for /overseer
   [junit4]   2> 	at org.apache.zookeeper.KeeperException.create(KeeperException.java:127)
   [junit4]   2> 	at org.apache.zookeeper.KeeperException.create(KeeperException.java:51)
   [junit4]   2> 	at org.apache.zookeeper.ZooKeeper.create(ZooKeeper.java:783)
   [junit4]   2> 	at org.apache.solr.common.cloud.SolrZkClient$9.execute(SolrZkClient.java:380)
   [junit4]   2> 	at org.apache.solr.common.cloud.SolrZkClient$9.execute(SolrZkClient.java:377)
   [junit4]   2> 	at org.apache.solr.common.cloud.ZkCmdExecutor.retryOperation(ZkCmdExecutor.java:60)
   [junit4]   2> 	at org.apache.solr.common.cloud.SolrZkClient.create(SolrZkClient.java:377)
   [junit4]   2> 	at org.apache.solr.cloud.Overseer.createOverseerNode(Overseer.java:948)
   [junit4]   2> 	... 20 more
   [junit4]   2> 175365 INFO  (TEST-CloudSolrClientTest.testShutdown-seed#[4C49404629846E7C]) [    ] o.e.j.s.ServerConnector Stopped ServerConnector@3effc2ec{HTTP/1.1}{127.0.0.1:0}
   [junit4]   2> 175365 INFO  (TEST-CloudSolrClientTest.testShutdown-seed#[4C49404629846E7C]) [    ] o.e.j.s.h.ContextHandler Stopped o.e.j.s.ServletContextHandler@3c4f2bf8{/,null,UNAVAILABLE}
   [junit4]   2> 175368 INFO  (TEST-CloudSolrClientTest.testShutdown-seed#[4C49404629846E7C]) [n:127.0.0.1:37325_ c:collection1 s:shard2 r:core_node3 x:collection1] o.a.s.c.ChaosMonkey monkey: stop shard! 63875
   [junit4]   2> 175369 INFO  (TEST-CloudSolrClientTest.testShutdown-seed#[4C49404629846E7C]) [n:127.0.0.1:37325_ c:collection1 s:shard2 r:core_node3 x:collection1] o.a.s.c.ZkTestServer connecting to 127.0.0.1:38972 38972
   [junit4]   2> 175392 INFO  (Thread-457) [n:127.0.0.1:64699_ c:collection1 s:shard2 r:core_node3 x:collection1] o.a.s.c.ZkTestServer connecting to 127.0.0.1:38972 38972
   [junit4]   2> 175394 WARN  (Thread-457) [n:127.0.0.1:64699_ c:collection1 s:shard2 r:core_node3 x:collection1] o.a.s.c.ZkTestServer Watch limit violations: 
   [junit4]   2> Maximum concurrent create/delete watches above limit:
   [junit4]   2> 
   [junit4]   2> 	5	/solr/aliases.json
   [junit4]   2> 	4	/solr/security.json
   [junit4]   2> 	4	/solr/configs/conf1
   [junit4]   2> 
   [junit4]   2> Maximum concurrent data watches above limit:
   [junit4]   2> 
   [junit4]   2> 	5	/solr/clusterstate.json
   [junit4]   2> 	3	/solr/collections/collection1/state.json
   [junit4]   2> 
   [junit4]   2> Maximum concurrent children watches above limit:
   [junit4]   2> 
   [junit4]   2> 	5	/solr/live_nodes
   [junit4]   2> 	5	/solr/collections
   [junit4]   2> 	3	/solr/overseer/queue
   [junit4]   2> 	3	/solr/overseer/collection-queue-work
   [junit4]   2> 	2	/solr/overseer/queue-work
   [junit4]   2> 
   [junit4]   2> 175397 INFO  (SUITE-CloudSolrClientTest-seed#[4C49404629846E7C]-worker) [n:127.0.0.1:37325_ c:collection1 s:shard2 r:core_node3 x:collection1] o.a.s.SolrTestCaseJ4 ###deleteCore
   [junit4]   2> NOTE: leaving temporary files on disk at: /export/home/jenkins/workspace/Lucene-Solr-5.x-Solaris/solr/build/solr-solrj/test/J1/temp/solr.client.solrj.impl.CloudSolrClientTest_4C49404629846E7C-001
   [junit4]   2> Feb 09, 2016 3:20:40 AM com.carrotsearch.randomizedtesting.ThreadLeakControl checkThreadLeaks
   [junit4]   2> WARNING: Will linger awaiting termination of 2 leaked thread(s).
   [junit4]   2> NOTE: test params are: codec=HighCompressionCompressingStoredFields(storedFieldsFormat=CompressingStoredFieldsFormat(compressionMode=HIGH_COMPRESSION, chunkSize=4, maxDocsPerChunk=7, blockSize=4), termVectorsFormat=CompressingTermVectorsFormat(compressionMode=HIGH_COMPRESSION, chunkSize=4, blockSize=4)), sim=DefaultSimilarity, locale=sr-Latn-ME, timezone=America/St_Vincent
   [junit4]   2> NOTE: SunOS 5.11 amd64/Oracle Corporation 1.8.0_72 (64-bit)/cpus=3,threads=1,free=92599232,total=196517888
   [junit4]   2> NOTE: All tests run in this JVM: [SolrParamTest, SolrPingTest, TestJsonRecordReader, StreamExpressionParserTest, CloudSolrClientMultiConstructorTest, SolrExampleStreamingBinaryTest, ClientUtilsTest, TestLBHttpSolrClient, SolrExceptionTest, GetByIdTest, SolrExampleBinaryTest, MergeIndexesEmbeddedTest, QueryResponseTest, TestCloudSolrClientConnections, LargeVolumeBinaryJettyTest, LargeVolumeEmbeddedTest, TestSpellCheckResponse, TestCoreAdmin, TestJavaBinCodec, TestHash, TestFastInputStream, DocumentAnalysisResponseTest, FieldAnalysisResponseTest, AnlysisResponseBaseTest, CloudSolrClientTest]
   [junit4] Completed [71/71 (1!)] on J1 in 82.99s, 3 tests, 1 failure <<< FAILURES!

[...truncated 10 lines...]
BUILD FAILED
/export/home/jenkins/workspace/Lucene-Solr-5.x-Solaris/build.xml:750: The following error occurred while executing this line:
/export/home/jenkins/workspace/Lucene-Solr-5.x-Solaris/build.xml:694: The following error occurred while executing this line:
/export/home/jenkins/workspace/Lucene-Solr-5.x-Solaris/build.xml:59: The following error occurred while executing this line:
/export/home/jenkins/workspace/Lucene-Solr-5.x-Solaris/solr/build.xml:246: The following error occurred while executing this line:
/export/home/jenkins/workspace/Lucene-Solr-5.x-Solaris/solr/common-build.xml:534: The following error occurred while executing this line:
/export/home/jenkins/workspace/Lucene-Solr-5.x-Solaris/lucene/common-build.xml:1477: The following error occurred while executing this line:
/export/home/jenkins/workspace/Lucene-Solr-5.x-Solaris/lucene/common-build.xml:1033: There were test failures: 71 suites, 483 tests, 1 failure [seed: 4C49404629846E7C]

Total time: 72 minutes 1 second
Build step 'Invoke Ant' marked build as failure
Archiving artifacts
[WARNINGS] Skipping publisher since build result is FAILURE
Recording test results
Email was triggered for: Failure - Any
Sending email for trigger: Failure - Any



Mime
View raw message