lucene-dev mailing list archives

Site index · List index
Message view « Date » · « Thread »
Top « Date » · « Thread »
From Policeman Jenkins Server <jenk...@thetaphi.de>
Subject [JENKINS] Lucene-Solr-trunk-Windows (64bit/jdk1.8.0_72) - Build # 5635 - Still Failing!
Date Mon, 22 Feb 2016 03:32:27 GMT
Build: http://jenkins.thetaphi.de/job/Lucene-Solr-trunk-Windows/5635/
Java: 64bit/jdk1.8.0_72 -XX:+UseCompressedOops -XX:+UseParallelGC

3 tests failed.
FAILED:  junit.framework.TestSuite.org.apache.solr.core.TestLazyCores

Error Message:
ObjectTracker found 4 object(s) that were not released!!! [SolrCore, MockDirectoryWrapper, MDCAwareThreadPoolExecutor, MockDirectoryWrapper]

Stack Trace:
java.lang.AssertionError: ObjectTracker found 4 object(s) that were not released!!! [SolrCore, MockDirectoryWrapper, MDCAwareThreadPoolExecutor, MockDirectoryWrapper]
	at __randomizedtesting.SeedInfo.seed([A8DA3FB6C6EAC481]:0)
	at org.junit.Assert.fail(Assert.java:93)
	at org.junit.Assert.assertTrue(Assert.java:43)
	at org.junit.Assert.assertNull(Assert.java:551)
	at org.apache.solr.SolrTestCaseJ4.afterClass(SolrTestCaseJ4.java:228)
	at sun.reflect.GeneratedMethodAccessor16.invoke(Unknown Source)
	at sun.reflect.DelegatingMethodAccessorImpl.invoke(DelegatingMethodAccessorImpl.java:43)
	at java.lang.reflect.Method.invoke(Method.java:498)
	at com.carrotsearch.randomizedtesting.RandomizedRunner.invoke(RandomizedRunner.java:1764)
	at com.carrotsearch.randomizedtesting.RandomizedRunner$7.evaluate(RandomizedRunner.java:834)
	at com.carrotsearch.randomizedtesting.rules.StatementAdapter.evaluate(StatementAdapter.java:36)
	at com.carrotsearch.randomizedtesting.rules.SystemPropertiesRestoreRule$1.evaluate(SystemPropertiesRestoreRule.java:57)
	at org.apache.lucene.util.AbstractBeforeAfterRule$1.evaluate(AbstractBeforeAfterRule.java:45)
	at com.carrotsearch.randomizedtesting.rules.StatementAdapter.evaluate(StatementAdapter.java:36)
	at org.apache.lucene.util.TestRuleStoreClassName$1.evaluate(TestRuleStoreClassName.java:41)
	at com.carrotsearch.randomizedtesting.rules.NoShadowingOrOverridesOnMethodsRule$1.evaluate(NoShadowingOrOverridesOnMethodsRule.java:40)
	at com.carrotsearch.randomizedtesting.rules.NoShadowingOrOverridesOnMethodsRule$1.evaluate(NoShadowingOrOverridesOnMethodsRule.java:40)
	at com.carrotsearch.randomizedtesting.rules.StatementAdapter.evaluate(StatementAdapter.java:36)
	at com.carrotsearch.randomizedtesting.rules.StatementAdapter.evaluate(StatementAdapter.java:36)
	at com.carrotsearch.randomizedtesting.rules.StatementAdapter.evaluate(StatementAdapter.java:36)
	at org.apache.lucene.util.TestRuleAssertionsRequired$1.evaluate(TestRuleAssertionsRequired.java:53)
	at org.apache.lucene.util.TestRuleMarkFailure$1.evaluate(TestRuleMarkFailure.java:47)
	at org.apache.lucene.util.TestRuleIgnoreAfterMaxFailures$1.evaluate(TestRuleIgnoreAfterMaxFailures.java:64)
	at org.apache.lucene.util.TestRuleIgnoreTestSuites$1.evaluate(TestRuleIgnoreTestSuites.java:54)
	at com.carrotsearch.randomizedtesting.rules.StatementAdapter.evaluate(StatementAdapter.java:36)
	at com.carrotsearch.randomizedtesting.ThreadLeakControl$StatementRunner.run(ThreadLeakControl.java:367)
	at java.lang.Thread.run(Thread.java:745)


FAILED:  junit.framework.TestSuite.org.apache.solr.core.TestLazyCores

Error Message:
1 thread leaked from SUITE scope at org.apache.solr.core.TestLazyCores:     1) Thread[id=12955, name=searcherExecutor-5985-thread-1, state=WAITING, group=TGRP-TestLazyCores]         at sun.misc.Unsafe.park(Native Method)         at java.util.concurrent.locks.LockSupport.park(LockSupport.java:175)         at java.util.concurrent.locks.AbstractQueuedSynchronizer$ConditionObject.await(AbstractQueuedSynchronizer.java:2039)         at java.util.concurrent.LinkedBlockingQueue.take(LinkedBlockingQueue.java:442)         at java.util.concurrent.ThreadPoolExecutor.getTask(ThreadPoolExecutor.java:1067)         at java.util.concurrent.ThreadPoolExecutor.runWorker(ThreadPoolExecutor.java:1127)         at java.util.concurrent.ThreadPoolExecutor$Worker.run(ThreadPoolExecutor.java:617)         at java.lang.Thread.run(Thread.java:745)

Stack Trace:
com.carrotsearch.randomizedtesting.ThreadLeakError: 1 thread leaked from SUITE scope at org.apache.solr.core.TestLazyCores: 
   1) Thread[id=12955, name=searcherExecutor-5985-thread-1, state=WAITING, group=TGRP-TestLazyCores]
        at sun.misc.Unsafe.park(Native Method)
        at java.util.concurrent.locks.LockSupport.park(LockSupport.java:175)
        at java.util.concurrent.locks.AbstractQueuedSynchronizer$ConditionObject.await(AbstractQueuedSynchronizer.java:2039)
        at java.util.concurrent.LinkedBlockingQueue.take(LinkedBlockingQueue.java:442)
        at java.util.concurrent.ThreadPoolExecutor.getTask(ThreadPoolExecutor.java:1067)
        at java.util.concurrent.ThreadPoolExecutor.runWorker(ThreadPoolExecutor.java:1127)
        at java.util.concurrent.ThreadPoolExecutor$Worker.run(ThreadPoolExecutor.java:617)
        at java.lang.Thread.run(Thread.java:745)
	at __randomizedtesting.SeedInfo.seed([A8DA3FB6C6EAC481]:0)


FAILED:  junit.framework.TestSuite.org.apache.solr.core.TestLazyCores

Error Message:
There are still zombie threads that couldn't be terminated:    1) Thread[id=12955, name=searcherExecutor-5985-thread-1, state=WAITING, group=TGRP-TestLazyCores]         at sun.misc.Unsafe.park(Native Method)         at java.util.concurrent.locks.LockSupport.park(LockSupport.java:175)         at java.util.concurrent.locks.AbstractQueuedSynchronizer$ConditionObject.await(AbstractQueuedSynchronizer.java:2039)         at java.util.concurrent.LinkedBlockingQueue.take(LinkedBlockingQueue.java:442)         at java.util.concurrent.ThreadPoolExecutor.getTask(ThreadPoolExecutor.java:1067)         at java.util.concurrent.ThreadPoolExecutor.runWorker(ThreadPoolExecutor.java:1127)         at java.util.concurrent.ThreadPoolExecutor$Worker.run(ThreadPoolExecutor.java:617)         at java.lang.Thread.run(Thread.java:745)

Stack Trace:
com.carrotsearch.randomizedtesting.ThreadLeakError: There are still zombie threads that couldn't be terminated:
   1) Thread[id=12955, name=searcherExecutor-5985-thread-1, state=WAITING, group=TGRP-TestLazyCores]
        at sun.misc.Unsafe.park(Native Method)
        at java.util.concurrent.locks.LockSupport.park(LockSupport.java:175)
        at java.util.concurrent.locks.AbstractQueuedSynchronizer$ConditionObject.await(AbstractQueuedSynchronizer.java:2039)
        at java.util.concurrent.LinkedBlockingQueue.take(LinkedBlockingQueue.java:442)
        at java.util.concurrent.ThreadPoolExecutor.getTask(ThreadPoolExecutor.java:1067)
        at java.util.concurrent.ThreadPoolExecutor.runWorker(ThreadPoolExecutor.java:1127)
        at java.util.concurrent.ThreadPoolExecutor$Worker.run(ThreadPoolExecutor.java:617)
        at java.lang.Thread.run(Thread.java:745)
	at __randomizedtesting.SeedInfo.seed([A8DA3FB6C6EAC481]:0)




Build Log:
[...truncated 11711 lines...]
   [junit4] Suite: org.apache.solr.core.TestLazyCores
   [junit4]   2> Creating dataDir: C:\Users\JenkinsSlave\workspace\Lucene-Solr-trunk-Windows\solr\build\solr-core\test\J1\temp\solr.core.TestLazyCores_A8DA3FB6C6EAC481-001\init-core-data-001
   [junit4]   2> 1946121 INFO  (SUITE-TestLazyCores-seed#[A8DA3FB6C6EAC481]-worker) [    ] o.a.s.SolrTestCaseJ4 Randomized ssl (false) and clientAuth (false)
   [junit4]   2> 1946124 INFO  (TEST-TestLazyCores.testCreateTransientFromAdmin-seed#[A8DA3FB6C6EAC481]) [    ] o.a.s.SolrTestCaseJ4 ###Starting testCreateTransientFromAdmin
   [junit4]   2> 1946178 INFO  (TEST-TestLazyCores.testCreateTransientFromAdmin-seed#[A8DA3FB6C6EAC481]) [    ] o.a.s.c.SolrResourceLoader new SolrResourceLoader for directory: 'C:\Users\JenkinsSlave\workspace\Lucene-Solr-trunk-Windows\solr\build\solr-core\test\J1\temp\solr.core.TestLazyCores_A8DA3FB6C6EAC481-001\tempDir-001'
   [junit4]   2> 1946179 INFO  (TEST-TestLazyCores.testCreateTransientFromAdmin-seed#[A8DA3FB6C6EAC481]) [    ] o.a.s.c.SolrResourceLoader JNDI not configured for solr (NoInitialContextEx)
   [junit4]   2> 1946179 INFO  (TEST-TestLazyCores.testCreateTransientFromAdmin-seed#[A8DA3FB6C6EAC481]) [    ] o.a.s.c.SolrResourceLoader solr home defaulted to 'solr/' (could not find system property or JNDI)
   [junit4]   2> 1946179 INFO  (TEST-TestLazyCores.testCreateTransientFromAdmin-seed#[A8DA3FB6C6EAC481]) [    ] o.a.s.c.CoreContainer New CoreContainer 591498759
   [junit4]   2> 1946179 INFO  (TEST-TestLazyCores.testCreateTransientFromAdmin-seed#[A8DA3FB6C6EAC481]) [    ] o.a.s.c.CoreContainer Loading cores into CoreContainer [instanceDir=C:\Users\JenkinsSlave\workspace\Lucene-Solr-trunk-Windows\solr\build\solr-core\test\J1\temp\solr.core.TestLazyCores_A8DA3FB6C6EAC481-001\tempDir-001]
   [junit4]   2> 1946179 WARN  (TEST-TestLazyCores.testCreateTransientFromAdmin-seed#[A8DA3FB6C6EAC481]) [    ] o.a.s.c.CoreContainer Couldn't add files from C:\Users\JenkinsSlave\workspace\Lucene-Solr-trunk-Windows\solr\build\solr-core\test\J1\temp\solr.core.TestLazyCores_A8DA3FB6C6EAC481-001\tempDir-001\lib to classpath: C:\Users\JenkinsSlave\workspace\Lucene-Solr-trunk-Windows\solr\build\solr-core\test\J1\temp\solr.core.TestLazyCores_A8DA3FB6C6EAC481-001\tempDir-001\lib
   [junit4]   2> 1946180 INFO  (TEST-TestLazyCores.testCreateTransientFromAdmin-seed#[A8DA3FB6C6EAC481]) [    ] o.a.s.h.c.HttpShardHandlerFactory created with socketTimeout : 600000,connTimeout : 60000,maxConnectionsPerHost : 20,maxConnections : 10000,corePoolSize : 0,maximumPoolSize : 2147483647,maxThreadIdleTime : 5,sizeOfQueue : -1,fairnessPolicy : false,useRetries : false,
   [junit4]   2> 1946187 INFO  (TEST-TestLazyCores.testCreateTransientFromAdmin-seed#[A8DA3FB6C6EAC481]) [    ] o.a.s.u.UpdateShardHandler Creating UpdateShardHandler HTTP client with params: socketTimeout=600000&connTimeout=60000&retry=true
   [junit4]   2> 1946187 INFO  (TEST-TestLazyCores.testCreateTransientFromAdmin-seed#[A8DA3FB6C6EAC481]) [    ] o.a.s.c.SolrCores Allocating transient cache for 4 transient cores
   [junit4]   2> 1946191 INFO  (TEST-TestLazyCores.testCreateTransientFromAdmin-seed#[A8DA3FB6C6EAC481]) [    ] o.a.s.l.LogWatcher SLF4J impl is org.slf4j.impl.Log4jLoggerFactory
   [junit4]   2> 1946191 INFO  (TEST-TestLazyCores.testCreateTransientFromAdmin-seed#[A8DA3FB6C6EAC481]) [    ] o.a.s.l.LogWatcher Registering Log Listener [Log4j (org.slf4j.impl.Log4jLoggerFactory)]
   [junit4]   2> 1946191 INFO  (TEST-TestLazyCores.testCreateTransientFromAdmin-seed#[A8DA3FB6C6EAC481]) [    ] o.a.s.c.CoreContainer Security conf doesn't exist. Skipping setup for authorization module.
   [junit4]   2> 1946191 INFO  (TEST-TestLazyCores.testCreateTransientFromAdmin-seed#[A8DA3FB6C6EAC481]) [    ] o.a.s.c.CoreContainer No authentication plugin used.
   [junit4]   2> 1946196 INFO  (TEST-TestLazyCores.testCreateTransientFromAdmin-seed#[A8DA3FB6C6EAC481]) [    ] o.a.s.c.CoreDescriptor Created CoreDescriptor: {name=collection1, config=solrconfig.xml, loadOnStartup=true, schema=schema.xml, configSetProperties=configsetprops.json, transient=false, dataDir=data\}
   [junit4]   2> 1946196 INFO  (TEST-TestLazyCores.testCreateTransientFromAdmin-seed#[A8DA3FB6C6EAC481]) [    ] o.a.s.c.CoreDescriptor Created CoreDescriptor: {name=collection2, config=solrconfig.xml, loadOnStartup=true, schema=schema.xml, configSetProperties=configsetprops.json, transient=true, dataDir=data\}
   [junit4]   2> 1946197 INFO  (TEST-TestLazyCores.testCreateTransientFromAdmin-seed#[A8DA3FB6C6EAC481]) [    ] o.a.s.c.CoreDescriptor Created CoreDescriptor: {name=collection3, config=solrconfig.xml, loadOnStartup=false, schema=schema.xml, configSetProperties=configsetprops.json, transient=on, dataDir=data\}
   [junit4]   2> 1946197 INFO  (TEST-TestLazyCores.testCreateTransientFromAdmin-seed#[A8DA3FB6C6EAC481]) [    ] o.a.s.c.CoreDescriptor Created CoreDescriptor: {name=collection4, config=solrconfig.xml, loadOnStartup=false, schema=schema.xml, configSetProperties=configsetprops.json, transient=false, dataDir=data\}
   [junit4]   2> 1946198 INFO  (TEST-TestLazyCores.testCreateTransientFromAdmin-seed#[A8DA3FB6C6EAC481]) [    ] o.a.s.c.CoreDescriptor Created CoreDescriptor: {name=collection5, config=solrconfig.xml, loadOnStartup=true, schema=schema.xml, configSetProperties=configsetprops.json, transient=false, dataDir=data\}
   [junit4]   2> 1946198 INFO  (TEST-TestLazyCores.testCreateTransientFromAdmin-seed#[A8DA3FB6C6EAC481]) [    ] o.a.s.c.CoreDescriptor Created CoreDescriptor: {name=collection6, config=solrconfig.xml, loadOnStartup=false, schema=schema.xml, configSetProperties=configsetprops.json, transient=true, dataDir=data\}
   [junit4]   2> 1946199 INFO  (TEST-TestLazyCores.testCreateTransientFromAdmin-seed#[A8DA3FB6C6EAC481]) [    ] o.a.s.c.CoreDescriptor Created CoreDescriptor: {name=collection7, config=solrconfig.xml, loadOnStartup=false, schema=schema.xml, configSetProperties=configsetprops.json, transient=true, dataDir=data\}
   [junit4]   2> 1946199 INFO  (TEST-TestLazyCores.testCreateTransientFromAdmin-seed#[A8DA3FB6C6EAC481]) [    ] o.a.s.c.CoreDescriptor Created CoreDescriptor: {name=collection8, config=solrconfig.xml, loadOnStartup=false, schema=schema.xml, configSetProperties=configsetprops.json, transient=true, dataDir=data\}
   [junit4]   2> 1946200 INFO  (TEST-TestLazyCores.testCreateTransientFromAdmin-seed#[A8DA3FB6C6EAC481]) [    ] o.a.s.c.CoreDescriptor Created CoreDescriptor: {name=collection9, config=solrconfig.xml, loadOnStartup=false, schema=schema.xml, configSetProperties=configsetprops.json, transient=true, dataDir=data\}
   [junit4]   2> 1946201 INFO  (coreLoadExecutor-5730-thread-1) [    ] o.a.s.c.SolrResourceLoader new SolrResourceLoader for directory: 'C:\Users\JenkinsSlave\workspace\Lucene-Solr-trunk-Windows\solr\build\solr-core\test\J1\temp\solr.core.TestLazyCores_A8DA3FB6C6EAC481-001\tempDir-001\collection1'
   [junit4]   2> 1946201 INFO  (coreLoadExecutor-5730-thread-1) [    ] o.a.s.c.SolrResourceLoader JNDI not configured for solr (NoInitialContextEx)
   [junit4]   2> 1946201 INFO  (coreLoadExecutor-5730-thread-1) [    ] o.a.s.c.SolrResourceLoader solr home defaulted to 'solr/' (could not find system property or JNDI)
   [junit4]   2> 1946201 INFO  (coreLoadExecutor-5730-thread-3) [    ] o.a.s.c.SolrResourceLoader new SolrResourceLoader for directory: 'C:\Users\JenkinsSlave\workspace\Lucene-Solr-trunk-Windows\solr\build\solr-core\test\J1\temp\solr.core.TestLazyCores_A8DA3FB6C6EAC481-001\tempDir-001\collection5'
   [junit4]   2> 1946201 INFO  (coreLoadExecutor-5730-thread-3) [    ] o.a.s.c.SolrResourceLoader JNDI not configured for solr (NoInitialContextEx)
   [junit4]   2> 1946201 INFO  (coreLoadExecutor-5730-thread-3) [    ] o.a.s.c.SolrResourceLoader solr home defaulted to 'solr/' (could not find system property or JNDI)
   [junit4]   2> 1946211 INFO  (coreLoadExecutor-5730-thread-2) [    ] o.a.s.c.SolrResourceLoader new SolrResourceLoader for directory: 'C:\Users\JenkinsSlave\workspace\Lucene-Solr-trunk-Windows\solr\build\solr-core\test\J1\temp\solr.core.TestLazyCores_A8DA3FB6C6EAC481-001\tempDir-001\collection2'
   [junit4]   2> 1946211 INFO  (coreLoadExecutor-5730-thread-2) [    ] o.a.s.c.SolrResourceLoader JNDI not configured for solr (NoInitialContextEx)
   [junit4]   2> 1946211 INFO  (coreLoadExecutor-5730-thread-2) [    ] o.a.s.c.SolrResourceLoader solr home defaulted to 'solr/' (could not find system property or JNDI)
   [junit4]   2> 1946225 INFO  (coreLoadExecutor-5730-thread-3) [    ] o.a.s.c.SolrConfig current version of requestparams : -1
   [junit4]   2> 1946225 INFO  (coreLoadExecutor-5730-thread-2) [    ] o.a.s.c.SolrConfig current version of requestparams : -1
   [junit4]   2> 1946226 INFO  (coreLoadExecutor-5730-thread-3) [    ] o.a.s.c.SolrConfig Using Lucene MatchVersion: 6.0.0
   [junit4]   2> 1946226 INFO  (coreLoadExecutor-5730-thread-2) [    ] o.a.s.c.SolrConfig Using Lucene MatchVersion: 6.0.0
   [junit4]   2> 1946229 INFO  (coreLoadExecutor-5730-thread-3) [    ] o.a.s.c.SolrConfig Loaded SolrConfig: solrconfig.xml
   [junit4]   2> 1946229 INFO  (coreLoadExecutor-5730-thread-2) [    ] o.a.s.c.SolrConfig Loaded SolrConfig: solrconfig.xml
   [junit4]   2> 1946232 INFO  (coreLoadExecutor-5730-thread-1) [    ] o.a.s.c.SolrConfig current version of requestparams : -1
   [junit4]   2> 1946232 INFO  (coreLoadExecutor-5730-thread-2) [    ] o.a.s.s.IndexSchema [collection2] Schema name=tiny
   [junit4]   2> 1946232 INFO  (coreLoadExecutor-5730-thread-3) [    ] o.a.s.s.IndexSchema [collection5] Schema name=tiny
   [junit4]   2> 1946232 INFO  (coreLoadExecutor-5730-thread-1) [    ] o.a.s.c.SolrConfig Using Lucene MatchVersion: 6.0.0
   [junit4]   2> 1946243 INFO  (coreLoadExecutor-5730-thread-3) [    ] o.a.s.s.IndexSchema unique key field: id
   [junit4]   2> 1946244 INFO  (coreLoadExecutor-5730-thread-1) [    ] o.a.s.c.SolrConfig Loaded SolrConfig: solrconfig.xml
   [junit4]   2> 1946244 INFO  (coreLoadExecutor-5730-thread-2) [    ] o.a.s.s.IndexSchema unique key field: id
   [junit4]   2> 1946250 INFO  (coreLoadExecutor-5730-thread-1) [    ] o.a.s.s.IndexSchema [collection1] Schema name=tiny
   [junit4]   2> 1946252 INFO  (coreLoadExecutor-5730-thread-3) [    ] o.a.s.c.ConfigSetProperties Did not find ConfigSet properties, assuming default properties: Can't find resource 'configsetprops.json' in classpath or 'C:\Users\JenkinsSlave\workspace\Lucene-Solr-trunk-Windows\solr\build\solr-core\test\J1\temp\solr.core.TestLazyCores_A8DA3FB6C6EAC481-001\tempDir-001\collection5'
   [junit4]   2> 1946252 INFO  (coreLoadExecutor-5730-thread-3) [    ] o.a.s.c.CoreContainer Creating SolrCore 'collection5' using configuration from instancedir C:\Users\JenkinsSlave\workspace\Lucene-Solr-trunk-Windows\solr\build\solr-core\test\J1\temp\solr.core.TestLazyCores_A8DA3FB6C6EAC481-001\tempDir-001\collection5
   [junit4]   2> 1946252 INFO  (coreLoadExecutor-5730-thread-3) [    x:collection5] o.a.s.c.SolrCore org.apache.solr.core.MockDirectoryFactory
   [junit4]   2> 1946252 INFO  (coreLoadExecutor-5730-thread-3) [    x:collection5] o.a.s.c.SolrCore [[collection5] ] Opening new SolrCore at [C:\Users\JenkinsSlave\workspace\Lucene-Solr-trunk-Windows\solr\build\solr-core\test\J1\temp\solr.core.TestLazyCores_A8DA3FB6C6EAC481-001\tempDir-001\collection5], dataDir=[C:\Users\JenkinsSlave\workspace\Lucene-Solr-trunk-Windows\solr\build\solr-core\test\J1\temp\solr.core.TestLazyCores_A8DA3FB6C6EAC481-001\tempDir-001\collection5\data\]
   [junit4]   2> 1946252 INFO  (coreLoadExecutor-5730-thread-3) [    x:collection5] o.a.s.c.SolrCore JMX monitoring not detected for core: collection5
   [junit4]   2> 1946253 INFO  (coreLoadExecutor-5730-thread-3) [    x:collection5] o.a.s.c.CachingDirectoryFactory return new directory for C:\Users\JenkinsSlave\workspace\Lucene-Solr-trunk-Windows\solr\build\solr-core\test\J1\temp\solr.core.TestLazyCores_A8DA3FB6C6EAC481-001\tempDir-001\collection5\data\
   [junit4]   2> 1946253 INFO  (coreLoadExecutor-5730-thread-3) [    x:collection5] o.a.s.c.SolrCore New index directory detected: old=null new=C:\Users\JenkinsSlave\workspace\Lucene-Solr-trunk-Windows\solr\build\solr-core\test\J1\temp\solr.core.TestLazyCores_A8DA3FB6C6EAC481-001\tempDir-001\collection5\data\index/
   [junit4]   2> 1946253 WARN  (coreLoadExecutor-5730-thread-3) [    x:collection5] o.a.s.c.SolrCore [collection5] Solr index directory 'C:\Users\JenkinsSlave\workspace\Lucene-Solr-trunk-Windows\solr\build\solr-core\test\J1\temp\solr.core.TestLazyCores_A8DA3FB6C6EAC481-001\tempDir-001\collection5\data\index' doesn't exist. Creating new index...
   [junit4]   2> 1946253 INFO  (coreLoadExecutor-5730-thread-1) [    ] o.a.s.s.IndexSchema unique key field: id
   [junit4]   2> 1946253 INFO  (coreLoadExecutor-5730-thread-3) [    x:collection5] o.a.s.c.CachingDirectoryFactory return new directory for C:\Users\JenkinsSlave\workspace\Lucene-Solr-trunk-Windows\solr\build\solr-core\test\J1\temp\solr.core.TestLazyCores_A8DA3FB6C6EAC481-001\tempDir-001\collection5\data\index
   [junit4]   2> 1946253 INFO  (coreLoadExecutor-5730-thread-3) [    x:collection5] o.a.s.u.RandomMergePolicy RandomMergePolicy wrapping class org.apache.lucene.index.TieredMergePolicy: [TieredMergePolicy: maxMergeAtOnce=29, maxMergeAtOnceExplicit=50, maxMergedSegmentMB=28.8984375, floorSegmentMB=0.982421875, forceMergeDeletesPctAllowed=13.881371755758318, segmentsPerTier=46.0, maxCFSSegmentSizeMB=8.796093022207999E12, noCFSRatio=0.0
   [junit4]   2> 1946254 INFO  (coreLoadExecutor-5730-thread-2) [    ] o.a.s.c.ConfigSetProperties Did not find ConfigSet properties, assuming default properties: Can't find resource 'configsetprops.json' in classpath or 'C:\Users\JenkinsSlave\workspace\Lucene-Solr-trunk-Windows\solr\build\solr-core\test\J1\temp\solr.core.TestLazyCores_A8DA3FB6C6EAC481-001\tempDir-001\collection2'
   [junit4]   2> 1946254 INFO  (coreLoadExecutor-5730-thread-2) [    ] o.a.s.c.CoreContainer Creating SolrCore 'collection2' using configuration from instancedir C:\Users\JenkinsSlave\workspace\Lucene-Solr-trunk-Windows\solr\build\solr-core\test\J1\temp\solr.core.TestLazyCores_A8DA3FB6C6EAC481-001\tempDir-001\collection2
   [junit4]   2> 1946254 INFO  (coreLoadExecutor-5730-thread-2) [    x:collection2] o.a.s.c.SolrCore org.apache.solr.core.MockDirectoryFactory
   [junit4]   2> 1946254 INFO  (coreLoadExecutor-5730-thread-2) [    x:collection2] o.a.s.c.SolrCore [[collection2] ] Opening new SolrCore at [C:\Users\JenkinsSlave\workspace\Lucene-Solr-trunk-Windows\solr\build\solr-core\test\J1\temp\solr.core.TestLazyCores_A8DA3FB6C6EAC481-001\tempDir-001\collection2], dataDir=[C:\Users\JenkinsSlave\workspace\Lucene-Solr-trunk-Windows\solr\build\solr-core\test\J1\temp\solr.core.TestLazyCores_A8DA3FB6C6EAC481-001\tempDir-001\collection2\data\]
   [junit4]   2> 1946254 INFO  (coreLoadExecutor-5730-thread-2) [    x:collection2] o.a.s.c.SolrCore JMX monitoring not detected for core: collection2
   [junit4]   2> 1946254 INFO  (coreLoadExecutor-5730-thread-2) [    x:collection2] o.a.s.c.CachingDirectoryFactory return new directory for C:\Users\JenkinsSlave\workspace\Lucene-Solr-trunk-Windows\solr\build\solr-core\test\J1\temp\solr.core.TestLazyCores_A8DA3FB6C6EAC481-001\tempDir-001\collection2\data\
   [junit4]   2> 1946254 INFO  (coreLoadExecutor-5730-thread-2) [    x:collection2] o.a.s.c.SolrCore New index directory detected: old=null new=C:\Users\JenkinsSlave\workspace\Lucene-Solr-trunk-Windows\solr\build\solr-core\test\J1\temp\solr.core.TestLazyCores_A8DA3FB6C6EAC481-001\tempDir-001\collection2\data\index/
   [junit4]   2> 1946254 WARN  (coreLoadExecutor-5730-thread-2) [    x:collection2] o.a.s.c.SolrCore [collection2] Solr index directory 'C:\Users\JenkinsSlave\workspace\Lucene-Solr-trunk-Windows\solr\build\solr-core\test\J1\temp\solr.core.TestLazyCores_A8DA3FB6C6EAC481-001\tempDir-001\collection2\data\index' doesn't exist. Creating new index...
   [junit4]   2> 1946254 INFO  (coreLoadExecutor-5730-thread-2) [    x:collection2] o.a.s.c.CachingDirectoryFactory return new directory for C:\Users\JenkinsSlave\workspace\Lucene-Solr-trunk-Windows\solr\build\solr-core\test\J1\temp\solr.core.TestLazyCores_A8DA3FB6C6EAC481-001\tempDir-001\collection2\data\index
   [junit4]   2> 1946255 INFO  (coreLoadExecutor-5730-thread-2) [    x:collection2] o.a.s.u.RandomMergePolicy RandomMergePolicy wrapping class org.apache.lucene.index.TieredMergePolicy: [TieredMergePolicy: maxMergeAtOnce=29, maxMergeAtOnceExplicit=50, maxMergedSegmentMB=28.8984375, floorSegmentMB=0.982421875, forceMergeDeletesPctAllowed=13.881371755758318, segmentsPerTier=46.0, maxCFSSegmentSizeMB=8.796093022207999E12, noCFSRatio=0.0
   [junit4]   2> 1946255 INFO  (coreLoadExecutor-5730-thread-1) [    ] o.a.s.c.ConfigSetProperties Did not find ConfigSet properties, assuming default properties: Can't find resource 'configsetprops.json' in classpath or 'C:\Users\JenkinsSlave\workspace\Lucene-Solr-trunk-Windows\solr\build\solr-core\test\J1\temp\solr.core.TestLazyCores_A8DA3FB6C6EAC481-001\tempDir-001\collection1'
   [junit4]   2> 1946255 INFO  (coreLoadExecutor-5730-thread-1) [    ] o.a.s.c.CoreContainer Creating SolrCore 'collection1' using configuration from instancedir C:\Users\JenkinsSlave\workspace\Lucene-Solr-trunk-Windows\solr\build\solr-core\test\J1\temp\solr.core.TestLazyCores_A8DA3FB6C6EAC481-001\tempDir-001\collection1
   [junit4]   2> 1946255 INFO  (coreLoadExecutor-5730-thread-1) [    x:collection1] o.a.s.c.SolrCore org.apache.solr.core.MockDirectoryFactory
   [junit4]   2> 1946255 INFO  (coreLoadExecutor-5730-thread-3) [    x:collection5] o.a.s.c.SolrDeletionPolicy SolrDeletionPolicy.onCommit: commits: num=1
   [junit4]   2> 	commit{dir=MockDirectoryWrapper(RAMDirectory@756580df lockFactory=org.apache.lucene.store.SingleInstanceLockFactory@acf6cdb),segFN=segments_1,generation=1}
   [junit4]   2> 1946255 INFO  (coreLoadExecutor-5730-thread-3) [    x:collection5] o.a.s.c.SolrDeletionPolicy newest commit generation = 1
   [junit4]   2> 1946255 INFO  (coreLoadExecutor-5730-thread-1) [    x:collection1] o.a.s.c.SolrCore [[collection1] ] Opening new SolrCore at [C:\Users\JenkinsSlave\workspace\Lucene-Solr-trunk-Windows\solr\build\solr-core\test\J1\temp\solr.core.TestLazyCores_A8DA3FB6C6EAC481-001\tempDir-001\collection1], dataDir=[C:\Users\JenkinsSlave\workspace\Lucene-Solr-trunk-Windows\solr\build\solr-core\test\J1\temp\solr.core.TestLazyCores_A8DA3FB6C6EAC481-001\tempDir-001\collection1\data\]
   [junit4]   2> 1946255 INFO  (coreLoadExecutor-5730-thread-1) [    x:collection1] o.a.s.c.SolrCore JMX monitoring not detected for core: collection1
   [junit4]   2> 1946255 INFO  (coreLoadExecutor-5730-thread-2) [    x:collection2] o.a.s.c.SolrDeletionPolicy SolrDeletionPolicy.onCommit: commits: num=1
   [junit4]   2> 	commit{dir=MockDirectoryWrapper(RAMDirectory@7a989ad4 lockFactory=org.apache.lucene.store.SingleInstanceLockFactory@29da109d),segFN=segments_1,generation=1}
   [junit4]   2> 1946255 INFO  (coreLoadExecutor-5730-thread-2) [    x:collection2] o.a.s.c.SolrDeletionPolicy newest commit generation = 1
   [junit4]   2> 1946255 INFO  (coreLoadExecutor-5730-thread-1) [    x:collection1] o.a.s.c.CachingDirectoryFactory return new directory for C:\Users\JenkinsSlave\workspace\Lucene-Solr-trunk-Windows\solr\build\solr-core\test\J1\temp\solr.core.TestLazyCores_A8DA3FB6C6EAC481-001\tempDir-001\collection1\data\
   [junit4]   2> 1946255 INFO  (coreLoadExecutor-5730-thread-1) [    x:collection1] o.a.s.c.SolrCore New index directory detected: old=null new=C:\Users\JenkinsSlave\workspace\Lucene-Solr-trunk-Windows\solr\build\solr-core\test\J1\temp\solr.core.TestLazyCores_A8DA3FB6C6EAC481-001\tempDir-001\collection1\data\index/
   [junit4]   2> 1946255 WARN  (coreLoadExecutor-5730-thread-1) [    x:collection1] o.a.s.c.SolrCore [collection1] Solr index directory 'C:\Users\JenkinsSlave\workspace\Lucene-Solr-trunk-Windows\solr\build\solr-core\test\J1\temp\solr.core.TestLazyCores_A8DA3FB6C6EAC481-001\tempDir-001\collection1\data\index' doesn't exist. Creating new index...
   [junit4]   2> 1946256 INFO  (coreLoadExecutor-5730-thread-1) [    x:collection1] o.a.s.c.CachingDirectoryFactory return new directory for C:\Users\JenkinsSlave\workspace\Lucene-Solr-trunk-Windows\solr\build\solr-core\test\J1\temp\solr.core.TestLazyCores_A8DA3FB6C6EAC481-001\tempDir-001\collection1\data\index
   [junit4]   2> 1946256 INFO  (coreLoadExecutor-5730-thread-1) [    x:collection1] o.a.s.u.RandomMergePolicy RandomMergePolicy wrapping class org.apache.lucene.index.TieredMergePolicy: [TieredMergePolicy: maxMergeAtOnce=29, maxMergeAtOnceExplicit=50, maxMergedSegmentMB=28.8984375, floorSegmentMB=0.982421875, forceMergeDeletesPctAllowed=13.881371755758318, segmentsPerTier=46.0, maxCFSSegmentSizeMB=8.796093022207999E12, noCFSRatio=0.0
   [junit4]   2> 1946256 INFO  (coreLoadExecutor-5730-thread-1) [    x:collection1] o.a.s.c.SolrDeletionPolicy SolrDeletionPolicy.onCommit: commits: num=1
   [junit4]   2> 	commit{dir=MockDirectoryWrapper(RAMDirectory@32fe4246 lockFactory=org.apache.lucene.store.SingleInstanceLockFactory@1f232946),segFN=segments_1,generation=1}
   [junit4]   2> 1946256 INFO  (coreLoadExecutor-5730-thread-1) [    x:collection1] o.a.s.c.SolrDeletionPolicy newest commit generation = 1
   [junit4]   2> 1946258 INFO  (coreLoadExecutor-5730-thread-3) [    x:collection5] o.a.s.c.SolrCore no updateRequestProcessorChain defined as default, creating implicit default
   [junit4]   2> 1946258 INFO  (coreLoadExecutor-5730-thread-1) [    x:collection1] o.a.s.c.SolrCore no updateRequestProcessorChain defined as default, creating implicit default
   [junit4]   2> 1946259 INFO  (coreLoadExecutor-5730-thread-2) [    x:collection2] o.a.s.c.SolrCore no updateRequestProcessorChain defined as default, creating implicit default
   [junit4]   2> 1946260 INFO  (OldIndexDirectoryCleanupThreadForCore-collection5) [    x:collection5] o.a.s.c.SolrCore Looking for old index directories to cleanup for core collection5 in C:\Users\JenkinsSlave\workspace\Lucene-Solr-trunk-Windows\solr\build\solr-core\test\J1\temp\solr.core.TestLazyCores_A8DA3FB6C6EAC481-001\tempDir-001\collection5\data\
   [junit4]   2> 1946260 INFO  (OldIndexDirectoryCleanupThreadForCore-collection2) [    x:collection2] o.a.s.c.SolrCore Looking for old index directories to cleanup for core collection2 in C:\Users\JenkinsSlave\workspace\Lucene-Solr-trunk-Windows\solr\build\solr-core\test\J1\temp\solr.core.TestLazyCores_A8DA3FB6C6EAC481-001\tempDir-001\collection2\data\
   [junit4]   2> 1946261 INFO  (OldIndexDirectoryCleanupThreadForCore-collection1) [    x:collection1] o.a.s.c.SolrCore Looking for old index directories to cleanup for core collection1 in C:\Users\JenkinsSlave\workspace\Lucene-Solr-trunk-Windows\solr\build\solr-core\test\J1\temp\solr.core.TestLazyCores_A8DA3FB6C6EAC481-001\tempDir-001\collection1\data\
   [junit4]   2> 1946270 WARN  (OldIndexDirectoryCleanupThreadForCore-collection1) [    x:collection1] o.a.s.c.DirectoryFactory C:\Users\JenkinsSlave\workspace\Lucene-Solr-trunk-Windows\solr\build\solr-core\test\J1\temp\solr.core.TestLazyCores_A8DA3FB6C6EAC481-001\tempDir-001\collection1\data\ does not point to a valid data directory; skipping clean-up of old index directories.
   [junit4]   2> 1946271 WARN  (OldIndexDirectoryCleanupThreadForCore-collection2) [    x:collection2] o.a.s.c.DirectoryFactory C:\Users\JenkinsSlave\workspace\Lucene-Solr-trunk-Windows\solr\build\solr-core\test\J1\temp\solr.core.TestLazyCores_A8DA3FB6C6EAC481-001\tempDir-001\collection2\data\ does not point to a valid data directory; skipping clean-up of old index directories.
   [junit4]   2> 1946273 INFO  (coreLoadExecutor-5730-thread-1) [    x:collection1] o.a.s.h.l.XMLLoader xsltCacheLifetimeSeconds=60
   [junit4]   2> 1946273 INFO  (coreLoadExecutor-5730-thread-2) [    x:collection2] o.a.s.h.l.XMLLoader xsltCacheLifetimeSeconds=60
   [junit4]   2> 1946274 INFO  (coreLoadExecutor-5730-thread-2) [    x:collection2] o.a.s.h.l.XMLLoader xsltCacheLifetimeSeconds=60
   [junit4]   2> 1946274 INFO  (coreLoadExecutor-5730-thread-1) [    x:collection1] o.a.s.h.l.XMLLoader xsltCacheLifetimeSeconds=60
   [junit4]   2> 1946275 INFO  (coreLoadExecutor-5730-thread-2) [    x:collection2] o.a.s.h.l.XMLLoader xsltCacheLifetimeSeconds=60
   [junit4]   2> 1946275 INFO  (coreLoadExecutor-5730-thread-3) [    x:collection5] o.a.s.h.l.XMLLoader xsltCacheLifetimeSeconds=60
   [junit4]   2> 1946275 INFO  (coreLoadExecutor-5730-thread-2) [    x:collection2] o.a.s.h.l.XMLLoader xsltCacheLifetimeSeconds=60
   [junit4]   2> 1946276 INFO  (coreLoadExecutor-5730-thread-1) [    x:collection1] o.a.s.h.l.XMLLoader xsltCacheLifetimeSeconds=60
   [junit4]   2> 1946277 INFO  (coreLoadExecutor-5730-thread-1) [    x:collection1] o.a.s.h.l.XMLLoader xsltCacheLifetimeSeconds=60
   [junit4]   2> 1946277 INFO  (coreLoadExecutor-5730-thread-3) [    x:collection5] o.a.s.h.l.XMLLoader xsltCacheLifetimeSeconds=60
   [junit4]   2> 1946278 INFO  (coreLoadExecutor-5730-thread-2) [    x:collection2] o.a.s.c.RequestHandlers Registered paths: /admin/mbeans,/update/csv,/sql,/update/json/docs,/admin/luke,/export,/select,/admin/segments,/get,/admin/system,/replication,/admin/properties,/config,/stream,/schema,/admin/plugins,/admin/logging,/update/json,/admin/ping,/admin/threads,/update,/admin/file
   [junit4]   2> 1946278 INFO  (coreLoadExecutor-5730-thread-3) [    x:collection5] o.a.s.h.l.XMLLoader xsltCacheLifetimeSeconds=60
   [junit4]   2> 1946278 INFO  (coreLoadExecutor-5730-thread-2) [    x:collection2] o.a.s.c.SolrCore Using default statsCache cache: org.apache.solr.search.stats.LocalStatsCache
   [junit4]   2> 1946279 INFO  (coreLoadExecutor-5730-thread-2) [    x:collection2] o.a.s.u.CommitTracker Hard AutoCommit: disabled
   [junit4]   2> 1946279 INFO  (coreLoadExecutor-5730-thread-2) [    x:collection2] o.a.s.u.CommitTracker Soft AutoCommit: disabled
   [junit4]   2> 1946279 WARN  (OldIndexDirectoryCleanupThreadForCore-collection5) [    x:collection5] o.a.s.c.DirectoryFactory C:\Users\JenkinsSlave\workspace\Lucene-Solr-trunk-Windows\solr\build\solr-core\test\J1\temp\solr.core.TestLazyCores_A8DA3FB6C6EAC481-001\tempDir-001\collection5\data\ does not point to a valid data directory; skipping clean-up of old index directories.
   [junit4]   2> 1946279 INFO  (coreLoadExecutor-5730-thread-3) [    x:collection5] o.a.s.h.l.XMLLoader xsltCacheLifetimeSeconds=60
   [junit4]   2> 1946279 INFO  (coreLoadExecutor-5730-thread-2) [    x:collection2] o.a.s.u.RandomMergePolicy RandomMergePolicy wrapping class org.apache.lucene.index.TieredMergePolicy: [TieredMergePolicy: maxMergeAtOnce=18, maxMergeAtOnceExplicit=27, maxMergedSegmentMB=47.466796875, floorSegmentMB=0.927734375, forceMergeDeletesPctAllowed=25.09594060404489, segmentsPerTier=22.0, maxCFSSegmentSizeMB=1.353515625, noCFSRatio=0.8156174535094844
   [junit4]   2> 1946279 INFO  (coreLoadExecutor-5730-thread-2) [    x:collection2] o.a.s.c.SolrDeletionPolicy SolrDeletionPolicy.onInit: commits: num=1
   [junit4]   2> 	commit{dir=MockDirectoryWrapper(RAMDirectory@7a989ad4 lockFactory=org.apache.lucene.store.SingleInstanceLockFactory@29da109d),segFN=segments_1,generation=1}
   [junit4]   2> 1946280 INFO  (coreLoadExecutor-5730-thread-2) [    x:collection2] o.a.s.c.SolrDeletionPolicy newest commit generation = 1
   [junit4]   2> 1946280 INFO  (coreLoadExecutor-5730-thread-2) [    x:collection2] o.a.s.s.SolrIndexSearcher Opening [Searcher@6e2ca0eb[collection2] main]
   [junit4]   2> 1946280 INFO  (coreLoadExecutor-5730-thread-2) [    x:collection2] o.a.s.r.ManagedResourceStorage File-based storage initialized to use dir: C:\Users\JenkinsSlave\workspace\Lucene-Solr-trunk-Windows\solr\build\solr-core\test\J1\temp\solr.core.TestLazyCores_A8DA3FB6C6EAC481-001\tempDir-001\collection2\conf
   [junit4]   2> 1946280 INFO  (coreLoadExecutor-5730-thread-2) [    x:collection2] o.a.s.r.RestManager Initializing RestManager with initArgs: {storageDir=C:\Users\JenkinsSlave\workspace\Lucene-Solr-trunk-Windows\solr\build\solr-core\test\J1\temp\solr.core.TestLazyCores_A8DA3FB6C6EAC481-001\tempDir-001\collection2\conf}
   [junit4]   2> 1946280 INFO  (coreLoadExecutor-5730-thread-2) [    x:collection2] o.a.s.r.ManagedResourceStorage Reading _rest_managed.json using file:dir=C:\Users\JenkinsSlave\workspace\Lucene-Solr-trunk-Windows\solr\build\solr-core\test\J1\temp\solr.core.TestLazyCores_A8DA3FB6C6EAC481-001\tempDir-001\collection2\conf
   [junit4]   2> 1946280 INFO  (coreLoadExecutor-5730-thread-3) [    x:collection5] o.a.s.c.RequestHandlers Registered paths: /admin/mbeans,/update/csv,/sql,/update/json/docs,/admin/luke,/export,/select,/admin/segments,/get,/admin/system,/replication,/admin/properties,/config,/stream,/schema,/admin/plugins,/admin/logging,/update/json,/admin/ping,/admin/threads,/update,/admin/file
   [junit4]   2> 1946281 INFO  (coreLoadExecutor-5730-thread-3) [    x:collection5] o.a.s.c.SolrCore Using default statsCache cache: org.apache.solr.search.stats.LocalStatsCache
   [junit4]   2> 1946281 INFO  (coreLoadExecutor-5730-thread-2) [    x:collection2] o.a.s.r.RestManager Initializing 0 registered ManagedResources
   [junit4]   2> 1946281 INFO  (coreLoadExecutor-5730-thread-2) [    x:collection2] o.a.s.h.ReplicationHandler Commits will be reserved for  10000
   [junit4]   2> 1946281 INFO  (coreLoadExecutor-5730-thread-1) [    x:collection1] o.a.s.c.RequestHandlers Registered paths: /admin/mbeans,/update/csv,/sql,/update/json/docs,/admin/luke,/export,/select,/admin/segments,/get,/admin/system,/replication,/admin/properties,/config,/stream,/schema,/admin/plugins,/admin/logging,/update/json,/admin/ping,/admin/threads,/update,/admin/file
   [junit4]   2> 1946282 INFO  (coreLoadExecutor-5730-thread-1) [    x:collection1] o.a.s.c.SolrCore Using default statsCache cache: org.apache.solr.search.stats.LocalStatsCache
   [junit4]   2> 1946282 INFO  (coreLoadExecutor-5730-thread-3) [    x:collection5] o.a.s.u.CommitTracker Hard AutoCommit: disabled
   [junit4]   2> 1946282 INFO  (coreLoadExecutor-5730-thread-3) [    x:collection5] o.a.s.u.CommitTracker Soft AutoCommit: disabled
   [junit4]   2> 1946282 INFO  (coreLoadExecutor-5730-thread-3) [    x:collection5] o.a.s.u.RandomMergePolicy RandomMergePolicy wrapping class org.apache.lucene.index.TieredMergePolicy: [TieredMergePolicy: maxMergeAtOnce=18, maxMergeAtOnceExplicit=27, maxMergedSegmentMB=47.466796875, floorSegmentMB=0.927734375, forceMergeDeletesPctAllowed=25.09594060404489, segmentsPerTier=22.0, maxCFSSegmentSizeMB=1.353515625, noCFSRatio=0.8156174535094844
   [junit4]   2> 1946282 INFO  (coreLoadExecutor-5730-thread-3) [    x:collection5] o.a.s.c.SolrDeletionPolicy SolrDeletionPolicy.onInit: commits: num=1
   [junit4]   2> 	commit{dir=MockDirectoryWrapper(RAMDirectory@756580df lockFactory=org.apache.lucene.store.SingleInstanceLockFactory@acf6cdb),segFN=segments_1,generation=1}
   [junit4]   2> 1946282 INFO  (coreLoadExecutor-5730-thread-3) [    x:collection5] o.a.s.c.SolrDeletionPolicy newest commit generation = 1
   [junit4]   2> 1946282 INFO  (coreLoadExecutor-5730-thread-3) [    x:collection5] o.a.s.s.SolrIndexSearcher Opening [Searcher@4b74a2f4[collection5] main]
   [junit4]   2> 1946282 INFO  (coreLoadExecutor-5730-thread-3) [    x:collection5] o.a.s.r.ManagedResourceStorage File-based storage initialized to use dir: C:\Users\JenkinsSlave\workspace\Lucene-Solr-trunk-Windows\solr\build\solr-core\test\J1\temp\solr.core.TestLazyCores_A8DA3FB6C6EAC481-001\tempDir-001\collection5\conf
   [junit4]   2> 1946282 INFO  (coreLoadExecutor-5730-thread-3) [    x:collection5] o.a.s.r.RestManager Initializing RestManager with initArgs: {storageDir=C:\Users\JenkinsSlave\workspace\Lucene-Solr-trunk-Windows\solr\build\solr-core\test\J1\temp\solr.core.TestLazyCores_A8DA3FB6C6EAC481-001\tempDir-001\collection5\conf}
   [junit4]   2> 1946282 INFO  (coreLoadExecutor-5730-thread-3) [    x:collection5] o.a.s.r.ManagedResourceStorage Reading _rest_managed.json using file:dir=C:\Users\JenkinsSlave\workspace\Lucene-Solr-trunk-Windows\solr\build\solr-core\test\J1\temp\solr.core.TestLazyCores_A8DA3FB6C6EAC481-001\tempDir-001\collection5\conf
   [junit4]   2> 1946283 INFO  (coreLoadExecutor-5730-thread-1) [    x:collection1] o.a.s.u.CommitTracker Hard AutoCommit: disabled
   [junit4]   2> 1946283 INFO  (coreLoadExecutor-5730-thread-1) [    x:collection1] o.a.s.u.CommitTracker Soft AutoCommit: disabled
   [junit4]   2> 1946283 INFO  (coreLoadExecutor-5730-thread-2) [    x:collection2] o.a.s.c.SolrCores Opening transient core collection2
   [junit4]   2> 1946283 INFO  (coreLoadExecutor-5730-thread-2) [    x:collection2] o.a.s.c.CoreContainer registering core: collection2
   [junit4]   2> 1946283 INFO  (coreLoadExecutor-5730-thread-3) [    x:collection5] o.a.s.r.RestManager Initializing 0 registered ManagedResources
   [junit4]   2> 1946283 INFO  (coreLoadExecutor-5730-thread-3) [    x:collection5] o.a.s.h.ReplicationHandler Commits will be reserved for  10000
   [junit4]   2> 1946283 INFO  (coreLoadExecutor-5730-thread-3) [    x:collection5] o.a.s.c.CoreContainer registering core: collection5
   [junit4]   2> 1946283 INFO  (searcherExecutor-5731-thread-1-processing-x:collection5) [    x:collection5] o.a.s.c.SolrCore [collection5] Registered new searcher Searcher@4b74a2f4[collection5] main{ExitableDirectoryReader(UninvertingDirectoryReader())}
   [junit4]   2> 1946284 INFO  (coreLoadExecutor-5730-thread-1) [    x:collection1] o.a.s.u.RandomMergePolicy RandomMergePolicy wrapping class org.apache.lucene.index.TieredMergePolicy: [TieredMergePolicy: maxMergeAtOnce=18, maxMergeAtOnceExplicit=27, maxMergedSegmentMB=47.466796875, floorSegmentMB=0.927734375, forceMergeDeletesPctAllowed=25.09594060404489, segmentsPerTier=22.0, maxCFSSegmentSizeMB=1.353515625, noCFSRatio=0.8156174535094844
   [junit4]   2> 1946283 INFO  (searcherExecutor-5732-thread-1-processing-x:collection2) [    x:collection2] o.a.s.c.SolrCore [collection2] Registered new searcher Searcher@6e2ca0eb[collection2] main{ExitableDirectoryReader(UninvertingDirectoryReader())}
   [junit4]   2> 1946284 INFO  (coreLoadExecutor-5730-thread-1) [    x:collection1] o.a.s.c.SolrDeletionPolicy SolrDeletionPolicy.onInit: commits: num=1
   [junit4]   2> 	commit{dir=MockDirectoryWrapper(RAMDirectory@32fe4246 lockFactory=org.apache.lucene.store.SingleInstanceLockFactory@1f232946),segFN=segments_1,generation=1}
   [junit4]   2> 1946284 INFO  (coreLoadExecutor-5730-thread-1) [    x:collection1] o.a.s.c.SolrDeletionPolicy newest commit generation = 1
   [junit4]   2> 1946284 INFO  (coreLoadExecutor-5730-thread-1) [    x:collection1] o.a.s.s.SolrIndexSearcher Opening [Searcher@47e891df[collection1] main]
   [junit4]   2> 1946285 INFO  (coreLoadExecutor-5730-thread-1) [    x:collection1] o.a.s.r.ManagedResourceStorage File-based storage initialized to use dir: C:\Users\JenkinsSlave\workspace\Lucene-Solr-trunk-Windows\solr\build\solr-core\test\J1\temp\solr.core.TestLazyCores_A8DA3FB6C6EAC481-001\tempDir-001\collection1\conf
   [junit4]   2> 1946285 INFO  (coreLoadExecutor-5730-thread-1) [    x:collection1] o.a.s.r.RestManager Initializing RestManager with initArgs: {storageDir=C:\Users\JenkinsSlave\workspace\Lucene-Solr-trunk-Windows\solr\build\solr-core\test\J1\temp\solr.core.TestLazyCores_A8DA3FB6C6EAC481-001\tempDir-001\collection1\conf}
   [junit4]   2> 1946285 INFO  (coreLoadExecutor-5730-thread-1) [    x:collection1] o.a.s.r.ManagedResourceStorage Reading _rest_managed.json using file:dir=C:\Users\JenkinsSlave\workspace\Lucene-Solr-trunk-Windows\solr\build\solr-core\test\J1\temp\solr.core.TestLazyCores_A8DA3FB6C6EAC481-001\tempDir-001\collection1\conf
   [junit4]   2> 1946285 INFO  (coreLoadExecutor-5730-thread-1) [    x:collection1] o.a.s.r.RestManager Initializing 0 registered ManagedResources
   [junit4]   2> 1946285 INFO  (coreLoadExecutor-5730-thread-1) [    x:collection1] o.a.s.h.ReplicationHandler Commits will be reserved for  10000
   [junit4]   2> 1946286 INFO  (searcherExecutor-5733-thread-1-processing-x:collection1) [    x:collection1] o.a.s.c.SolrCore [collection1] Registered new searcher Searcher@47e891df[collection1] main{ExitableDirectoryReader(UninvertingDirectoryReader())}
   [junit4]   2> 1946286 INFO  (coreLoadExecutor-5730-thread-1) [    x:collection1] o.a.s.c.CoreContainer registering core: collection1
   [junit4]   2> 1946313 INFO  (TEST-TestLazyCores.testCreateTransientFromAdmin-seed#[A8DA3FB6C6EAC481]) [    ] o.a.s.h.a.CoreAdminOperation core create command loadOnStartup=true&transient=true&name=core1&action=CREATE&wt=xml
   [junit4]   2> 1946314 INFO  (TEST-TestLazyCores.testCreateTransientFromAdmin-seed#[A8DA3FB6C6EAC481]) [    ] o.a.s.c.CoreDescriptor Created CoreDescriptor: {name=core1, config=solrconfig.xml, loadOnStartup=true, schema=schema.xml, configSetProperties=configsetprops.json, transient=true, dataDir=data\}
   [junit4]   2> 1946314 INFO  (TEST-TestLazyCores.testCreateTransientFromAdmin-seed#[A8DA3FB6C6EAC481]) [    ] o.a.s.c.SolrResourceLoader new SolrResourceLoader for directory: 'C:\Users\JenkinsSlave\workspace\Lucene-Solr-trunk-Windows\solr\build\solr-core\test\J1\temp\solr.core.TestLazyCores_A8DA3FB6C6EAC481-001\tempDir-001\core1'
   [junit4]   2> 1946314 INFO  (TEST-TestLazyCores.testCreateTransientFromAdmin-seed#[A8DA3FB6C6EAC481]) [    ] o.a.s.c.SolrResourceLoader JNDI not configured for solr (NoInitialContextEx)
   [junit4]   2> 1946314 INFO  (TEST-TestLazyCores.testCreateTransientFromAdmin-seed#[A8DA3FB6C6EAC481]) [    ] o.a.s.c.SolrResourceLoader solr home defaulted to 'solr/' (could not find system property or JNDI)
   [junit4]   2> 1946320 INFO  (TEST-TestLazyCores.testCreateTransientFromAdmin-seed#[A8DA3FB6C6EAC481]) [    ] o.a.s.c.SolrConfig current version of requestparams : -1
   [junit4]   2> 1946321 INFO  (TEST-TestLazyCores.testCreateTransientFromAdmin-seed#[A8DA3FB6C6EAC481]) [    ] o.a.s.c.SolrConfig Using Lucene MatchVersion: 6.0.0
   [junit4]   2> 1946324 INFO  (TEST-TestLazyCores.testCreateTransientFromAdmin-seed#[A8DA3FB6C6EAC481]) [    ] o.a.s.c.SolrConfig Loaded SolrConfig: solrconfig.xml
   [junit4]   2> 1946326 INFO  (TEST-TestLazyCores.testCreateTransientFromAdmin-seed#[A8DA3FB6C6EAC481]) [    ] o.a.s.s.IndexSchema [core1] Schema name=tiny
   [junit4]   2> 1946328 INFO  (TEST-TestLazyCores.testCreateTransientFromAdmin-seed#[A8DA3FB6C6EAC481]) [    ] o.a.s.s.IndexSchema unique key field: id
   [junit4]   2> 1946330 INFO  (TEST-TestLazyCores.testCreateTransientFromAdmin-seed#[A8DA3FB6C6EAC481]) [    ] o.a.s.c.ConfigSetProperties Did not find ConfigSet properties, assuming default properties: Can't find resource 'configsetprops.json' in classpath or 'C:\Users\JenkinsSlave\workspace\Lucene-Solr-trunk-Windows\solr\build\solr-core\test\J1\temp\solr.core.TestLazyCores_A8DA3FB6C6EAC481-001\tempDir-001\core1'
   [junit4]   2> 1946330 INFO  (TEST-TestLazyCores.testCreateTransientFromAdmin-seed#[A8DA3FB6C6EAC481]) [    ] o.a.s.c.CoreContainer Creating SolrCore 'core1' using configuration from instancedir C:\Users\JenkinsSlave\workspace\Lucene-Solr-trunk-Windows\solr\build\solr-core\test\J1\temp\solr.core.TestLazyCores_A8DA3FB6C6EAC481-001\tempDir-001\core1
   [junit4]   2> 1946330 INFO  (TEST-TestLazyCores.testCreateTransientFromAdmin-seed#[A8DA3FB6C6EAC481]) [    x:core1] o.a.s.c.SolrCore org.apache.solr.core.MockDirectoryFactory
   [junit4]   2> 1946331 INFO  (TEST-TestLazyCores.testCreateTransientFromAdmin-seed#[A8DA3FB6C6EAC481]) [    x:core1] o.a.s.c.SolrCore [[core1] ] Opening new SolrCore at [C:\Users\JenkinsSlave\workspace\Lucene-Solr-trunk-Windows\solr\build\solr-core\test\J1\temp\solr.core.TestLazyCores_A8DA3FB6C6EAC481-001\tempDir-001\core1], dataDir=[C:\Users\JenkinsSlave\workspace\Lucene-Solr-trunk-Windows\solr\build\solr-core\test\J1\temp\solr.core.TestLazyCores_A8DA3FB6C6EAC481-001\tempDir-001\core1\data\]
   [junit4]   2> 1946331 INFO  (TEST-TestLazyCores.testCreateTransientFromAdmin-seed#[A8DA3FB6C6EAC481]) [    x:core1] o.a.s.c.SolrCore JMX monitoring not detected for core: core1
   [junit4]   2> 1946331 INFO  (TEST-TestLazyCores.testCreateTransientFromAdmin-seed#[A8DA3FB6C6EAC481]) [    x:core1] o.a.s.c.CachingDirectoryFactory return new directory for C:\Users\JenkinsSlave\workspace\Lucene-Solr-trunk-Windows\solr\build\solr-core\test\J1\temp\solr.core.TestLazyCores_A8DA3FB6C6EAC481-001\tempDir-001\core1\data\
   [junit4]   2> 1946331 INFO  (TEST-TestLazyCores.testCreateTransientFromAdmin-seed#[A8DA3FB6C6EAC481]) [    x:core1] o.a.s.c.SolrCore New index directory detected: old=null new=C:\Users\JenkinsSlave\workspace\Lucene-Solr-trunk-Windows\solr\build\solr-core\test\J1\temp\solr.core.TestLazyCores_A8DA3FB6C6EAC481-001\tempDir-001\core1\data\index/
   [junit4]   2> 1946331 WARN  (TEST-TestLazyCores.testCreateTransientFromAdmin-seed#[A8DA3FB6C6EAC481]) [    x:core1] o.a.s.c.SolrCore [core1] Solr index directory 'C:\Users\JenkinsSlave\workspace\Lucene-Solr-trunk-Windows\solr\build\solr-core\test\J1\temp\solr.core.TestLazyCores_A8DA3FB6C6EAC481-001\tempDir-001\core1\data\index' doesn't exist. Creating new index...
   [junit4]   2> 1946331 INFO  (TEST-TestLazyCores.testCreateTransientFromAdmin-seed#[A8DA3FB6C6EAC481]) [    x:core1] o.a.s.c.CachingDirectoryFactory return new directory for C:\Users\JenkinsSlave\workspace\Lucene-Solr-trunk-Windows\solr\build\solr-core\test\J1\temp\solr.core.TestLazyCores_A8DA3FB6C6EAC481-001\tempDir-001\core1\data\index
   [junit4]   2> 1946332 INFO  (TEST-TestLazyCores.testCreateTransientFromAdmin-seed#[A8DA3FB6C6EAC481]) [    x:core1] o.a.s.u.RandomMergePolicy RandomMergePolicy wrapping class org.apache.lucene.index.LogByteSizeMergePolicy: [LogByteSizeMergePolicy: minMergeSize=1677721, mergeFactor=34, maxMergeSize=2147483648, maxMergeSizeForForcedMerge=9223372036854775807, calibrateSizeByDeletes=true, maxMergeDocs=2147483647, maxCFSSegmentSizeMB=8.796093022207999E12, noCFSRatio=1.0]
   [junit4]   2> 1946332 INFO  (TEST-TestLazyCores.testCreateTransientFromAdmin-seed#[A8DA3FB6C6EAC481]) [    x:core1] o.a.s.c.SolrDeletionPolicy SolrDeletionPolicy.onCommit: commits: num=1
   [junit4]   2> 	commit{dir=MockDirectoryWrapper(RAMDirectory@1addff56 lockFactory=org.apache.lucene.store.SingleInstanceLockFactory@5cd9fba4),segFN=segments_1,generation=1}
   [junit4]   2> 1946332 INFO  (TEST-TestLazyCores.testCreateTransientFromAdmin-seed#[A8DA3FB6C6EAC481]) [    x:core1] o.a.s.c.SolrDeletionPolicy newest commit generation = 1
   [junit4]   2> 1946334 INFO  (OldIndexDirectoryCleanupThreadForCore-core1) [    x:core1] o.a.s.c.SolrCore Looking for old index directories to cleanup for core core1 in C:\Users\JenkinsSlave\workspace\Lucene-Solr-trunk-Windows\solr\build\solr-core\test\J1\temp\solr.core.TestLazyCores_A8DA3FB6C6EAC481-001\tempDir-001\core1\data\
   [junit4]   2> 1946335 WARN  (OldIndexDirectoryCleanupThreadForCore-core1) [    x:core1] o.a.s.c.DirectoryFactory C:\Users\JenkinsSlave\workspace\Lucene-Solr-trunk-Windows\solr\build\solr-core\test\J1\temp\solr.core.TestLazyCores_A8DA3FB6C6EAC481-001\tempDir-001\core1\data\ does not point to a valid data directory; skipping clean-up of old index directories.
   [junit4]   2> 1946335 INFO  (TEST-TestLazyCores.testCreateTransientFromAdmin-seed#[A8DA3FB6C6EAC481]) [    x:core1] o.a.s.c.SolrCore no updateRequestProcessorChain defined as default, creating implicit default
   [junit4]   2> 1946336 INFO  (TEST-TestLazyCores.testCreateTransientFromAdmin-seed#[A8DA3FB6C6EAC481]) [    x:core1] o.a.s.h.l.XMLLoader xsltCacheLifetimeSeconds=60
   [junit4]   2> 1946337 INFO  (TEST-TestLazyCores.testCreateTransientFromAdmin-seed#[A8DA3FB6C6EAC481]) [    x:core1] o.a.s.h.l.XMLLoader xsltCacheLifetimeSeconds=60
   [junit4]   2> 1946337 INFO  (TEST-TestLazyCores.testCreateTransientFromAdmin-seed#[A8DA3FB6C6EAC481]) [    x:core1] o.a.s.h.l.XMLLoader xsltCacheLifetimeSeconds=60
   [junit4]   2> 1946338 INFO  (TEST-TestLazyCores.testCreateTransientFromAdmin-seed#[A8DA3FB6C6EAC481]) [    x:core1] o.a.s.h.l.XMLLoader xsltCacheLifetimeSeconds=60
   [junit4]   2> 1946339 INFO  (TEST-TestLazyCores.testCreateTransientFromAdmin-seed#[A8DA3FB6C6EAC481]) [    x:core1] o.a.s.c.RequestHandlers Registered paths: /admin/mbeans,/update/csv,/sql,/update/json/docs,/admin/luke,/export,/select,/admin/segments,/get,/admin/system,/replication,/admin/properties,/config,/stream,/schema,/admin/plugins,/admin/logging,/update/json,/admin/ping,/admin/threads,/update,/admin/file
   [junit4]   2> 1946339 INFO  (TEST-TestLazyCores.testCreateTransientFromAdmin-seed#[A8DA3FB6C6EAC481]) [    x:core1] o.a.s.c.SolrCore Using default statsCache cache: org.apache.solr.search.stats.LocalStatsCache
   [junit4]   2> 1946340 INFO  (TEST-TestLazyCores.testCreateTransientFromAdmin-seed#[A8DA3FB6C6EAC481]) [    x:core1] o.a.s.u.CommitTracker Hard AutoCommit: disabled
   [junit4]   2> 1946340 INFO  (TEST-TestLazyCores.testCreateTransientFromAdmin-seed#[A8DA3FB6C6EAC481]) [    x:core1] o.a.s.u.CommitTracker Soft AutoCommit: disabled
   [junit4]   2> 1946340 INFO  (TEST-TestLazyCores.testCreateTransientFromAdmin-seed#[A8DA3FB6C6EAC481]) [    x:core1] o.a.s.u.RandomMergePolicy RandomMergePolicy wrapping class org.apache.lucene.index.TieredMergePolicy: [TieredMergePolicy: maxMergeAtOnce=26, maxMergeAtOnceExplicit=33, maxMergedSegmentMB=96.775390625, floorSegmentMB=0.6015625, forceMergeDeletesPctAllowed=7.327292924667095, segmentsPerTier=30.0, maxCFSSegmentSizeMB=8.796093022207999E12, noCFSRatio=0.0
   [junit4]   2> 1946340 INFO  (TEST-TestLazyCores.testCreateTransientFromAdmin-seed#[A8DA3FB6C6EAC481]) [    x:core1] o.a.s.c.SolrDeletionPolicy SolrDeletionPolicy.onInit: commits: num=1
   [junit4]   2> 	commit{dir=MockDirectoryWrapper(RAMDirectory@1addff56 lockFactory=org.apache.lucene.store.SingleInstanceLockFactory@5cd9fba4),segFN=segments_1,generation=1}
   [junit4]   2> 1946340 INFO  (TEST-TestLazyCores.testCreateTransientFromAdmin-seed#[A8DA3FB6C6EAC481]) [    x:core1] o.a.s.c.SolrDeletionPolicy newest commit generation = 1
   [junit4]   2> 1946340 INFO  (TEST-TestLazyCores.testCreateTransientFromAdmin-seed#[A8DA3FB6C6EAC481]) [    x:core1] o.a.s.s.SolrIndexSearcher Opening [Searcher@2ca1a177[core1] main]
   [junit4]   2> 1946340 INFO  (TEST-TestLazyCores.testCreateTransientFromAdmin-seed#[A8DA3FB6C6EAC481]) [    x:core1] o.a.s.r.ManagedResourceStorage File-based storage initialized to use dir: C:\Users\JenkinsSlave\workspace\Lucene-Solr-trunk-Windows\solr\build\solr-core\test\J1\temp\solr.core.TestLazyCores_A8DA3FB6C6EAC481-001\tempDir-001\core1\conf
   [junit4]   2> 1946340 INFO  (TEST-TestLazyCores.testCreateTransientFromAdmin-seed#[A8DA3FB6C6EAC481]) [    x:core1] o.a.s.r.RestManager Initializing RestManager with initArgs: {storageDir=C:\Users\JenkinsSlave\workspace\Lucene-Solr-trunk-Windows\solr\build\solr-core\test\J1\temp\solr.core.TestLazyCores_A8DA3FB6C6EAC481-001\tempDir-001\core1\conf}
   [junit4]   2> 1946340 INFO  (TEST-TestLazyCores.testCreateTransientFromAdmin-seed#[A8DA3FB6C6EAC481]) [    x:core1] o.a.s.r.ManagedResourceStorage Reading _rest_managed.json using file:dir=C:\Users\JenkinsSlave\workspace\Lucene-Solr-trunk-Windows\solr\build\solr-core\test\J1\temp\solr.core.TestLazyCores_A8DA3FB6C6EAC481-001\tempDir-001\core1\conf
   [junit4]   2> 1946341 INFO  (TEST-TestLazyCores.testCreateTransientFromAdmin-seed#[A8DA3FB6C6EAC481]) [    x:core1] o.a.s.r.RestManager Initializing 0 registered ManagedResources
   [junit4]   2> 1946341 INFO  (TEST-TestLazyCores.testCreateTransientFromAdmin-seed#[A8DA3FB6C6EAC481]) [    x:core1] o.a.s.h.ReplicationHandler Commits will be reserved for  10000
   [junit4]   2> 1946341 INFO  (TEST-TestLazyCores.testCreateTransientFromAdmin-seed#[A8DA3FB6C6EAC481]) [    x:core1] o.a.s.c.SolrCores Opening transient core core1
   [junit4]   2> 1946341 INFO  (TEST-TestLazyCores.testCreateTransientFromAdmin-seed#[A8DA3FB6C6EAC481]) [    x:core1] o.a.s.c.CoreContainer registering core: core1
   [junit4]   2> 1946341 INFO  (TEST-TestLazyCores.testCreateTransientFromAdmin-seed#[A8DA3FB6C6EAC481]) [    x:core1] o.a.s.h.a.CoreAdminOperation core create command loadOnStartup=false&transient=true&name=core2&action=CREATE&wt=xml
   [junit4]   2> 1946342 INFO  (TEST-TestLazyCores.testCreateTransientFromAdmin-seed#[A8DA3FB6C6EAC481]) [    x:core1] o.a.s.c.CoreDescriptor Created CoreDescriptor: {name=core2, config=solrconfig.xml, loadOnStartup=false, schema=schema.xml, configSetProperties=configsetprops.json, transient=true, dataDir=data\}
   [junit4]   2> 1946342 INFO  (TEST-TestLazyCores.testCreateTransientFromAdmin-seed#[A8DA3FB6C6EAC481]) [    x:core1] o.a.s.c.SolrResourceLoader new SolrResourceLoader for directory: 'C:\Users\JenkinsSlave\workspace\Lucene-Solr-trunk-Windows\solr\build\solr-core\test\J1\temp\solr.core.TestLazyCores_A8DA3FB6C6EAC481-001\tempDir-001\core2'
   [junit4]   2> 1946342 INFO  (TEST-TestLazyCores.testCreateTransientFromAdmin-seed#[A8DA3FB6C6EAC481]) [    x:core1] o.a.s.c.SolrResourceLoader JNDI not configured for solr (NoInitialContextEx)
   [junit4]   2> 1946342 INFO  (TEST-TestLazyCores.testCreateTransientFromAdmin-seed#[A8DA3FB6C6EAC481]) [    x:core1] o.a.s.c.SolrResourceLoader solr home defaulted to 'solr/' (could not find system property or JNDI)
   [junit4]   2> 1946349 INFO  (TEST-TestLazyCores.testCreateTransientFromAdmin-seed#[A8DA3FB6C6EAC481]) [    x:core1] o.a.s.c.SolrConfig current version of requestparams : -1
   [junit4]   2> 1946351 INFO  (TEST-TestLazyCores.testCreateTransientFromAdmin-seed#[A8DA3FB6C6EAC481]) [    x:core1] o.a.s.c.SolrConfig Using Lucene MatchVersion: 6.0.0
   [junit4]   2> 1946354 INFO  (TEST-TestLazyCores.testCreateTransientFromAdmin-seed#[A8DA3FB6C6EAC481]) [    x:core1] o.a.s.c.SolrConfig Loaded SolrConfig: solrconfig.xml
   [junit4]   2> 1946356 INFO  (TEST-TestLazyCores.testCreateTransientFromAdmin-seed#[A8DA3FB6C6EAC481]) [    x:core1] o.a.s.s.IndexSchema [core2] Schema name=tiny
   [junit4]   2> 1946357 INFO  (TEST-TestLazyCores.testCreateTransientFromAdmin-seed#[A8DA3FB6C6EAC481]) [    x:core1] o.a.s.s.IndexSchema unique key field: id
   [junit4]   2> 1946359 INFO  (TEST-TestLazyCores.testCreateTransientFromAdmin-seed#[A8DA3FB6C6EAC481]) [    x:core1] o.a.s.c.ConfigSetProperties Did not find ConfigSet properties, assuming default properties: Can't find resource 'configsetprops.json' in classpath or 'C:\Users\JenkinsSlave\workspace\Lucene-Solr-trunk-Windows\solr\build\solr-core\test\J1\temp\solr.core.TestLazyCores_A8DA3FB6C6EAC481-001\tempDir-001\core2'
   [junit4]   2> 1946359 INFO  (TEST-TestLazyCores.testCreateTransientFromAdmin-seed#[A8DA3FB6C6EAC481]) [    x:core1] o.a.s.c.CoreContainer Creating SolrCore 'core2' using configuration from instancedir C:\Users\JenkinsSlave\workspace\Lucene-Solr-trunk-Windows\solr\build\solr-core\test\J1\temp\solr.core.TestLazyCores_A8DA3FB6C6EAC481-001\tempDir-001\core2
   [junit4]   2> 1946360 INFO  (TEST-TestLazyCores.testCreateTransientFromAdmin-seed#[A8DA3FB6C6EAC481]) [    x:core2] o.a.s.c.SolrCore org.apache.solr.core.MockDirectoryFactory
   [junit4]   2> 1946360 INFO  (TEST-TestLazyCores.testCreateTransientFromAdmin-seed#[A8DA3FB6C6EAC481]) [    x:core2] o.a.s.c.SolrCore [[core2] ] Opening new SolrCore at [C:\Users\JenkinsSlave\workspace\Lucene-Solr-trunk-Windows\solr\build\solr-core\test\J1\temp\solr.core.TestLazyCores_A8DA3FB6C6EAC481-001\tempDir-001\core2], dataDir=[C:\Users\JenkinsSlave\workspace\Lucene-Solr-trunk-Windows\solr\build\solr-core\test\J1\temp\solr.core.TestLazyCores_A8DA3FB6C6EAC481-001\tempDir-001\core2\data\]
   [junit4]   2> 1946360 INFO  (TEST-TestLazyCores.testCreateTransientFromAdmin-seed#[A8DA3FB6C6EAC481]) [    x:core2] o.a.s.c.SolrCore JMX monitoring not detected for core: core2
   [junit4]   2> 1946360 INFO  (TEST-TestLazyCores.testCreateTransientFromAdmin-seed#[A8DA3FB6C6EAC481]) [    x:core2] o.a.s.c.CachingDirectoryFactory return new directory for C:\Users\JenkinsSlave\workspace\Lucene-Solr-trunk-Windows\solr\build\solr-core\test\J1\temp\solr.core.TestLazyCores_A8DA3FB6C6EAC481-001\tempDir-001\core2\data\
   [junit4]   2> 1946360 INFO  (searcherExecutor-5744-thread-1-processing-x:core1) [    x:core1] o.a.s.c.SolrCore [core1] Registered new searcher Searcher@2ca1a177[core1] main{ExitableDirectoryReader(UninvertingDirectoryReader())}
   [junit4]   2> 1946361 INFO  (TEST-TestLazyCores.testCreateTransientFromAdmin-seed#[A8DA3FB6C6EAC481]) [    x:core2] o.a.s.c.SolrCore New index directory detected: old=null new=C:\Users\JenkinsSlave\workspace\Lucene-Solr-trunk-Windows\solr\build\solr-core\test\J1\temp\solr.core.TestLazyCores_A8DA3FB6C6EAC481-001\tempDir-001\core2\data\index/
   [junit4]   2> 1946361 WARN  (TEST-TestLazyCores.testCreateTransientFromAdmin-seed#[A8DA3FB6C6EAC481]) [    x:core2] o.a.s.c.SolrCore [core2] Solr index directory 'C:\Users\JenkinsSlave\workspace\Lucene-Solr-trunk-Windows\solr\build\solr-core\test\J1\temp\solr.core.TestLazyCores_A8DA3FB6C6EAC481-001\tempDir-001\core2\data\index' doesn't exist. Creating new index...
   [junit4]   2> 1946361 INFO  (TEST-TestLazyCores.testCreateTransientFromAdmin-seed#[A8DA3FB6C6EAC481]) [    x:core2] o.a.s.c.CachingDirectoryFactory return new directory for C:\Users\JenkinsSlave\workspace\Lucene-Solr-trunk-Windows\solr\build\solr-core\test\J1\temp\solr.core.TestLazyCores_A8DA3FB6C6EAC481-001\tempDir-001\core2\data\index
   [junit4]   2> 1946361 INFO  (TEST-TestLazyCores.testCreateTransientFromAdmin-seed#[A8DA3FB6C6EAC481]) [    x:core2] o.a.s.u.RandomMergePolicy RandomMergePolicy wrapping class org.apache.lucene.index.TieredMergePolicy: [TieredMergePolicy: maxMergeAtOnce=37, maxMergeAtOnceExplicit=47, maxMergedSegmentMB=34.4658203125, floorSegmentMB=1.4619140625, forceMergeDeletesPctAllowed=26.04499894197925, segmentsPerTier=30.0, maxCFSSegmentSizeMB=8.796093022207999E12, noCFSRatio=0.0
   [junit4]   2> 1946362 INFO  (TEST-TestLazyCores.testCreateTransientFromAdmin-seed#[A8DA3FB6C6EAC481]) [    x:core2] o.a.s.c.SolrDeletionPolicy SolrDeletionPolicy.onCommit: commits: num=1
   [junit4]   2> 	commit{dir=MockDirectoryWrapper(RAMDirectory@5de3f35f lockFactory=org.apache.lucene.store.SingleInstanceLockFactory@5ee7aaa0),segFN=segments_1,generation=1}
   [junit4]   2> 1946362 INFO  (TEST-TestLazyCores.testCreateTransientFromAdmin-seed#[A8DA3FB6C6EAC481]) [    x:core2] o.a.s.c.SolrDeletionPolicy newest commit generation = 1
   [junit4]   2> 1946363 INFO  (TEST-TestLazyCores.testCreateTransientFromAdmin-seed#[A8DA3FB6C6EAC481]) [    x:core2] o.a.s.c.SolrCore no updateRequestProcessorChain defined as default, creating implicit default
   [junit4]   2> 1946365 INFO  (TEST-TestLazyCores.testCreateTransientFromAdmin-seed#[A8DA3FB6C6EAC481]) [    x:core2] o.a.s.h.l.XMLLoader xsltCacheLifetimeSeconds=60
   [junit4]   2> 1946365 INFO  (TEST-TestLazyCores.testCreateTransientFromAdmin-seed#[A8DA3FB6C6EAC481]) [    x:core2] o.a.s.h.l.XMLLoader xsltCacheLifetimeSeconds=60
   [junit4]   2> 1946366 INFO  (TEST-TestLazyCores.testCreateTransientFromAdmin-seed#[A8DA3FB6C6EAC481]) [    x:core2] o.a.s.h.l.XMLLoader xsltCacheLifetimeSeconds=60
   [junit4]   2> 1946367 INFO  (TEST-TestLazyCores.testCreateTransientFromAdmin-seed#[A8DA3FB6C6EAC481]) [    x:core2] o.a.s.h.l.XMLLoader xsltCacheLifetimeSeconds=60
   [junit4]   2> 1946369 INFO  (OldIndexDirectoryCleanupThreadForCore-core2) [    x:core2] o.a.s.c.SolrCore Looking for old index directories to cleanup for core core2 in C:\Users\JenkinsSlave\workspace\Lucene-Solr-trunk-Windows\solr\build\solr-core\test\J1\temp\solr.core.TestLazyCores_A8DA3FB6C6EAC481-001\tempDir-001\core2\data\
   [junit4]   2> 1946370 INFO  (TEST-TestLazyCores.testCreateTransientFromAdmin-seed#[A8DA3FB6C6EAC481]) [    x:core2] o.a.s.c.RequestHandlers Registered paths: /admin/mbeans,/update/csv,/sql,/update/json/docs,/admin/luke,/export,/select,/admin/segments,/get,/admin/system,/replication,/admin/properties,/config,/stream,/schema,/admin/plugins,/admin/logging,/update/json,/admin/ping,/admin/threads,/update,/admin/file
   [junit4]   2> 1946370 INFO  (TEST-TestLazyCores.testCreateTransientFromAdmin-seed#[A8DA3FB6C6EAC481]) [    x:core2] o.a.s.c.SolrCore Using default statsCache cache: org.apache.solr.search.stats.LocalStatsCache
   [junit4]   2> 1946370 WARN  (OldIndexDirectoryCleanupThreadForCore-core2) [    x:core2] o.a.s.c.DirectoryFactory C:\Users\JenkinsSlave\workspace\Lucene-Solr-trunk-Windows\solr\build\solr-core\test\J1\temp\solr.core.TestLazyCores_A8DA3FB6C6EAC481-001\tempDir-001\core2\data\ does not point to a valid data directory; skipping clean-up of old index directories.
   [junit4]   2> 1946370 INFO  (TEST-TestLazyCores.testCreateTransientFromAdmin-seed#[A8DA3FB6C6EAC481]) [    x:core2] o.a.s.u.CommitTracker Hard AutoCommit: disabled
   [junit4]   2> 1946370 INFO  (TEST-TestLazyCores.testCreateTransientFromAdmin-seed#[A8DA3FB6C6EAC481]) [    x:core2] o.a.s.u.CommitTracker Soft AutoCommit: disabled
   [junit4]   2> 1946371 INFO  (TEST-TestLazyCores.testCreateTransientFromAdmin-seed#[A8DA3FB6C6EAC481]) [    x:core2] o.a.s.u.RandomMergePolicy RandomMergePolicy wrapping class org.apache.lucene.index.AlcoholicMergePolicy: [AlcoholicMergePolicy: minMergeSize=0, mergeFactor=10, maxMergeSize=945100843, maxMergeSizeForForcedMerge=9223372036854775807, calibrateSizeByDeletes=true, maxMergeDocs=2147483647, maxCFSSegmentSizeMB=8.796093022207999E12, noCFSRatio=0.1]
   [junit4]   2> 1946372 INFO  (TEST-TestLazyCores.testCreateTransientFromAdmin-seed#[A8DA3FB6C6EAC481]) [    x:core2] o.a.s.c.SolrDeletionPolicy SolrDeletionPolicy.onInit: commits: num=1
   [junit4]   2> 	commit{dir=MockDirectoryWrapper(RAMDirectory@5de3f35f lockFactory=org.apache.lucene.store.SingleInstanceLockFactory@5ee7aaa0),segFN=segments_1,generation=1}
   [junit4]   2> 1946372 INFO  (TEST-TestLazyCores.testCreateTransientFromAdmin-seed#[A8DA3FB6C6EAC481]) [    x:core2] o.a.s.c.SolrDeletionPolicy newest commit generation = 1
   [junit4]   2> 1946372 INFO  (TEST-TestLazyCores.testCreateTransientFromAdmin-seed#[A8DA3FB6C6EAC481]) [    x:core2] o.a.s.s.SolrIndexSearcher Opening [Searcher@29abb064[core2] main]
   [junit4]   2> 1946372 INFO  (TEST-TestLazyCores.testCreateTransientFromAdmin-seed#[A8DA3FB6C6EAC481]) [    x:core2] o.a.s.r.ManagedResourceStorage File-based storage initialized to use dir: C:\Users\JenkinsSlave\workspace\Lucene-Solr-trunk-Windows\solr\build\solr-core\test\J1\temp\solr.core.TestLazyCores_A8DA3FB6C6EAC481-001\tempDir-001\core2\conf
   [junit4]   2> 1946372 INFO  (TEST-TestLazyCores.testCreateTransientFromAdmin-seed#[A8DA3FB6C6EAC481]) [    x:core2] o.a.s.r.RestManager Initializing RestManager with initArgs: {storageDir=C:\Users\JenkinsSlave\workspace\Lucene-Solr-trunk-Windows\solr\build\solr-core\test\J1\temp\solr.core.TestLazyCores_A8DA3FB6C6EAC481-001\tempDir-001\core2\conf}
   [junit4]   2> 1946372 INFO  (TEST-TestLazyCores.testCreateTransientFromAdmin-seed#[A8DA3FB6C6EAC481]) [    x:core2] o.a.s.r.ManagedResourceStorage Reading _rest_managed.json using file:dir=C:\Users\JenkinsSlave\workspace\Lucene-Solr-trunk-Windows\solr\build\solr-core\test\J1\temp\solr.core.TestLazyCores_A8DA3FB6C6EAC481-001\tempDir-001\core2\conf
   [junit4]   2> 1946373 INFO  (TEST-TestLazyCores.testCreateTransientFromAdmin-seed#[A8DA3FB6C6EAC481]) [    x:core2] o.a.s.r.RestManager Initializing 0 registered ManagedResources
   [junit4]   2> 1946373 INFO  (TEST-TestLazyCores.testCreateTransientFromAdmin-seed#[A8DA3FB6C6EAC481]) [    x:core2] o.a.s.h.ReplicationHandler Commits will be reserved for  10000
   [junit4]   2> 1946373 INFO  (TEST-TestLazyCores.testCreateTransientFromAdmin-seed#[A8DA3FB6C6EAC481]) [    x:core2] o.a.s.c.SolrCores Opening transient core core2
   [junit4]   2> 1946373 INFO  (TEST-TestLazyCores.testCreateTransientFromAdmin-seed#[A8DA3FB6C6EAC481]) [    x:core2] o.a.s.c.CoreContainer registering core: core2
   [junit4]   2> 1946373 INFO  (TEST-TestLazyCores.testCreateTransientFromAdmin-seed#[A8DA3FB6C6EAC481]) [    x:core2] o.a.s.h.a.CoreAdminOperation core create command loadOnStartup=true&transient=true&name=core3&action=CREATE&wt=xml
   [junit4]   2> 1946374 INFO  (TEST-TestLazyCores.testCreateTransientFromAdmin-seed#[A8DA3FB6C6EAC481]) [    x:core2] o.a.s.c.CoreDescriptor Created CoreDescriptor: {name=core3, config=solrconfig.xml, loadOnStartup=true, schema=schema.xml, configSetProperties=configsetprops.json, transient=true, dataDir=data\}
   [junit4]   2> 1946374 INFO  (TEST-TestLazyCores.testCreateTransientFromAdmin-seed#[A8DA3FB6C6EAC481]) [    x:core2] o.a.s.c.SolrResourceLoader new SolrResourceLoader for directory: 'C:\Users\JenkinsSlave\workspace\Lucene-Solr-trunk-Windows\solr\build\solr-core\test\J1\temp\solr.core.TestLazyCores_A8DA3FB6C6EAC481-001\tempDir-001\core3'
   [junit4]   2> 1946374 INFO  (TEST-TestLazyCores.testCreateTransientFromAdmin-seed#[A8DA3FB6C6EAC481]) [    x:core2] o.a.s.c.SolrResourceLoader JNDI not configured for solr (NoInitialContextEx)
   [junit4]   2> 1946374 INFO  (TEST-TestLazyCores.testCreateTransientFromAdmin-seed#[A8DA3FB6C6EAC481]) [    x:core2] o.a.s.c.SolrResourceLoader solr home defaulted to 'solr/' (could not find system property or JNDI)
   [junit4]   2> 1946381 INFO  (TEST-TestLazyCores.testCreateTransientFromAdmin-seed#[A8DA3FB6C6EAC481]) [    x:core2] o.a.s.c.SolrConfig current version of requestparams : -1
   [junit4]   2> 1946383 INFO  (TEST-TestLazyCores.testCreateTransientFromAdmin-seed#[A8DA3FB6C6EAC481]) [    x:core2] o.a.s.c.SolrConfig Using Lucene MatchVersion: 6.0.0
   [junit4]   2> 1946385 INFO  (TEST-TestLazyCores.testCreateTransientFromAdmin-seed#[A8DA3FB6C6EAC481]) [    x:core2] o.a.s.c.SolrConfig Loaded SolrConfig: solrconfig.xml
   [junit4]   2> 1946388 INFO  (TEST-TestLazyCores.testCreateTransientFromAdmin-seed#[A8DA3FB6C6EAC481]) [    x:core2] o.a.s.s.IndexSchema [core3] Schema name=tiny
   [junit4]   2> 1946390 INFO  (TEST-TestLazyCores.testCreateTransientFromAdmin-seed#[A8DA3FB6C6EAC481]) [    x:core2] o.a.s.s.IndexSchema unique key field: id
   [junit4]   2> 1946392 INFO  (TEST-TestLazyCores.testCreateTransientFromAdmin-seed#[A8DA3FB6C6EAC481]) [    x:core2] o.a.s.c.ConfigSetProperties Did not find ConfigSet properties, assuming default properties: Can't find resource 'configsetprops.json' in classpath or 'C:\Users\JenkinsSlave\workspace\Lucene-Solr-trunk-Windows\solr\build\solr-core\test\J1\temp\solr.core.TestLazyCores_A8DA3FB6C6EAC481-001\tempDir-001\core3'
   [junit4]   2> 1946392 INFO  (TEST-TestLazyCores.testCreateTransientFromAdmin-seed#[A8DA3FB6C6EAC481]) [    x:core2] o.a.s.c.CoreContainer Creating SolrCore 'core3' using configuration from instancedir C:\Users\JenkinsSlave\workspace\Lucene-Solr-trunk-Windows\solr\build\solr-core\test\J1\temp\solr.core.TestLazyCores_A8DA3FB6C6EAC481-001\tempDir-001\core3
   [junit4]   2> 1946392 INFO  (TEST-TestLazyCores.testCreateTransientFromAdmin-seed#[A8DA3FB6C6EAC481]) [    x:core3] o.a.s.c.SolrCore org.apache.solr.core.MockDirectoryFactory
   [junit4]   2> 1946392 INFO  (TEST-TestLazyCores.testCreateTransientFromAdmin-seed#[A8DA3FB6C6EAC481]) [    x:core3] o.a.s.c.SolrCore [[core3] ] Opening new SolrCore at [C:\Users\JenkinsSlave\workspace\Lucene-Solr-trunk-Windows\solr\build\solr-core\test\J1\temp\solr.core.TestLazyCores_A8DA3FB6C6EAC481-001\tempDir-001\core3], dataDir=[C:\Users\JenkinsSlave\workspace\Lucene-Solr-trunk-Windows\solr\build\solr-core\test\J1\temp\solr.core.TestLazyCores_A8DA3FB6C6EAC481-001\tempDir-001\core3\data\]
   [junit4]   2> 1946392 INFO  (TEST-TestLazyCores.testCreateTransientFromAdmin-seed#[A8DA3FB6C6EAC481]) [    x:core3] o.a.s.c.SolrCore JMX monitoring not detected for core: core3
   [junit4]   2> 1946393 INFO  (TEST-TestLazyCores.testCreateTransientFromAdmin-seed#[A8DA3FB6C6EAC481]) [    x:core3] o.a.s.c.CachingDirectoryFactory return new directory for C:\Users\JenkinsSlave\workspace\Lucene-Solr-trunk-Windows\solr\build\solr-core\test\J1\temp\solr.core.TestLazyCores_A8DA3FB6C6EAC481-001\tempDir-001\core3\data\
   [junit4]   2> 1946393 INFO  (TEST-TestLazyCores.testCreateTransientFromAdmin-seed#[A8DA3FB6C6EAC481]) [    x:core3] o.a.s.c.SolrCore New index directory detected: old=null new=C:\Users\JenkinsSlave\workspace\Lucene-Solr-trunk-Windows\solr\build\solr-core\test\J1\temp\solr.core.TestLazyCores_A8DA3FB6C6EAC481-001\tempDir-001\core3\data\index/
   [junit4]   2> 1946393 WARN  (TEST-TestLazyCores.testCreateTransientFromAdmin-seed#[A8DA3FB6C6EAC481]) [    x:core3] o.a.s.c.SolrCore [core3] Solr index directory 'C:\Users\JenkinsSlave\workspace\Lucene-Solr-trunk-Windows\solr\build\solr-core\test\J1\temp\solr.core.TestLazyCores_A8DA3FB6C6EAC481-001\tempDir-001\core3\data\index' doesn't exist. Creating new index...
   [junit4]   2> 1946393 INFO  (TEST-TestLazyCores.testCreateTransientFromAdmin-seed#[A8DA3FB6C6EAC481]) [    x:core3] o.a.s.c.CachingDirectoryFactory return new directory for C:\Users\JenkinsSlave\workspace\Lucene-Solr-trunk-Windows\solr\build\solr-core\test\J1\temp\solr.core.TestLazyCores_A8DA3FB6C6EAC481-001\tempDir-001\core3\data\index
   [junit4]   2> 1946393 INFO  (TEST-TestLazyCores.testCreateTransientFromAdmin-seed#[A8DA3FB6C6EAC481]) [    x:core3] o.a.s.u.RandomMergePolicy RandomMergePolicy wrapping class org.apache.lucene.index.TieredMergePolicy: [TieredMergePolicy: maxMergeAtOnce=34, maxMergeAtOnceExplicit=26, maxMergedSegmentMB=64.1015625, floorSegmentMB=0.380859375, forceMergeDeletesPctAllowed=16.56819170863998, segmentsPerTier=20.0, maxCFSSegmentSizeMB=8.796093022207999E12, noCFSRatio=0.42764353453580595
   [junit4]   2> 1946394 INFO  (TEST-TestLazyCores.testCreateTransientFromAdmin-seed#[A8DA3FB6C6EAC481]) [    x:core3] o.a.s.c.SolrDeletionPolicy SolrDeletionPolicy.onCommit: commits: num=1
   [junit4]   2> 	commit{dir=MockDirectoryWrapper(RAMDirectory@24210488 lockFactory=org.apache.lucene.store.SingleInstanceLockFactory@78e0cd88),segFN=segments_1,generation=1}
   [junit4]   2> 1946394 INFO  (TEST-TestLazyCores.testCreateTransientFromAdmin-seed#[A8DA3FB6C6EAC481]) [    x:core3] o.a.s.c.SolrDeletionPolicy newest commit generation = 1
   [junit4]   2> 1946394 INFO  (searcherExecutor-5749-thread-1-processing-x:core2) [    x:core2] o.a.s.c.SolrCore [core2] Registered new searcher Searcher@29abb064[core2] main{ExitableDirectoryReader(UninvertingDirectoryReader())}
   [junit4]   2> 1946395 INFO  (TEST-TestLazyCores.testCreateTransientFromAdmin-seed#[A8DA3FB6C6EAC481]) [    x:core3] o.a.s.c.SolrCore no updateRequestProcessorChain defined as default, creating implicit default
   [junit4]   2> 1946396 INFO  (OldIndexDirectoryCleanupThreadForCore-core3) [    x:core3] o.a.s.c.SolrCore Looking for old index directories to cleanup for core core3 in C:\Users\JenkinsSlave\workspace\Lucene-Solr-trunk-Windows\solr\build\solr-core\test\J1\temp\solr.core.TestLazyCores_A8DA3FB6C6EAC481-001\tempDir-001\core3\data\
   [junit4]   2> 1946396 WARN  (OldIndexDirectoryCleanupThreadForCore-core3) [    x:core3] o.a.s.c.DirectoryFactory C:\Users\JenkinsSlave\workspace\Lucene-Solr-trunk-Windows\solr\build\solr-core\test\J1\temp\solr.core.TestLazyCores_A8DA3FB6C6EAC481-001\tempDir-001\core3\data\ does not point to a valid data directory; skipping clean-up of old index directories.
   [junit4]   2> 1946397 INFO  (TEST-TestLazyCores.testCreateTransientFromAdmin-seed#[A8DA3FB6C6EAC481]) [    x:core3] o.a.s.h.l.XMLLoader xsltCacheLifetimeSeconds=60
   [junit4]   2> 1946398 INFO  (TEST-TestLazyCores.testCreateTransientFromAdmin-seed#[A8DA3FB6C6EAC481]) [    x:core3] o.a.s.h.l.XMLLoader xsltCacheLifetimeSeconds=60
   [junit4]   2> 1946398 INFO  (TEST-TestLazyCores.testCreateTransientFromAdmin-seed#[A8DA3FB6C6EAC481]) [    x:core3] o.a.s.h.l.XMLLoader xsltCacheLifetimeSeconds=60
   [junit4]   2> 1946398 INFO  (TEST-TestLazyCores.testCreateTransientFromAdmin-seed#[A8DA3FB6C6EAC481]) [    x:core3] o.a.s.h.l.XMLLoader xsltCacheLifetimeSeconds=60
   [junit4]   2> 1946399 INFO  (TEST-TestLazyCores.testCreateTransientFromAdmin-seed#[A8DA3FB6C6EAC481]) [    x:core3] o.a.s.c.RequestHandlers Registered paths: /admin/mbeans,/update/csv,/sql,/update/json/docs,/admin/luke,/export,/select,/admin/segments,/get,/admin/system,/replication,/admin/properties,/config,/stream,/schema,/admin/plugins,/admin/logging,/update/json,/admin/ping,/admin/threads,/update,/admin/file
   [junit4]   2> 1946399 INFO  (TEST-TestLazyCores.testCreateTransientFromAdmin-seed#[A8DA3FB6C6EAC481]) [    x:core3] o.a.s.c.SolrCore Using default statsCache cache: org.apache.solr.search.stats.LocalStatsCache
   [junit4]   2> 1946399 INFO  (TEST-TestLazyCores.testCreateTransientFromAdmin-seed#[A8DA3FB6C6EAC481]) [    x:core3] o.a.s.u.CommitTracker Hard AutoCommit: disabled
   [junit4]   2> 1946399 INFO  (TEST-TestLazyCores.testCreateTransientFromAdmin-seed#[A8DA3FB6C6EAC481]) [    x:core3] o.a.s.u.CommitTracker Soft AutoCommit: disabled
   [junit4]   2> 1946399 INFO  (TEST-TestLazyCores.testCreateTransientFromAdmin-seed#[A8DA3FB6C6EAC481]) [    x:core3] o.a.s.u.RandomMergePolicy RandomMergePolicy wrapping class org.apache.lucene.index.LogByteSizeMergePolicy: [LogByteSizeMergePolicy: minMergeSize=1677721, mergeFactor=29, maxMergeSize=2147483648, maxMergeSizeForForcedMerge=9223372036854775807, calibrateSizeByDeletes=true, maxMergeDocs=2147483647, maxCFSSegmentSizeMB=8.796093022207999E12, noCFSRatio=0.8654991730544587]
   [junit4]   2> 1946399 INFO  (TEST-TestLazyCores.testCreateTransientFromAdmin-seed#[A8DA3FB6C6EAC481]) [    x:core3] o.a.s.c.SolrDeletionPolicy SolrDeletionPolicy.onInit: commits: num=1
   [junit4]   2> 	commit{dir=MockDirectoryWrapper(RAMDirectory@24210488 lockFactory=org.apache.lucene.store.SingleInstanceLockFactory@78e0cd88),segFN=segments_1,generation=1}
   [junit4]   2> 1946399 INFO  (TEST-TestLazyCores.testCreateTransientFromAdmin-seed#[A8DA3FB6C6EAC481]) [    x:core3] o.a.s.c.SolrDeletionPolicy newest commit generation = 1
   [junit4]   2> 1946399 INFO  (TEST-TestLazyCores.testCreateTransientFromAdmin-seed#[A8DA3FB6C6EAC481]) [    x:core3] o.a.s.s.SolrIndexSearcher Opening [Searcher@6e0f1217[core3] main]
   [junit4]   2> 1946400 INFO  (TEST-TestLazyCores.testCreateTransientFromAdmin-seed#[A8DA3FB6C6EAC481]) [    x:core3] o.a.s.r.ManagedResourceStorage File-based storage initialized to use dir: C:\Users\JenkinsSlave\workspace\Lucene-Solr-trunk-Windows\solr\build\solr-core\test\J1\temp\solr.core.TestLazyCores_A8DA3FB6C6EAC481-001\tempDir-001\core3\conf
   [junit4]   2> 1946400 INFO  (TEST-TestLazyCores.testCreateTransientFromAdmin-seed#[A8DA3FB6C6EAC481]) [    x:core3] o.a.s.r.RestManager Initializing RestManager with initArgs: {storageDir=C:\Users\JenkinsSlave\workspace\Lucene-Solr-trunk-Windows\solr\build\solr-core\test\J1\temp\solr.core.TestLazyCores_A8DA3FB6C6EAC481-001\tempDir-001\core3\conf}
   [junit4]   2> 1946400 INFO  (TEST-TestLazyCores.testCreateTransientFromAdmin-seed#[A8DA3FB6C6EAC481]) [    x:core3] o.a.s.r.ManagedResourceStorage Reading _rest_managed.json using file:dir=C:\Users\JenkinsSlave\workspace\Lucene-Solr-trunk-Windows\solr\build\solr-core\test\J1\temp\solr.core.TestLazyCores_A8DA3FB6C6EAC481-001\tempDir-001\core3\conf
   [junit4]   2> 1946400 INFO  (TEST-TestLazyCores.testCreateTransientFromAdmin-seed#[A8DA3FB6C6EAC481]) [    x:core3] o.a.s.r.RestManager Initializing 0 registered ManagedResources
   [junit4]   2> 1946400 INFO  (TEST-TestLazyCores.testCreateTransientFromAdmin-seed#[A8DA3FB6C6EAC481]) [    x:core3] o.a.s.h.ReplicationHandler Commits will be reserved for  10000
   [junit4]   2> 1946401 INFO  (TEST-TestLazyCores.testCreateTransientFromAdmin-seed#[A8DA3FB6C6EAC481]) [    x:core3] o.a.s.c.SolrCores Opening transient core core3
   [junit4]   2> 1946401 INFO  (TEST-TestLazyCores.testCreateTransientFromAdmin-seed#[A8DA3FB6C6EAC481]) [    x:core3] o.a.s.c.CoreContainer registering core: core3
   [junit4]   2> 1946401 INFO  (TEST-TestLazyCores.testCreateTransientFromAdmin-seed#[A8DA3FB6C6EAC481]) [    x:core3] o.a.s.h.a.CoreAdminOperation core create command loadOnStartup=false&transient=true&name=core4&action=CREATE&wt=xml
   [junit4]   2> 1946401 INFO  (TEST-TestLazyCores.testCreateTransientFromAdmin-seed#[A8DA3FB6C6EAC481]) [    x:core3] o.a.s.c.CoreDescriptor Created CoreDescriptor: {name=core4, config=solrconfig.xml, loadOnStartup=false, schema=schema.xml, configSetProperties=configsetprops.json, transient=true, dataDir=data\}
   [junit4]   2> 1946401 INFO  (TEST-TestLazyCores.testCreateTransientFromAdmin-seed#[A8DA3FB6C6EAC481]) [    x:core3] o.a.s.c.SolrResourceLoader new SolrResourceLoader for directory: 'C:\Users\JenkinsSlave\workspace\Lucene-Solr-trunk-Windows\solr\build\solr-core\test\J1\temp\solr.core.TestLazyCores_A8DA3FB6C6EAC481-001\tempDir-001\core4'
   [junit4]   2> 1946402 INFO  (TEST-TestLazyCores.testCreateTransientFromAdmin-seed#[A8DA3FB6C6EAC481]) [    x:core3] o.a.s.c.SolrResourceLoader JNDI not configured for solr (NoInitialContextEx)
   [junit4]   2> 1946402 INFO  (TEST-TestLazyCores.testCreateTransientFromAdmin-seed#[A8DA3FB6C6EAC481]) [    x:core3] o.a.s.c.SolrResourceLoader solr home defaulted to 'solr/' (could not find system property or JNDI)
   [junit4]   2> 1946416 INFO  (TEST-TestLazyCores.testCreateTransientFromAdmin-seed#[A8DA3FB6C6EAC481]) [    x:core3] o.a.s.c.SolrConfig current version of requestparams : -1
   [junit4]   2> 1946417 INFO  (TEST-TestLazyCores.testCreateTransientFromAdmin-seed#[A8DA3FB6C6EAC481]) [    x:core3] o.a.s.c.SolrConfig Using Lucene MatchVersion: 6.0.0
   [junit4]   2> 1946433 INFO  (TEST-TestLazyCores.testCreateTransientFromAdmin-seed#[A8DA3FB6C6EAC481]) [    x:core3] o.a.s.c.SolrConfig Loaded SolrConfig: solrconfig.xml
   [junit4]   2> 1946436 INFO  (TEST-TestLazyCores.testCreateTransientFromAdmin-seed#[A8DA3FB6C6EAC481]) [    x:core3] o.a.s.s.IndexSchema [core4] Schema name=tiny
   [junit4]   2> 1946437 INFO  (searcherExecutor-5754-thread-1-processing-x:core3) [    x:core3] o.a.s.c.SolrCore [core3] Registered new searcher Searcher@6e0f1217[core3] main{ExitableDirectoryReader(UninvertingDirectoryReader())}
   [junit4]   2> 1946438 INFO  (TEST-TestLazyCores.testCreateTransientFromAdmin-seed#[A8DA3FB6C6EAC481]) [    x:core3] o.a.s.s.IndexSchema unique key field: id
   [junit4]   2> 1946440 INFO  (TEST-TestLazyCores.testCreateTransientFromAdmin-seed#[A8DA3FB6C6EAC481]) [    x:core3] o.a.s.c.ConfigSetProperties Did not find ConfigSet properties, assuming default properties: Can't find resource 'configsetprops.json' in classpath or 'C:\Users\JenkinsSlave\workspace\Lucene-Solr-trunk-Windows\solr\build\solr-core\test\J1\temp\solr.core.TestLazyCores_A8DA3FB6C6EAC481-001\tempDir-001\core4'
   [junit4]   2> 1946440 INFO  (TEST-TestLazyCores.testCreateTransientFromAdmin-seed#[A8DA3FB6C6EAC481]) [    x:core3] o.a.s.c.CoreContainer Creating SolrCore 'core4' using configuration from instancedir C:\Users\JenkinsSlave\workspace\Lucene-Solr-trunk-Windows\solr\build\solr-core\test\J1\temp\solr.core.TestLazyCores_A8DA3FB6C6EAC481-001\tempDir-001\core4
   [junit4]   2> 1946440 INFO  (TEST-TestLazyCores.testCreateTransientFromAdmin-seed#[A8DA3FB6C6EAC481]) [    x:core4] o.a.s.c.SolrCore org.apache.solr.core.MockDirectoryFactory
   [junit4]   2> 1946440 INFO  (TEST-TestLazyCores.testCreateTransientFromAdmin-seed#[A8DA3FB6C6EAC481]) [    x:core4] o.a.s.c.SolrCore [[core4] ] Opening new SolrCore at [C:\Users\JenkinsSlave\workspace\Lucene-Solr-trunk-Windows\solr\build\solr-core\test\J1\temp\solr.core.TestLazyCores_A8DA3FB6C6EAC481-001\tempDir-001\core4], dataDir=[C:\Users\JenkinsSlave\workspace\Lucene-Solr-trunk-Windows\solr\build\solr-core\test\J1\temp\solr.core.TestLazyCores_A8DA3FB6C6EAC481-001\tempDir-001\core4\data\]
   [junit4]   2> 1946440 INFO  (TEST-TestLazyCores.testCreateTransientFromAdmin-seed#[A8DA3FB6C6EAC481]) [    x:core4] o.a.s.c.SolrCore JMX monitoring not detected for core: core4
   [junit4]   2> 1946440 INFO  (TEST-TestLazyCores.testCreateTransientFromAdmin-seed#[A8DA3FB6C6EAC481]) [    x:core4] o.a.s.c.CachingDirectoryFactory return new directory for C:\Users\JenkinsSlave\workspace\Lucene-Solr-trunk-Windows\solr\build\solr-core\test\J1\temp\solr.core.TestLazyCores_A8DA3FB6C6EAC481-001\tempDir-001\core4\data\
   [junit4]   2> 1946440 INFO  (TEST-TestLazyCores.testCreateTransientFromAdmin-seed#[A8DA3FB6C6EAC481]) [    x:core4] o.a.s.c.SolrCore New index directory detected: old=null new=C:\Users\JenkinsSlave\workspace\Lucene-Solr-trunk-Windows\solr\build\solr-core\test\J1\temp\solr.core.TestLazyCores_A8DA3FB6C6EAC481-001\tempDir-001\core4\data\index/
   [junit4]   2> 1946441 WARN  (TEST-TestLazyCores.testCreateTransientFromAdmin-seed#[A8DA3FB6C6EAC481]) [    x:core4] o.a.s.c.SolrCore [core4] Solr index directory 'C:\Users\JenkinsSlave\workspace\Lucene-Solr-trunk-Windows\solr\build\solr-core\test\J1\temp\solr.core.TestLazyCores_A8DA3FB6C6EAC481-001\tempDir-001\core4\data\index' doesn't exist. Creating new index...
   [junit4]   2> 1946441 INFO  (TEST-TestLazyCores.testCreateTransientFromAdmin-seed#[A8DA3FB6C6EAC481]) [    x:core4] o.a.s.c.CachingDirectoryFactory return new directory for C:\Users\JenkinsSlave\workspace\Lucene-Solr-trunk-Windows\solr\build\solr-core\test\J1\temp\solr.core.TestLazyCores_A8DA3FB6C6EAC481-001\tempDir-001\core4\data\index
   [junit4]   2> 1946441 INFO  (TEST-TestLazyCores.testCreateTransientFromAdmin-seed#[A8DA3FB6C6EAC481]) [    x:core4] o.a.s.u.RandomMergePolicy RandomMergePolicy wrapping class org.apache.lucene.index.TieredMergePolicy: [TieredMergePolicy: maxMergeAtOnce=46, maxMergeAtOnceExplicit=49, maxMergedSegmentMB=74.5537109375, floorSegmentMB=1.4736328125, forceMergeDeletesPctAllowed=14.600914831930064, segmentsPerTier=21.0, maxCFSSegmentSizeMB=8.796093022207999E12, noCFSRatio=0.4505570732843789
   [junit4]   2> 1946441 INFO  (TEST-TestLazyCores.testCreateTransientFromAdmin-seed#[A8DA3FB6C6EAC481]) [    x:core4] o.a.s.c.SolrDeletionPolicy SolrDeletionPolicy.onCommit: commits: num=1
   [junit4]   2> 	commit{dir=MockDirectoryWrapper(RAMDirectory@3ecd2f2e lockFactory=org.apache.lucene.store.SingleInstanceLockFactory@2927dc23),segFN=segments_1,generation=1}
   [junit4]   2> 1946441 INFO  (TEST-TestLazyCores.testCreateTransientFromAdmin-seed#[A8DA3FB6C6EAC481]) [    x:core4] o.a.s.c.SolrDeletionPolicy newest commit generation = 1
   [junit4]   2> 1946442 INFO  (TEST-TestLazyCores.testCreateTransientFromAdmin-seed#[A8DA3FB6C6EAC481]) [    x:core4] o.a.s.c.SolrCore no updateRequestProcessorChain defined as default, creating implicit default
   [junit4]   2> 1946444 INFO  (TEST-TestLazyCores.testCreateTransientFromAdmin-seed#[A8DA3FB6C6EAC481]) [    x:core4] o.a.s.h.l.XMLLoader xsltCacheLifetimeSeconds=60
   [junit4]   2> 1946444 INFO  (TEST-TestLazyCores.testCreateTransientFromAdmin-seed#[A8DA3FB6C6EAC481]) [    x:core4] o.a.s.h.l.XMLLoader xsltCacheLifetimeSeconds=60
   [junit4]   2> 1946445 INFO  (TEST-TestLazyCores.testCreateTransientFromAdmin-seed#[A8DA3FB6C6EAC481]) [    x:core4] o.a.s.h.l.XMLLoader xsltCacheLifetimeSeconds=60
   [junit4]   2> 1946446 INFO  (TEST-TestLazyCores.testCreateTransientFromAdmin-seed#[A8DA3FB6C6EAC481]) [    x:core4] o.a.s.h.l.XMLLoader xsltCacheLifetimeSeconds=60
   [junit4]   2> 1946447 INFO  (TEST-TestLazyCores.testCreateTransientFromAdmin-seed#[A8DA3FB6C6EAC481]) [    x:core4] o.a.s.c.RequestHandlers Registered paths: /admin/mbeans,/update/csv,/sql,/update/json/docs,/admin/luke,/export,/select,/admin/segments,/get,/admin/system,/replication,/admin/properties,/config,/stream,/schema,/admin/plugins,/admin/logging,/update/json,/admin/ping,/admin/threads,/update,/admin/file
   [junit4]   2> 1946448 INFO  (TEST-TestLazyCores.testCreateTransientFromAdmin-seed#[A8DA3FB6C6EAC481]) [    x:core4] o.a.s.c.SolrCore Using default statsCache cache: org.apache.solr.search.stats.LocalStatsCache
   [junit4]   2> 1946448 INFO  (TEST-TestLazyCores.testCreateTransientFromAdmin-seed#[A8DA3FB6C6EAC481]) [    x:core4] o.a.s.u.CommitTracker Hard AutoCommit: disabled
   [junit4]   2> 1946448 INFO  (TEST-TestLazyCores.testCreateTransientFromAdmin-seed#[A8DA3FB6C6EAC481]) [    x:core4] o.a.s.u.CommitTracker Soft AutoCommit: disabled
   [junit4]   2> 1946448 INFO  (TEST-TestLazyCores.testCreateTransientFromAdmin-seed#[A8DA3FB6C6EAC481]) [    x:core4] o.a.s.u.RandomMergePolicy RandomMergePolicy wrapping class org.apache.lucene.index.TieredMergePolicy: [TieredMergePolicy: maxMergeAtOnce=47, maxMergeAtOnceExplicit=42, maxMergedSegmentMB=44.2138671875, floorSegmentMB=0.21484375, forceMergeDeletesPctAllowed=29.739843536698547, segmentsPerTier=16.0, maxCFSSegmentSizeMB=8.796093022207999E12, noCFSRatio=0.0
   [junit4]   2> 1946448 INFO  (TEST-TestLazyCores.testCreateTransientFromAdmin-seed#[A8DA3FB6C6EAC481]) [    x:core4] o.a.s.c.SolrDeletionPolicy SolrDeletionPolicy.onInit: commits: num=1
   [junit4]   2> 	commit{dir=MockDirectoryWrapper(RAMDirectory@3ecd2f2e lockFactory=org.apache.lucene.store.SingleInstanceLockFactory@2927dc23),segFN=segments_1,generation=1}
   [junit4]   2> 1946448 INFO  (TEST-TestLazyCores.testCreateTransientFromAdmin-seed#[A8DA3FB6C6EAC481]) [    x:core4] o.a.s.c.SolrDeletionPolicy newest commit generation = 1
   [junit4]   2> 1946448 INFO  (TEST-TestLazyCores.testCreateTransientFromAdmin-seed#[A8DA3FB6C6EAC481]) [    x:core4] o.a.s.s.SolrIndexSearcher Opening [Searcher@5e4aa999[core4] main]
   [junit4]   2> 1946449 INFO  (TEST-TestLazyCores.testCreateTransientFromAdmin-seed#[A8DA3FB6C6EAC481]) [    x:core4] o.a.s.r.ManagedResourceStorage File-based storage initialized to use dir: C:\Users\JenkinsSlave\workspace\Lucene-Solr-trunk-Windows\solr\build\solr-core\test\J1\temp\solr.core.TestLazyCores_A8DA3FB6C6EAC481-001\tempDir-001\core4\conf
   [junit4]   2> 1946449 INFO  (TEST-TestLazyCores.testCreateTransientFromAdmin-seed#[A8DA3FB6C6EAC481]) [    x:core4] o.a.s.r.RestManager Initializing RestManager with initArgs: {storageDir=C:\Users\JenkinsSlave\workspace\Lucene-Solr-trunk-Windows\solr\build\solr-core\test\J1\temp\solr.core.TestLazyCores_A8DA3FB6C6EAC481-001\tempDir-001\core4\conf}
   [junit4]   2> 1946449 INFO  (TEST-TestLazyCores.testCreateTransientFromAdmin-seed#[A8DA3FB6C6EAC481]) [    x:core4] o.a.s.r.ManagedResourceStorage Reading _rest_managed.json using file:dir=C:\Users\JenkinsSlave\workspace\Lucene-Solr-trunk-Windows\solr\build\solr-core\test\J1\temp\solr.core.TestLazyCores_A8DA3FB6C6EAC481-001\tempDir-001\core4\conf
   [junit4]   2> 1946449 INFO  (TEST-TestLazyCores.testCreateTransientFromAdmin-seed#[A8DA3FB6C6EAC481]) [    x:core4] o.a.s.r.RestManager Initializing 0 registered ManagedResources
   [junit4]   2> 1946449 INFO  (TEST-TestLazyCores.testCreateTransientFromAdmin-seed#[A8DA3FB6C6EAC481]) [    x:core4] o.a.s.h.ReplicationHandler Commits will be reserved for  10000
   [junit4]   2> 1946450 INFO  (TEST-TestLazyCores.testCreateTransientFromAdmin-seed#[A8DA3FB6C6EAC481]) [    x:core4] o.a.s

[...truncated too long message...]

2 AM com.carrotsearch.randomizedtesting.ThreadLeakControl tryToInterruptAll
   [junit4]   2> SEVERE: There are still zombie threads that couldn't be terminated:
   [junit4]   2>    1) Thread[id=12955, name=searcherExecutor-5985-thread-1, state=WAITING, group=TGRP-TestLazyCores]
   [junit4]   2>         at sun.misc.Unsafe.park(Native Method)
   [junit4]   2>         at java.util.concurrent.locks.LockSupport.park(LockSupport.java:175)
   [junit4]   2>         at java.util.concurrent.locks.AbstractQueuedSynchronizer$ConditionObject.await(AbstractQueuedSynchronizer.java:2039)
   [junit4]   2>         at java.util.concurrent.LinkedBlockingQueue.take(LinkedBlockingQueue.java:442)
   [junit4]   2>         at java.util.concurrent.ThreadPoolExecutor.getTask(ThreadPoolExecutor.java:1067)
   [junit4]   2>         at java.util.concurrent.ThreadPoolExecutor.runWorker(ThreadPoolExecutor.java:1127)
   [junit4]   2>         at java.util.concurrent.ThreadPoolExecutor$Worker.run(ThreadPoolExecutor.java:617)
   [junit4]   2>         at java.lang.Thread.run(Thread.java:745)
   [junit4]   2> NOTE: test params are: codec=FastDecompressionCompressingStoredFields(storedFieldsFormat=CompressingStoredFieldsFormat(compressionMode=FAST_DECOMPRESSION, chunkSize=9, maxDocsPerChunk=1, blockSize=725), termVectorsFormat=CompressingTermVectorsFormat(compressionMode=FAST_DECOMPRESSION, chunkSize=9, blockSize=725)), sim=RandomSimilarity(queryNorm=false,coord=yes): {}, locale=it-IT, timezone=Asia/Chita
   [junit4]   2> NOTE: Windows 7 6.1 amd64/Oracle Corporation 1.8.0_72 (64-bit)/cpus=3,threads=2,free=149680640,total=396361728
   [junit4]   2> NOTE: All tests run in this JVM: [DistributedMLTComponentTest, TestSearcherReuse, TestRTGBase, TestConfigSetsAPIZkFailure, HdfsDirectoryFactoryTest, NotRequiredUniqueKeyTest, TestTrieFacet, FullSolrCloudDistribCmdsTest, AnalysisErrorHandlingTest, TestNoOpRegenerator, TestSolrIndexConfig, GraphQueryTest, TestClassicSimilarityFactory, CloudMLTQParserTest, TestSortingResponseWriter, TestFreeTextSuggestions, DistributedFacetPivotLongTailTest, TestDistributedMissingSort, WordBreakSolrSpellCheckerTest, SSLMigrationTest, TestRTimerTree, TestTrackingShardHandlerFactory, TestQueryUtils, TestManagedStopFilterFactory, DistanceUnitsTest, TestMacros, TestReqParamsAPI, TestSolrDynamicMBean, BlockCacheTest, DirectoryFactoryTest, DefaultValueUpdateProcessorTest, TestLMJelinekMercerSimilarityFactory, SolrPluginUtilsTest, TestValueSourceCache, TestPKIAuthenticationPlugin, LukeRequestHandlerTest, TestSchemaNameResource, ParsingFieldUpdateProcessorsTest, TestNRTOpen, HdfsWriteToMultipleCollectionsTest, TestTrie, TestManagedSchemaDynamicFieldResource, TestSolrJ, DistributedFacetPivotSmallTest, SolrCmdDistributorTest, AliasIntegrationTest, DistributedTermsComponentTest, NoCacheHeaderTest, FieldMutatingUpdateProcessorTest, BlockJoinFacetRandomTest, TestCollationFieldDocValues, TestSQLHandler, OverseerTaskQueueTest, TestRawTransformer, SpellingQueryConverterTest, CollectionReloadTest, TestRandomFaceting, SearchHandlerTest, DeleteReplicaTest, TestSystemIdResolver, OpenCloseCoreStressTest, CleanupOldIndexTest, TestBlendedInfixSuggestions, TestExpandComponent, TestSolrDeletionPolicy2, DeleteInactiveReplicaTest, TestFastOutputStream, TestQueryWrapperFilter, ShardRoutingCustomTest, TestSmileRequest, TestMaxScoreQueryParser, BadIndexSchemaTest, TestCrossCoreJoin, HdfsNNFailoverTest, TestBulkSchemaConcurrent, TestConfigOverlay, TlogReplayBufferedWhileIndexingTest, TestShardHandlerFactory, FileUtilsTest, HdfsBasicDistributedZkTest, DistributedSuggestComponentTest, HighlighterMaxOffsetTest, TestSchemaManager, TestNonDefinedSimilarityFactory, TestAtomicUpdateErrorCases, SuggestComponentTest, TestQueryTypes, TestManagedSchemaFieldTypeResource, RAMDirectoryFactoryTest, LeaderElectionIntegrationTest, ConvertedLegacyTest, DistribDocExpirationUpdateProcessorTest, OpenExchangeRatesOrgProviderTest, TestZkChroot, TermVectorComponentDistributedTest, TestBulkSchemaAPI, BaseCdcrDistributedZkTest, UpdateRequestProcessorFactoryTest, TestSuggestSpellingConverter, TestScoreJoinQPScore, MinimalSchemaTest, InfoHandlerTest, ConcurrentDeleteAndCreateCollectionTest, DateFieldTest, TestJettySolrRunner, VersionInfoTest, SortSpecParsingTest, BasicFunctionalityTest, LeaderFailoverAfterPartitionTest, RestartWhileUpdatingTest, TestStandardQParsers, ExplicitHLLTest, UniqFieldsUpdateProcessorFactoryTest, SynonymTokenizerTest, OverriddenZkACLAndCredentialsProvidersTest, ShardSplitTest, TestJsonFacets, ChaosMonkeySafeLeaderTest, VMParamsZkACLAndCredentialsProvidersTest, EchoParamsTest, CurrencyFieldOpenExchangeTest, SolrCoreCheckLockOnStartupTest, TestFoldingMultitermQuery, ResponseLogComponentTest, TestShortCircuitedRequests, TestHashQParserPlugin, TestExactSharedStatsCache, RemoteQueryErrorTest, RequestLoggingTest, EnumFieldTest, TestManagedResourceStorage, TestPerFieldSimilarityWithDefaultOverride, TestRebalanceLeaders, SparseHLLTest, PluginInfoTest, ResourceLoaderTest, CacheHeaderTest, SegmentsInfoRequestHandlerTest, TestFastWriter, BasicZkTest, TestAuthenticationFramework, HLLSerializationTest, BasicDistributedZk2Test, CollectionsAPIDistributedZkTest, OverseerTest, ZkSolrClientTest, TestRandomDVFaceting, AutoCommitTest, TestDistributedGrouping, TestFaceting, TestRecovery, DistributedSpellCheckComponentTest, TestRealTimeGet, TestJoin, TestReload, TestStressVersions, TestRangeQuery, TestCoreContainer, SimpleFacetsTest, TestSolr4Spatial, StatsComponentTest, QueryElevationComponentTest, TestSort, TestFiltering, TestLazyCores]
   [junit4]   2> NOTE: reproduce with: ant test  -Dtestcase=TestLazyCores -Dtests.seed=A8DA3FB6C6EAC481 -Dtests.slow=true -Dtests.locale=it-IT -Dtests.timezone=Asia/Chita -Dtests.asserts=true -Dtests.file.encoding=US-ASCII
   [junit4] ERROR   0.00s J1 | TestLazyCores (suite) <<<
   [junit4]    > Throwable #1: java.lang.AssertionError: ObjectTracker found 4 object(s) that were not released!!! [SolrCore, MockDirectoryWrapper, MDCAwareThreadPoolExecutor, MockDirectoryWrapper]
   [junit4]    > 	at __randomizedtesting.SeedInfo.seed([A8DA3FB6C6EAC481]:0)
   [junit4]    > 	at org.apache.solr.SolrTestCaseJ4.afterClass(SolrTestCaseJ4.java:228)
   [junit4]    > 	at java.lang.Thread.run(Thread.java:745)Throwable #2: com.carrotsearch.randomizedtesting.ThreadLeakError: 1 thread leaked from SUITE scope at org.apache.solr.core.TestLazyCores: 
   [junit4]    >    1) Thread[id=12955, name=searcherExecutor-5985-thread-1, state=WAITING, group=TGRP-TestLazyCores]
   [junit4]    >         at sun.misc.Unsafe.park(Native Method)
   [junit4]    >         at java.util.concurrent.locks.LockSupport.park(LockSupport.java:175)
   [junit4]    >         at java.util.concurrent.locks.AbstractQueuedSynchronizer$ConditionObject.await(AbstractQueuedSynchronizer.java:2039)
   [junit4]    >         at java.util.concurrent.LinkedBlockingQueue.take(LinkedBlockingQueue.java:442)
   [junit4]    >         at java.util.concurrent.ThreadPoolExecutor.getTask(ThreadPoolExecutor.java:1067)
   [junit4]    >         at java.util.concurrent.ThreadPoolExecutor.runWorker(ThreadPoolExecutor.java:1127)
   [junit4]    >         at java.util.concurrent.ThreadPoolExecutor$Worker.run(ThreadPoolExecutor.java:617)
   [junit4]    >         at java.lang.Thread.run(Thread.java:745)
   [junit4]    > 	at __randomizedtesting.SeedInfo.seed([A8DA3FB6C6EAC481]:0)Throwable #3: com.carrotsearch.randomizedtesting.ThreadLeakError: There are still zombie threads that couldn't be terminated:
   [junit4]    >    1) Thread[id=12955, name=searcherExecutor-5985-thread-1, state=WAITING, group=TGRP-TestLazyCores]
   [junit4]    >         at sun.misc.Unsafe.park(Native Method)
   [junit4]    >         at java.util.concurrent.locks.LockSupport.park(LockSupport.java:175)
   [junit4]    >         at java.util.concurrent.locks.AbstractQueuedSynchronizer$ConditionObject.await(AbstractQueuedSynchronizer.java:2039)
   [junit4]    >         at java.util.concurrent.LinkedBlockingQueue.take(LinkedBlockingQueue.java:442)
   [junit4]    >         at java.util.concurrent.ThreadPoolExecutor.getTask(ThreadPoolExecutor.java:1067)
   [junit4]    >         at java.util.concurrent.ThreadPoolExecutor.runWorker(ThreadPoolExecutor.java:1127)
   [junit4]    >         at java.util.concurrent.ThreadPoolExecutor$Worker.run(ThreadPoolExecutor.java:617)
   [junit4]    >         at java.lang.Thread.run(Thread.java:745)
   [junit4]    > 	at __randomizedtesting.SeedInfo.seed([A8DA3FB6C6EAC481]:0)
   [junit4] Completed [424/579 (1!)] on J1 in 152.80s, 8 tests, 1 failure, 2 errors <<< FAILURES!

[...truncated 520 lines...]
BUILD FAILED
C:\Users\JenkinsSlave\workspace\Lucene-Solr-trunk-Windows\build.xml:740: The following error occurred while executing this line:
C:\Users\JenkinsSlave\workspace\Lucene-Solr-trunk-Windows\build.xml:684: The following error occurred while executing this line:
C:\Users\JenkinsSlave\workspace\Lucene-Solr-trunk-Windows\build.xml:59: The following error occurred while executing this line:
C:\Users\JenkinsSlave\workspace\Lucene-Solr-trunk-Windows\solr\build.xml:233: The following error occurred while executing this line:
C:\Users\JenkinsSlave\workspace\Lucene-Solr-trunk-Windows\solr\common-build.xml:524: The following error occurred while executing this line:
C:\Users\JenkinsSlave\workspace\Lucene-Solr-trunk-Windows\lucene\common-build.xml:1457: The following error occurred while executing this line:
C:\Users\JenkinsSlave\workspace\Lucene-Solr-trunk-Windows\lucene\common-build.xml:1014: There were test failures: 579 suites (8 ignored), 2331 tests, 3 suite-level errors, 524 ignored (77 assumptions) [seed: A8DA3FB6C6EAC481]

Total time: 55 minutes 6 seconds
Build step 'Invoke Ant' marked build as failure
Archiving artifacts
[WARNINGS] Skipping publisher since build result is FAILURE
Recording test results
Email was triggered for: Failure - Any
Sending email for trigger: Failure - Any



Mime
View raw message