lucene-dev mailing list archives

Site index · List index
Message view « Date » · « Thread »
Top « Date » · « Thread »
From Policeman Jenkins Server <jenk...@thetaphi.de>
Subject [JENKINS-EA] Lucene-Solr-trunk-Linux (64bit/jdk-9-ea+105) - Build # 15939 - Failure!
Date Sun, 21 Feb 2016 03:08:42 GMT
Build: http://jenkins.thetaphi.de/job/Lucene-Solr-trunk-Linux/15939/
Java: 64bit/jdk-9-ea+105 -XX:+UseCompressedOops -XX:+UseParallelGC -XX:-UseSuperWord

1 tests failed.
FAILED:  org.apache.lucene.search.TestShardSearching.testSimple

Error Message:


Stack Trace:
java.lang.AssertionError
	at __randomizedtesting.SeedInfo.seed([BF08B34FC3F0470F:87BB97B1E40393DE]:0)
	at org.apache.lucene.search.BooleanScorer.scoreWindowIntoBitSetAndReplay(BooleanScorer.java:218)
	at org.apache.lucene.search.BooleanScorer.scoreWindowMultipleScorers(BooleanScorer.java:266)
	at org.apache.lucene.search.BooleanScorer.scoreWindow(BooleanScorer.java:311)
	at org.apache.lucene.search.BooleanScorer.score(BooleanScorer.java:335)
	at org.apache.lucene.search.ConstantScoreQuery$ConstantBulkScorer.score(ConstantScoreQuery.java:84)
	at org.apache.lucene.search.BulkScorer.score(BulkScorer.java:39)
	at org.apache.lucene.search.IndexSearcher.search(IndexSearcher.java:669)
	at org.apache.lucene.search.IndexSearcher.search(IndexSearcher.java:473)
	at org.apache.lucene.search.IndexSearcher.search(IndexSearcher.java:592)
	at org.apache.lucene.search.IndexSearcher.searchAfter(IndexSearcher.java:450)
	at org.apache.lucene.search.IndexSearcher.search(IndexSearcher.java:461)
	at org.apache.lucene.search.TestShardSearching.assertSame(TestShardSearching.java:298)
	at org.apache.lucene.search.TestShardSearching.testSimple(TestShardSearching.java:236)
	at sun.reflect.NativeMethodAccessorImpl.invoke0(Native Method)
	at sun.reflect.NativeMethodAccessorImpl.invoke(NativeMethodAccessorImpl.java:62)
	at sun.reflect.DelegatingMethodAccessorImpl.invoke(DelegatingMethodAccessorImpl.java:43)
	at java.lang.reflect.Method.invoke(Method.java:520)
	at com.carrotsearch.randomizedtesting.RandomizedRunner.invoke(RandomizedRunner.java:1764)
	at com.carrotsearch.randomizedtesting.RandomizedRunner$8.evaluate(RandomizedRunner.java:871)
	at com.carrotsearch.randomizedtesting.RandomizedRunner$9.evaluate(RandomizedRunner.java:907)
	at com.carrotsearch.randomizedtesting.RandomizedRunner$10.evaluate(RandomizedRunner.java:921)
	at org.apache.lucene.util.TestRuleSetupTeardownChained$1.evaluate(TestRuleSetupTeardownChained.java:49)
	at org.apache.lucene.util.AbstractBeforeAfterRule$1.evaluate(AbstractBeforeAfterRule.java:45)
	at org.apache.lucene.util.TestRuleThreadAndTestName$1.evaluate(TestRuleThreadAndTestName.java:48)
	at org.apache.lucene.util.TestRuleIgnoreAfterMaxFailures$1.evaluate(TestRuleIgnoreAfterMaxFailures.java:64)
	at org.apache.lucene.util.TestRuleMarkFailure$1.evaluate(TestRuleMarkFailure.java:47)
	at com.carrotsearch.randomizedtesting.rules.StatementAdapter.evaluate(StatementAdapter.java:36)
	at com.carrotsearch.randomizedtesting.ThreadLeakControl$StatementRunner.run(ThreadLeakControl.java:367)
	at com.carrotsearch.randomizedtesting.ThreadLeakControl.forkTimeoutingTask(ThreadLeakControl.java:809)
	at com.carrotsearch.randomizedtesting.ThreadLeakControl$3.evaluate(ThreadLeakControl.java:460)
	at com.carrotsearch.randomizedtesting.RandomizedRunner.runSingleTest(RandomizedRunner.java:880)
	at com.carrotsearch.randomizedtesting.RandomizedRunner$5.evaluate(RandomizedRunner.java:781)
	at com.carrotsearch.randomizedtesting.RandomizedRunner$6.evaluate(RandomizedRunner.java:816)
	at com.carrotsearch.randomizedtesting.RandomizedRunner$7.evaluate(RandomizedRunner.java:827)
	at org.apache.lucene.util.AbstractBeforeAfterRule$1.evaluate(AbstractBeforeAfterRule.java:45)
	at com.carrotsearch.randomizedtesting.rules.StatementAdapter.evaluate(StatementAdapter.java:36)
	at org.apache.lucene.util.TestRuleStoreClassName$1.evaluate(TestRuleStoreClassName.java:41)
	at com.carrotsearch.randomizedtesting.rules.NoShadowingOrOverridesOnMethodsRule$1.evaluate(NoShadowingOrOverridesOnMethodsRule.java:40)
	at com.carrotsearch.randomizedtesting.rules.NoShadowingOrOverridesOnMethodsRule$1.evaluate(NoShadowingOrOverridesOnMethodsRule.java:40)
	at com.carrotsearch.randomizedtesting.rules.StatementAdapter.evaluate(StatementAdapter.java:36)
	at com.carrotsearch.randomizedtesting.rules.StatementAdapter.evaluate(StatementAdapter.java:36)
	at com.carrotsearch.randomizedtesting.rules.StatementAdapter.evaluate(StatementAdapter.java:36)
	at org.apache.lucene.util.TestRuleAssertionsRequired$1.evaluate(TestRuleAssertionsRequired.java:53)
	at org.apache.lucene.util.TestRuleMarkFailure$1.evaluate(TestRuleMarkFailure.java:47)
	at org.apache.lucene.util.TestRuleIgnoreAfterMaxFailures$1.evaluate(TestRuleIgnoreAfterMaxFailures.java:64)
	at org.apache.lucene.util.TestRuleIgnoreTestSuites$1.evaluate(TestRuleIgnoreTestSuites.java:54)
	at com.carrotsearch.randomizedtesting.rules.StatementAdapter.evaluate(StatementAdapter.java:36)
	at com.carrotsearch.randomizedtesting.ThreadLeakControl$StatementRunner.run(ThreadLeakControl.java:367)
	at java.lang.Thread.run(Thread.java:804)




Build Log:
[...truncated 894 lines...]
   [junit4] Suite: org.apache.lucene.search.TestShardSearching
   [junit4]   2> NOTE: reproduce with: ant test  -Dtestcase=TestShardSearching -Dtests.method=testSimple
-Dtests.seed=BF08B34FC3F0470F -Dtests.multiplier=3 -Dtests.slow=true -Dtests.locale=se -Dtests.timezone=CTT
-Dtests.asserts=true -Dtests.file.encoding=UTF-8
   [junit4] FAILURE 2.96s J2 | TestShardSearching.testSimple <<<
   [junit4]    > Throwable #1: java.lang.AssertionError
   [junit4]    > 	at __randomizedtesting.SeedInfo.seed([BF08B34FC3F0470F:87BB97B1E40393DE]:0)
   [junit4]    > 	at org.apache.lucene.search.BooleanScorer.scoreWindowIntoBitSetAndReplay(BooleanScorer.java:218)
   [junit4]    > 	at org.apache.lucene.search.BooleanScorer.scoreWindowMultipleScorers(BooleanScorer.java:266)
   [junit4]    > 	at org.apache.lucene.search.BooleanScorer.scoreWindow(BooleanScorer.java:311)
   [junit4]    > 	at org.apache.lucene.search.BooleanScorer.score(BooleanScorer.java:335)
   [junit4]    > 	at org.apache.lucene.search.ConstantScoreQuery$ConstantBulkScorer.score(ConstantScoreQuery.java:84)
   [junit4]    > 	at org.apache.lucene.search.BulkScorer.score(BulkScorer.java:39)
   [junit4]    > 	at org.apache.lucene.search.IndexSearcher.search(IndexSearcher.java:669)
   [junit4]    > 	at org.apache.lucene.search.IndexSearcher.search(IndexSearcher.java:473)
   [junit4]    > 	at org.apache.lucene.search.IndexSearcher.search(IndexSearcher.java:592)
   [junit4]    > 	at org.apache.lucene.search.IndexSearcher.searchAfter(IndexSearcher.java:450)
   [junit4]    > 	at org.apache.lucene.search.IndexSearcher.search(IndexSearcher.java:461)
   [junit4]    > 	at org.apache.lucene.search.TestShardSearching.assertSame(TestShardSearching.java:298)
   [junit4]    > 	at org.apache.lucene.search.TestShardSearching.testSimple(TestShardSearching.java:236)
   [junit4]    > 	at java.lang.Thread.run(Thread.java:804)
   [junit4]   2> NOTE: leaving temporary files on disk at: /home/jenkins/workspace/Lucene-Solr-trunk-Linux/lucene/build/core/test/J2/temp/lucene.search.TestShardSearching_BF08B34FC3F0470F-001
   [junit4]   2> Feb 21, 2016 3:05:30 AM com.carrotsearch.randomizedtesting.ThreadLeakControl
checkThreadLeaks
   [junit4]   2> WARNING: Will linger awaiting termination of 1 leaked thread(s).
   [junit4]   2> NOTE: test params are: codec=FastDecompressionCompressingStoredFields(storedFieldsFormat=CompressingStoredFieldsFormat(compressionMode=FAST_DECOMPRESSION,
chunkSize=4, maxDocsPerChunk=583, blockSize=186), termVectorsFormat=CompressingTermVectorsFormat(compressionMode=FAST_DECOMPRESSION,
chunkSize=4, blockSize=186)), sim=ClassicSimilarity, locale=se, timezone=CTT
   [junit4]   2> NOTE: Linux 3.19.0-47-generic amd64/Oracle Corporation 9-ea (64-bit)/cpus=12,threads=1,free=321539152,total=419430400
   [junit4]   2> NOTE: All tests run in this JVM: [TestCodecHoldsOpenFiles, TestCustomSearcherSort,
TestMultiMMap, TestMultiPhraseEnum, TestNRTReaderCleanup, TestDirectPacked, TestFastDecompressionMode,
TestIntroSorter, TestSPIClassIterator, TestSearchWithThreads, TestTotalHitCountCollector,
TestMultiLevelSkipList, TestIntBlockPool, Test2BPagedBytes, TestBufferedChecksum, TestTopDocsMerge,
TestSpans, TestSearch, TestLucene60PointFormat, TestForUtil, TestPhrasePrefixQuery, TestSpanContainQuery,
TestTermVectorsReader, TestMathUtil, TestIndexInput, TestBufferedIndexInput, TestSpanOrQuery,
TestMergeSchedulerExternal, TestIndexWriterMaxDocs, TestPackedTokenAttributeImpl, TestRegexpRandom2,
TestRollingUpdates, TestMixedCodecs, TestManyFields, TestSpanFirstQuery, TestLiveFieldValues,
TestDocBoost, Test2BPositions, TestPointValues, TestPrefixQuery, TestNot, TestDirectory, TestCharsRefBuilder,
TestFastCompressionMode, TestOfflineSorter, TestTransactions, TestBKD, TestMaxTermFrequency,
TestCharsRef, TestTimSorterWorstCase, TestBooleanRewrites, TestLongPostings, TestIndexWriterDeleteByQuery,
TestElevationComparator, Test2BNumericDocValues, TestMergeRateLimiter, TestCharTermAttributeImpl,
TestLazyProxSkipping, TestBytesRefHash, TestBooleanOr, TestTieredMergePolicy, TestFieldValueQuery,
TestFilterSpans, TestTwoPhaseCommitTool, TestTermVectors, TestIndexWriterMerging, TestBagOfPositions,
TestSimpleSearchEquivalence, TestIndexWriterReader, TestNumericRangeQuery32, TestAddIndexes,
TestShardSearching]
   [junit4] Completed [205/411 (1!)] on J2 in 12.79s, 1 test, 1 failure <<< FAILURES!

[...truncated 670 lines...]
BUILD FAILED
/home/jenkins/workspace/Lucene-Solr-trunk-Linux/build.xml:740: The following error occurred
while executing this line:
/home/jenkins/workspace/Lucene-Solr-trunk-Linux/build.xml:684: The following error occurred
while executing this line:
/home/jenkins/workspace/Lucene-Solr-trunk-Linux/build.xml:59: The following error occurred
while executing this line:
/home/jenkins/workspace/Lucene-Solr-trunk-Linux/lucene/build.xml:50: The following error occurred
while executing this line:
/home/jenkins/workspace/Lucene-Solr-trunk-Linux/lucene/common-build.xml:1457: The following
error occurred while executing this line:
/home/jenkins/workspace/Lucene-Solr-trunk-Linux/lucene/common-build.xml:1014: There were test
failures: 411 suites (1 ignored), 3395 tests, 1 failure, 58 ignored (54 assumptions) [seed:
BF08B34FC3F0470F]

Total time: 6 minutes 21 seconds
Build step 'Invoke Ant' marked build as failure
Archiving artifacts
[WARNINGS] Skipping publisher since build result is FAILURE
Recording test results
Email was triggered for: Failure - Any
Sending email for trigger: Failure - Any



Mime
View raw message