lucene-dev mailing list archives

Site index · List index
Message view « Date » · « Thread »
Top « Date » · « Thread »
From Policeman Jenkins Server <jenk...@thetaphi.de>
Subject [JENKINS] Lucene-Solr-trunk-MacOSX (64bit/jdk1.8.0) - Build # 3092 - Still Failing!
Date Wed, 17 Feb 2016 21:45:55 GMT
Build: http://jenkins.thetaphi.de/job/Lucene-Solr-trunk-MacOSX/3092/
Java: 64bit/jdk1.8.0 -XX:-UseCompressedOops -XX:+UseSerialGC

1 tests failed.
FAILED:  org.apache.solr.util.TestSolrCLIRunExample.testInteractiveSolrCloudExample

Error Message:
Could not find a healthy node to handle the request.

Stack Trace:
org.apache.solr.common.SolrException: Could not find a healthy node to handle the request.
	at __randomizedtesting.SeedInfo.seed([42D092F8EB8D53B4:99A17232DCF896D2]:0)
	at org.apache.solr.client.solrj.impl.CloudSolrClient.sendRequest(CloudSolrClient.java:1084)
	at org.apache.solr.client.solrj.impl.CloudSolrClient.requestWithRetryOnStaleState(CloudSolrClient.java:870)
	at org.apache.solr.client.solrj.impl.CloudSolrClient.requestWithRetryOnStaleState(CloudSolrClient.java:953)
	at org.apache.solr.client.solrj.impl.CloudSolrClient.requestWithRetryOnStaleState(CloudSolrClient.java:953)
	at org.apache.solr.client.solrj.impl.CloudSolrClient.requestWithRetryOnStaleState(CloudSolrClient.java:953)
	at org.apache.solr.client.solrj.impl.CloudSolrClient.requestWithRetryOnStaleState(CloudSolrClient.java:953)
	at org.apache.solr.client.solrj.impl.CloudSolrClient.requestWithRetryOnStaleState(CloudSolrClient.java:953)
	at org.apache.solr.client.solrj.impl.CloudSolrClient.request(CloudSolrClient.java:806)
	at org.apache.solr.client.solrj.SolrRequest.process(SolrRequest.java:149)
	at org.apache.solr.client.solrj.SolrClient.commit(SolrClient.java:484)
	at org.apache.solr.client.solrj.SolrClient.commit(SolrClient.java:463)
	at org.apache.solr.util.TestSolrCLIRunExample.testInteractiveSolrCloudExample(TestSolrCLIRunExample.java:446)
	at sun.reflect.NativeMethodAccessorImpl.invoke0(Native Method)
	at sun.reflect.NativeMethodAccessorImpl.invoke(NativeMethodAccessorImpl.java:62)
	at sun.reflect.DelegatingMethodAccessorImpl.invoke(DelegatingMethodAccessorImpl.java:43)
	at java.lang.reflect.Method.invoke(Method.java:498)
	at com.carrotsearch.randomizedtesting.RandomizedRunner.invoke(RandomizedRunner.java:1764)
	at com.carrotsearch.randomizedtesting.RandomizedRunner$8.evaluate(RandomizedRunner.java:871)
	at com.carrotsearch.randomizedtesting.RandomizedRunner$9.evaluate(RandomizedRunner.java:907)
	at com.carrotsearch.randomizedtesting.RandomizedRunner$10.evaluate(RandomizedRunner.java:921)
	at com.carrotsearch.randomizedtesting.rules.SystemPropertiesRestoreRule$1.evaluate(SystemPropertiesRestoreRule.java:57)
	at org.apache.lucene.util.TestRuleSetupTeardownChained$1.evaluate(TestRuleSetupTeardownChained.java:49)
	at org.apache.lucene.util.AbstractBeforeAfterRule$1.evaluate(AbstractBeforeAfterRule.java:45)
	at org.apache.lucene.util.TestRuleThreadAndTestName$1.evaluate(TestRuleThreadAndTestName.java:48)
	at org.apache.lucene.util.TestRuleIgnoreAfterMaxFailures$1.evaluate(TestRuleIgnoreAfterMaxFailures.java:64)
	at org.apache.lucene.util.TestRuleMarkFailure$1.evaluate(TestRuleMarkFailure.java:47)
	at com.carrotsearch.randomizedtesting.rules.StatementAdapter.evaluate(StatementAdapter.java:36)
	at com.carrotsearch.randomizedtesting.ThreadLeakControl$StatementRunner.run(ThreadLeakControl.java:367)
	at com.carrotsearch.randomizedtesting.ThreadLeakControl.forkTimeoutingTask(ThreadLeakControl.java:809)
	at com.carrotsearch.randomizedtesting.ThreadLeakControl$3.evaluate(ThreadLeakControl.java:460)
	at com.carrotsearch.randomizedtesting.RandomizedRunner.runSingleTest(RandomizedRunner.java:880)
	at com.carrotsearch.randomizedtesting.RandomizedRunner$5.evaluate(RandomizedRunner.java:781)
	at com.carrotsearch.randomizedtesting.RandomizedRunner$6.evaluate(RandomizedRunner.java:816)
	at com.carrotsearch.randomizedtesting.RandomizedRunner$7.evaluate(RandomizedRunner.java:827)
	at com.carrotsearch.randomizedtesting.rules.StatementAdapter.evaluate(StatementAdapter.java:36)
	at com.carrotsearch.randomizedtesting.rules.SystemPropertiesRestoreRule$1.evaluate(SystemPropertiesRestoreRule.java:57)
	at org.apache.lucene.util.AbstractBeforeAfterRule$1.evaluate(AbstractBeforeAfterRule.java:45)
	at com.carrotsearch.randomizedtesting.rules.StatementAdapter.evaluate(StatementAdapter.java:36)
	at org.apache.lucene.util.TestRuleStoreClassName$1.evaluate(TestRuleStoreClassName.java:41)
	at com.carrotsearch.randomizedtesting.rules.NoShadowingOrOverridesOnMethodsRule$1.evaluate(NoShadowingOrOverridesOnMethodsRule.java:40)
	at com.carrotsearch.randomizedtesting.rules.NoShadowingOrOverridesOnMethodsRule$1.evaluate(NoShadowingOrOverridesOnMethodsRule.java:40)
	at com.carrotsearch.randomizedtesting.rules.StatementAdapter.evaluate(StatementAdapter.java:36)
	at com.carrotsearch.randomizedtesting.rules.StatementAdapter.evaluate(StatementAdapter.java:36)
	at com.carrotsearch.randomizedtesting.rules.StatementAdapter.evaluate(StatementAdapter.java:36)
	at org.apache.lucene.util.TestRuleAssertionsRequired$1.evaluate(TestRuleAssertionsRequired.java:53)
	at org.apache.lucene.util.TestRuleMarkFailure$1.evaluate(TestRuleMarkFailure.java:47)
	at org.apache.lucene.util.TestRuleIgnoreAfterMaxFailures$1.evaluate(TestRuleIgnoreAfterMaxFailures.java:64)
	at org.apache.lucene.util.TestRuleIgnoreTestSuites$1.evaluate(TestRuleIgnoreTestSuites.java:54)
	at com.carrotsearch.randomizedtesting.rules.StatementAdapter.evaluate(StatementAdapter.java:36)
	at com.carrotsearch.randomizedtesting.ThreadLeakControl$StatementRunner.run(ThreadLeakControl.java:367)
	at java.lang.Thread.run(Thread.java:745)




Build Log:
[...truncated 12105 lines...]
   [junit4] Suite: org.apache.solr.util.TestSolrCLIRunExample
   [junit4]   2> Creating dataDir: /Users/jenkins/workspace/Lucene-Solr-trunk-MacOSX/solr/build/solr-core/test/J0/temp/solr.util.TestSolrCLIRunExample_42D092F8EB8D53B4-001/init-core-data-001
   [junit4]   2> 3164184 INFO  (TEST-TestSolrCLIRunExample.testSchemalessExample-seed#[42D092F8EB8D53B4]) [    ] o.a.s.SolrTestCaseJ4 ###Starting testSchemalessExample
   [junit4]   2> 3164185 INFO  (TEST-TestSolrCLIRunExample.testSchemalessExample-seed#[42D092F8EB8D53B4]) [    ] o.a.s.u.TestSolrCLIRunExample Selected port 54143 to start schemaless example Solr instance on ...
   [junit4]   2> 3164531 INFO  (Thread-7761) [    ] o.e.j.s.Server jetty-9.3.6.v20151106
   [junit4]   2> 3164535 INFO  (Thread-7761) [    ] o.e.j.s.h.ContextHandler Started o.e.j.s.ServletContextHandler@1a5637b3{/solr,null,AVAILABLE}
   [junit4]   2> 3164540 INFO  (Thread-7761) [    ] o.e.j.s.ServerConnector Started ServerConnector@4d20b02a{HTTP/1.1,[http/1.1]}{127.0.0.1:54143}
   [junit4]   2> 3164541 INFO  (Thread-7761) [    ] o.e.j.s.Server Started @3168680ms
   [junit4]   2> 3164541 INFO  (Thread-7761) [    ] o.a.s.c.s.e.JettySolrRunner Jetty properties: {hostContext=/solr, hostPort=54143}
   [junit4]   2> 3164541 INFO  (Thread-7761) [    ] o.a.s.s.SolrDispatchFilter SolrDispatchFilter.init(): sun.misc.Launcher$AppClassLoader@1540e19d
   [junit4]   2> 3164541 INFO  (Thread-7761) [    ] o.a.s.c.SolrResourceLoader new SolrResourceLoader for directory: '/Users/jenkins/workspace/Lucene-Solr-trunk-MacOSX/solr/build/solr-core/test/J0/temp/solr.util.TestSolrCLIRunExample_42D092F8EB8D53B4-001/tempDir-001/schemaless/solr'
   [junit4]   2> 3164541 INFO  (Thread-7761) [    ] o.a.s.c.SolrResourceLoader JNDI not configured for solr (NoInitialContextEx)
   [junit4]   2> 3164541 INFO  (Thread-7761) [    ] o.a.s.c.SolrResourceLoader solr home defaulted to 'solr/' (could not find system property or JNDI)
   [junit4]   2> 3164542 INFO  (Thread-7761) [    ] o.a.s.c.SolrXmlConfig Loading container configuration from /Users/jenkins/workspace/Lucene-Solr-trunk-MacOSX/solr/build/solr-core/test/J0/temp/solr.util.TestSolrCLIRunExample_42D092F8EB8D53B4-001/tempDir-001/schemaless/solr/solr.xml
   [junit4]   2> 3164548 INFO  (Thread-7761) [    ] o.a.s.c.CorePropertiesLocator Config-defined core root directory: /Users/jenkins/workspace/Lucene-Solr-trunk-MacOSX/solr/build/solr-core/test/J0/temp/solr.util.TestSolrCLIRunExample_42D092F8EB8D53B4-001/tempDir-001/schemaless/solr
   [junit4]   2> 3164548 INFO  (Thread-7761) [    ] o.a.s.c.CoreContainer New CoreContainer 14364674
   [junit4]   2> 3164548 INFO  (Thread-7761) [    ] o.a.s.c.CoreContainer Loading cores into CoreContainer [instanceDir=/Users/jenkins/workspace/Lucene-Solr-trunk-MacOSX/solr/build/solr-core/test/J0/temp/solr.util.TestSolrCLIRunExample_42D092F8EB8D53B4-001/tempDir-001/schemaless/solr]
   [junit4]   2> 3164549 WARN  (Thread-7761) [    ] o.a.s.c.CoreContainer Couldn't add files from /Users/jenkins/workspace/Lucene-Solr-trunk-MacOSX/solr/build/solr-core/test/J0/temp/solr.util.TestSolrCLIRunExample_42D092F8EB8D53B4-001/tempDir-001/schemaless/solr/lib to classpath: /Users/jenkins/workspace/Lucene-Solr-trunk-MacOSX/solr/build/solr-core/test/J0/temp/solr.util.TestSolrCLIRunExample_42D092F8EB8D53B4-001/tempDir-001/schemaless/solr/lib
   [junit4]   2> 3164550 INFO  (Thread-7761) [    ] o.a.s.h.c.HttpShardHandlerFactory created with socketTimeout : 600000,connTimeout : 60000,maxConnectionsPerHost : 20,maxConnections : 10000,corePoolSize : 0,maximumPoolSize : 2147483647,maxThreadIdleTime : 5,sizeOfQueue : -1,fairnessPolicy : false,useRetries : false,
   [junit4]   2> 3164552 INFO  (Thread-7761) [    ] o.a.s.u.UpdateShardHandler Creating UpdateShardHandler HTTP client with params: socketTimeout=600000&connTimeout=60000&retry=true
   [junit4]   2> 3164552 INFO  (Thread-7761) [    ] o.a.s.l.LogWatcher SLF4J impl is org.slf4j.impl.Log4jLoggerFactory
   [junit4]   2> 3164552 INFO  (Thread-7761) [    ] o.a.s.l.LogWatcher Registering Log Listener [Log4j (org.slf4j.impl.Log4jLoggerFactory)]
   [junit4]   2> 3164553 INFO  (Thread-7761) [    ] o.a.s.c.CoreContainer Security conf doesn't exist. Skipping setup for authorization module.
   [junit4]   2> 3164553 INFO  (Thread-7761) [    ] o.a.s.c.CoreContainer No authentication plugin used.
   [junit4]   2> 3164554 INFO  (Thread-7761) [    ] o.a.s.c.CorePropertiesLocator Looking for core definitions underneath /Users/jenkins/workspace/Lucene-Solr-trunk-MacOSX/solr/build/solr-core/test/J0/temp/solr.util.TestSolrCLIRunExample_42D092F8EB8D53B4-001/tempDir-001/schemaless/solr
   [junit4]   2> 3164554 INFO  (Thread-7761) [    ] o.a.s.c.CorePropertiesLocator Found 0 core definitions
   [junit4]   2> 3164555 INFO  (Thread-7761) [    ] o.a.s.s.SolrDispatchFilter user.dir=/Users/jenkins/workspace/Lucene-Solr-trunk-MacOSX/solr/build/solr-core/test/J0
   [junit4]   2> 3164555 INFO  (Thread-7761) [    ] o.a.s.s.SolrDispatchFilter SolrDispatchFilter.init() done
   [junit4]   2> 3165760 INFO  (qtp208549583-21334) [    ] o.a.s.s.HttpSolrCall [admin] webapp=null path=/admin/info/system params={wt=json} status=0 QTime=1173
   [junit4]   2> 3165774 INFO  (qtp208549583-21337) [    ] o.a.s.s.HttpSolrCall [admin] webapp=null path=/admin/cores params={core=gettingstarted&action=STATUS&wt=json} status=0 QTime=0
   [junit4]   2> 3165816 INFO  (qtp208549583-21338) [    ] o.a.s.s.HttpSolrCall [admin] webapp=null path=/admin/info/system params={wt=json} status=0 QTime=22
   [junit4]   2> 3165887 INFO  (qtp208549583-21334) [    ] o.a.s.s.HttpSolrCall [admin] webapp=null path=/admin/info/system params={wt=json} status=0 QTime=39
   [junit4]   2> 3165900 INFO  (qtp208549583-21339) [    ] o.a.s.s.HttpSolrCall [admin] webapp=null path=/admin/cores params={core=gettingstarted&action=STATUS&wt=json} status=0 QTime=0
   [junit4]   2> 3166847 INFO  (qtp208549583-21334) [    ] o.a.s.h.a.CoreAdminOperation core create command name=gettingstarted&action=CREATE&instanceDir=gettingstarted&wt=json
   [junit4]   2> 3166848 INFO  (qtp208549583-21334) [    ] o.a.s.c.CoreDescriptor Created CoreDescriptor: {name=gettingstarted, config=solrconfig.xml, loadOnStartup=true, schema=schema.xml, configSetProperties=configsetprops.json, transient=false, dataDir=data/}
   [junit4]   2> 3166848 INFO  (qtp208549583-21334) [    ] o.a.s.c.SolrResourceLoader new SolrResourceLoader for directory: '/Users/jenkins/workspace/Lucene-Solr-trunk-MacOSX/solr/build/solr-core/test/J0/temp/solr.util.TestSolrCLIRunExample_42D092F8EB8D53B4-001/tempDir-001/schemaless/solr/gettingstarted'
   [junit4]   2> 3166848 INFO  (qtp208549583-21334) [    ] o.a.s.c.SolrResourceLoader JNDI not configured for solr (NoInitialContextEx)
   [junit4]   2> 3166848 INFO  (qtp208549583-21334) [    ] o.a.s.c.SolrResourceLoader solr home defaulted to 'solr/' (could not find system property or JNDI)
   [junit4]   2> 3166856 INFO  (qtp208549583-21334) [    ] o.a.s.c.SolrConfig current version of requestparams : 0
   [junit4]   2> 3166857 INFO  (qtp208549583-21334) [    ] o.a.s.c.SolrConfig Adding specified lib dirs to ClassLoader
   [junit4]   2> 3166892 WARN  (qtp208549583-21334) [    ] o.a.s.c.SolrConfig Couldn't add files from /Users/jenkins/workspace/Lucene-Solr-trunk-MacOSX/solr/build/solr-core/test/J0/temp/solr.util.TestSolrCLIRunExample_42D092F8EB8D53B4-001/tempDir-001/schemaless/solr/gettingstarted/../../../../contrib/extraction/lib filtered by .*\.jar to classpath: /Users/jenkins/workspace/Lucene-Solr-trunk-MacOSX/solr/build/solr-core/test/J0/temp/solr.util.TestSolrCLIRunExample_42D092F8EB8D53B4-001/tempDir-001/schemaless/solr/gettingstarted/../../../../contrib/extraction/lib
   [junit4]   2> 3166892 WARN  (qtp208549583-21334) [    ] o.a.s.c.SolrConfig Couldn't add files from /Users/jenkins/workspace/Lucene-Solr-trunk-MacOSX/solr/build/solr-core/test/J0/temp/solr.util.TestSolrCLIRunExample_42D092F8EB8D53B4-001/tempDir-001/schemaless/solr/gettingstarted/../../../../dist filtered by solr-cell-\d.*\.jar to classpath: /Users/jenkins/workspace/Lucene-Solr-trunk-MacOSX/solr/build/solr-core/test/J0/temp/solr.util.TestSolrCLIRunExample_42D092F8EB8D53B4-001/tempDir-001/schemaless/solr/gettingstarted/../../../../dist
   [junit4]   2> 3166893 WARN  (qtp208549583-21334) [    ] o.a.s.c.SolrConfig Couldn't add files from /Users/jenkins/workspace/Lucene-Solr-trunk-MacOSX/solr/build/solr-core/test/J0/temp/solr.util.TestSolrCLIRunExample_42D092F8EB8D53B4-001/tempDir-001/schemaless/solr/gettingstarted/../../../../contrib/clustering/lib filtered by .*\.jar to classpath: /Users/jenkins/workspace/Lucene-Solr-trunk-MacOSX/solr/build/solr-core/test/J0/temp/solr.util.TestSolrCLIRunExample_42D092F8EB8D53B4-001/tempDir-001/schemaless/solr/gettingstarted/../../../../contrib/clustering/lib
   [junit4]   2> 3166893 WARN  (qtp208549583-21334) [    ] o.a.s.c.SolrConfig Couldn't add files from /Users/jenkins/workspace/Lucene-Solr-trunk-MacOSX/solr/build/solr-core/test/J0/temp/solr.util.TestSolrCLIRunExample_42D092F8EB8D53B4-001/tempDir-001/schemaless/solr/gettingstarted/../../../../dist filtered by solr-clustering-\d.*\.jar to classpath: /Users/jenkins/workspace/Lucene-Solr-trunk-MacOSX/solr/build/solr-core/test/J0/temp/solr.util.TestSolrCLIRunExample_42D092F8EB8D53B4-001/tempDir-001/schemaless/solr/gettingstarted/../../../../dist
   [junit4]   2> 3166893 WARN  (qtp208549583-21334) [    ] o.a.s.c.SolrConfig Couldn't add files from /Users/jenkins/workspace/Lucene-Solr-trunk-MacOSX/solr/build/solr-core/test/J0/temp/solr.util.TestSolrCLIRunExample_42D092F8EB8D53B4-001/tempDir-001/schemaless/solr/gettingstarted/../../../../contrib/langid/lib filtered by .*\.jar to classpath: /Users/jenkins/workspace/Lucene-Solr-trunk-MacOSX/solr/build/solr-core/test/J0/temp/solr.util.TestSolrCLIRunExample_42D092F8EB8D53B4-001/tempDir-001/schemaless/solr/gettingstarted/../../../../contrib/langid/lib
   [junit4]   2> 3166894 WARN  (qtp208549583-21334) [    ] o.a.s.c.SolrConfig Couldn't add files from /Users/jenkins/workspace/Lucene-Solr-trunk-MacOSX/solr/build/solr-core/test/J0/temp/solr.util.TestSolrCLIRunExample_42D092F8EB8D53B4-001/tempDir-001/schemaless/solr/gettingstarted/../../../../dist filtered by solr-langid-\d.*\.jar to classpath: /Users/jenkins/workspace/Lucene-Solr-trunk-MacOSX/solr/build/solr-core/test/J0/temp/solr.util.TestSolrCLIRunExample_42D092F8EB8D53B4-001/tempDir-001/schemaless/solr/gettingstarted/../../../../dist
   [junit4]   2> 3166894 WARN  (qtp208549583-21334) [    ] o.a.s.c.SolrConfig Couldn't add files from /Users/jenkins/workspace/Lucene-Solr-trunk-MacOSX/solr/build/solr-core/test/J0/temp/solr.util.TestSolrCLIRunExample_42D092F8EB8D53B4-001/tempDir-001/schemaless/solr/gettingstarted/../../../../contrib/velocity/lib filtered by .*\.jar to classpath: /Users/jenkins/workspace/Lucene-Solr-trunk-MacOSX/solr/build/solr-core/test/J0/temp/solr.util.TestSolrCLIRunExample_42D092F8EB8D53B4-001/tempDir-001/schemaless/solr/gettingstarted/../../../../contrib/velocity/lib
   [junit4]   2> 3166895 WARN  (qtp208549583-21334) [    ] o.a.s.c.SolrConfig Couldn't add files from /Users/jenkins/workspace/Lucene-Solr-trunk-MacOSX/solr/build/solr-core/test/J0/temp/solr.util.TestSolrCLIRunExample_42D092F8EB8D53B4-001/tempDir-001/schemaless/solr/gettingstarted/../../../../dist filtered by solr-velocity-\d.*\.jar to classpath: /Users/jenkins/workspace/Lucene-Solr-trunk-MacOSX/solr/build/solr-core/test/J0/temp/solr.util.TestSolrCLIRunExample_42D092F8EB8D53B4-001/tempDir-001/schemaless/solr/gettingstarted/../../../../dist
   [junit4]   2> 3166925 WARN  (qtp208549583-21334) [    ] o.a.s.c.Config Beginning with Solr 5.5, <maxMergeDocs> is deprecated, configure it on the relevant <mergePolicyFactory> instead.
   [junit4]   2> 3166925 WARN  (qtp208549583-21334) [    ] o.a.s.c.Config Beginning with Solr 5.5, <mergeFactor> is deprecated, configure it on the relevant <mergePolicyFactory> instead.
   [junit4]   2> 3166927 INFO  (qtp208549583-21334) [    ] o.a.s.c.SolrConfig Using Lucene MatchVersion: 6.0.0
   [junit4]   2> 3166943 INFO  (qtp208549583-21334) [    ] o.a.s.c.SolrConfig Loaded SolrConfig: solrconfig.xml
   [junit4]   2> 3166952 INFO  (qtp208549583-21334) [    ] o.a.s.s.IndexSchema [gettingstarted] Schema name=example-data-driven-schema
   [junit4]   2> 3167203 INFO  (qtp208549583-21334) [    ] o.a.s.s.IndexSchema unique key field: id
   [junit4]   2> 3167398 INFO  (qtp208549583-21334) [    ] o.a.s.s.FileExchangeRateProvider Reloading exchange rates from file currency.xml
   [junit4]   2> 3167411 INFO  (qtp208549583-21334) [    ] o.a.s.s.FileExchangeRateProvider Reloading exchange rates from file currency.xml
   [junit4]   2> 3167431 INFO  (qtp208549583-21334) [    ] o.a.s.c.ConfigSetProperties Did not find ConfigSet properties, assuming default properties: Can't find resource 'configsetprops.json' in classpath or '/Users/jenkins/workspace/Lucene-Solr-trunk-MacOSX/solr/build/solr-core/test/J0/temp/solr.util.TestSolrCLIRunExample_42D092F8EB8D53B4-001/tempDir-001/schemaless/solr/gettingstarted'
   [junit4]   2> 3167431 INFO  (qtp208549583-21334) [    ] o.a.s.c.CoreContainer Creating SolrCore 'gettingstarted' using configuration from instancedir /Users/jenkins/workspace/Lucene-Solr-trunk-MacOSX/solr/build/solr-core/test/J0/temp/solr.util.TestSolrCLIRunExample_42D092F8EB8D53B4-001/tempDir-001/schemaless/solr/gettingstarted
   [junit4]   2> 3167431 INFO  (qtp208549583-21334) [    x:gettingstarted] o.a.s.c.SolrCore org.apache.solr.core.MockDirectoryFactory
   [junit4]   2> 3167432 INFO  (qtp208549583-21334) [    x:gettingstarted] o.a.s.c.SolrCore [[gettingstarted] ] Opening new SolrCore at [/Users/jenkins/workspace/Lucene-Solr-trunk-MacOSX/solr/build/solr-core/test/J0/temp/solr.util.TestSolrCLIRunExample_42D092F8EB8D53B4-001/tempDir-001/schemaless/solr/gettingstarted], dataDir=[/Users/jenkins/workspace/Lucene-Solr-trunk-MacOSX/solr/build/solr-core/test/J0/temp/solr.util.TestSolrCLIRunExample_42D092F8EB8D53B4-001/tempDir-001/schemaless/solr/gettingstarted/data/]
   [junit4]   2> 3167432 INFO  (qtp208549583-21334) [    x:gettingstarted] o.a.s.c.JmxMonitoredMap JMX monitoring is enabled. Adding Solr mbeans to JMX Server: com.sun.jmx.mbeanserver.JmxMBeanServer@564a4f07
   [junit4]   2> 3167432 INFO  (qtp208549583-21334) [    x:gettingstarted] o.a.s.c.SolrCore [[gettingstarted] ] Added SolrEventListener for newSearcher: [org.apache.solr.core.QuerySenderListener{queries=[]}]
   [junit4]   2> 3167432 INFO  (qtp208549583-21334) [    x:gettingstarted] o.a.s.c.SolrCore [[gettingstarted] ] Added SolrEventListener for firstSearcher: [org.apache.solr.core.QuerySenderListener{queries=[]}]
   [junit4]   2> 3167432 INFO  (qtp208549583-21334) [    x:gettingstarted] o.a.s.c.SchemaCodecFactory Using default compressionMode: BEST_SPEED
   [junit4]   2> 3167433 INFO  (qtp208549583-21334) [    x:gettingstarted] o.a.s.c.CachingDirectoryFactory return new directory for /Users/jenkins/workspace/Lucene-Solr-trunk-MacOSX/solr/build/solr-core/test/J0/temp/solr.util.TestSolrCLIRunExample_42D092F8EB8D53B4-001/tempDir-001/schemaless/solr/gettingstarted/data
   [junit4]   2> 3167433 INFO  (qtp208549583-21334) [    x:gettingstarted] o.a.s.c.SolrCore New index directory detected: old=null new=/Users/jenkins/workspace/Lucene-Solr-trunk-MacOSX/solr/build/solr-core/test/J0/temp/solr.util.TestSolrCLIRunExample_42D092F8EB8D53B4-001/tempDir-001/schemaless/solr/gettingstarted/data/index/
   [junit4]   2> 3167433 WARN  (qtp208549583-21334) [    x:gettingstarted] o.a.s.c.SolrCore [gettingstarted] Solr index directory '/Users/jenkins/workspace/Lucene-Solr-trunk-MacOSX/solr/build/solr-core/test/J0/temp/solr.util.TestSolrCLIRunExample_42D092F8EB8D53B4-001/tempDir-001/schemaless/solr/gettingstarted/data/index' doesn't exist. Creating new index...
   [junit4]   2> 3167434 INFO  (qtp208549583-21334) [    x:gettingstarted] o.a.s.c.CachingDirectoryFactory return new directory for /Users/jenkins/workspace/Lucene-Solr-trunk-MacOSX/solr/build/solr-core/test/J0/temp/solr.util.TestSolrCLIRunExample_42D092F8EB8D53B4-001/tempDir-001/schemaless/solr/gettingstarted/data/index
   [junit4]   2> 3167434 INFO  (qtp208549583-21334) [    x:gettingstarted] o.a.s.c.SolrDeletionPolicy SolrDeletionPolicy.onCommit: commits: num=1
   [junit4]   2> 	commit{dir=MockDirectoryWrapper(RAMDirectory@2095d5aa lockFactory=org.apache.lucene.store.SingleInstanceLockFactory@45b88f06),segFN=segments_1,generation=1}
   [junit4]   2> 3167435 INFO  (qtp208549583-21334) [    x:gettingstarted] o.a.s.c.SolrDeletionPolicy newest commit generation = 1
   [junit4]   2> 3167436 INFO  (OldIndexDirectoryCleanupThreadForCore-gettingstarted) [    x:gettingstarted] o.a.s.c.SolrCore Looking for old index directories to cleanup for core gettingstarted in /Users/jenkins/workspace/Lucene-Solr-trunk-MacOSX/solr/build/solr-core/test/J0/temp/solr.util.TestSolrCLIRunExample_42D092F8EB8D53B4-001/tempDir-001/schemaless/solr/gettingstarted/data/
   [junit4]   2> 3167465 WARN  (OldIndexDirectoryCleanupThreadForCore-gettingstarted) [    x:gettingstarted] o.a.s.c.DirectoryFactory /Users/jenkins/workspace/Lucene-Solr-trunk-MacOSX/solr/build/solr-core/test/J0/temp/solr.util.TestSolrCLIRunExample_42D092F8EB8D53B4-001/tempDir-001/schemaless/solr/gettingstarted/data/ does not point to a valid data directory; skipping clean-up of old index directories.
   [junit4]   2> 3167486 INFO  (qtp208549583-21334) [    x:gettingstarted] o.a.s.c.PluginBag queryResponseWriter : 'velocity' created with startup=lazy 
   [junit4]   2> 3167536 INFO  (qtp208549583-21334) [    x:gettingstarted] o.a.s.r.XSLTResponseWriter xsltCacheLifetimeSeconds=5
   [junit4]   2> 3167625 INFO  (qtp208549583-21334) [    x:gettingstarted] o.a.s.u.p.UpdateRequestProcessorChain creating updateRequestProcessorChain "add-unknown-fields-to-the-schema"
   [junit4]   2> 3168273 INFO  (qtp208549583-21334) [    x:gettingstarted] o.a.s.c.SolrCore no updateRequestProcessorChain defined as default, creating implicit default
   [junit4]   2> 3168277 INFO  (qtp208549583-21334) [    x:gettingstarted] o.a.s.h.l.XMLLoader xsltCacheLifetimeSeconds=60
   [junit4]   2> 3168278 INFO  (qtp208549583-21334) [    x:gettingstarted] o.a.s.h.l.XMLLoader xsltCacheLifetimeSeconds=60
   [junit4]   2> 3168279 INFO  (qtp208549583-21334) [    x:gettingstarted] o.a.s.h.l.XMLLoader xsltCacheLifetimeSeconds=60
   [junit4]   2> 3168280 INFO  (qtp208549583-21334) [    x:gettingstarted] o.a.s.h.l.XMLLoader xsltCacheLifetimeSeconds=60
   [junit4]   2> 3168283 INFO  (qtp208549583-21334) [    x:gettingstarted] o.a.s.c.PluginBag requestHandler : '/update/extract' created with startup=lazy 
   [junit4]   2> 3168283 INFO  (qtp208549583-21334) [    x:gettingstarted] o.a.s.c.PluginBag requestHandler : '/analysis/field' created with startup=lazy 
   [junit4]   2> 3168283 INFO  (qtp208549583-21334) [    x:gettingstarted] o.a.s.c.PluginBag requestHandler : '/analysis/document' created with startup=lazy 
   [junit4]   2> 3168283 INFO  (qtp208549583-21334) [    x:gettingstarted] o.a.s.c.PluginBag requestHandler : '/spell' created with startup=lazy 
   [junit4]   2> 3168283 INFO  (qtp208549583-21334) [    x:gettingstarted] o.a.s.c.PluginBag requestHandler : '/tvrh' created with startup=lazy 
   [junit4]   2> 3168283 INFO  (qtp208549583-21334) [    x:gettingstarted] o.a.s.c.PluginBag requestHandler : '/terms' created with startup=lazy 
   [junit4]   2> 3168283 INFO  (qtp208549583-21334) [    x:gettingstarted] o.a.s.c.PluginBag requestHandler : '/elevate' created with startup=lazy 
   [junit4]   2> 3168283 INFO  (qtp208549583-21334) [    x:gettingstarted] o.a.s.c.RequestHandlers Registered paths: /admin/mbeans,/browse,/update/json/docs,/admin/luke,/export,/get,/admin/properties,/elevate,/update/json,/admin/threads,/query,/analysis/field,/analysis/document,/spell,/update/csv,/sql,/tvrh,/select,/admin/segments,/admin/system,/replication,/config,/stream,/schema,/admin/plugins,/admin/logging,/admin/ping,/update,/admin/file,/debug/dump,/terms,/update/extract
   [junit4]   2> 3168284 INFO  (qtp208549583-21334) [    x:gettingstarted] o.a.s.c.SolrCore Using default statsCache cache: org.apache.solr.search.stats.LocalStatsCache
   [junit4]   2> 3168285 INFO  (qtp208549583-21334) [    x:gettingstarted] o.a.s.u.UpdateHandler Using UpdateLog implementation: org.apache.solr.update.UpdateLog
   [junit4]   2> 3168285 INFO  (qtp208549583-21334) [    x:gettingstarted] o.a.s.u.UpdateLog Initializing UpdateLog: dataDir= defaultSyncLevel=FLUSH numRecordsToKeep=100 maxNumLogsToKeep=10 numVersionBuckets=65536
   [junit4]   2> 3168286 INFO  (qtp208549583-21334) [    x:gettingstarted] o.a.s.u.CommitTracker Hard AutoCommit: if uncommited for 15000ms; 
   [junit4]   2> 3168286 INFO  (qtp208549583-21334) [    x:gettingstarted] o.a.s.u.CommitTracker Soft AutoCommit: disabled
   [junit4]   2> 3168295 INFO  (qtp208549583-21334) [    x:gettingstarted] o.a.s.c.SolrDeletionPolicy SolrDeletionPolicy.onInit: commits: num=1
   [junit4]   2> 	commit{dir=MockDirectoryWrapper(RAMDirectory@2095d5aa lockFactory=org.apache.lucene.store.SingleInstanceLockFactory@45b88f06),segFN=segments_1,generation=1}
   [junit4]   2> 3168295 INFO  (qtp208549583-21334) [    x:gettingstarted] o.a.s.c.SolrDeletionPolicy newest commit generation = 1
   [junit4]   2> 3168295 INFO  (qtp208549583-21334) [    x:gettingstarted] o.a.s.s.SolrIndexSearcher Opening [Searcher@5e0d0fb7[gettingstarted] main]
   [junit4]   2> 3168295 INFO  (qtp208549583-21334) [    x:gettingstarted] o.a.s.r.ManagedResourceStorage File-based storage initialized to use dir: /Users/jenkins/workspace/Lucene-Solr-trunk-MacOSX/solr/build/solr-core/test/J0/temp/solr.util.TestSolrCLIRunExample_42D092F8EB8D53B4-001/tempDir-001/schemaless/solr/gettingstarted/conf
   [junit4]   2> 3168295 INFO  (qtp208549583-21334) [    x:gettingstarted] o.a.s.r.RestManager Initializing RestManager with initArgs: {storageDir=/Users/jenkins/workspace/Lucene-Solr-trunk-MacOSX/solr/build/solr-core/test/J0/temp/solr.util.TestSolrCLIRunExample_42D092F8EB8D53B4-001/tempDir-001/schemaless/solr/gettingstarted/conf}
   [junit4]   2> 3168441 INFO  (qtp208549583-21334) [    x:gettingstarted] o.a.s.r.ManagedResourceStorage Reading _rest_managed.json using file:dir=/Users/jenkins/workspace/Lucene-Solr-trunk-MacOSX/solr/build/solr-core/test/J0/temp/solr.util.TestSolrCLIRunExample_42D092F8EB8D53B4-001/tempDir-001/schemaless/solr/gettingstarted/conf
   [junit4]   2> 3168441 INFO  (qtp208549583-21334) [    x:gettingstarted] o.a.s.r.RestManager Initializing 0 registered ManagedResources
   [junit4]   2> 3168441 INFO  (qtp208549583-21334) [    x:gettingstarted] o.a.s.h.c.SpellCheckComponent Initializing spell checkers
   [junit4]   2> 3168441 INFO  (qtp208549583-21334) [    x:gettingstarted] o.a.s.s.DirectSolrSpellChecker init: {name=default,field=_text_,classname=solr.DirectSolrSpellChecker,distanceMeasure=internal,accuracy=0.5,maxEdits=2,minPrefix=1,maxInspections=5,minQueryLength=4,maxQueryFrequency=0.01}
   [junit4]   2> 3168442 INFO  (qtp208549583-21334) [    x:gettingstarted] o.a.s.h.c.SpellCheckComponent No queryConverter defined, using default converter
   [junit4]   2> 3168443 INFO  (qtp208549583-21334) [    x:gettingstarted] o.a.s.h.c.QueryElevationComponent Loading QueryElevation from: /Users/jenkins/workspace/Lucene-Solr-trunk-MacOSX/solr/build/solr-core/test/J0/temp/solr.util.TestSolrCLIRunExample_42D092F8EB8D53B4-001/tempDir-001/schemaless/solr/gettingstarted/conf/elevate.xml
   [junit4]   2> 3168605 INFO  (qtp208549583-21334) [    x:gettingstarted] o.a.s.h.ReplicationHandler Commits will be reserved for  10000
   [junit4]   2> 3168605 INFO  (searcherExecutor-9597-thread-1-processing-x:gettingstarted) [    x:gettingstarted] o.a.s.c.QuerySenderListener QuerySenderListener sending requests to Searcher@5e0d0fb7[gettingstarted] main{ExitableDirectoryReader(UninvertingDirectoryReader())}
   [junit4]   2> 3168606 INFO  (searcherExecutor-9597-thread-1-processing-x:gettingstarted) [    x:gettingstarted] o.a.s.c.QuerySenderListener QuerySenderListener done.
   [junit4]   2> 3168606 INFO  (searcherExecutor-9597-thread-1-processing-x:gettingstarted) [    x:gettingstarted] o.a.s.h.c.SpellCheckComponent Loading spell index for spellchecker: default
   [junit4]   2> 3168606 INFO  (searcherExecutor-9597-thread-1-processing-x:gettingstarted) [    x:gettingstarted] o.a.s.c.SolrCore [gettingstarted] Registered new searcher Searcher@5e0d0fb7[gettingstarted] main{ExitableDirectoryReader(UninvertingDirectoryReader())}
   [junit4]   2> 3168606 INFO  (qtp208549583-21334) [    x:gettingstarted] o.a.s.u.UpdateLog Looking up max value of version field to seed version buckets
   [junit4]   2> 3168607 INFO  (qtp208549583-21334) [    x:gettingstarted] o.a.s.u.VersionInfo Refreshing highest value of _version_ for 65536 version buckets from index
   [junit4]   2> 3168607 INFO  (qtp208549583-21334) [    x:gettingstarted] o.a.s.u.VersionInfo No terms found for _version_, cannot seed version bucket highest value from index
   [junit4]   2> 3168607 INFO  (qtp208549583-21334) [    x:gettingstarted] o.a.s.u.UpdateLog Could not find max version in index or recent updates, using new clock 1526459779410558976
   [junit4]   2> 3168608 INFO  (qtp208549583-21334) [    x:gettingstarted] o.a.s.u.UpdateLog Took 1.0ms to seed version buckets with highest version 1526459779410558976
   [junit4]   2> 3168608 INFO  (qtp208549583-21334) [    x:gettingstarted] o.a.s.c.CoreContainer registering core: gettingstarted
   [junit4]   2> 3168609 INFO  (qtp208549583-21334) [    x:gettingstarted] o.a.s.s.HttpSolrCall [admin] webapp=null path=/admin/cores params={name=gettingstarted&action=CREATE&instanceDir=gettingstarted&wt=json} status=0 QTime=1761
   [junit4]   2> 3168611 INFO  (TEST-TestSolrCLIRunExample.testSchemalessExample-seed#[42D092F8EB8D53B4]) [    ] o.e.j.s.ServerConnector Stopped ServerConnector@4d20b02a{HTTP/1.1,[http/1.1]}{127.0.0.1:54143}
   [junit4]   2> 3168612 INFO  (TEST-TestSolrCLIRunExample.testSchemalessExample-seed#[42D092F8EB8D53B4]) [    ] o.a.s.c.CoreContainer Shutting down CoreContainer instance=14364674
   [junit4]   2> 3168612 INFO  (coreCloseExecutor-9602-thread-1) [    x:gettingstarted] o.a.s.c.SolrCore [gettingstarted]  CLOSING SolrCore org.apache.solr.core.SolrCore@31a67e3b
   [junit4]   2> 3168613 INFO  (coreCloseExecutor-9602-thread-1) [    x:gettingstarted] o.a.s.u.DirectUpdateHandler2 closing DirectUpdateHandler2{commits=0,autocommit maxTime=15000ms,autocommits=0,soft autocommits=0,optimizes=0,rollbacks=0,expungeDeletes=0,docsPending=0,adds=0,deletesById=0,deletesByQuery=0,errors=0,cumulative_adds=0,cumulative_deletesById=0,cumulative_deletesByQuery=0,cumulative_errors=0,transaction_logs_total_size=0,transaction_logs_total_number=0}
   [junit4]   2> 3168613 INFO  (coreCloseExecutor-9602-thread-1) [    x:gettingstarted] o.a.s.u.SolrCoreState Closing SolrCoreState
   [junit4]   2> 3168613 INFO  (coreCloseExecutor-9602-thread-1) [    x:gettingstarted] o.a.s.u.DefaultSolrCoreState SolrCoreState ref count has reached 0 - closing IndexWriter
   [junit4]   2> 3168613 INFO  (coreCloseExecutor-9602-thread-1) [    x:gettingstarted] o.a.s.u.DefaultSolrCoreState closing IndexWriter with IndexWriterCloser
   [junit4]   2> 3168614 INFO  (coreCloseExecutor-9602-thread-1) [    x:gettingstarted] o.a.s.c.SolrCore [gettingstarted] Closing main searcher on request.
   [junit4]   2> 3168619 INFO  (coreCloseExecutor-9602-thread-1) [    x:gettingstarted] o.a.s.c.CachingDirectoryFactory Closing MockDirectoryFactory - 2 directories currently being tracked
   [junit4]   2> 3168619 INFO  (coreCloseExecutor-9602-thread-1) [    x:gettingstarted] o.a.s.c.CachingDirectoryFactory looking to close /Users/jenkins/workspace/Lucene-Solr-trunk-MacOSX/solr/build/solr-core/test/J0/temp/solr.util.TestSolrCLIRunExample_42D092F8EB8D53B4-001/tempDir-001/schemaless/solr/gettingstarted/data/index [CachedDir<<refCount=0;path=/Users/jenkins/workspace/Lucene-Solr-trunk-MacOSX/solr/build/solr-core/test/J0/temp/solr.util.TestSolrCLIRunExample_42D092F8EB8D53B4-001/tempDir-001/schemaless/solr/gettingstarted/data/index;done=false>>]
   [junit4]   2> 3168620 INFO  (coreCloseExecutor-9602-thread-1) [    x:gettingstarted] o.a.s.c.CachingDirectoryFactory Closing directory: /Users/jenkins/workspace/Lucene-Solr-trunk-MacOSX/solr/build/solr-core/test/J0/temp/solr.util.TestSolrCLIRunExample_42D092F8EB8D53B4-001/tempDir-001/schemaless/solr/gettingstarted/data/index
   [junit4]   2> 3168625 INFO  (coreCloseExecutor-9602-thread-1) [    x:gettingstarted] o.a.s.c.CachingDirectoryFactory looking to close /Users/jenkins/workspace/Lucene-Solr-trunk-MacOSX/solr/build/solr-core/test/J0/temp/solr.util.TestSolrCLIRunExample_42D092F8EB8D53B4-001/tempDir-001/schemaless/solr/gettingstarted/data [CachedDir<<refCount=0;path=/Users/jenkins/workspace/Lucene-Solr-trunk-MacOSX/solr/build/solr-core/test/J0/temp/solr.util.TestSolrCLIRunExample_42D092F8EB8D53B4-001/tempDir-001/schemaless/solr/gettingstarted/data;done=false>>]
   [junit4]   2> 3168625 INFO  (coreCloseExecutor-9602-thread-1) [    x:gettingstarted] o.a.s.c.CachingDirectoryFactory Closing directory: /Users/jenkins/workspace/Lucene-Solr-trunk-MacOSX/solr/build/solr-core/test/J0/temp/solr.util.TestSolrCLIRunExample_42D092F8EB8D53B4-001/tempDir-001/schemaless/solr/gettingstarted/data
   [junit4]   2> 3168626 INFO  (TEST-TestSolrCLIRunExample.testSchemalessExample-seed#[42D092F8EB8D53B4]) [    ] o.e.j.s.h.ContextHandler Stopped o.e.j.s.ServletContextHandler@1a5637b3{/solr,null,UNAVAILABLE}
   [junit4]   2> 3168628 INFO  (TEST-TestSolrCLIRunExample.testSchemalessExample-seed#[42D092F8EB8D53B4]) [    ] o.a.s.u.TestSolrCLIRunExample Stopped standalone Solr instance running on port 54143
   [junit4]   2> 3168629 INFO  (TEST-TestSolrCLIRunExample.testSchemalessExample-seed#[42D092F8EB8D53B4]) [    ] o.a.s.SolrTestCaseJ4 ###Ending testSchemalessExample
   [junit4]   2> 3168631 INFO  (TEST-TestSolrCLIRunExample.testInteractiveSolrCloudExample-seed#[42D092F8EB8D53B4]) [    ] o.a.s.SolrTestCaseJ4 ###Starting testInteractiveSolrCloudExample
   [junit4]   2> 3168826 INFO  (TEST-TestSolrCLIRunExample.testInteractiveSolrCloudExample-seed#[42D092F8EB8D53B4]) [    ] o.a.s.c.ZkTestServer STARTING ZK TEST SERVER
   [junit4]   2> 3168826 INFO  (Thread-7776) [    ] o.a.s.c.ZkTestServer client port:0.0.0.0/0.0.0.0:0
   [junit4]   2> 3168826 INFO  (Thread-7776) [    ] o.a.s.c.ZkTestServer Starting server
   [junit4]   2> 3168927 INFO  (TEST-TestSolrCLIRunExample.testInteractiveSolrCloudExample-seed#[42D092F8EB8D53B4]) [    ] o.a.s.c.ZkTestServer start zk server on port:54158
   [junit4]   2> 3168928 INFO  (TEST-TestSolrCLIRunExample.testInteractiveSolrCloudExample-seed#[42D092F8EB8D53B4]) [    ] o.a.s.c.c.SolrZkClient Using default ZkCredentialsProvider
   [junit4]   2> 3168929 INFO  (TEST-TestSolrCLIRunExample.testInteractiveSolrCloudExample-seed#[42D092F8EB8D53B4]) [    ] o.a.s.c.c.ConnectionManager Waiting for client to connect to ZooKeeper
   [junit4]   2> 3169111 INFO  (zkCallback-3446-thread-1) [    ] o.a.s.c.c.ConnectionManager Watcher org.apache.solr.common.cloud.ConnectionManager@535d21c name:ZooKeeperConnection Watcher:127.0.0.1:54158 got event WatchedEvent state:SyncConnected type:None path:null path:null type:None
   [junit4]   2> 3169111 INFO  (TEST-TestSolrCLIRunExample.testInteractiveSolrCloudExample-seed#[42D092F8EB8D53B4]) [    ] o.a.s.c.c.ConnectionManager Client is connected to ZooKeeper
   [junit4]   2> 3169111 INFO  (TEST-TestSolrCLIRunExample.testInteractiveSolrCloudExample-seed#[42D092F8EB8D53B4]) [    ] o.a.s.c.c.SolrZkClient Using default ZkACLProvider
   [junit4]   2> 3169111 INFO  (TEST-TestSolrCLIRunExample.testInteractiveSolrCloudExample-seed#[42D092F8EB8D53B4]) [    ] o.a.s.c.c.SolrZkClient makePath: /solr/solr.xml
   [junit4]   2> 3169119 INFO  (jetty-launcher-3445-thread-1) [    ] o.e.j.s.Server jetty-9.3.6.v20151106
   [junit4]   2> 3169122 INFO  (jetty-launcher-3445-thread-1) [    ] o.e.j.s.h.ContextHandler Started o.e.j.s.ServletContextHandler@71e455c2{/solr,null,AVAILABLE}
   [junit4]   2> 3169122 INFO  (jetty-launcher-3445-thread-1) [    ] o.e.j.s.ServerConnector Started ServerConnector@2ea5e2d1{HTTP/1.1,[http/1.1]}{127.0.0.1:54155}
   [junit4]   2> 3169122 INFO  (jetty-launcher-3445-thread-1) [    ] o.e.j.s.Server Started @3173261ms
   [junit4]   2> 3169122 INFO  (jetty-launcher-3445-thread-1) [    ] o.a.s.c.s.e.JettySolrRunner Jetty properties: {hostContext=/solr, hostPort=54155}
   [junit4]   2> 3169122 INFO  (jetty-launcher-3445-thread-1) [    ] o.a.s.s.SolrDispatchFilter SolrDispatchFilter.init(): sun.misc.Launcher$AppClassLoader@1540e19d
   [junit4]   2> 3169123 INFO  (jetty-launcher-3445-thread-1) [    ] o.a.s.c.SolrResourceLoader new SolrResourceLoader for directory: '/Users/jenkins/workspace/Lucene-Solr-trunk-MacOSX/solr/build/solr-core/test/J0/temp/solr.util.TestSolrCLIRunExample_42D092F8EB8D53B4-001/tempDir-003/node1'
   [junit4]   2> 3169123 INFO  (jetty-launcher-3445-thread-1) [    ] o.a.s.c.SolrResourceLoader JNDI not configured for solr (NoInitialContextEx)
   [junit4]   2> 3169123 INFO  (jetty-launcher-3445-thread-1) [    ] o.a.s.c.SolrResourceLoader solr home defaulted to 'solr/' (could not find system property or JNDI)
   [junit4]   2> 3169123 INFO  (jetty-launcher-3445-thread-1) [    ] o.a.s.c.c.SolrZkClient Using default ZkCredentialsProvider
   [junit4]   2> 3169124 INFO  (jetty-launcher-3445-thread-1) [    ] o.a.s.c.c.ConnectionManager Waiting for client to connect to ZooKeeper
   [junit4]   2> 3169126 INFO  (zkCallback-3447-thread-1) [    ] o.a.s.c.c.ConnectionManager Watcher org.apache.solr.common.cloud.ConnectionManager@1876e551 name:ZooKeeperConnection Watcher:127.0.0.1:54158/solr got event WatchedEvent state:SyncConnected type:None path:null path:null type:None
   [junit4]   2> 3169127 INFO  (jetty-launcher-3445-thread-1) [    ] o.a.s.c.c.ConnectionManager Client is connected to ZooKeeper
   [junit4]   2> 3169128 INFO  (jetty-launcher-3445-thread-1) [    ] o.a.s.c.c.SolrZkClient Using default ZkACLProvider
   [junit4]   2> 3169129 INFO  (jetty-launcher-3445-thread-1) [    ] o.a.s.s.SolrDispatchFilter solr.xml found in ZooKeeper. Loading...
   [junit4]   2> 3169147 INFO  (jetty-launcher-3445-thread-1) [    ] o.a.s.c.CorePropertiesLocator Config-defined core root directory: /Users/jenkins/workspace/Lucene-Solr-trunk-MacOSX/solr/build/solr-core/test/J0/temp/solr.util.TestSolrCLIRunExample_42D092F8EB8D53B4-001/tempDir-003/node1
   [junit4]   2> 3169148 INFO  (jetty-launcher-3445-thread-1) [    ] o.a.s.c.CoreContainer New CoreContainer 1062854497
   [junit4]   2> 3169148 INFO  (jetty-launcher-3445-thread-1) [    ] o.a.s.c.CoreContainer Loading cores into CoreContainer [instanceDir=/Users/jenkins/workspace/Lucene-Solr-trunk-MacOSX/solr/build/solr-core/test/J0/temp/solr.util.TestSolrCLIRunExample_42D092F8EB8D53B4-001/tempDir-003/node1]
   [junit4]   2> 3169148 WARN  (jetty-launcher-3445-thread-1) [    ] o.a.s.c.CoreContainer Couldn't add files from /Users/jenkins/workspace/Lucene-Solr-trunk-MacOSX/solr/build/solr-core/test/J0/temp/solr.util.TestSolrCLIRunExample_42D092F8EB8D53B4-001/tempDir-003/node1/lib to classpath: /Users/jenkins/workspace/Lucene-Solr-trunk-MacOSX/solr/build/solr-core/test/J0/temp/solr.util.TestSolrCLIRunExample_42D092F8EB8D53B4-001/tempDir-003/node1/lib
   [junit4]   2> 3169148 INFO  (jetty-launcher-3445-thread-1) [    ] o.a.s.h.c.HttpShardHandlerFactory created with socketTimeout : 600000,connTimeout : 60000,maxConnectionsPerHost : 20,maxConnections : 10000,corePoolSize : 0,maximumPoolSize : 2147483647,maxThreadIdleTime : 5,sizeOfQueue : -1,fairnessPolicy : false,useRetries : false,
   [junit4]   2> 3169150 INFO  (jetty-launcher-3445-thread-1) [    ] o.a.s.u.UpdateShardHandler Creating UpdateShardHandler HTTP client with params: socketTimeout=600000&connTimeout=60000&retry=true
   [junit4]   2> 3169151 INFO  (jetty-launcher-3445-thread-1) [    ] o.a.s.l.LogWatcher SLF4J impl is org.slf4j.impl.Log4jLoggerFactory
   [junit4]   2> 3169151 INFO  (jetty-launcher-3445-thread-1) [    ] o.a.s.l.LogWatcher Registering Log Listener [Log4j (org.slf4j.impl.Log4jLoggerFactory)]
   [junit4]   2> 3169151 INFO  (jetty-launcher-3445-thread-1) [    ] o.a.s.c.ZkContainer Zookeeper client=127.0.0.1:54158/solr
   [junit4]   2> 3169151 INFO  (jetty-launcher-3445-thread-1) [    ] o.a.s.c.ZkController zkHost includes chroot
   [junit4]   2> 3169151 INFO  (jetty-launcher-3445-thread-1) [    ] o.a.s.c.c.SolrZkClient Using default ZkCredentialsProvider
   [junit4]   2> 3169153 INFO  (jetty-launcher-3445-thread-1) [    ] o.a.s.c.c.ConnectionManager Waiting for client to connect to ZooKeeper
   [junit4]   2> 3169154 INFO  (zkCallback-3450-thread-1) [    ] o.a.s.c.c.ConnectionManager Watcher org.apache.solr.common.cloud.ConnectionManager@3380be51 name:ZooKeeperConnection Watcher:127.0.0.1:54158 got event WatchedEvent state:SyncConnected type:None path:null path:null type:None
   [junit4]   2> 3169154 INFO  (jetty-launcher-3445-thread-1) [    ] o.a.s.c.c.ConnectionManager Client is connected to ZooKeeper
   [junit4]   2> 3169154 INFO  (jetty-launcher-3445-thread-1) [    ] o.a.s.c.c.SolrZkClient Using default ZkACLProvider
   [junit4]   2> 3169157 INFO  (jetty-launcher-3445-thread-1) [n:localhost:54155_solr    ] o.a.s.c.c.ConnectionManager Waiting for client to connect to ZooKeeper
   [junit4]   2> 3169158 INFO  (zkCallback-3451-thread-1-processing-n:localhost:54155_solr) [n:localhost:54155_solr    ] o.a.s.c.c.ConnectionManager Watcher org.apache.solr.common.cloud.ConnectionManager@363c1547 name:ZooKeeperConnection Watcher:127.0.0.1:54158/solr got event WatchedEvent state:SyncConnected type:None path:null path:null type:None
   [junit4]   2> 3169158 INFO  (jetty-launcher-3445-thread-1) [n:localhost:54155_solr    ] o.a.s.c.c.ConnectionManager Client is connected to ZooKeeper
   [junit4]   2> 3169160 INFO  (jetty-launcher-3445-thread-1) [n:localhost:54155_solr    ] o.a.s.c.c.SolrZkClient makePath: /overseer/queue
   [junit4]   2> 3169164 INFO  (jetty-launcher-3445-thread-1) [n:localhost:54155_solr    ] o.a.s.c.c.SolrZkClient makePath: /overseer/collection-queue-work
   [junit4]   2> 3169169 INFO  (jetty-launcher-3445-thread-1) [n:localhost:54155_solr    ] o.a.s.c.c.SolrZkClient makePath: /overseer/collection-map-running
   [junit4]   2> 3169174 INFO  (jetty-launcher-3445-thread-1) [n:localhost:54155_solr    ] o.a.s.c.c.SolrZkClient makePath: /overseer/collection-map-completed
   [junit4]   2> 3169178 INFO  (jetty-launcher-3445-thread-1) [n:localhost:54155_solr    ] o.a.s.c.c.SolrZkClient makePath: /overseer/collection-map-failure
   [junit4]   2> 3169182 INFO  (jetty-launcher-3445-thread-1) [n:localhost:54155_solr    ] o.a.s.c.c.SolrZkClient makePath: /live_nodes
   [junit4]   2> 3169185 INFO  (jetty-launcher-3445-thread-1) [n:localhost:54155_solr    ] o.a.s.c.c.SolrZkClient makePath: /collections
   [junit4]   2> 3169188 INFO  (jetty-launcher-3445-thread-1) [n:localhost:54155_solr    ] o.a.s.c.c.SolrZkClient makePath: /aliases.json
   [junit4]   2> 3169190 INFO  (jetty-launcher-3445-thread-1) [n:localhost:54155_solr    ] o.a.s.c.c.SolrZkClient makePath: /clusterstate.json
   [junit4]   2> 3169192 INFO  (jetty-launcher-3445-thread-1) [n:localhost:54155_solr    ] o.a.s.c.c.SolrZkClient makePath: /security.json
   [junit4]   2> 3169195 INFO  (jetty-launcher-3445-thread-1) [n:localhost:54155_solr    ] o.a.s.c.ZkController Register node as live in ZooKeeper:/live_nodes/localhost:54155_solr
   [junit4]   2> 3169196 INFO  (jetty-launcher-3445-thread-1) [n:localhost:54155_solr    ] o.a.s.c.c.SolrZkClient makePath: /live_nodes/localhost:54155_solr
   [junit4]   2> 3169199 INFO  (jetty-launcher-3445-thread-1) [n:localhost:54155_solr    ] o.a.s.c.c.SolrZkClient makePath: /overseer_elect
   [junit4]   2> 3169202 INFO  (jetty-launcher-3445-thread-1) [n:localhost:54155_solr    ] o.a.s.c.c.SolrZkClient makePath: /overseer_elect/election
   [junit4]   2> 3169205 INFO  (jetty-launcher-3445-thread-1) [n:localhost:54155_solr    ] o.a.s.c.Overseer Overseer (id=null) closing
   [junit4]   2> 3169206 INFO  (jetty-launcher-3445-thread-1) [n:localhost:54155_solr    ] o.a.s.c.LeaderElector Joined leadership election with path: /overseer_elect/election/95403736227708931-localhost:54155_solr-n_0000000000
   [junit4]   2> 3169206 INFO  (jetty-launcher-3445-thread-1) [n:localhost:54155_solr    ] o.a.s.c.OverseerElectionContext I am going to be the leader localhost:54155_solr
   [junit4]   2> 3169206 INFO  (jetty-launcher-3445-thread-1) [n:localhost:54155_solr    ] o.a.s.c.c.SolrZkClient makePath: /overseer_elect/leader
   [junit4]   2> 3169209 INFO  (jetty-launcher-3445-thread-1) [n:localhost:54155_solr    ] o.a.s.c.Overseer Overseer (id=95403736227708931-localhost:54155_solr-n_0000000000) starting
   [junit4]   2> 3169212 INFO  (jetty-launcher-3445-thread-1) [n:localhost:54155_solr    ] o.a.s.c.c.SolrZkClient makePath: /overseer/queue-work
   [junit4]   2> 3169225 INFO  (jetty-launcher-3445-thread-1) [n:localhost:54155_solr    ] o.a.s.c.OverseerAutoReplicaFailoverThread Starting OverseerAutoReplicaFailoverThread autoReplicaFailoverWorkLoopDelay=10000 autoReplicaFailoverWaitAfterExpiration=30000 autoReplicaFailoverBadNodeExpiration=60000
   [junit4]   2> 3169226 INFO  (OverseerCollectionConfigSetProcessor-95403736227708931-localhost:54155_solr-n_0000000000) [n:localhost:54155_solr    ] o.a.s.c.OverseerTaskProcessor Process current queue of overseer operations
   [junit4]   2> 3169226 INFO  (jetty-launcher-3445-thread-1) [n:localhost:54155_solr    ] o.a.s.c.c.ZkStateReader Updating cluster state from ZooKeeper... 
   [junit4]   2> 3169227 INFO  (OverseerStateUpdate-95403736227708931-localhost:54155_solr-n_0000000000) [n:localhost:54155_solr    ] o.a.s.c.Overseer Starting to work on the main queue
   [junit4]   2> 3169245 INFO  (jetty-launcher-3445-thread-1) [n:localhost:54155_solr    ] o.a.s.c.CoreContainer Security conf doesn't exist. Skipping setup for authorization module.
   [junit4]   2> 3169245 INFO  (jetty-launcher-3445-thread-1) [n:localhost:54155_solr    ] o.a.s.c.CoreContainer No authentication plugin used.
   [junit4]   2> 3169247 INFO  (jetty-launcher-3445-thread-1) [n:localhost:54155_solr    ] o.a.s.c.CorePropertiesLocator Looking for core definitions underneath /Users/jenkins/workspace/Lucene-Solr-trunk-MacOSX/solr/build/solr-core/test/J0/temp/solr.util.TestSolrCLIRunExample_42D092F8EB8D53B4-001/tempDir-003/node1
   [junit4]   2> 3169248 INFO  (jetty-launcher-3445-thread-1) [n:localhost:54155_solr    ] o.a.s.c.CorePropertiesLocator Found 0 core definitions
   [junit4]   2> 3169249 INFO  (jetty-launcher-3445-thread-1) [n:localhost:54155_solr    ] o.a.s.s.SolrDispatchFilter user.dir=/Users/jenkins/workspace/Lucene-Solr-trunk-MacOSX/solr/build/solr-core/test/J0
   [junit4]   2> 3169249 INFO  (jetty-launcher-3445-thread-1) [n:localhost:54155_solr    ] o.a.s.s.SolrDispatchFilter SolrDispatchFilter.init() done
   [junit4]   2> 3169249 INFO  (TEST-TestSolrCLIRunExample.testInteractiveSolrCloudExample-seed#[42D092F8EB8D53B4]) [    ] o.a.s.c.c.SolrZkClient Using default ZkCredentialsProvider
   [junit4]   2> 3169250 INFO  (TEST-TestSolrCLIRunExample.testInteractiveSolrCloudExample-seed#[42D092F8EB8D53B4]) [    ] o.a.s.c.c.ConnectionManager Waiting for client to connect to ZooKeeper
   [junit4]   2> 3169251 INFO  (zkCallback-3452-thread-1) [    ] o.a.s.c.c.ConnectionManager Watcher org.apache.solr.common.cloud.ConnectionManager@7711560 name:ZooKeeperConnection Watcher:127.0.0.1:54158 got event WatchedEvent state:SyncConnected type:None path:null path:null type:None
   [junit4]   2> 3169251 INFO  (TEST-TestSolrCLIRunExample.testInteractiveSolrCloudExample-seed#[42D092F8EB8D53B4]) [    ] o.a.s.c.c.ConnectionManager Client is connected to ZooKeeper
   [junit4]   2> 3169252 INFO  (TEST-TestSolrCLIRunExample.testInteractiveSolrCloudExample-seed#[42D092F8EB8D53B4]) [    ] o.a.s.c.c.SolrZkClient Using default ZkACLProvider
   [junit4]   2> 3169451 INFO  (qtp1284478078-21364) [n:localhost:54155_solr    ] o.a.s.s.HttpSolrCall [admin] webapp=null path=/admin/info/system params={wt=json} status=0 QTime=192
   [junit4]   2> 3169456 INFO  (qtp1284478078-21365) [n:localhost:54155_solr    ] o.a.s.h.a.CollectionsHandler Invoked Collection Action :clusterstatus with params action=CLUSTERSTATUS&wt=json and sendToOCPQueue=true
   [junit4]   2> 3169460 INFO  (qtp1284478078-21365) [n:localhost:54155_solr    ] o.a.s.s.HttpSolrCall [admin] webapp=null path=/admin/collections params={action=CLUSTERSTATUS&wt=json} status=0 QTime=4
   [junit4]   2> 3169461 INFO  (TEST-TestSolrCLIRunExample.testInteractiveSolrCloudExample-seed#[42D092F8EB8D53B4]) [    ] o.a.s.c.c.SolrZkClient Using default ZkCredentialsProvider
   [junit4]   2> 3169462 INFO  (TEST-TestSolrCLIRunExample.testInteractiveSolrCloudExample-seed#[42D092F8EB8D53B4]) [    ] o.a.s.c.c.ConnectionManager Waiting for client to connect to ZooKeeper
   [junit4]   2> 3169463 INFO  (zkCallback-3455-thread-1) [    ] o.a.s.c.c.ConnectionManager Watcher org.apache.solr.common.cloud.ConnectionManager@3056d5be name:ZooKeeperConnection Watcher:127.0.0.1:54158/solr got event WatchedEvent state:SyncConnected type:None path:null path:null type:None
   [junit4]   2> 3169463 INFO  (TEST-TestSolrCLIRunExample.testInteractiveSolrCloudExample-seed#[42D092F8EB8D53B4]) [    ] o.a.s.c.c.ConnectionManager Client is connected to ZooKeeper
   [junit4]   2> 3169463 INFO  (TEST-TestSolrCLIRunExample.testInteractiveSolrCloudExample-seed#[42D092F8EB8D53B4]) [    ] o.a.s.c.c.SolrZkClient Using default ZkACLProvider
   [junit4]   2> 3169464 INFO  (TEST-TestSolrCLIRunExample.testInteractiveSolrCloudExample-seed#[42D092F8EB8D53B4]) [    ] o.a.s.c.c.ZkStateReader Updating cluster state from ZooKeeper... 
   [junit4]   2> 3169471 INFO  (qtp1284478078-21369) [n:localhost:54155_solr    ] o.a.s.h.a.CollectionsHandler Invoked Collection Action :list with params action=list&wt=json and sendToOCPQueue=true
   [junit4]   2> 3169471 INFO  (qtp1284478078-21369) [n:localhost:54155_solr    ] o.a.s.s.HttpSolrCall [admin] webapp=null path=/admin/collections params={action=list&wt=json} status=0 QTime=0
   [junit4]   2> 3169585 INFO  (qtp1284478078-21366) [n:localhost:54155_solr    ] o.a.s.s.HttpSolrCall [admin] webapp=null path=/admin/info/system params={wt=json} status=0 QTime=24
   [junit4]   2> 3169590 INFO  (qtp1284478078-21368) [n:localhost:54155_solr    ] o.a.s.h.a.CollectionsHandler Invoked Collection Action :clusterstatus with params action=CLUSTERSTATUS&wt=json and sendToOCPQueue=true
   [junit4]   2> 3169594 INFO  (qtp1284478078-21368) [n:localhost:54155_solr    ] o.a.s.s.HttpSolrCall [admin] webapp=null path=/admin/collections params={action=CLUSTERSTATUS&wt=json} status=0 QTime=4
   [junit4]   2> 3169595 INFO  (TEST-TestSolrCLIRunExample.testInteractiveSolrCloudExample-seed#[42D092F8EB8D53B4]) [    ] o.a.s.c.c.SolrZkClient Using default ZkCredentialsProvider
   [junit4]   2> 3169596 INFO  (TEST-TestSolrCLIRunExample.testInteractiveSolrCloudExample-seed#[42D092F8EB8D53B4]) [    ] o.a.s.c.c.ConnectionManager Waiting for client to connect to ZooKeeper
   [junit4]   2> 3169597 INFO  (zkCallback-3457-thread-1) [    ] o.a.s.c.c.ConnectionManager Watcher org.apache.solr.common.cloud.ConnectionManager@fc4b316 name:ZooKeeperConnection Watcher:127.0.0.1:54158/solr got event WatchedEvent state:SyncConnected type:None path:null path:null type:None
   [junit4]   2> 3169597 INFO  (TEST-TestSolrCLIRunExample.testInteractiveSolrCloudExample-seed#[42D092F8EB8D53B4]) [    ] o.a.s.c.c.ConnectionManager Client is connected to ZooKeeper
   [junit4]   2> 3169598 INFO  (TEST-TestSolrCLIRunExample.testInteractiveSolrCloudExample-seed#[42D092F8EB8D53B4]) [    ] o.a.s.c.c.SolrZkClient Using default ZkACLProvider
   [junit4]   2> 3169598 INFO  (TEST-TestSolrCLIRunExample.testInteractiveSolrCloudExample-seed#[42D092F8EB8D53B4]) [    ] o.a.s.c.c.ZkStateReader Updating cluster state from ZooKeeper... 
   [junit4]   2> 3169605 INFO  (TEST-TestSolrCLIRunExample.testInteractiveSolrCloudExample-seed#[42D092F8EB8D53B4]) [    ] o.a.s.c.c.SolrZkClient makePath: /configs/testCloudExamplePrompt/currency.xml
   [junit4]   2> 3169612 INFO  (TEST-TestSolrCLIRunExample.testInteractiveSolrCloudExample-seed#[42D092F8EB8D53B4]) [    ] o.a.s.c.c.SolrZkClient makePath: /configs/testCloudExamplePrompt/elevate.xml
   [junit4]   2> 3169616 INFO  (TEST-TestSolrCLIRunExample.testInteractiveSolrCloudExample-seed#[42D092F8EB8D53B4]) [    ] o.a.s.c.c.SolrZkClient makePath: /configs/testCloudExamplePrompt/lang/contractions_ca.txt
   [junit4]   2> 3169621 INFO  (TEST-TestSolrCLIRunExample.testInteractiveSolrCloudExample-seed#[42D092F8EB8D53B4]) [    ] o.a.s.c.c.SolrZkClient makePath: /configs/testCloudExamplePrompt/lang/contractions_fr.txt
   [junit4]   2> 3169626 INFO  (TEST-TestSolrCLIRunExample.testInteractiveSolrCloudExample-seed#[42D092F8EB8D53B4]) [    ] o.a.s.c.c.SolrZkClient makePath: /configs/testCloudExamplePrompt/lang/contractions_ga.txt
   [junit4]   2> 3169631 INFO  (TEST-TestSolrCLIRunExample.testInteractiveSolrCloudExample-seed#[42D092F8EB8D53B4]) [    ] o.a.s.c.c.SolrZkClient makePath: /configs/testCloudExamplePrompt/lang/contractions_it.txt
   [junit4]   2> 3169635 INFO  (TEST-TestSolrCLIRunExample.testInteractiveSolrCloudExample-seed#[42D092F8EB8D53B4]) [    ] o.a.s.c.c.SolrZkClient makePath: /configs/testCloudExamplePrompt/lang/hyphenations_ga.txt
   [junit4]   2> 3169639 INFO  (TEST-TestSolrCLIRunExample.testInteractiveSolrCloudExample-seed#[42D092F8EB8D53B4]) [    ] o.a.s.c.c.SolrZkClient makePath: /configs/testCloudExamplePrompt/lang/stemdict_nl.txt
   [junit4]   2> 3169643 INFO  (TEST-TestSolrCLIRunExample.testInteractiveSolrCloudExample-seed#[42D092F8EB8D53B4]) [    ] o.a.s.c.c.SolrZkClient makePath: /configs/testCloudExamplePrompt/lang/stoptags_ja.txt
   [junit4]   2> 3169647 INFO  (TEST-TestSolrCLIRunExample.testInteractiveSolrCloudExample-seed#[42D092F8EB8D53B4]) [    ] o.a.s.c.c.SolrZkClient makePath: /configs/testCloudExamplePrompt/lang/stopwords_ar.txt
   [junit4]   2> 3169651 INFO  (TEST-TestSolrCLIRunExample.testInteractiveSolrCloudExample-seed#[42D092F8EB8D53B4]) [    ] o.a.s.c.c.SolrZkClient makePath: /configs/testCloudExamplePrompt/lang/stopwords_bg.txt
   [junit4]   2> 3169655 INFO  (TEST-TestSolrCLIRunExample.testInteractiveSolrCloudExample-seed#[42D092F8EB8D53B4]) [    ] o.a.s.c.c.SolrZkClient makePath: /configs/testCloudExamplePrompt/lang/stopwords_ca.txt
   [junit4]   2> 3169659 INFO  (TEST-TestSolrCLIRunExample.testInteractiveSolrCloudExample-seed#[42D092F8EB8D53B4]) [    ] o.a.s.c.c.SolrZkClient makePath: /configs/testCloudExamplePrompt/lang/stopwords_cz.txt
   [junit4]   2> 3169663 INFO  (TEST-TestSolrCLIRunExample.testInteractiveSolrCloudExample-seed#[42D092F8EB8D53B4]) [    ] o.a.s.c.c.SolrZkClient makePath: /configs/testCloudExamplePrompt/lang/stopwords_da.txt
   [junit4]   2> 3169667 INFO  (TEST-TestSolrCLIRunExample.testInteractiveSolrCloudExample-seed#[42D092F8EB8D53B4]) [    ] o.a.s.c.c.SolrZkClient makePath: /configs/testCloudExamplePrompt/lang/stopwords_de.txt
   [junit4]   2> 3169670 INFO  (TEST-TestSolrCLIRunExample.testInteractiveSolrCloudExample-seed#[42D092F8EB8D53B4]) [    ] o.a.s.c.c.SolrZkClient makePath: /configs/testCloudExamplePrompt/lang/stopwords_el.txt
   [junit4]   2> 3169674 INFO  (TEST-TestSolrCLIRunExample.testInteractiveSolrCloudExample-seed#[42D092F8EB8D53B4]) [    ] o.a.s.c.c.SolrZkClient makePath: /configs/testCloudExamplePrompt/lang/stopwords_en.txt
   [junit4]   2> 3169679 INFO  (TEST-TestSolrCLIRunExample.testInteractiveSolrCloudExample-seed#[42D092F8EB8D53B4]) [    ] o.a.s.c.c.SolrZkClient makePath: /configs/testCloudExamplePrompt/lang/stopwords_es.txt
   [junit4]   2> 3169683 INFO  (TEST-TestSolrCLIRunExample.testInteractiveSolrCloudExample-seed#[42D092F8EB8D53B4]) [    ] o.a.s.c.c.SolrZkClient makePath: /configs/testCloudExamplePrompt/lang/stopwords_eu.txt
   [junit4]   2> 3169688 INFO  (TEST-TestSolrCLIRunExample.testInteractiveSolrCloudExample-seed#[42D092F8EB8D53B4]) [    ] o.a.s.c.c.SolrZkClient makePath: /configs/testCloudExamplePrompt/lang/stopwords_fa.txt
   [junit4]   2> 3169692 INFO  (TEST-TestSolrCLIRunExample.testInteractiveSolrCloudExample-seed#[42D092F8EB8D53B4]) [    ] o.a.s.c.c.SolrZkClient makePath: /configs/testCloudExamplePrompt/lang/stopwords_fi.txt
   [junit4]   2> 3169695 INFO  (TEST-TestSolrCLIRunExample.testInteractiveSolrCloudExample-seed#[42D092F8EB8D53B4]) [    ] o.a.s.c.c.SolrZkClient makePath: /configs/testCloudExamplePrompt/lang/stopwords_fr.txt
   [junit4]   2> 3169699 INFO  (TEST-TestSolrCLIRunExample.testInteractiveSolrCloudExample-seed#[42D092F8EB8D53B4]) [    ] o.a.s.c.c.SolrZkClient makePath: /configs/testCloudExamplePrompt/lang/stopwords_ga.txt
   [junit4]   2> 3169703 INFO  (TEST-TestSolrCLIRunExample.testInteractiveSolrCloudExample-seed#[42D092F8EB8D53B4]) [    ] o.a.s.c.c.SolrZkClient makePath: /configs/testCloudExamplePrompt/lang/stopwords_gl.txt
   [junit4]   2> 3169707 INFO  (TEST-TestSolrCLIRunExample.testInteractiveSolrCloudExample-seed#[42D092F8EB8D53B4]) [    ] o.a.s.c.c.SolrZkClient makePath: /configs/testCloudExamplePrompt/lang/stopwords_hi.txt
   [junit4]   2> 3169712 INFO  (TEST-TestSolrCLIRunExample.testInteractiveSolrCloudExample-seed#[42D092F8EB8D53B4]) [    ] o.a.s.c.c.SolrZkClient makePath: /configs/testCloudExamplePrompt/lang/stopwords_hu.txt
   [junit4]   2> 3169716 INFO  (TEST-TestSolrCLIRunExample.testInteractiveSolrCloudExample-seed#[42D092F8EB8D53B4]) [    ] o.a.s.c.c.SolrZkClient makePath: /configs/testCloudExamplePrompt/lang/stopwords_hy.txt
   [junit4]   2> 3169722 INFO  (TEST-TestSolrCLIRunExample.testInteractiveSolrCloudExample-seed#[42D092F8EB8D53B4]) [    ] o.a.s.c.c.SolrZkClient makePath: /configs/testCloudExamplePrompt/lang/stopwords_id.txt
   [junit4]   2> 3169727 INFO  (TEST-TestSolrCLIRunExample.testInteractiveSolrCloudExample-seed#[42D092F8EB8D53B4]) [    ] o.a.s.c.c.SolrZkClient makePath: /configs/testCloudExamplePrompt/lang/stopwords_it.txt
   [junit4]   2> 3169731 INFO  (TEST-TestSolrCLIRunExample.testInteractiveSolrCloudExample-seed#[42D092F8EB8D53B4]) [    ] o.a.s.c.c.SolrZkClient makePath: /configs/testCloudExamplePrompt/lang/stopwords_ja.txt
   [junit4]   2> 3169735 INFO  (TEST-TestSolrCLIRunExample.testInteractiveSolrCloudExample-seed#[42D092F8EB8D53B4]) [    ] o.a.s.c.c.SolrZkClient makePath: /configs/testCloudExamplePrompt/lang/stopwords_lv.txt
   [junit4]   2> 3169740 INFO  (TEST-TestSolrCLIRunExample.testInteractiveSolrCloudExample-seed#[42D092F8EB8D53B4]) [    ] o.a.s.c.c.SolrZkClient makePath: /configs/testCloudExamplePrompt/lang/stopwords_nl.txt
   [junit4]   2> 3169745 INFO  (TEST-TestSolrCLIRunExample.testInteractiveSolrCloudExample-seed#[42D092F8EB8D53B4]) [    ] o.a.s.c.c.SolrZkClient makePath: /configs/testCloudExamplePrompt/lang/stopwords_no.txt
   [junit4]   2> 3169750 INFO  (TEST-TestSolrCLIRunExample.testInteractiveSolrCloudExample-seed#[42D092F8EB8D53B4]) [    ] o.a.s.c.c.SolrZkClient makePath: /configs/testCloudExamplePrompt/lang/stopwords_pt.txt
   [junit4]   2> 3169755 INFO  (TEST-TestSolrCLIRunExample.testInteractiveSolrCloudExample-seed#[42D092F8EB8D53B4]) [    ] o.a.s.c.c.SolrZkClient makePath: /configs/testCloudExamplePrompt/lang/stopwords_ro.txt
   [junit4]   2> 3169760 INFO  (TEST-TestSolrCLIRunExample.testInteractiveSolrCloudExample-seed#[42D092F8EB8D53B4]) [    ] o.a.s.c.c.SolrZkClient makePath: /configs/testCloudExamplePrompt/lang/stopwords_ru.txt
   [junit4]   2> 3169765 INFO  (TEST-TestSolrCLIRunExample.testInteractiveSolrCloudExample-seed#[42D092F8EB8D53B4]) [    ] o.a.s.c.c.SolrZkClient makePath: /configs/testCloudExamplePrompt/lang/stopwords_sv.txt
   [junit4]   2> 3169770 INFO  (TEST-TestSolrCLIRunExample.testInteractiveSolrCloudExample-seed#[42D092F8EB8D53B4]) [    ] o.a.s.c.c.SolrZkClient makePath: /configs/testCloudExamplePrompt/lang/stopwords_th.txt
   [junit4]   2> 3169775 INFO  (TEST-TestSolrCLIRunExample.testInteractiveSolrCloudExample-seed#[42D092F8EB8D53B4]) [    ] o.a.s.c.c.SolrZkClient makePath: /configs/testCloudExamplePrompt/lang/stopwords_tr.txt
   [junit4]   2> 3169778 INFO  (TEST-TestSolrCLIRunExample.testInteractiveSolrCloudExample-seed#[42D092F8EB8D53B4]) [    ] o.a.s.c.c.SolrZkClient makePath: /configs/testCloudExamplePrompt/lang/userdict_ja.txt
   [junit4]   2> 3169783 INFO  (TEST-TestSolrCLIRunExample.testInteractiveSolrCloudExample-seed#[42D092F8EB8D53B4]) [    ] o.a.s.c.c.SolrZkClient makePath: /configs/testCloudExamplePrompt/managed-schema
   [junit4]   2> 3169786 INFO  (TEST-TestSolrCLIRunExample.testInteractiveSolrCloudExample-seed#[42D092F8EB8D53B4]) [    ] o.a.s.c.c.SolrZkClient makePath: /configs/testCloudExamplePrompt/params.json
   [junit4]   2> 3169790 INFO  (TEST-TestSolrCLIRunExample.testInteractiveSolrCloudExample-seed#[42D092F8EB8D53B4]) [    ] o.a.s.c.c.SolrZkClient makePath: /configs/testCloudExamplePrompt/protwords.txt
   [junit4]   2> 3169794 INFO  (TEST-TestSolrCLIRunExample.testInteractiveSolrCloudExample-seed#[42D092F8EB8D53B4]) [    ] o.a.s.c.c.SolrZkClient makePath: /configs/testCloudExamplePrompt/solrconfig.xml
   [junit4]   2> 3169798 INFO  (TEST-TestSolrCLIRunExample.testInteractiveSolrCloudExample-seed#[42D092F8EB8D53B4]) [    ] o.a.s.c.c.SolrZkClient makePath: /configs/testCloudExamplePrompt/stopwords.txt
   [junit4]   2> 3169802 INFO  (TEST-TestSolrCLIRunExample.testInteractiveSolrCloudExample-seed#[42D092F8EB8D53B4]) [    ] o.a.s.c.c.SolrZkClient makePath: /configs/testCloudExamplePrompt/synonyms.txt
   [junit4]   2> 3169808 INFO  (qtp1284478078-21362) [n:localhost:54155_solr    ] o.a.s.h.a.CollectionsHandler Invoked Collection Action :list with params action=list&wt=json and sendToOCPQueue=true
   [junit4]   2> 3169808 INFO  (qtp1284478078-21362) [n:localhost:54155_solr    ] o.a.s.s.HttpSolrCall [admin] webapp=null path=/admin/collections params={action=list&wt=json} status=0 QTime=0
   [junit4]   2> 3169810 INFO  (qtp1284478078-21368) [n:localhost:54155_solr    ] o.a.s.h.a.CollectionsHandler Invoked Collection Action :create with params replicationFactor=2&maxShardsPerNode=4&collection.configName=testCloudExamplePrompt&name=testCloudExamplePrompt&action=CREATE&numShards=2&wt=json and sendToOCPQueue=true
   [junit4]   2> 3169816 INFO  (OverseerCollectionConfigSetProcessor-95403736227708931-localhost:54155_solr-n_0000000000) [n:localhost:54155_solr    ] o.a.s.c.OverseerTaskProcessor Overseer Collection Message Handler: Get the message id:/overseer/collection-queue-work/qn-0000000000 message:{
   [junit4]   2>   "name":"testCloudExamplePrompt",
   [junit4]   2>   "fromApi":"true",
   [junit4]   2>   "replicationFactor":"2",
   [junit4]   2>   "collection.configName":"testCloudExamplePrompt",
   [junit4]   2>   "numShards":"2",
   [junit4]   2>   "maxShardsPerNode":"4",
   [junit4]   2>   "stateFormat":"2",
   [junit4]   2>   "operation":"create"}
   [junit4]   2> 3169817 INFO  (OverseerThreadFactory-9607-thread-1-processing-n:localhost:54155_solr) [n:localhost:54155_solr    ] o.a.s.c.OverseerCollectionMessageHandler OverseerCollectionMessageHandler.processMessage : create , {
   [junit4]   2>   "name":"testCloudExamplePrompt",
   [junit4]   2>   "fromApi":"true",
   [junit4]   2>   "replicationFactor":"2",
   [junit4]   2>   "collection.configName":"testCloudExamplePrompt",
   [junit4]   2>   "numShards":"2",
   [junit4]   2>   "maxShardsPerNode":"4",
   [junit4]   2>   "stateFormat":"2",
   [junit4]   2>   "operation":"create"}
   [junit4]   2> 3169819 INFO  (OverseerThreadFactory-9607-thread-1-processing-n:localhost:54155_solr) [n:localhost:54155_solr    ] o.a.s.c.OverseerCollectionMessageHandler Create collection testCloudExamplePrompt
   [junit4]   2> 3169820 WARN  (OverseerThreadFactory-9607-thread-1-processing-n:localhost:54155_solr) [n:localhost:54155_solr    ] o.a.s.c.OverseerCollectionMessageHandler Specified replicationFactor of 2 on collection testCloudExamplePrompt is higher than or equal to the number of Solr instances currently live or live and part of your createNodeSet(1). It's unusual to run two replica of the same slice on the same Solr-instance.
   [junit4]   2> 3169821 INFO  (OverseerThreadFactory-9607-thread-1-processing-n:localhost:54155_solr) [n:localhost:54155_solr    ] o.a.s.c.OverseerCollectionMessageHandler creating collections conf node /collections/testCloudExamplePrompt 
   [junit4]   2> 3169823 INFO  (OverseerThreadFactory-9607-thread-1-processing-n:localhost:54155_solr) [n:localhost:54155_solr    ] o.a.s.c.c.SolrZkClient makePath: /collections/testCloudExamplePrompt
   [junit4]   2> 3169825 INFO  (zkCallback-3457-thread-1) [    ] o.a.s.c.c.ZkStateReader A collections change: [WatchedEvent state:SyncConnected type:NodeChildrenChanged path:/collections], has occurred - updating...
   [junit4]   2> 3169825 INFO  (zkCallback-3451-thread-1-processing-n:localhost:54155_solr) [n:localhost:54155_solr    ] o.a.s.c.c.ZkStateReader A collections change: [WatchedEvent state:SyncConnected type:NodeChildrenChanged path:/collections], has occurred - updating...
   [junit4]   2> 3169830 INFO  (OverseerStateUpdate-95403736227708931-localhost:54155_solr-n_0000000000) [n:localhost:54155_solr    ] o.a.s.c.Overseer processMessage: queueSize: 1, message = {
   [junit4]   2>   "name":"testCloudExamplePrompt",
   [junit4]   2>   "fromApi":"true",
   [junit4]   2>   "replicationFactor":"2",
   [junit4]   2>   "collection.configName":"testCloudExamplePrompt",
   [junit4]   2>   "numShards":"2",
   [junit4]   2>   "maxShardsPerNode":"4",
   [junit4]   2>   "stateFormat":"2",
   [junit4]   2>   "operation":"create"} current state version: 0
   [junit4]   2> 3169830 INFO  (OverseerStateUpdate-95403736227708931-localhost:54155_solr-n_0000000000) [n:localhost:54155_solr    ] o.a.s.c.o.ClusterStateMutator building a new cName: testCloudExamplePrompt
   [junit4]   2> 3169832 INFO  (OverseerStateUpdate-95403736227708931-localhost:54155_solr-n_0000000000) [n:localhost:54155_solr    ] o.a.s.c.o.ZkStateWriter going to create_collection /collections/testCloudExamplePrompt/state.json
   [junit4]   2> 3169930 INFO  (OverseerThreadFactory-9607-thread-1-processing-n:localhost:54155_solr) [n:localhost:54155_solr    ] o.a.s.c.OverseerCollectionMessageHandler Creating SolrCores for new collection testCloudExamplePrompt, shardNames [shard1, shard2] , replicationFactor : 2
   [junit4]   2> 3169931 INFO  (OverseerThreadFactory-9607-thread-1-processing-n:localhost:54155_solr) [n:localhost:54155_solr    ] o.a.s.c.OverseerCollectionMessageHandler Creating core testCloudExamplePrompt_shard1_replica1 as part of shard shard1 of collection testCloudExamplePrompt on localhost:54155_solr
   [junit4]   2> 3169932 INFO  (OverseerThreadFactory-9607-thread-1-processing-n:localhost:54155_solr) [n:localhost:54155_solr    ] o.a.s.c.OverseerCollectionMessageHandler Creating core testCloudExamplePrompt_shard1_replica2 as part of shard shard1 of collection testCloudExamplePrompt on localhost:54155_solr
   [junit4]   2> 3169933 INFO  (OverseerThreadFactory-9607-thread-1-processing-n:localhost:54155_solr) [n:localhost:54155_solr    ] o.a.s.c.OverseerCollectionMessageHandler Creating core testCloudExamplePrompt_shard2_replica2 as part of shard shard2 of collection testCloudExamplePrompt on localhost:54155_solr
   [junit4]   2> 3169934 INFO  (qtp1284478078-21367) [n:localhost:54155_solr    ] o.a.s.h.a.CoreAdminOperation core create command qt=/admin/cores&collection.configName=testCloudExamplePrompt&name=testCloudExamplePrompt_shard1_replica1&action=CREATE&numShards=2&collection=testCloudExamplePrompt&shard=shard1&wt=javabin&version=2
   [junit4]   2> 3169935 INFO  (qtp1284478078-21362) [n:localhost:54155_solr    ] o.a.s.h.a.CoreAdminOperation core create command qt=/admin/cores&collection.configName=testCloudExamplePrompt&name=testCloudExamplePrompt_shard1_replica2&action=CREATE&numShards=2&collection=testCloudExamplePrompt&shard=shard1&wt=javabin&version=2
   [junit4]   2> 3169935 INFO  (qtp1284478078-21367) [n:localhost:54155_solr    ] o.a.s.c.CoreDescriptor Created CoreDescriptor: {name=testCloudExamplePrompt_shard1_replica1, collection.configName=testCloudExamplePrompt, config=solrconfig.xml, transient=false, schema=schema.xml, loadOnStartup=true, configSetProperties=configsetprops.json, collection=testCloudExamplePrompt, numShards=2, dataDir=data/, shard=shard1}
   [junit4]   2> 3169935 INFO  (OverseerThreadFactory-9607-thread-1-processing-n:localhost:54155_solr) [n:localhost:54155_solr    ] o.a.s.c.OverseerCollectionMessageHandler Creating core testCloudExamplePrompt_shard2_replica1 as part of shard shard2 of collection testCloudExamplePrompt on localhost:54155_solr
   [junit4]   2> 3169935 INFO  (qtp1284478078-21362) [n:localhost:54155_solr    ] o.a.s.c.CoreDescriptor Created CoreDescriptor: {name=testCloudExamplePrompt_shard1_replica2, collection.configName=testCloudExamplePrompt, config=solrconfig.xml, transient=false, schema=schema.xml, loadOnStartup=true, configSetProperties=configsetprops.json, collection=testCloudExamplePrompt, numShards=2, dataDir=data/, shard=shard1}
   [junit4]   2> 3169936 INFO  (qtp1284478078-21365) [n:localhost:54155_solr    ] o.a.s.h.a.CoreAdminOperation core create command qt=/admin/cores&collection.configName=testCloudExamplePrompt&name=testCloudExamplePrompt_shard2_replica2&action=CREATE&numShards=2&collection=testCloudExamplePrompt&shard=shard2&wt=javabin&version=2
   [junit4]   2> 3169937 INFO  (qtp1284478078-21365) [n:localhost:54155_solr    ] o.a.s.c.CoreDescriptor Created CoreDescriptor: {name=testCloudExamplePrompt_shard2_replica2, collection.configName=testCloudExamplePrompt, config=solrconfig.xml, transient=false, schema=schema.xml, loadOnStartup=true, configSetProperties=configsetprops.json, collection=testCloudExamplePrompt, numShards=2, dataDir=data/, shard=shard2}
   [junit4]   2> 3169938 INFO  (qtp1284478078-21364) [n:localhost:54155_solr    ] o.a.s.h.a.CoreAdminOperation core create command qt=/admin/cores&collection.configName=testCloudExamplePrompt&name=testCloudExamplePrompt_shard2_replica1&action=CREATE&numShards=2&collection=testCloudExamplePrompt&shard=shard2&wt=javabin&version=2
   [junit4]   2> 3169939 INFO  (qtp1284478078-21364) [n:localhost:54155_solr    ] o.a.s.c.CoreDescriptor Created CoreDescriptor: {name=testCloudExamplePrompt_shard2_replica1, collection.configName=testCloudExamplePrompt, config=solrconfig.xml, transient=false, schema=schema.xml, loadOnStartup=true, configSetProperties=configsetprops.json, collection=testCloudExamplePrompt, numShards=2, dataDir=data/, shard=shard2}
   [junit4]   2> 3169940 INFO  (qtp1284478078-21362) [n:localhost:54155_solr c:testCloudExamplePrompt s:shard1  x:testCloudExamplePrompt_shard1_replica2] o.a.s.c.ZkController publishing state=down
   [junit4]   2> 3169941 INFO  (qtp1284478078-21365) [n:localhost:54155_solr c:testCloudExamplePrompt s:shard2  x:testCloudExamplePrompt_shard2_replica2] o.a.s.c.ZkController publishing state=down
   [junit4]   2> 3169941 INFO  (qtp1284478078-21367) [n:localhost:54155_solr c:testCloudExamplePrompt s:shard1  x:testCloudExamplePrompt_shard1_replica1] o.a.s.c.ZkController publishing state=down
   [junit4]   2> 3169944 INFO  (qtp1284478078-21364) [n:localhost:54155_solr c:testCloudExamplePrompt s:shard2  x:testCloudExamplePrompt_shard2_replica1] o.a.s.c.ZkController publishing state=down
   [junit4]   2> 3169944 INFO  (qtp1284478078-21362) [n:localhost:54155_solr c:testCloudExamplePrompt s:shard1  x:testCloudExamplePrompt_shard1_replica2] o.a.s.c.ZkController Registering watch for collection testCloudExamplePrompt
   [junit4]   2> 3169945 INFO  (qtp1284478078-21362) [n:localhost:54155_solr c:testCloudExamplePrompt s:shard1  x:testCloudExamplePrompt_shard1_replica2] o.a.s.c.c.ZkStateReader addZkWatch [testCloudExamplePrompt]
   [junit4]   2> 3169945 INFO  (qtp1284478078-21367) [n:localhost:54155_solr c:testCloudExamplePrompt s:shard1  x:testCloudExamplePrompt_shard1_replica1] o.a.s.c.ZkController Registering watch for collection testCloudExamplePrompt
   [junit4]   2> 3169946 INFO  (qtp1284478078-21367) [n:localhost:54155_solr c:testCloudExamplePrompt s:shard1  x:testCloudExamplePrompt_shard1_replica1] o.a.s.c.ZkController look for our core node name
   [junit4]   2> 3169946 INFO  (qtp1284478078-21365) [n:localhost:54155_solr c:testCloudExamplePrompt s:shard2  x:testCloudExamplePrompt_shard2_replica2] o.a.s.c.ZkController Registering watch for collection testCloudExamplePrompt
   [junit4]   2> 3169946 INFO  (qtp1284478078-21365) [n:localhost:54155_solr c:testCloudExamplePrompt s:shard2  x:testCloudExamplePrompt_shard2_replica2] o.a.s.c.ZkController look for our core node name
   [junit4]   2> 3169946 INFO  (qtp1284478078-21362) [n:localhost:54155_solr c:testCloudExamplePrompt s:shard1  x:testCloudExamplePrompt_shard1_replica2] o.a.s.c.c.ZkStateReader Add data for [testCloudExamplePrompt] ver [0]
   [junit4]   2> 3169946 INFO  (qtp1284478078-21362) [n:localhost:54155_solr c:testCloudExamplePrompt s:shard1  x:testCloudExamplePrompt_shard1_replica2] o.a.s.c.ZkController look for our core node name
   [junit4]   2> 3169946 INFO  (OverseerStateUpdate-95403736227708931-localhost:54155_solr-n_0000000000) [n:localhost:54155_solr    ] o.a.s.c.Overseer processMessage: queueSize: 3, message = {
   [junit4]   2>   "core":"testCloudExamplePrompt_shard1_replica2",
   [junit4]   2>   "roles":null,
   [junit4]   2>   "base_url":"http://localhost:54155/solr",
   [junit4]   2>   "node_name":"localhost:54155_solr",
   [junit4]   2>   "numShards":"2",
   [junit4]   2>   "state":"down",
   [junit4]   2>   "shard":"shard1",
   [junit4]   2>   "collection":"testCloudExamplePrompt",
   [junit4]   2>   "operation":"state"} current state version: 0
   [junit4]   2> 3169947 INFO  (qtp1284478078-21364) [n:localhost:54155_solr c:testCloudExamplePrompt s:shard2  x:testCloudExamplePrompt_shard2_replica1] o.a.s.c.ZkController Registering watch for collection testCloudExamplePrompt
   [junit4]   2> 3169947 INFO  (qtp1284478078-21364) [n:localhost:54155_solr c:testCloudExamplePrompt s:shard2  x:testCloudExamplePrompt_shard2_replica1] o.a.s.c.ZkController look for our core node name
   [junit4]   2> 3169947 INFO  (OverseerStateUpdate-95403736227708931-localhost:54155_solr-n_0000000000) [n:localhost:54155_solr    ] o.a.s.c.o.ReplicaMutator Update state numShards=2 message={
   [junit4]   2>   "core":"testCloudExamplePrompt_shard1_replica2",
   [junit4]   2>   "roles":null,
   [junit4]   2>   "base_url":"http://localhost:54155/solr",
   [junit4]   2>   "node_name":"localhost:54155_solr",
   [junit4]   2>   "numShards":"2",
   [junit4]   2>   "state":"down",
   [junit4]   2>   "shard":"shard1",
   [junit4]   2>   "collection":"testCloudExamplePrompt",
   [junit4]   2>   "operation":"state"}
   [junit4]   2> 3169951 INFO  (OverseerStateUpdate-95403736227708931-localhost:54155_solr-n_0000000000) [n:localhost:54155_solr    ] o.a.s.c.Overseer processMessage: queueSize: 3, message = {
   [junit4]   2>   "core":"testCloudExamplePrompt_shard2_replica2",
   [junit4]   2>   "roles":null,
   [junit4]   2>   "base_url":"http://localhost:54155/solr",
   [junit4]   2>   "node_name":"localhost:54155_solr",
   [junit4]   2>   "numShards":"2",
   [junit4]   2>   "state":"down",
   [junit4]   2>   "shard":"shard2",
   [junit4]   2>   "collection":"testCloudExamplePrompt",
   [junit4]   2>   "operation":"state"} current state version: 0
   [junit4]   2> 3169952 INFO  (OverseerStateUpdate-95403736227708931-localhost:54155_solr-n_0000000000) [n:localhost:54155_solr    ] o.a.s.c.o.ReplicaMutator Update state numShards=2 message={
   [junit4]   2>   "core":"testCloudExamplePrompt_shard2_replica2",
   [junit4]   2>   "roles":null,
   [junit4]   2>   "base_url":"http://localhost:54155/solr",
   [junit4]   2>   "node_name":"localhost:54155_solr",
   [junit4]   2>   "numShards":"2",
   [junit4]   2>   "state":"down",
   [junit4]   2>   "shard":"shard2",
   [junit4]   2>   "collection":"testCloudExamplePrompt",
   [junit4]   2>   "operation":"state"}
   [junit4]   2> 3169956 INFO  (OverseerStateUpdate-95403736227708931-localhost:54155_solr-n_0000000000) [n:localhost:54155_solr    ] o.a.s.c.Overseer processMessage: queueSize: 3, message = {
   [junit4]   2>   "core":"testCloudExamplePrompt_shard1_replica1",
   [junit4]   2>   "roles":null,
   [junit4]   2>   "base_url":"http://localhost:54155/solr",
   [junit4]   2>   "node_name":"localhost:54155_solr",
   [junit4]   2>   "numShards":"2",
   [junit4]   2>   "state":"down",
   [junit4]   2>   "shard":"shard1",
   [junit4]   2>   "collection":"testCloudExamplePrompt",
   [junit4]   2>   "operation":"state"} current state version: 0
   [junit4]   2> 3169957 INFO  (OverseerStateUpdate-95403736227708931-localhost:54155_solr-n_0000000000) [n:localhost:54155_solr    ] o.a.s.c.o.ReplicaMutator Update state numShards=2 message={
   [junit4]   2>   "core":"testCloudExamplePrompt_shard1_replica1",
   [junit4]   2>   "roles":null,
   [junit4]   2>   "base_url":"http://localhost:54155/solr",
   [junit4]   2>   "node_name":"localhost:54155_solr",
   [junit4]   2>   "numShards":"2",
   [junit4]   2>   "state":"down",
   [junit4]   2>   "shard":"shard1",
   [junit4]   2>   "collection":"testCloudExamplePrompt",
   [junit4]   2>   "operation":"state"}
   [junit4]   2> 3169961 INFO  (OverseerStateUpdate-95403736227708931-localhost:54155_solr-n_0000000000) [n:localhost:54155_solr    ] o.a.s.c.Overseer processMessage: queueSize: 1, message = {
   [junit4]   2>   "core":"testCloudExamplePrompt_shard2_replica1",
   [junit4]   2>   "roles":null,
   [junit4]   2>   "base_url":"http://localhost:54155/solr",
   [junit4]   2>   "node_name":"localhost:54155_solr",
   [junit4]   2>   "numShards":"2",
   [junit4]   2>   "state":"down",
   [junit4]   2>   "shard":"shard2",
   [junit4]   2>   "collection":"testCloudExamplePrompt",
   [junit4]   2>   "operation":"state"} current state version: 0
   [junit4]   2> 3169962 INFO  (OverseerStateUpdate-95403736227708931-localhost:54155_solr-n_0000000000) [n:localhost:54155_solr    ] o.a.s.c.o.ReplicaMutator Update state numShards=2 message={
   [junit4]   2>   "core":"testCloudExamplePrompt_shard2_replica1",
   [junit4]   2>   "roles":null,
   [junit4]   2>   "base_url":"http://localhost:54155/solr",
   [junit4]   2>   "node_name":"localhost:54155_solr",
   [junit4]   2>   "numShards":"2",
   [junit4]   2>   "state":"down",
   [junit4]   2>   "shard":"shard2",
   [junit4]   2>   "collection":"testCloudExamplePrompt",
   [junit4]   2>   "operation":"state"}
   [junit4]   2> 3170067 INFO  (OverseerStateUpdate-95403736227708931-localhost:54155_solr-n_0000000000) [n:localhost:54155_solr    ] o.a.s.c.o.ZkStateWriter going to update_collection /collections/testCloudExamplePrompt/state.json version: 0
   [junit4]   2> 3170068 INFO  (zkCallback-3451-thread-1-processing-n:localhost:54155_solr) [n:localhost:54155_solr    ] o.a.s.c.c.ZkStateReader A cluster state change: [WatchedEvent state:SyncConnected type:NodeDataChanged path:/collections/testCloudExamplePrompt/state.json] for collection [testCloudExamplePrompt] has occurred - updating... (live nodes size: [1])
   [junit4]   2> 3170069 INFO  (zkCallback-3451-thread-1-processing-n:localhost:54155_solr) [n:localhost:54155_solr    ] o.a.s.c.c.ZkStateReader Updating data for [testCloudExamplePrompt] from [0] to [1]
   [junit4]   2> 3170947 INFO  (qtp1284478078-21365) [n:localhost:54155_solr c:testCloudExamplePrompt s:shard2  x:testCloudExamplePrompt_shard2_replica2] o.a.s.c.ZkController waiting to find shard id in clusterstate for testCloudExamplePrompt_shard2_replica2
   [junit4]   2> 3170947 INFO  (qtp1284478078-21362) [n:localhost:54155_solr c:testCloudExamplePrompt s:shard1  x:testCloudExamplePrompt_shard1_replica2] o.a.s.c.ZkController waiting to find shard id in clusterstate for testCloudExamplePrompt_shard1_replica2
   [junit4]   2> 3170948 INFO  (qtp1284478078-21362) [n:localhost:54155_solr c:testCloudExamplePrompt s:shard1  x:testCloudExamplePrompt_shard1_replica2] o.a.s.c.ZkController Check for collection zkNode:testCloudExamplePrompt
   [junit4]   2> 3170948 INFO  (qtp1284478078-21365) [n:localhost:54155_solr c:testCloudExamplePrompt s:shard2  x:testCloudExamplePrompt_shard2_replica2] o.a.s.c.ZkController Check for collection zkNode:testCloudExamplePrompt
   [junit4]   2> 3170948 INFO  (qtp1284478078-21367) [n:localhost:54155_solr c:testCloudExamplePrompt s:shard1  x:testCloudExamplePrompt_shard1_replica1] o.a.s.c.ZkController waiting to find shard id in clusterstate for testCloudExamplePrompt_shard1_replica1
   [junit4]   2> 3170948 INFO  (qtp1284478078-21367) [n:localhost:54155_solr c:testCloudExamplePrompt s:shard1  x:testCloudExamplePrompt_shard1_replica1] o.a.s.c.ZkController Check for collection zkNode:testCloudExamplePrompt
   [junit4]   2> 3170948 INFO  (qtp1284478078-21364) [n:localhost:54155_solr c:testCloudExamplePrompt s:shard2  x:testCloudExamplePrompt_shard2_replica1] o.a.s.c.ZkController waiting to find shard id in clusterstate for testCloudExamplePrompt_shard2_replica1
   [junit4]   2> 3170948 INFO  (qtp1284478078-21364) [n:localhost:54155_solr c:testCloudExamplePrompt s:shard2  x:testCloudExamplePrompt_shard2_replica1] o.a.s.c.ZkController Check for collection zkNode:testCloudExamplePrompt
   [junit4]   2> 3170949 INFO  (qtp1284478078-21365) [n:localhost:54155_solr c:testCloudExamplePrompt s:shard2  x:testCloudExamplePrompt_shard2_replica2] o.a.s.c.ZkController Collection zkNode exists
   [junit4]   2> 3170949 INFO  (qtp1284478078-21365) [n:localhost:54155_solr c:testCloudExamplePrompt s:shard2  x:testCloudExamplePrompt_shard2_replica2] o.a.s.c.c.ZkStateReader Load collection config from: [/collections/testCloudExamplePrompt]
   [junit4]   2> 3170949 INFO  (qtp1284478078-21367) [n:localhost:54155_solr c:testCloudExamplePrompt s:shard1  x:testCloudExamplePrompt_shard1_replica1] o.a.s.c.ZkController Collection zkNode exists
   [junit4]   2> 3170949 INFO  (qtp1284478078-21367) [n:localhost:54155_solr c:testCloudExamplePrompt s:shard1  x:testCloudExamplePrompt_shard1_replica1] o.a.s.c.c.ZkStateReader Load collection config from: [/collections/testCloudExamplePrompt]
   [junit4]   2> 3170949 INFO  (qtp1284478078-21362) [n:localhost:54155_solr c:testCloudExamplePrompt s:shard1  x:testCloudExamplePrompt_shard1_replica2] o.a.s.c.ZkController Collection zkNode exists
   [junit4]   2> 3170949 INFO  (qtp1284478078-21362) [n:localhost:54155_solr c:testCloudExamplePrompt s:shard1  x:testCloudExamplePrompt_shard1_replica2] o.a.s.c.c.ZkStateReader Load collection config from: [/collections/testCloudExamplePrompt]
   [junit4]   2> 3170949 INFO  (qtp1284478078-21364) [n:localhost:54155_solr c:testCloudExamplePrompt s:shard2  x:testCloudExamplePrompt_shard2_replica1] o.a.s.c.ZkController Collection zkNode exists
   [junit4]   2> 3170949 INFO  (qtp1284478078-21364) [n:localhost:54155_solr c:testCloudExamplePrompt s:shard2  x:testCloudExamplePrompt_shard2_replica1] o.a.s.c.c.ZkStateReader Load collection config from: [/collections/testCloudExamplePrompt]
   [junit4]   2> 3170951 INFO  (qtp1284478078-21365) [n:localhost:54155_solr c:testCloudExamplePrompt s:shard2  x:testCloudExamplePrompt_shard2_replica2] o.a.s.c.c.ZkStateReader path=[/collections/testCloudExamplePrompt] [configName]=[testCloudExamplePrompt] specified config exists in ZooKeeper
   [junit4]   2> 3170951 INFO  (qtp1284478078-21365) [n:localhost:54155_solr c:testCloudExamplePrompt s:shard2  x:testCloudExamplePrompt_shard2_replica2] o.a.s.c.SolrResourceLoader new SolrResourceLoader for directory: '/Users/jenkins/workspace/Lucene-Solr-trunk-MacOSX/solr/build/solr-core/test/J0/temp/solr.util.TestSolrCLIRunExample_42D092F8EB8D53B4-001/tempDir-003/node1/testCloudExamplePrompt_shard2_replica2'
   [junit4]   2> 3170952 INFO  (qtp1284478078-21364) [n:localhost:54155_solr c:testCloudExamplePrompt s:shard2  x:testCloudExamplePrompt_shard2_replica1] o.a.s.c.c.ZkStateReader path=[/collections/testCloudExamplePrompt] [configName]=[testCloudExamplePrompt] specified config exists in ZooKeeper
   [junit4]   2> 3170951 INFO  (qtp1284478078-21367) [n:localhost:54155_solr c:testCloudExamplePrompt s:shard1  x:testCloudExamplePrompt_shard1_replica1] o.a.s.c.c.ZkStateReader path=[/collections/testCloudExamplePrompt] [configName]=[testCloudExamplePrompt] specified config exists in ZooKeeper
   [junit4]   2> 3170952 INFO  (qtp1284478078-21364) [n:localhost:54155_solr c:testCloudExamplePrompt s:shard2  x:testCloudExamplePrompt_shard2_replica1] o.a.s.c.SolrResourceLoader new SolrResourceLoader for directory: '/Users/jenkins/workspace/Lucene-Solr-trunk-MacOSX/solr/build/solr-core/test/J0/temp/solr.util.TestSolrCLIRunExample_42D092F8EB8D53B4-001/tempDir-003/node1/testCloudExamplePrompt_shard2_replica1'
   [junit4]   2> 3170952 INFO  (qtp1284478078-21365) [n:localhost:54155_solr c:testCloudExamplePrompt s:shard2  x:testCloudExamplePrompt_shard2_replica2] o.a.s.c.SolrResourceLoader JNDI not configured for solr (NoInitialContextEx)
   [junit4]   2> 3170952 INFO  (qtp1284478078-21364) [n:localhost:54155_solr c:testCloudExamplePrompt s:shard2  x:testCloudExamplePrompt_shard2_replica1] o.a.s.c.SolrResourceLoader JNDI not configured for solr (NoInitialContextEx)
   [junit4]   2> 3170952 INFO  (qtp1284478078-21365) [n:localhost:54155_solr c:testCloudExamplePrompt s:shard2  x:testCloudExamplePrompt_shard2_replica2] o.a.s.c.SolrResourceLoader solr home defaulted to 'solr/' (could not find system property or JNDI)
   [junit4]   2> 3170952 INFO  (qtp1284478078-21364) [n:localhost:54155_solr c:testCloudExamplePrompt s:shard2  x:testCloudExamplePrompt_shard2_replica1] o.a.s.c.SolrResourceLoader solr home defaulted to 'solr/' (could not find system property or JNDI)
   [junit4]   2> 3170952 INFO  (qtp1284478078-21367) [n:localhost:54155_solr c:testCloudExamplePrompt s:shard1  x:testCloudExamplePrompt_shard1_replica1] o.a.s.c.SolrResourceLoader new SolrResourceLoader for directory: '/Users/jenkins/workspace/Lucene-Solr-trunk-MacOSX/solr/build/solr-core/test/J0/temp/solr.util.TestSolrCLIRunExample_42D092F8EB8D53B4-001/tempDir-003/node1/testCloudExamplePrompt_shard1_replica1'
   [junit4]   2> 3170953 INFO  (qtp1284478078-21367) [n:localhost:54155_solr c:testCloudExamplePrompt s:shard1  x:testCloudExamplePrompt_shard1_replica1] o.a.s.c.SolrResourceLoader JNDI not configured for solr (NoInitialContextEx)
   [junit4]   2> 3170953 INFO  (qtp1284478078-21367) [n:localhost:54155_solr c:testCloudExamplePrompt s:shard1  x:testCloudExamplePrompt_shard1_replica1] o.a.s.c.SolrResourceLoader solr home defaulted to 'solr/' (could not find system property or JNDI)
   [junit4]   2> 3170955 INFO  (qtp1284478078-21362) [n:localhost:54155_solr c:testCloudExamplePrompt s:shard1  x:testCloudExamplePrompt_shard1_replica2] o.a.s.c.c.ZkStateReader path=[/collections/testCloudExamplePrompt] [configName]=[testCloudExamplePrompt] specified config exists in ZooKeeper
   [junit4]   2> 3170955 INFO  (qtp1284478078-21362) [n:localhost:54155_solr c:testCloudExamplePrompt s:shard1  x:testCloudExamplePrompt_shard1_replica2] o.a.s.c.SolrResourceLoader new SolrResourceLoader for directory: '/Users/jenkins/workspace/Lucene-Solr-trunk-MacOSX/solr/build/solr-core/test/J0/temp/solr.util.TestSolrCLIRunExample_42D092F8EB8D53B4-001/tempDir-003/node1/testCloudExamplePrompt_shard1_replica2'
   [junit4]   2> 3170956 INFO  (qtp1284478078-21362) [n:localhost:54155_solr c:testCloudExamplePrompt s:shard1  x:testCloudExamplePrompt_shard1_replica2] o.a.s.c.SolrResourceLoader JNDI not configured for solr (NoInitialContextEx)
   [junit4]   2> 3170956 INFO  (qtp1284478078-21362) [n:localhost:54155_solr c:testCloudExamplePrompt s:shard1  x:testCloudExamplePrompt_shard1_replica2] o.a.s.c.SolrResourceLoader solr home defaulted to 'solr/' (could not find system property or JNDI)
   [junit4]   2> 3170957 INFO  (qtp1284478078-21365) [n:localhost:54155_solr c:testCloudExamplePrompt s:shard2  x:testCloudExamplePrompt_shard2_replica2] o.a.s.c.Config loaded config solrconfig.xml with version 0 
   [junit4]   2> 3170957 INFO  (qtp1284478078-21367) [n:localhost:54155_solr c:testCloudExamplePrompt s:shard1  x:testCloudExamplePrompt_shard1_replica1]

[...truncated too long message...]

IRunExample.testInteractiveSolrCloudExample <<<
   [junit4]    > Throwable #1: org.apache.solr.common.SolrException: Could not find a healthy node to handle the request.
   [junit4]    > 	at __randomizedtesting.SeedInfo.seed([42D092F8EB8D53B4:99A17232DCF896D2]:0)
   [junit4]    > 	at org.apache.solr.client.solrj.impl.CloudSolrClient.sendRequest(CloudSolrClient.java:1084)
   [junit4]    > 	at org.apache.solr.client.solrj.impl.CloudSolrClient.requestWithRetryOnStaleState(CloudSolrClient.java:870)
   [junit4]    > 	at org.apache.solr.client.solrj.impl.CloudSolrClient.requestWithRetryOnStaleState(CloudSolrClient.java:953)
   [junit4]    > 	at org.apache.solr.client.solrj.impl.CloudSolrClient.requestWithRetryOnStaleState(CloudSolrClient.java:953)
   [junit4]    > 	at org.apache.solr.client.solrj.impl.CloudSolrClient.requestWithRetryOnStaleState(CloudSolrClient.java:953)
   [junit4]    > 	at org.apache.solr.client.solrj.impl.CloudSolrClient.requestWithRetryOnStaleState(CloudSolrClient.java:953)
   [junit4]    > 	at org.apache.solr.client.solrj.impl.CloudSolrClient.requestWithRetryOnStaleState(CloudSolrClient.java:953)
   [junit4]    > 	at org.apache.solr.client.solrj.impl.CloudSolrClient.request(CloudSolrClient.java:806)
   [junit4]    > 	at org.apache.solr.client.solrj.SolrRequest.process(SolrRequest.java:149)
   [junit4]    > 	at org.apache.solr.client.solrj.SolrClient.commit(SolrClient.java:484)
   [junit4]    > 	at org.apache.solr.client.solrj.SolrClient.commit(SolrClient.java:463)
   [junit4]    > 	at org.apache.solr.util.TestSolrCLIRunExample.testInteractiveSolrCloudExample(TestSolrCLIRunExample.java:446)
   [junit4]    > 	at java.lang.Thread.run(Thread.java:745)
   [junit4]   2> 3186315 INFO  (SUITE-TestSolrCLIRunExample-seed#[42D092F8EB8D53B4]-worker) [    ] o.a.s.SolrTestCaseJ4 ###deleteCore
   [junit4]   2> NOTE: leaving temporary files on disk at: /Users/jenkins/workspace/Lucene-Solr-trunk-MacOSX/solr/build/solr-core/test/J0/temp/solr.util.TestSolrCLIRunExample_42D092F8EB8D53B4-001
   [junit4]   2> NOTE: test params are: codec=Asserting(Lucene60), sim=ClassicSimilarity, locale=hr-HR, timezone=America/St_Kitts
   [junit4]   2> NOTE: Mac OS X 10.8.5 x86_64/Oracle Corporation 1.8.0_72 (64-bit)/cpus=3,threads=1,free=162791864,total=518979584
   [junit4]   2> NOTE: All tests run in this JVM: [AddSchemaFieldsUpdateProcessorFactoryTest, RegexBoostProcessorTest, MigrateRouteKeyTest, TestPseudoReturnFields, TriLevelCompositeIdRoutingTest, DocumentAnalysisRequestHandlerTest, TestDistributedStatsComponentCardinality, RuleEngineTest, TestSurroundQueryParser, ResponseHeaderTest, TestDefaultSearchFieldResource, AnalysisAfterCoreReloadTest, HLLUtilTest, TestCustomSort, TestArbitraryIndexDir, DirectSolrSpellCheckerTest, LeaderInitiatedRecoveryOnCommitTest, TestDownShardTolerantSearch, TestRequestStatusCollectionAPI, XsltUpdateRequestHandlerTest, TestConfigSets, CloneFieldUpdateProcessorFactoryTest, DistributedQueryElevationComponentTest, SimpleFacetsTest, TestCloudInspectUtil, UnloadDistributedZkTest, TestAnalyzeInfixSuggestions, CollectionsAPIAsyncDistributedZkTest, SecurityConfHandlerTest, TestClassNameShortening, ReturnFieldsTest, OverseerCollectionConfigSetProcessorTest, UUIDUpdateProcessorFallbackTest, DirectUpdateHandlerTest, DocValuesMultiTest, ExitableDirectoryReaderTest, OutOfBoxZkACLAndCredentialsProvidersTest, SolrTestCaseJ4Test, TestLRUCache, SoftAutoCommitTest, TestSchemaVersionResource, CdcrRequestHandlerTest, TestTolerantSearch, HdfsCollectionsAPIDistributedZkTest, TestPhraseSuggestions, TestStressUserVersions, LeaderElectionTest, TestLazyCores, ShardRoutingTest, TestSolrXml, TestPostingsSolrHighlighter, TestDFISimilarityFactory, TestLMDirichletSimilarityFactory, CloudExitableDirectoryReaderTest, BlockJoinFacetDistribTest, SOLR749Test, TestIBSimilarityFactory, CachingDirectoryFactoryTest, DisMaxRequestHandlerTest, DocValuesMissingTest, TestGroupingSearch, MoreLikeThisHandlerTest, TestRestoreCore, SolrCoreTest, DistributedDebugComponentTest, TestManagedSynonymFilterFactory, TestInitParams, TestPartialUpdateDeduplication, AsyncMigrateRouteKeyTest, TestDistributedSearch, CoreMergeIndexesAdminHandlerTest, TestCloudSchemaless, PrimUtilsTest, TestHighFrequencyDictionaryFactory, SimpleCollectionCreateDeleteTest, TestStressLucene, ReplicationFactorTest, TestCryptoKeys, HdfsDirectoryTest, TestStressVersions, DocumentBuilderTest, ZkControllerTest, TestMiniSolrCloudCluster, SaslZkACLProviderTest, SliceStateTest, TestRuleBasedAuthorizationPlugin, ExternalFileFieldSortTest, CursorMarkTest, TestFilteredDocIdSet, JSONWriterTest, TestScoreJoinQPNoScore, FastVectorHighlighterTest, TestReplicationHandler, DistributedFacetPivotLargeTest, TestSort, SchemaVersionSpecificBehaviorTest, TestChildDocTransformer, TestHighlightDedupGrouping, TestConfigSetImmutable, TestCollapseQParserPlugin, TestReloadAndDeleteDocs, SimplePostToolTest, TestSolrConfigHandlerCloud, TestRandomRequestDistribution, PolyFieldTest, TestDynamicFieldResource, SharedFSAutoReplicaFailoverTest, DeleteShardTest, UUIDFieldTest, DistributedFacetPivotWhiteBoxTest, SpatialRPTFieldTypeTest, TestInitQParser, DOMUtilTest, TestFieldTypeResource, AnalyticsMergeStrategyTest, RecoveryAfterSoftCommitTest, TestCollectionAPI, TestJmxIntegration, HardAutoCommitTest, StressHdfsTest, TestObjectReleaseTracker, TestSearchPerf, SuggesterFSTTest, AssignTest, TestIntervalFaceting, ChangedSchemaMergeTest, FacetPivotSmallTest, IndexSchemaTest, TestMergePolicyConfig, PeerSyncTest, CircularListTest, PingRequestHandlerTest, TestMissingGroups, TestComponentsName, RequiredFieldsTest, SimpleMLTQParserTest, TimeZoneUtilsTest, BigEndianAscendingWordDeserializerTest, URLClassifyProcessorTest, BasicDistributedZkTest, SyncSliceTest, OverseerTest, RecoveryZkTest, ClusterStateUpdateTest, TestRandomFaceting, ZkSolrClientTest, AutoCommitTest, TestFaceting, TestHashPartitioner, TestStressReorder, TestJoin, TestCoreContainer, SpellCheckComponentTest, BadIndexSchemaTest, TestFunctionQuery, BasicFunctionalityTest, TestIndexSearcher, CurrencyFieldOpenExchangeTest, CurrencyFieldXmlFileTest, CoreAdminHandlerTest, TestTrie, SuggesterWFSTTest, NoCacheHeaderTest, SolrCoreCheckLockOnStartupTest, TestUpdate, QueryEqualityTest, TestRemoteStreaming, TestSolrDeletionPolicy1, IndexBasedSpellCheckerTest, TestQueryUtils, StandardRequestHandlerTest, TestQueryTypes, PrimitiveFieldTypeTest, TermsComponentTest, RequestHandlersTest, TermVectorComponentTest, MBeansHandlerTest, JsonLoaderTest, BinaryUpdateRequestHandlerTest, TestBinaryResponseWriter, HighlighterConfigTest, TestQuerySenderListener, UpdateParamsTest, AlternateDirectoryTest, TestSolrIndexConfig, TestQuerySenderNoQuery, CopyFieldTest, SolrIndexConfigTest, BadComponentTest, TestStressRecovery, PreAnalyzedFieldTest, DateFieldTest, SpellingQueryConverterTest, ClusterStateTest, TestSolrJ, TestUtils, TestDocumentBuilder, SystemInfoHandlerTest, DistributedMLTComponentTest, TestRTGBase, CursorPagingTest, ConnectionReuseTest, AliasIntegrationTest, CollectionStateFormat2Test, ConfigSetsAPITest, CustomCollectionTest, DeleteStatusTest, DistribJoinFromCollectionTest, HttpPartitionTest, SharedFSAutoReplicaFailoverUtilsTest, SolrXmlInZkTest, TestCloudPivotFacet, TestLeaderElectionZkExpiry, TestMiniSolrCloudClusterBase, TestReplicaProperties, TlogReplayBufferedWhileIndexingTest, VMParamsZkACLAndCredentialsProvidersTest, HdfsBasicDistributedZk2Test, HdfsBasicDistributedZkTest, HdfsChaosMonkeyNothingIsSafeTest, HdfsChaosMonkeySafeLeaderTest, HdfsRecoverLeaseTest, HdfsRecoveryZkTest, HdfsRestartWhileUpdatingTest, HdfsThreadLeakTest, HdfsTlogReplayBufferedWhileIndexingTest, HdfsUnloadDistributedZkTest, HdfsWriteToMultipleCollectionsTest, ZkStateReaderTest, ZkStateWriterTest, RulesTest, DistributedSuggestComponentTest, SpatialHeatmapFacetsTest, TestDynamicFieldCollectionResource, TestFieldTypeCollectionResource, TestManagedSchemaFieldResource, TestRemoveLastDynamicCopyField, TestSchemaResource, TestSolrQueryParserDefaultOperatorResource, BadCopyFieldTest, DateRangeFieldTest, TestCloudManagedSchema, TestReRankQParserPlugin, TestReloadDeadlock, TestSimpleQParserPlugin, TestSolr4Spatial2, TestTrieFacet, TestXmlQParser, TestJsonFacets, TestClassicSimilarityFactory, TestNonDefinedSimilarityFactory, TestPerFieldSimilarityClassic, TestPerFieldSimilarityWithDefaultOverride, TestDistribIDF, TestExactSharedStatsCache, BasicAuthIntegrationTest, TestAuthorizationFramework, AnalysisErrorHandlingTest, CdcrUpdateLogTest, DataDrivenBlockJoinTest, TestHdfsUpdateLog, AtomicUpdatesTest, PreAnalyzedUpdateProcessorTest, DistanceUnitsTest, TestSolrCLIRunExample]
   [junit4] Completed [572/579 (1!)] on J0 in 22.16s, 3 tests, 1 error, 1 skipped <<< FAILURES!

[...truncated 39 lines...]
BUILD FAILED
/Users/jenkins/workspace/Lucene-Solr-trunk-MacOSX/build.xml:740: The following error occurred while executing this line:
/Users/jenkins/workspace/Lucene-Solr-trunk-MacOSX/build.xml:684: The following error occurred while executing this line:
/Users/jenkins/workspace/Lucene-Solr-trunk-MacOSX/build.xml:59: The following error occurred while executing this line:
/Users/jenkins/workspace/Lucene-Solr-trunk-MacOSX/solr/build.xml:233: The following error occurred while executing this line:
/Users/jenkins/workspace/Lucene-Solr-trunk-MacOSX/solr/common-build.xml:524: The following error occurred while executing this line:
/Users/jenkins/workspace/Lucene-Solr-trunk-MacOSX/lucene/common-build.xml:1457: The following error occurred while executing this line:
/Users/jenkins/workspace/Lucene-Solr-trunk-MacOSX/lucene/common-build.xml:1014: There were test failures: 579 suites (8 ignored), 2331 tests, 1 error, 122 ignored (71 assumptions) [seed: 42D092F8EB8D53B4]

Total time: 74 minutes 18 seconds
Build step 'Invoke Ant' marked build as failure
Archiving artifacts
[WARNINGS] Skipping publisher since build result is FAILURE
Recording test results
Email was triggered for: Failure - Any
Sending email for trigger: Failure - Any



Mime
View raw message