lucene-dev mailing list archives

Site index · List index
Message view « Date » · « Thread »
Top « Date » · « Thread »
From Policeman Jenkins Server <jenk...@thetaphi.de>
Subject [JENKINS-EA] Lucene-Solr-5.5-Linux (64bit/jdk-9-ea+105) - Build # 63 - Still Failing!
Date Sun, 21 Feb 2016 14:48:57 GMT
Build: http://jenkins.thetaphi.de/job/Lucene-Solr-5.5-Linux/63/
Java: 64bit/jdk-9-ea+105 -XX:-UseCompressedOops -XX:+UseParallelGC -XX:-UseSuperWord

1 tests failed.
FAILED:  org.apache.lucene.util.automaton.TestAutomaton.testRandomFinite

Error Message:
22

Stack Trace:
java.lang.ArrayIndexOutOfBoundsException: 22
	at __randomizedtesting.SeedInfo.seed([30659942ED5E670B:77D3FF7F52CE022A]:0)
	at org.apache.lucene.util.automaton.MinimizationOperations.minimize(MinimizationOperations.java:235)
	at org.apache.lucene.util.automaton.TestAutomaton.testRandomFinite(TestAutomaton.java:757)
	at sun.reflect.NativeMethodAccessorImpl.invoke0(Native Method)
	at sun.reflect.NativeMethodAccessorImpl.invoke(NativeMethodAccessorImpl.java:62)
	at sun.reflect.DelegatingMethodAccessorImpl.invoke(DelegatingMethodAccessorImpl.java:43)
	at java.lang.reflect.Method.invoke(Method.java:520)
	at com.carrotsearch.randomizedtesting.RandomizedRunner.invoke(RandomizedRunner.java:1764)
	at com.carrotsearch.randomizedtesting.RandomizedRunner$8.evaluate(RandomizedRunner.java:871)
	at com.carrotsearch.randomizedtesting.RandomizedRunner$9.evaluate(RandomizedRunner.java:907)
	at com.carrotsearch.randomizedtesting.RandomizedRunner$10.evaluate(RandomizedRunner.java:921)
	at org.apache.lucene.util.TestRuleSetupTeardownChained$1.evaluate(TestRuleSetupTeardownChained.java:49)
	at org.apache.lucene.util.AbstractBeforeAfterRule$1.evaluate(AbstractBeforeAfterRule.java:45)
	at org.apache.lucene.util.TestRuleThreadAndTestName$1.evaluate(TestRuleThreadAndTestName.java:48)
	at org.apache.lucene.util.TestRuleIgnoreAfterMaxFailures$1.evaluate(TestRuleIgnoreAfterMaxFailures.java:64)
	at org.apache.lucene.util.TestRuleMarkFailure$1.evaluate(TestRuleMarkFailure.java:47)
	at com.carrotsearch.randomizedtesting.rules.StatementAdapter.evaluate(StatementAdapter.java:36)
	at com.carrotsearch.randomizedtesting.ThreadLeakControl$StatementRunner.run(ThreadLeakControl.java:367)
	at com.carrotsearch.randomizedtesting.ThreadLeakControl.forkTimeoutingTask(ThreadLeakControl.java:809)
	at com.carrotsearch.randomizedtesting.ThreadLeakControl$3.evaluate(ThreadLeakControl.java:460)
	at com.carrotsearch.randomizedtesting.RandomizedRunner.runSingleTest(RandomizedRunner.java:880)
	at com.carrotsearch.randomizedtesting.RandomizedRunner$5.evaluate(RandomizedRunner.java:781)
	at com.carrotsearch.randomizedtesting.RandomizedRunner$6.evaluate(RandomizedRunner.java:816)
	at com.carrotsearch.randomizedtesting.RandomizedRunner$7.evaluate(RandomizedRunner.java:827)
	at org.apache.lucene.util.AbstractBeforeAfterRule$1.evaluate(AbstractBeforeAfterRule.java:45)
	at com.carrotsearch.randomizedtesting.rules.StatementAdapter.evaluate(StatementAdapter.java:36)
	at org.apache.lucene.util.TestRuleStoreClassName$1.evaluate(TestRuleStoreClassName.java:41)
	at com.carrotsearch.randomizedtesting.rules.NoShadowingOrOverridesOnMethodsRule$1.evaluate(NoShadowingOrOverridesOnMethodsRule.java:40)
	at com.carrotsearch.randomizedtesting.rules.NoShadowingOrOverridesOnMethodsRule$1.evaluate(NoShadowingOrOverridesOnMethodsRule.java:40)
	at com.carrotsearch.randomizedtesting.rules.StatementAdapter.evaluate(StatementAdapter.java:36)
	at com.carrotsearch.randomizedtesting.rules.StatementAdapter.evaluate(StatementAdapter.java:36)
	at com.carrotsearch.randomizedtesting.rules.StatementAdapter.evaluate(StatementAdapter.java:36)
	at org.apache.lucene.util.TestRuleAssertionsRequired$1.evaluate(TestRuleAssertionsRequired.java:53)
	at org.apache.lucene.util.TestRuleMarkFailure$1.evaluate(TestRuleMarkFailure.java:47)
	at org.apache.lucene.util.TestRuleIgnoreAfterMaxFailures$1.evaluate(TestRuleIgnoreAfterMaxFailures.java:64)
	at org.apache.lucene.util.TestRuleIgnoreTestSuites$1.evaluate(TestRuleIgnoreTestSuites.java:54)
	at com.carrotsearch.randomizedtesting.rules.StatementAdapter.evaluate(StatementAdapter.java:36)
	at com.carrotsearch.randomizedtesting.ThreadLeakControl$StatementRunner.run(ThreadLeakControl.java:367)
	at java.lang.Thread.run(Thread.java:804)




Build Log:
[...truncated 1734 lines...]
   [junit4] Suite: org.apache.lucene.util.automaton.TestAutomaton
   [junit4]   2> NOTE: reproduce with: ant test  -Dtestcase=TestAutomaton -Dtests.method=testRandomFinite
-Dtests.seed=30659942ED5E670B -Dtests.multiplier=3 -Dtests.slow=true -Dtests.locale=fr -Dtests.timezone=America/St_Thomas
-Dtests.asserts=true -Dtests.file.encoding=ISO-8859-1
   [junit4] ERROR   2.99s J0 | TestAutomaton.testRandomFinite <<<
   [junit4]    > Throwable #1: java.lang.ArrayIndexOutOfBoundsException: 22
   [junit4]    > 	at __randomizedtesting.SeedInfo.seed([30659942ED5E670B:77D3FF7F52CE022A]:0)
   [junit4]    > 	at org.apache.lucene.util.automaton.MinimizationOperations.minimize(MinimizationOperations.java:235)
   [junit4]    > 	at org.apache.lucene.util.automaton.TestAutomaton.testRandomFinite(TestAutomaton.java:757)
   [junit4]    > 	at java.lang.Thread.run(Thread.java:804)
   [junit4]   2> NOTE: test params are: codec=Asserting(Lucene54): {}, docValues:{}, sim=DefaultSimilarity,
locale=fr, timezone=America/St_Thomas
   [junit4]   2> NOTE: Linux 3.19.0-47-generic amd64/Oracle Corporation 9-ea (64-bit)/cpus=12,threads=1,free=145179744,total=452984832
   [junit4]   2> NOTE: All tests run in this JVM: [TestMultiTermQueryRewrites, TestDateFilter,
TestUTF32ToUTF8, TestTermVectors, TestMultiset, TestFieldValueFilter, TestPrefixCodedTerms,
TestDoc, TestElevationComparator, TestRegexpRandom2, TestSimilarityProvider, TestMultiTermConstantScore,
Test2BPositions, Test2BPagedBytes, TestSortRandom, TestPerSegmentDeletes, TestDocumentsWriterDeleteQueue,
TestBooleanScorer, TestConjunctionDISI, TestMultiTermsEnum, TestMixedCodecs, TestLevenshteinAutomata,
TestIndexWriterMergePolicy, TestRAMDirectory, TestNot, TestCustomNorms, TestIndexWriter, TestDateSort,
TestMinimize, TestSubScorerFreqs, TestSegmentReader, TestNumericRangeQuery64, TestIndexCommit,
TestParallelReaderEmptyIndex, TestBufferedChecksum, TestIndexFileDeleter, TestIndexWriterCommit,
TestCharTermAttributeImpl, TestNeverDelete, TestMinShouldMatch2, TestMergePolicyWrapper, TestDocValues,
TestNoMergeScheduler, TestCachingCollector, TestSegmentInfos, TestVirtualMethod, TestReusableStringReader,
TestIndexReaderClose, TestIndexWriterDelete, Test2BSortedDocValuesFixedSorted, TestSloppyPhraseQuery2,
TestRegExp, TestEarlyTermination, LimitedFiniteStringsIteratorTest, TestBooleanQuery, TestIndexWriterWithThreads,
TestSentinelIntSet, TestNearSpansOrdered, Test2BPostings, TestDemo, TestFilterLeafReader,
TestBagOfPositions, TestIndexWriterNRTIsCurrent, TestPayloadsOnVectors, TestSortedNumericSortField,
TestLucene50StoredFieldsFormat, TestHugeRamFile, TestLucene53NormsFormat, TestRegexpQuery,
TestSparseFixedBitDocIdSet, TestParallelTermEnum, TestFSTs, TestBytesStore, TestPackedInts,
TestAddIndexes, TestShardSearching, TestMultiMMap, TestSearcherManager, TestDeletionPolicy,
TestFlushByRamOrCountsPolicy, TestPersistentSnapshotDeletionPolicy, TestNorms, TestSearchWithThreads,
TestTopDocsMerge, TestSnapshotDeletionPolicy, TestIndexWriterUnicode, TestIndexWriterForceMerge,
TestPerFieldPostingsFormat, TestConsistentFieldNumbers, TestWeakIdentityMap, TestDirectoryReader,
TestSegmentMerger, TestCollectionUtil, TestNRTCachingDirectory, TestFastDecompressionMode,
TestParallelCompositeReader, TestFieldCacheRewriteMethod, TestMultiThreadTermVectors, TestSegmentTermDocs,
TestPerFieldPostingsFormat2, TestSort, TestToken, TestSimpleSearchEquivalence, TestCustomSearcherSort,
TestTermsEnum2, TestNumericUtils, TestDeterminizeLexicon, TestTransactionRollback, TestStressIndexing2,
TestMultiPhraseQuery, TestDeterminism, TestDocsAndPositions, TestMergeSchedulerExternal, TestBagOfPostings,
TestCodecs, TestParallelLeafReader, TestBytesRefHash, TestThreadedForceMerge, TestIndexInput,
TestDisjunctionMaxQuery, TestQueryWrapperFilter, TestMultiFields, TestWildcard, TestTermRangeFilter,
TestTermVectorsReader, TestMultiValuedNumericRangeQuery, TestAutomatonQuery, TestSumDocFreq,
TestDocValuesScoring, TestDirectory, TestMultiLevelSkipList, TestSearchForDuplicates, TestConstantScoreQuery,
TestPrefixQuery, TestBytesRef, TestIndexWriterOnJRECrash, TestVersion, MultiCollectorTest,
TestScoreCachingWrappingScorer, TestSimpleAttributeImpl, TestTerm, Test2BTerms, Test2BNumericDocValues,
TestPackedTokenAttributeImpl, TestBlockPostingsFormat, TestLucene50FieldInfoFormat, TestLucene50TermVectorsFormat,
TestAllFilesCheckIndexHeader, TestAllFilesDetectTruncation, TestAllFilesHaveChecksumFooter,
TestBinaryDocValuesUpdates, TestCodecUtil, TestDuelingCodecsAtNight, TestExitableDirectoryReader,
TestIndexWriterDeleteByQuery, TestIndexWriterFromReader, TestIndexWriterOutOfFileDescriptors,
TestInfoStream, TestLogMergePolicy, TestMaxPosition, TestNRTReaderCleanup, TestOrdinalMap,
TestReaderWrapperDVTypeCheck, TestSwappedIndexFiles, TestTerms, TestTragicIndexWriterDeadlock,
TestTryDelete, TestApproximationSearchEquivalence, TestBooleanCoord, TestBooleanRewrites,
TestIndexSearcher, TestLRUFilterCache, TestLRUQueryCache, TestMatchNoDocsQuery, TestMultiCollector,
TestMultiPhraseEnum, TestQueryCachingPolicy, TestQueryRescorer, TestReqExclBulkScorer, TestSortRescorer,
TestUsageTrackingFilterCachingPolicy, TestBM25Similarity, TestFilterSpans, TestSpanContainQuery,
TestSpanNotQuery, TestSpanOrQuery, TestSpansEnum, TestFilterDirectory, TestNIOFSDirectory,
TestRateLimiter, TestSimpleFSDirectory, TestSimpleFSLockFactory, TestSleepingLockWrapper,
TestBytesRefArray, TestDocIdSetBuilder, TestFixedBitDocIdSet, TestFrequencyTrackingRingBuffer,
TestIntArrayDocIdSet, TestLSBRadixSorter, TestLongBitSet, TestMathUtil, TestNotDocIdSet, TestQueryBuilder,
TestRoaringDocIdSet, TestSPIClassIterator, TestTimSorter, TestAutomaton]
   [junit4] Completed [419/421 (1!)] on J0 in 4.48s, 56 tests, 1 error <<< FAILURES!

[...truncated 23 lines...]
BUILD FAILED
/home/jenkins/workspace/Lucene-Solr-5.5-Linux/build.xml:750: The following error occurred
while executing this line:
/home/jenkins/workspace/Lucene-Solr-5.5-Linux/build.xml:694: The following error occurred
while executing this line:
/home/jenkins/workspace/Lucene-Solr-5.5-Linux/build.xml:59: The following error occurred while
executing this line:
/home/jenkins/workspace/Lucene-Solr-5.5-Linux/lucene/build.xml:50: The following error occurred
while executing this line:
/home/jenkins/workspace/Lucene-Solr-5.5-Linux/lucene/common-build.xml:1477: The following
error occurred while executing this line:
/home/jenkins/workspace/Lucene-Solr-5.5-Linux/lucene/common-build.xml:1033: There were test
failures: 421 suites (1 ignored), 3386 tests, 1 error, 147 ignored (143 assumptions) [seed:
30659942ED5E670B]

Total time: 5 minutes 47 seconds
Build step 'Invoke Ant' marked build as failure
Archiving artifacts
[WARNINGS] Skipping publisher since build result is FAILURE
Recording test results
Email was triggered for: Failure - Any
Sending email for trigger: Failure - Any



Mime
View raw message