lucene-dev mailing list archives

Site index · List index
Message view « Date » · « Thread »
Top « Date » · « Thread »
From Policeman Jenkins Server <jenk...@thetaphi.de>
Subject [JENKINS] Lucene-Solr-5.x-MacOSX (64bit/jdk1.8.0) - Build # 3043 - Failure!
Date Sat, 20 Feb 2016 06:50:05 GMT
Build: http://jenkins.thetaphi.de/job/Lucene-Solr-5.x-MacOSX/3043/
Java: 64bit/jdk1.8.0 -XX:+UseCompressedOops -XX:+UseParallelGC

3 tests failed.
FAILED:  org.apache.solr.core.TestShardHandlerFactory.testXML

Error Message:
Test abandoned because suite timeout was reached.

Stack Trace:
java.lang.Exception: Test abandoned because suite timeout was reached.
	at __randomizedtesting.SeedInfo.seed([2B3BC06C8E2CDF6D]:0)


FAILED:  junit.framework.TestSuite.org.apache.solr.core.TestShardHandlerFactory

Error Message:
Suite timeout exceeded (>= 7200000 msec).

Stack Trace:
java.lang.Exception: Suite timeout exceeded (>= 7200000 msec).
	at __randomizedtesting.SeedInfo.seed([2B3BC06C8E2CDF6D]:0)


FAILED:  org.apache.solr.search.TestIndexSearcher.testReopen

Error Message:
expected:<_1b(5.5.0):c2> but was:<_1d(5.5.0):C4>

Stack Trace:
java.lang.AssertionError: expected:<_1b(5.5.0):c2> but was:<_1d(5.5.0):C4>
	at __randomizedtesting.SeedInfo.seed([2B3BC06C8E2CDF6D:773117AFD10504E]:0)
	at org.junit.Assert.fail(Assert.java:93)
	at org.junit.Assert.failNotEquals(Assert.java:647)
	at org.junit.Assert.assertEquals(Assert.java:128)
	at org.junit.Assert.assertEquals(Assert.java:147)
	at org.apache.solr.search.TestIndexSearcher.testReopen(TestIndexSearcher.java:121)
	at sun.reflect.NativeMethodAccessorImpl.invoke0(Native Method)
	at sun.reflect.NativeMethodAccessorImpl.invoke(NativeMethodAccessorImpl.java:62)
	at sun.reflect.DelegatingMethodAccessorImpl.invoke(DelegatingMethodAccessorImpl.java:43)
	at java.lang.reflect.Method.invoke(Method.java:498)
	at com.carrotsearch.randomizedtesting.RandomizedRunner.invoke(RandomizedRunner.java:1764)
	at com.carrotsearch.randomizedtesting.RandomizedRunner$8.evaluate(RandomizedRunner.java:871)
	at com.carrotsearch.randomizedtesting.RandomizedRunner$9.evaluate(RandomizedRunner.java:907)
	at com.carrotsearch.randomizedtesting.RandomizedRunner$10.evaluate(RandomizedRunner.java:921)
	at com.carrotsearch.randomizedtesting.rules.SystemPropertiesRestoreRule$1.evaluate(SystemPropertiesRestoreRule.java:57)
	at org.apache.lucene.util.TestRuleSetupTeardownChained$1.evaluate(TestRuleSetupTeardownChained.java:49)
	at org.apache.lucene.util.AbstractBeforeAfterRule$1.evaluate(AbstractBeforeAfterRule.java:45)
	at org.apache.lucene.util.TestRuleThreadAndTestName$1.evaluate(TestRuleThreadAndTestName.java:48)
	at org.apache.lucene.util.TestRuleIgnoreAfterMaxFailures$1.evaluate(TestRuleIgnoreAfterMaxFailures.java:64)
	at org.apache.lucene.util.TestRuleMarkFailure$1.evaluate(TestRuleMarkFailure.java:47)
	at com.carrotsearch.randomizedtesting.rules.StatementAdapter.evaluate(StatementAdapter.java:36)
	at com.carrotsearch.randomizedtesting.ThreadLeakControl$StatementRunner.run(ThreadLeakControl.java:367)
	at com.carrotsearch.randomizedtesting.ThreadLeakControl.forkTimeoutingTask(ThreadLeakControl.java:809)
	at com.carrotsearch.randomizedtesting.ThreadLeakControl$3.evaluate(ThreadLeakControl.java:460)
	at com.carrotsearch.randomizedtesting.RandomizedRunner.runSingleTest(RandomizedRunner.java:880)
	at com.carrotsearch.randomizedtesting.RandomizedRunner$5.evaluate(RandomizedRunner.java:781)
	at com.carrotsearch.randomizedtesting.RandomizedRunner$6.evaluate(RandomizedRunner.java:816)
	at com.carrotsearch.randomizedtesting.RandomizedRunner$7.evaluate(RandomizedRunner.java:827)
	at com.carrotsearch.randomizedtesting.rules.StatementAdapter.evaluate(StatementAdapter.java:36)
	at com.carrotsearch.randomizedtesting.rules.SystemPropertiesRestoreRule$1.evaluate(SystemPropertiesRestoreRule.java:57)
	at org.apache.lucene.util.AbstractBeforeAfterRule$1.evaluate(AbstractBeforeAfterRule.java:45)
	at com.carrotsearch.randomizedtesting.rules.StatementAdapter.evaluate(StatementAdapter.java:36)
	at org.apache.lucene.util.TestRuleStoreClassName$1.evaluate(TestRuleStoreClassName.java:41)
	at com.carrotsearch.randomizedtesting.rules.NoShadowingOrOverridesOnMethodsRule$1.evaluate(NoShadowingOrOverridesOnMethodsRule.java:40)
	at com.carrotsearch.randomizedtesting.rules.NoShadowingOrOverridesOnMethodsRule$1.evaluate(NoShadowingOrOverridesOnMethodsRule.java:40)
	at com.carrotsearch.randomizedtesting.rules.StatementAdapter.evaluate(StatementAdapter.java:36)
	at com.carrotsearch.randomizedtesting.rules.StatementAdapter.evaluate(StatementAdapter.java:36)
	at com.carrotsearch.randomizedtesting.rules.StatementAdapter.evaluate(StatementAdapter.java:36)
	at org.apache.lucene.util.TestRuleAssertionsRequired$1.evaluate(TestRuleAssertionsRequired.java:53)
	at org.apache.lucene.util.TestRuleMarkFailure$1.evaluate(TestRuleMarkFailure.java:47)
	at org.apache.lucene.util.TestRuleIgnoreAfterMaxFailures$1.evaluate(TestRuleIgnoreAfterMaxFailures.java:64)
	at org.apache.lucene.util.TestRuleIgnoreTestSuites$1.evaluate(TestRuleIgnoreTestSuites.java:54)
	at com.carrotsearch.randomizedtesting.rules.StatementAdapter.evaluate(StatementAdapter.java:36)
	at com.carrotsearch.randomizedtesting.ThreadLeakControl$StatementRunner.run(ThreadLeakControl.java:367)
	at java.lang.Thread.run(Thread.java:745)




Build Log:
[...truncated 10784 lines...]
   [junit4] Suite: org.apache.solr.search.TestIndexSearcher
   [junit4]   2> Creating dataDir: /Users/jenkins/workspace/Lucene-Solr-5.x-MacOSX/solr/build/solr-core/test/J1/temp/solr.search.TestIndexSearcher_2B3BC06C8E2CDF6D-001/init-core-data-001
   [junit4]   2> 760943 INFO  (SUITE-TestIndexSearcher-seed#[2B3BC06C8E2CDF6D]-worker) [    ] o.a.s.SolrTestCaseJ4 Randomized ssl (false) and clientAuth (false)
   [junit4]   2> 760944 INFO  (SUITE-TestIndexSearcher-seed#[2B3BC06C8E2CDF6D]-worker) [    ] o.a.s.SolrTestCaseJ4 ####initCore
   [junit4]   2> 760944 INFO  (SUITE-TestIndexSearcher-seed#[2B3BC06C8E2CDF6D]-worker) [    ] o.a.s.c.SolrResourceLoader new SolrResourceLoader for directory: '/Users/jenkins/workspace/Lucene-Solr-5.x-MacOSX/solr/core/src/test-files/solr/collection1'
   [junit4]   2> 760944 INFO  (SUITE-TestIndexSearcher-seed#[2B3BC06C8E2CDF6D]-worker) [    ] o.a.s.c.SolrResourceLoader JNDI not configured for solr (NoInitialContextEx)
   [junit4]   2> 760944 INFO  (SUITE-TestIndexSearcher-seed#[2B3BC06C8E2CDF6D]-worker) [    ] o.a.s.c.SolrResourceLoader using system property solr.solr.home: /Users/jenkins/workspace/Lucene-Solr-5.x-MacOSX/solr/core/src/test-files/solr
   [junit4]   2> 760945 INFO  (SUITE-TestIndexSearcher-seed#[2B3BC06C8E2CDF6D]-worker) [    ] o.a.s.c.SolrResourceLoader Adding 'file:/Users/jenkins/workspace/Lucene-Solr-5.x-MacOSX/solr/core/src/test-files/solr/collection1/lib/classes/' to classloader
   [junit4]   2> 760945 INFO  (SUITE-TestIndexSearcher-seed#[2B3BC06C8E2CDF6D]-worker) [    ] o.a.s.c.SolrResourceLoader Adding 'file:/Users/jenkins/workspace/Lucene-Solr-5.x-MacOSX/solr/core/src/test-files/solr/collection1/lib/README' to classloader
   [junit4]   2> 760993 INFO  (SUITE-TestIndexSearcher-seed#[2B3BC06C8E2CDF6D]-worker) [    ] o.a.s.c.SolrConfig current version of requestparams : -1
   [junit4]   2> 761001 INFO  (SUITE-TestIndexSearcher-seed#[2B3BC06C8E2CDF6D]-worker) [    ] o.a.s.c.SolrConfig Using Lucene MatchVersion: 5.5.0
   [junit4]   2> 761018 INFO  (SUITE-TestIndexSearcher-seed#[2B3BC06C8E2CDF6D]-worker) [    ] o.a.s.c.SolrConfig Loaded SolrConfig: solrconfig.xml
   [junit4]   2> 761022 INFO  (SUITE-TestIndexSearcher-seed#[2B3BC06C8E2CDF6D]-worker) [    ] o.a.s.s.IndexSchema [null] Schema name=test
   [junit4]   2> 761121 INFO  (SUITE-TestIndexSearcher-seed#[2B3BC06C8E2CDF6D]-worker) [    ] o.a.s.s.OpenExchangeRatesOrgProvider Initialized with rates=open-exchange-rates.json, refreshInterval=1440.
   [junit4]   2> 761127 INFO  (SUITE-TestIndexSearcher-seed#[2B3BC06C8E2CDF6D]-worker) [    ] o.a.s.s.IndexSchema default search field in schema is text
   [junit4]   2> 761128 INFO  (SUITE-TestIndexSearcher-seed#[2B3BC06C8E2CDF6D]-worker) [    ] o.a.s.s.IndexSchema unique key field: id
   [junit4]   2> 761131 INFO  (SUITE-TestIndexSearcher-seed#[2B3BC06C8E2CDF6D]-worker) [    ] o.a.s.s.FileExchangeRateProvider Reloading exchange rates from file currency.xml
   [junit4]   2> 761133 INFO  (SUITE-TestIndexSearcher-seed#[2B3BC06C8E2CDF6D]-worker) [    ] o.a.s.s.FileExchangeRateProvider Reloading exchange rates from file currency.xml
   [junit4]   2> 761135 INFO  (SUITE-TestIndexSearcher-seed#[2B3BC06C8E2CDF6D]-worker) [    ] o.a.s.s.OpenExchangeRatesOrgProvider Reloading exchange rates from open-exchange-rates.json
   [junit4]   2> 761135 INFO  (SUITE-TestIndexSearcher-seed#[2B3BC06C8E2CDF6D]-worker) [    ] o.a.s.s.OpenExchangeRatesOrgProvider Reloading exchange rates from open-exchange-rates.json
   [junit4]   2> 761135 INFO  (SUITE-TestIndexSearcher-seed#[2B3BC06C8E2CDF6D]-worker) [    ] o.a.s.c.SolrResourceLoader JNDI not configured for solr (NoInitialContextEx)
   [junit4]   2> 761135 INFO  (SUITE-TestIndexSearcher-seed#[2B3BC06C8E2CDF6D]-worker) [    ] o.a.s.c.SolrResourceLoader using system property solr.solr.home: /Users/jenkins/workspace/Lucene-Solr-5.x-MacOSX/solr/core/src/test-files/solr
   [junit4]   2> 761135 INFO  (SUITE-TestIndexSearcher-seed#[2B3BC06C8E2CDF6D]-worker) [    ] o.a.s.c.SolrResourceLoader new SolrResourceLoader for directory: '/Users/jenkins/workspace/Lucene-Solr-5.x-MacOSX/solr/core/src/test-files/solr'
   [junit4]   2> 761135 INFO  (SUITE-TestIndexSearcher-seed#[2B3BC06C8E2CDF6D]-worker) [    ] o.a.s.c.SolrResourceLoader JNDI not configured for solr (NoInitialContextEx)
   [junit4]   2> 761135 INFO  (SUITE-TestIndexSearcher-seed#[2B3BC06C8E2CDF6D]-worker) [    ] o.a.s.c.SolrResourceLoader using system property solr.solr.home: /Users/jenkins/workspace/Lucene-Solr-5.x-MacOSX/solr/core/src/test-files/solr
   [junit4]   2> 761135 INFO  (SUITE-TestIndexSearcher-seed#[2B3BC06C8E2CDF6D]-worker) [    ] o.a.s.c.CoreContainer New CoreContainer 1688961866
   [junit4]   2> 761136 INFO  (SUITE-TestIndexSearcher-seed#[2B3BC06C8E2CDF6D]-worker) [    ] o.a.s.c.CoreContainer Loading cores into CoreContainer [instanceDir=/Users/jenkins/workspace/Lucene-Solr-5.x-MacOSX/solr/core/src/test-files/solr]
   [junit4]   2> 761136 WARN  (SUITE-TestIndexSearcher-seed#[2B3BC06C8E2CDF6D]-worker) [    ] o.a.s.c.CoreContainer Couldn't add files from /Users/jenkins/workspace/Lucene-Solr-5.x-MacOSX/solr/core/src/test-files/solr/lib to classpath: /Users/jenkins/workspace/Lucene-Solr-5.x-MacOSX/solr/core/src/test-files/solr/lib
   [junit4]   2> 761136 INFO  (SUITE-TestIndexSearcher-seed#[2B3BC06C8E2CDF6D]-worker) [    ] o.a.s.h.c.HttpShardHandlerFactory created with socketTimeout : 600000,connTimeout : 60000,maxConnectionsPerHost : 20,maxConnections : 10000,corePoolSize : 0,maximumPoolSize : 2147483647,maxThreadIdleTime : 5,sizeOfQueue : -1,fairnessPolicy : false,useRetries : false,
   [junit4]   2> 761141 INFO  (SUITE-TestIndexSearcher-seed#[2B3BC06C8E2CDF6D]-worker) [    ] o.a.s.u.UpdateShardHandler Creating UpdateShardHandler HTTP client with params: socketTimeout=30000&connTimeout=30000&retry=true
   [junit4]   2> 761142 INFO  (SUITE-TestIndexSearcher-seed#[2B3BC06C8E2CDF6D]-worker) [    ] o.a.s.l.LogWatcher SLF4J impl is org.slf4j.impl.Log4jLoggerFactory
   [junit4]   2> 761142 INFO  (SUITE-TestIndexSearcher-seed#[2B3BC06C8E2CDF6D]-worker) [    ] o.a.s.l.LogWatcher Registering Log Listener [Log4j (org.slf4j.impl.Log4jLoggerFactory)]
   [junit4]   2> 761142 INFO  (SUITE-TestIndexSearcher-seed#[2B3BC06C8E2CDF6D]-worker) [    ] o.a.s.c.CoreContainer Security conf doesn't exist. Skipping setup for authorization module.
   [junit4]   2> 761142 INFO  (SUITE-TestIndexSearcher-seed#[2B3BC06C8E2CDF6D]-worker) [    ] o.a.s.c.CoreContainer No authentication plugin used.
   [junit4]   2> 761143 INFO  (SUITE-TestIndexSearcher-seed#[2B3BC06C8E2CDF6D]-worker) [    ] o.a.s.c.CoreDescriptor Created CoreDescriptor: {name=collection1, config=solrconfig.xml, transient=false, schema=schema.xml, loadOnStartup=true, configSetProperties=configsetprops.json, collection=collection1, dataDir=/Users/jenkins/workspace/Lucene-Solr-5.x-MacOSX/solr/build/solr-core/test/J1/temp/solr.search.TestIndexSearcher_2B3BC06C8E2CDF6D-001/init-core-data-001, shard=shard1}
   [junit4]   2> 761144 INFO  (coreLoadExecutor-2626-thread-1) [    ] o.a.s.c.SolrResourceLoader new SolrResourceLoader for directory: '/Users/jenkins/workspace/Lucene-Solr-5.x-MacOSX/solr/core/src/test-files/solr/collection1'
   [junit4]   2> 761144 INFO  (coreLoadExecutor-2626-thread-1) [    ] o.a.s.c.SolrResourceLoader JNDI not configured for solr (NoInitialContextEx)
   [junit4]   2> 761144 INFO  (coreLoadExecutor-2626-thread-1) [    ] o.a.s.c.SolrResourceLoader using system property solr.solr.home: /Users/jenkins/workspace/Lucene-Solr-5.x-MacOSX/solr/core/src/test-files/solr
   [junit4]   2> 761144 INFO  (coreLoadExecutor-2626-thread-1) [    ] o.a.s.c.SolrResourceLoader Adding 'file:/Users/jenkins/workspace/Lucene-Solr-5.x-MacOSX/solr/core/src/test-files/solr/collection1/lib/classes/' to classloader
   [junit4]   2> 761144 INFO  (coreLoadExecutor-2626-thread-1) [    ] o.a.s.c.SolrResourceLoader Adding 'file:/Users/jenkins/workspace/Lucene-Solr-5.x-MacOSX/solr/core/src/test-files/solr/collection1/lib/README' to classloader
   [junit4]   2> 761161 INFO  (coreLoadExecutor-2626-thread-1) [    ] o.a.s.c.SolrConfig current version of requestparams : -1
   [junit4]   2> 761169 INFO  (coreLoadExecutor-2626-thread-1) [    ] o.a.s.c.SolrConfig Using Lucene MatchVersion: 5.5.0
   [junit4]   2> 761194 INFO  (coreLoadExecutor-2626-thread-1) [    ] o.a.s.c.SolrConfig Loaded SolrConfig: solrconfig.xml
   [junit4]   2> 761198 INFO  (coreLoadExecutor-2626-thread-1) [    ] o.a.s.s.IndexSchema [collection1] Schema name=test
   [junit4]   2> 761284 INFO  (coreLoadExecutor-2626-thread-1) [    ] o.a.s.s.OpenExchangeRatesOrgProvider Initialized with rates=open-exchange-rates.json, refreshInterval=1440.
   [junit4]   2> 761288 INFO  (coreLoadExecutor-2626-thread-1) [    ] o.a.s.s.IndexSchema default search field in schema is text
   [junit4]   2> 761290 INFO  (coreLoadExecutor-2626-thread-1) [    ] o.a.s.s.IndexSchema unique key field: id
   [junit4]   2> 761292 INFO  (coreLoadExecutor-2626-thread-1) [    ] o.a.s.s.FileExchangeRateProvider Reloading exchange rates from file currency.xml
   [junit4]   2> 761294 INFO  (coreLoadExecutor-2626-thread-1) [    ] o.a.s.s.FileExchangeRateProvider Reloading exchange rates from file currency.xml
   [junit4]   2> 761295 INFO  (coreLoadExecutor-2626-thread-1) [    ] o.a.s.s.OpenExchangeRatesOrgProvider Reloading exchange rates from open-exchange-rates.json
   [junit4]   2> 761295 INFO  (coreLoadExecutor-2626-thread-1) [    ] o.a.s.s.OpenExchangeRatesOrgProvider Reloading exchange rates from open-exchange-rates.json
   [junit4]   2> 761305 INFO  (coreLoadExecutor-2626-thread-1) [    ] o.a.s.c.ConfigSetProperties Did not find ConfigSet properties, assuming default properties: Can't find resource 'configsetprops.json' in classpath or '/Users/jenkins/workspace/Lucene-Solr-5.x-MacOSX/solr/core/src/test-files/solr/collection1'
   [junit4]   2> 761305 INFO  (coreLoadExecutor-2626-thread-1) [    ] o.a.s.c.CoreContainer Creating SolrCore 'collection1' using configuration from instancedir /Users/jenkins/workspace/Lucene-Solr-5.x-MacOSX/solr/core/src/test-files/solr/collection1
   [junit4]   2> 761305 INFO  (coreLoadExecutor-2626-thread-1) [    x:collection1] o.a.s.c.SolrCore org.apache.solr.core.MockDirectoryFactory
   [junit4]   2> 761306 INFO  (coreLoadExecutor-2626-thread-1) [    x:collection1] o.a.s.c.SolrCore [[collection1] ] Opening new SolrCore at [/Users/jenkins/workspace/Lucene-Solr-5.x-MacOSX/solr/core/src/test-files/solr/collection1], dataDir=[/Users/jenkins/workspace/Lucene-Solr-5.x-MacOSX/solr/build/solr-core/test/J1/temp/solr.search.TestIndexSearcher_2B3BC06C8E2CDF6D-001/init-core-data-001/]
   [junit4]   2> 761306 INFO  (coreLoadExecutor-2626-thread-1) [    x:collection1] o.a.s.c.JmxMonitoredMap JMX monitoring is enabled. Adding Solr mbeans to JMX Server: com.sun.jmx.mbeanserver.JmxMBeanServer@4672338a
   [junit4]   2> 761306 INFO  (coreLoadExecutor-2626-thread-1) [    x:collection1] o.a.s.c.CachingDirectoryFactory return new directory for /Users/jenkins/workspace/Lucene-Solr-5.x-MacOSX/solr/build/solr-core/test/J1/temp/solr.search.TestIndexSearcher_2B3BC06C8E2CDF6D-001/init-core-data-001
   [junit4]   2> 761306 INFO  (coreLoadExecutor-2626-thread-1) [    x:collection1] o.a.s.c.SolrCore New index directory detected: old=null new=/Users/jenkins/workspace/Lucene-Solr-5.x-MacOSX/solr/build/solr-core/test/J1/temp/solr.search.TestIndexSearcher_2B3BC06C8E2CDF6D-001/init-core-data-001/index/
   [junit4]   2> 761306 WARN  (coreLoadExecutor-2626-thread-1) [    x:collection1] o.a.s.c.SolrCore [collection1] Solr index directory '/Users/jenkins/workspace/Lucene-Solr-5.x-MacOSX/solr/build/solr-core/test/J1/temp/solr.search.TestIndexSearcher_2B3BC06C8E2CDF6D-001/init-core-data-001/index' doesn't exist. Creating new index...
   [junit4]   2> 761306 INFO  (coreLoadExecutor-2626-thread-1) [    x:collection1] o.a.s.c.CachingDirectoryFactory return new directory for /Users/jenkins/workspace/Lucene-Solr-5.x-MacOSX/solr/build/solr-core/test/J1/temp/solr.search.TestIndexSearcher_2B3BC06C8E2CDF6D-001/init-core-data-001/index
   [junit4]   2> 761307 INFO  (coreLoadExecutor-2626-thread-1) [    x:collection1] o.a.s.u.RandomMergePolicy RandomMergePolicy wrapping class org.apache.lucene.index.TieredMergePolicy: [TieredMergePolicy: maxMergeAtOnce=25, maxMergeAtOnceExplicit=42, maxMergedSegmentMB=48.6044921875, floorSegmentMB=1.8330078125, forceMergeDeletesPctAllowed=19.655882476476343, segmentsPerTier=50.0, maxCFSSegmentSizeMB=8.796093022207999E12, noCFSRatio=0.2950693606438223
   [junit4]   2> 761307 INFO  (coreLoadExecutor-2626-thread-1) [    x:collection1] o.a.s.c.SolrDeletionPolicy SolrDeletionPolicy.onCommit: commits: num=1
   [junit4]   2> 	commit{dir=MockDirectoryWrapper(RAMDirectory@1fb3ee4b lockFactory=org.apache.lucene.store.SingleInstanceLockFactory@4101d1ac),segFN=segments_1,generation=1}
   [junit4]   2> 761307 INFO  (coreLoadExecutor-2626-thread-1) [    x:collection1] o.a.s.c.SolrDeletionPolicy newest commit generation = 1
   [junit4]   2> 761308 INFO  (OldIndexDirectoryCleanupThreadForCore-collection1) [    x:collection1] o.a.s.c.SolrCore Looking for old index directories to cleanup for core collection1 in /Users/jenkins/workspace/Lucene-Solr-5.x-MacOSX/solr/build/solr-core/test/J1/temp/solr.search.TestIndexSearcher_2B3BC06C8E2CDF6D-001/init-core-data-001/
   [junit4]   2> 761310 INFO  (coreLoadExecutor-2626-thread-1) [    x:collection1] o.a.s.u.p.UpdateRequestProcessorChain creating updateRequestProcessorChain "dedupe"
   [junit4]   2> 761310 INFO  (coreLoadExecutor-2626-thread-1) [    x:collection1] o.a.s.u.p.UpdateRequestProcessorChain inserting DistributedUpdateProcessorFactory into updateRequestProcessorChain "dedupe"
   [junit4]   2> 761310 INFO  (coreLoadExecutor-2626-thread-1) [    x:collection1] o.a.s.u.p.UpdateRequestProcessorChain creating updateRequestProcessorChain "dedupe-allfields"
   [junit4]   2> 761310 INFO  (coreLoadExecutor-2626-thread-1) [    x:collection1] o.a.s.u.p.UpdateRequestProcessorChain inserting DistributedUpdateProcessorFactory into updateRequestProcessorChain "dedupe-allfields"
   [junit4]   2> 761310 INFO  (coreLoadExecutor-2626-thread-1) [    x:collection1] o.a.s.u.p.UpdateRequestProcessorChain creating updateRequestProcessorChain "stored_sig"
   [junit4]   2> 761311 INFO  (coreLoadExecutor-2626-thread-1) [    x:collection1] o.a.s.u.p.UpdateRequestProcessorChain inserting DistributedUpdateProcessorFactory into updateRequestProcessorChain "stored_sig"
   [junit4]   2> 761311 INFO  (coreLoadExecutor-2626-thread-1) [    x:collection1] o.a.s.u.p.UpdateRequestProcessorChain creating updateRequestProcessorChain "uniq-fields"
   [junit4]   2> 761311 INFO  (coreLoadExecutor-2626-thread-1) [    x:collection1] o.a.s.u.p.UpdateRequestProcessorChain inserting DistributedUpdateProcessorFactory into updateRequestProcessorChain "uniq-fields"
   [junit4]   2> 761311 INFO  (coreLoadExecutor-2626-thread-1) [    x:collection1] o.a.s.u.p.UpdateRequestProcessorChain creating updateRequestProcessorChain "distrib-dup-test-chain-explicit"
   [junit4]   2> 761311 INFO  (coreLoadExecutor-2626-thread-1) [    x:collection1] o.a.s.u.p.UpdateRequestProcessorChain creating updateRequestProcessorChain "distrib-dup-test-chain-implicit"
   [junit4]   2> 761311 INFO  (coreLoadExecutor-2626-thread-1) [    x:collection1] o.a.s.u.p.UpdateRequestProcessorChain inserting DistributedUpdateProcessorFactory into updateRequestProcessorChain "distrib-dup-test-chain-implicit"
   [junit4]   2> 761311 INFO  (coreLoadExecutor-2626-thread-1) [    x:collection1] o.a.s.c.SolrCore no updateRequestProcessorChain defined as default, creating implicit default
   [junit4]   2> 761315 INFO  (coreLoadExecutor-2626-thread-1) [    x:collection1] o.a.s.h.l.XMLLoader xsltCacheLifetimeSeconds=60
   [junit4]   2> 761316 INFO  (coreLoadExecutor-2626-thread-1) [    x:collection1] o.a.s.h.l.XMLLoader xsltCacheLifetimeSeconds=60
   [junit4]   2> 761317 INFO  (coreLoadExecutor-2626-thread-1) [    x:collection1] o.a.s.h.l.XMLLoader xsltCacheLifetimeSeconds=60
   [junit4]   2> 761318 INFO  (coreLoadExecutor-2626-thread-1) [    x:collection1] o.a.s.h.l.XMLLoader xsltCacheLifetimeSeconds=60
   [junit4]   2> 761321 INFO  (coreLoadExecutor-2626-thread-1) [    x:collection1] o.a.s.c.PluginBag requestHandler : 'lazy' created with startup=lazy 
   [junit4]   2> 761322 INFO  (coreLoadExecutor-2626-thread-1) [    x:collection1] o.a.s.c.RequestHandlers Registered paths: /admin/mbeans,standard,spellCheckCompRH,lazy,/update/json/docs,/admin/luke,spellCheckWithWordbreak_Direct,tvrh,/get,/admin/properties,/update/json,mltrh,/admin/threads,/search-facet-def,/update/csv,/search-facet-invariants,/admin/segments,spellCheckCompRH1,/mlt,/admin/system,/replication,dismax,defaults,/config,/schema,/admin/plugins,/admin/logging,spellCheckWithWordbreak,mock,/admin/ping,/update,/admin/file,/terms,spellCheckCompRH_Direct,/debug/dump
   [junit4]   2> 761322 WARN  (coreLoadExecutor-2626-thread-1) [    x:collection1] o.a.s.c.SolrCore solrconfig.xml uses deprecated <admin/gettableFiles>, Please update your config to use the ShowFileRequestHandler.
   [junit4]   2> 761323 INFO  (coreLoadExecutor-2626-thread-1) [    x:collection1] o.a.s.c.SolrCore Using default statsCache cache: org.apache.solr.search.stats.LocalStatsCache
   [junit4]   2> 761323 INFO  (coreLoadExecutor-2626-thread-1) [    x:collection1] o.a.s.u.UpdateHandler Using UpdateLog implementation: org.apache.solr.update.UpdateLog
   [junit4]   2> 761323 INFO  (coreLoadExecutor-2626-thread-1) [    x:collection1] o.a.s.u.UpdateLog Initializing UpdateLog: dataDir= defaultSyncLevel=FLUSH numRecordsToKeep=100 maxNumLogsToKeep=10 numVersionBuckets=65536
   [junit4]   2> 761324 INFO  (coreLoadExecutor-2626-thread-1) [    x:collection1] o.a.s.u.CommitTracker Hard AutoCommit: disabled
   [junit4]   2> 761324 INFO  (coreLoadExecutor-2626-thread-1) [    x:collection1] o.a.s.u.CommitTracker Soft AutoCommit: disabled
   [junit4]   2> 761325 INFO  (coreLoadExecutor-2626-thread-1) [    x:collection1] o.a.s.u.RandomMergePolicy RandomMergePolicy wrapping class org.apache.lucene.index.LogDocMergePolicy: [LogDocMergePolicy: minMergeSize=1000, mergeFactor=2, maxMergeSize=9223372036854775807, maxMergeSizeForForcedMerge=9223372036854775807, calibrateSizeByDeletes=true, maxMergeDocs=2147483647, maxCFSSegmentSizeMB=8.796093022207999E12, noCFSRatio=0.0]
   [junit4]   2> 761325 INFO  (coreLoadExecutor-2626-thread-1) [    x:collection1] o.a.s.c.SolrDeletionPolicy SolrDeletionPolicy.onInit: commits: num=1
   [junit4]   2> 	commit{dir=MockDirectoryWrapper(RAMDirectory@1fb3ee4b lockFactory=org.apache.lucene.store.SingleInstanceLockFactory@4101d1ac),segFN=segments_1,generation=1}
   [junit4]   2> 761325 INFO  (coreLoadExecutor-2626-thread-1) [    x:collection1] o.a.s.c.SolrDeletionPolicy newest commit generation = 1
   [junit4]   2> 761325 INFO  (coreLoadExecutor-2626-thread-1) [    x:collection1] o.a.s.s.SolrIndexSearcher Opening Searcher@77cbef9e[collection1] main
   [junit4]   2> 761325 INFO  (coreLoadExecutor-2626-thread-1) [    x:collection1] o.a.s.r.RestManager Initializing RestManager with initArgs: {storageIO=org.apache.solr.rest.ManagedResourceStorage$InMemoryStorageIO}
   [junit4]   2> 761325 INFO  (coreLoadExecutor-2626-thread-1) [    x:collection1] o.a.s.r.ManagedResourceStorage Reading _rest_managed.json using InMemoryStorage
   [junit4]   2> 761325 INFO  (coreLoadExecutor-2626-thread-1) [    x:collection1] o.a.s.r.RestManager Initializing 0 registered ManagedResources
   [junit4]   2> 761325 INFO  (coreLoadExecutor-2626-thread-1) [    x:collection1] o.a.s.h.c.SpellCheckComponent Initializing spell checkers
   [junit4]   2> 761346 INFO  (coreLoadExecutor-2626-thread-1) [    x:collection1] o.a.s.s.DirectSolrSpellChecker init: {name=direct,classname=DirectSolrSpellChecker,field=lowerfilt,minQueryLength=3}
   [junit4]   2> 761447 INFO  (coreLoadExecutor-2626-thread-1) [    x:collection1] o.a.s.h.ReplicationHandler Commits will be reserved for  10000
   [junit4]   2> 761447 INFO  (searcherExecutor-2627-thread-1-processing-x:collection1) [    x:collection1] o.a.s.h.c.SpellCheckComponent Loading spell index for spellchecker: default
   [junit4]   2> 761448 INFO  (coreLoadExecutor-2626-thread-1) [    x:collection1] o.a.s.u.UpdateLog Looking up max value of version field to seed version buckets
   [junit4]   2> 761448 INFO  (coreLoadExecutor-2626-thread-1) [    x:collection1] o.a.s.u.VersionInfo Refreshing highest value of _version_ for 65536 version buckets from index
   [junit4]   2> 761448 INFO  (searcherExecutor-2627-thread-1-processing-x:collection1) [    x:collection1] o.a.s.h.c.SpellCheckComponent Loading spell index for spellchecker: direct
   [junit4]   2> 761448 INFO  (coreLoadExecutor-2626-thread-1) [    x:collection1] o.a.s.u.VersionInfo No terms found for _version_, cannot seed version bucket highest value from index
   [junit4]   2> 761448 INFO  (searcherExecutor-2627-thread-1-processing-x:collection1) [    x:collection1] o.a.s.h.c.SpellCheckComponent Loading spell index for spellchecker: wordbreak
   [junit4]   2> 761448 INFO  (searcherExecutor-2627-thread-1-processing-x:collection1) [    x:collection1] o.a.s.h.c.SpellCheckComponent Loading spell index for spellchecker: multipleFields
   [junit4]   2> 761448 INFO  (coreLoadExecutor-2626-thread-1) [    x:collection1] o.a.s.u.UpdateLog Could not find max version in index or recent updates, using new clock 1526667159120379904
   [junit4]   2> 761449 INFO  (searcherExecutor-2627-thread-1-processing-x:collection1) [    x:collection1] o.a.s.h.c.SpellCheckComponent Loading spell index for spellchecker: jarowinkler
   [junit4]   2> 761449 INFO  (searcherExecutor-2627-thread-1-processing-x:collection1) [    x:collection1] o.a.s.h.c.SpellCheckComponent Loading spell index for spellchecker: external
   [junit4]   2> 761450 INFO  (searcherExecutor-2627-thread-1-processing-x:collection1) [    x:collection1] o.a.s.h.c.SpellCheckComponent Loading spell index for spellchecker: freq
   [junit4]   2> 761450 INFO  (coreLoadExecutor-2626-thread-1) [    x:collection1] o.a.s.u.UpdateLog Took 2.0ms to seed version buckets with highest version 1526667159120379904
   [junit4]   2> 761450 INFO  (searcherExecutor-2627-thread-1-processing-x:collection1) [    x:collection1] o.a.s.h.c.SpellCheckComponent Loading spell index for spellchecker: fqcn
   [junit4]   2> 761450 INFO  (coreLoadExecutor-2626-thread-1) [    x:collection1] o.a.s.c.CoreContainer registering core: collection1
   [junit4]   2> 761450 INFO  (searcherExecutor-2627-thread-1-processing-x:collection1) [    x:collection1] o.a.s.h.c.SpellCheckComponent Loading spell index for spellchecker: perDict
   [junit4]   2> 761451 INFO  (searcherExecutor-2627-thread-1-processing-x:collection1) [    x:collection1] o.a.s.c.SolrCore [collection1] Registered new searcher Searcher@77cbef9e[collection1] main{ExitableDirectoryReader(UninvertingDirectoryReader())}
   [junit4]   2> 761451 INFO  (SUITE-TestIndexSearcher-seed#[2B3BC06C8E2CDF6D]-worker) [    ] o.a.s.SolrTestCaseJ4 ####initCore end
   [junit4]   2> 761454 INFO  (TEST-TestIndexSearcher.testSearcherListeners-seed#[2B3BC06C8E2CDF6D]) [    ] o.a.s.SolrTestCaseJ4 ###Starting testSearcherListeners
   [junit4]   2> 761456 INFO  (TEST-TestIndexSearcher.testSearcherListeners-seed#[2B3BC06C8E2CDF6D]) [    ] o.a.s.c.CoreDescriptor Created CoreDescriptor: {name=core1, config=solrconfig-searcher-listeners1.xml, loadOnStartup=true, schema=schema.xml, configSetProperties=configsetprops.json, transient=false, dataDir=data/}
   [junit4]   2> 761456 INFO  (TEST-TestIndexSearcher.testSearcherListeners-seed#[2B3BC06C8E2CDF6D]) [    ] o.a.s.c.SolrResourceLoader new SolrResourceLoader for directory: '/Users/jenkins/workspace/Lucene-Solr-5.x-MacOSX/solr/core/src/test-files/solr/collection1'
   [junit4]   2> 761457 INFO  (TEST-TestIndexSearcher.testSearcherListeners-seed#[2B3BC06C8E2CDF6D]) [    ] o.a.s.c.SolrResourceLoader JNDI not configured for solr (NoInitialContextEx)
   [junit4]   2> 761457 INFO  (TEST-TestIndexSearcher.testSearcherListeners-seed#[2B3BC06C8E2CDF6D]) [    ] o.a.s.c.SolrResourceLoader using system property solr.solr.home: /Users/jenkins/workspace/Lucene-Solr-5.x-MacOSX/solr/core/src/test-files/solr
   [junit4]   2> 761457 INFO  (TEST-TestIndexSearcher.testSearcherListeners-seed#[2B3BC06C8E2CDF6D]) [    ] o.a.s.c.SolrResourceLoader Adding 'file:/Users/jenkins/workspace/Lucene-Solr-5.x-MacOSX/solr/core/src/test-files/solr/collection1/lib/classes/' to classloader
   [junit4]   2> 761457 INFO  (TEST-TestIndexSearcher.testSearcherListeners-seed#[2B3BC06C8E2CDF6D]) [    ] o.a.s.c.SolrResourceLoader Adding 'file:/Users/jenkins/workspace/Lucene-Solr-5.x-MacOSX/solr/core/src/test-files/solr/collection1/lib/README' to classloader
   [junit4]   2> 761508 INFO  (TEST-TestIndexSearcher.testSearcherListeners-seed#[2B3BC06C8E2CDF6D]) [    ] o.a.s.c.SolrConfig current version of requestparams : -1
   [junit4]   2> 761513 INFO  (TEST-TestIndexSearcher.testSearcherListeners-seed#[2B3BC06C8E2CDF6D]) [    ] o.a.s.c.SolrConfig Using Lucene MatchVersion: 5.5.0
   [junit4]   2> 761516 INFO  (TEST-TestIndexSearcher.testSearcherListeners-seed#[2B3BC06C8E2CDF6D]) [    ] o.a.s.c.SolrConfig Loaded SolrConfig: solrconfig-searcher-listeners1.xml
   [junit4]   2> 761520 INFO  (TEST-TestIndexSearcher.testSearcherListeners-seed#[2B3BC06C8E2CDF6D]) [    ] o.a.s.s.IndexSchema [core1] Schema name=test
   [junit4]   2> 761616 INFO  (TEST-TestIndexSearcher.testSearcherListeners-seed#[2B3BC06C8E2CDF6D]) [    ] o.a.s.s.OpenExchangeRatesOrgProvider Initialized with rates=open-exchange-rates.json, refreshInterval=1440.
   [junit4]   2> 761622 INFO  (TEST-TestIndexSearcher.testSearcherListeners-seed#[2B3BC06C8E2CDF6D]) [    ] o.a.s.s.IndexSchema default search field in schema is text
   [junit4]   2> 761623 INFO  (TEST-TestIndexSearcher.testSearcherListeners-seed#[2B3BC06C8E2CDF6D]) [    ] o.a.s.s.IndexSchema unique key field: id
   [junit4]   2> 761628 INFO  (TEST-TestIndexSearcher.testSearcherListeners-seed#[2B3BC06C8E2CDF6D]) [    ] o.a.s.s.FileExchangeRateProvider Reloading exchange rates from file currency.xml
   [junit4]   2> 761630 INFO  (TEST-TestIndexSearcher.testSearcherListeners-seed#[2B3BC06C8E2CDF6D]) [    ] o.a.s.s.FileExchangeRateProvider Reloading exchange rates from file currency.xml
   [junit4]   2> 761632 INFO  (TEST-TestIndexSearcher.testSearcherListeners-seed#[2B3BC06C8E2CDF6D]) [    ] o.a.s.s.OpenExchangeRatesOrgProvider Reloading exchange rates from open-exchange-rates.json
   [junit4]   2> 761632 INFO  (TEST-TestIndexSearcher.testSearcherListeners-seed#[2B3BC06C8E2CDF6D]) [    ] o.a.s.s.OpenExchangeRatesOrgProvider Reloading exchange rates from open-exchange-rates.json
   [junit4]   2> 761636 INFO  (TEST-TestIndexSearcher.testSearcherListeners-seed#[2B3BC06C8E2CDF6D]) [    ] o.a.s.c.ConfigSetProperties Did not find ConfigSet properties, assuming default properties: Can't find resource 'configsetprops.json' in classpath or '/Users/jenkins/workspace/Lucene-Solr-5.x-MacOSX/solr/core/src/test-files/solr/collection1'
   [junit4]   2> 761636 INFO  (TEST-TestIndexSearcher.testSearcherListeners-seed#[2B3BC06C8E2CDF6D]) [    ] o.a.s.c.CoreContainer Creating SolrCore 'core1' using configuration from instancedir /Users/jenkins/workspace/Lucene-Solr-5.x-MacOSX/solr/core/src/test-files/solr/collection1
   [junit4]   2> 761637 INFO  (TEST-TestIndexSearcher.testSearcherListeners-seed#[2B3BC06C8E2CDF6D]) [    x:core1] o.a.s.c.SolrCore org.apache.solr.core.MockDirectoryFactory
   [junit4]   2> 761637 INFO  (TEST-TestIndexSearcher.testSearcherListeners-seed#[2B3BC06C8E2CDF6D]) [    x:core1] o.a.s.c.SolrCore [[core1] ] Opening new SolrCore at [/Users/jenkins/workspace/Lucene-Solr-5.x-MacOSX/solr/core/src/test-files/solr/collection1], dataDir=[/Users/jenkins/workspace/Lucene-Solr-5.x-MacOSX/solr/core/src/test-files/solr/collection1/data/]
   [junit4]   2> 761637 INFO  (TEST-TestIndexSearcher.testSearcherListeners-seed#[2B3BC06C8E2CDF6D]) [    x:core1] o.a.s.c.SolrCore JMX monitoring not detected for core: core1
   [junit4]   2> 761637 INFO  (TEST-TestIndexSearcher.testSearcherListeners-seed#[2B3BC06C8E2CDF6D]) [    x:core1] o.a.s.c.CachingDirectoryFactory return new directory for /Users/jenkins/workspace/Lucene-Solr-5.x-MacOSX/solr/core/src/test-files/solr/collection1/data
   [junit4]   2> 761637 INFO  (TEST-TestIndexSearcher.testSearcherListeners-seed#[2B3BC06C8E2CDF6D]) [    x:core1] o.a.s.c.SolrCore New index directory detected: old=null new=/Users/jenkins/workspace/Lucene-Solr-5.x-MacOSX/solr/core/src/test-files/solr/collection1/data/index/
   [junit4]   2> 761637 WARN  (TEST-TestIndexSearcher.testSearcherListeners-seed#[2B3BC06C8E2CDF6D]) [    x:core1] o.a.s.c.SolrCore [core1] Solr index directory '/Users/jenkins/workspace/Lucene-Solr-5.x-MacOSX/solr/core/src/test-files/solr/collection1/data/index' doesn't exist. Creating new index...
   [junit4]   2> 761638 INFO  (TEST-TestIndexSearcher.testSearcherListeners-seed#[2B3BC06C8E2CDF6D]) [    x:core1] o.a.s.c.CachingDirectoryFactory return new directory for /Users/jenkins/workspace/Lucene-Solr-5.x-MacOSX/solr/core/src/test-files/solr/collection1/data/index
   [junit4]   2> 761638 INFO  (TEST-TestIndexSearcher.testSearcherListeners-seed#[2B3BC06C8E2CDF6D]) [    x:core1] o.a.s.u.RandomMergePolicy RandomMergePolicy wrapping class org.apache.lucene.index.LogDocMergePolicy: [LogDocMergePolicy: minMergeSize=1000, mergeFactor=30, maxMergeSize=9223372036854775807, maxMergeSizeForForcedMerge=9223372036854775807, calibrateSizeByDeletes=false, maxMergeDocs=2147483647, maxCFSSegmentSizeMB=8.796093022207999E12, noCFSRatio=0.0]
   [junit4]   2> 761638 INFO  (TEST-TestIndexSearcher.testSearcherListeners-seed#[2B3BC06C8E2CDF6D]) [    x:core1] o.a.s.c.SolrDeletionPolicy SolrDeletionPolicy.onCommit: commits: num=1
   [junit4]   2> 	commit{dir=MockDirectoryWrapper(RAMDirectory@5fb4ac84 lockFactory=org.apache.lucene.store.SingleInstanceLockFactory@250b8328),segFN=segments_1,generation=1}
   [junit4]   2> 761638 INFO  (TEST-TestIndexSearcher.testSearcherListeners-seed#[2B3BC06C8E2CDF6D]) [    x:core1] o.a.s.c.SolrDeletionPolicy newest commit generation = 1
   [junit4]   2> 761639 INFO  (OldIndexDirectoryCleanupThreadForCore-core1) [    x:core1] o.a.s.c.SolrCore Looking for old index directories to cleanup for core core1 in /Users/jenkins/workspace/Lucene-Solr-5.x-MacOSX/solr/core/src/test-files/solr/collection1/data/
   [junit4]   2> 761639 WARN  (OldIndexDirectoryCleanupThreadForCore-core1) [    x:core1] o.a.s.c.DirectoryFactory /Users/jenkins/workspace/Lucene-Solr-5.x-MacOSX/solr/core/src/test-files/solr/collection1/data/ does not point to a valid data directory; skipping clean-up of old index directories.
   [junit4]   2> 761640 INFO  (TEST-TestIndexSearcher.testSearcherListeners-seed#[2B3BC06C8E2CDF6D]) [    x:core1] o.a.s.c.SolrCore no updateRequestProcessorChain defined as default, creating implicit default
   [junit4]   2> 761644 INFO  (TEST-TestIndexSearcher.testSearcherListeners-seed#[2B3BC06C8E2CDF6D]) [    x:core1] o.a.s.h.l.XMLLoader xsltCacheLifetimeSeconds=60
   [junit4]   2> 761644 INFO  (TEST-TestIndexSearcher.testSearcherListeners-seed#[2B3BC06C8E2CDF6D]) [    x:core1] o.a.s.h.l.XMLLoader xsltCacheLifetimeSeconds=60
   [junit4]   2> 761645 INFO  (TEST-TestIndexSearcher.testSearcherListeners-seed#[2B3BC06C8E2CDF6D]) [    x:core1] o.a.s.h.l.XMLLoader xsltCacheLifetimeSeconds=60
   [junit4]   2> 761646 INFO  (TEST-TestIndexSearcher.testSearcherListeners-seed#[2B3BC06C8E2CDF6D]) [    x:core1] o.a.s.h.l.XMLLoader xsltCacheLifetimeSeconds=60
   [junit4]   2> 761647 INFO  (TEST-TestIndexSearcher.testSearcherListeners-seed#[2B3BC06C8E2CDF6D]) [    x:core1] o.a.s.c.RequestHandlers Registered paths: /admin/mbeans,standard,/update/csv,/update/json/docs,/admin/luke,/admin/segments,/get,/admin/system,/replication,/admin/properties,/config,/schema,/admin/plugins,/admin/logging,/update/json,/admin/threads,/admin/ping,/update,/admin/file
   [junit4]   2> 761647 INFO  (TEST-TestIndexSearcher.testSearcherListeners-seed#[2B3BC06C8E2CDF6D]) [    x:core1] o.a.s.c.SolrCore Using default statsCache cache: org.apache.solr.search.stats.LocalStatsCache
   [junit4]   2> 761648 INFO  (TEST-TestIndexSearcher.testSearcherListeners-seed#[2B3BC06C8E2CDF6D]) [    x:core1] o.a.s.u.CommitTracker Hard AutoCommit: disabled
   [junit4]   2> 761648 INFO  (TEST-TestIndexSearcher.testSearcherListeners-seed#[2B3BC06C8E2CDF6D]) [    x:core1] o.a.s.u.CommitTracker Soft AutoCommit: disabled
   [junit4]   2> 761648 INFO  (TEST-TestIndexSearcher.testSearcherListeners-seed#[2B3BC06C8E2CDF6D]) [    x:core1] o.a.s.u.RandomMergePolicy RandomMergePolicy wrapping class org.apache.lucene.index.TieredMergePolicy: [TieredMergePolicy: maxMergeAtOnce=43, maxMergeAtOnceExplicit=34, maxMergedSegmentMB=94.57421875, floorSegmentMB=0.46875, forceMergeDeletesPctAllowed=24.428707762183937, segmentsPerTier=20.0, maxCFSSegmentSizeMB=8.796093022207999E12, noCFSRatio=0.4499193397457505
   [junit4]   2> 761648 INFO  (TEST-TestIndexSearcher.testSearcherListeners-seed#[2B3BC06C8E2CDF6D]) [    x:core1] o.a.s.c.SolrDeletionPolicy SolrDeletionPolicy.onInit: commits: num=1
   [junit4]   2> 	commit{dir=MockDirectoryWrapper(RAMDirectory@5fb4ac84 lockFactory=org.apache.lucene.store.SingleInstanceLockFactory@250b8328),segFN=segments_1,generation=1}
   [junit4]   2> 761648 INFO  (TEST-TestIndexSearcher.testSearcherListeners-seed#[2B3BC06C8E2CDF6D]) [    x:core1] o.a.s.c.SolrDeletionPolicy newest commit generation = 1
   [junit4]   2> 761649 INFO  (TEST-TestIndexSearcher.testSearcherListeners-seed#[2B3BC06C8E2CDF6D]) [    x:core1] o.a.s.s.SolrIndexSearcher Opening Searcher@687d863e[core1] main
   [junit4]   2> 761649 WARN  (TEST-TestIndexSearcher.testSearcherListeners-seed#[2B3BC06C8E2CDF6D]) [    x:core1] o.a.s.r.ManagedResourceStorage Cannot write to config directory /Users/jenkins/workspace/Lucene-Solr-5.x-MacOSX/solr/core/src/test-files/solr/collection1/conf; switching to use InMemory storage instead.
   [junit4]   2> 761649 INFO  (TEST-TestIndexSearcher.testSearcherListeners-seed#[2B3BC06C8E2CDF6D]) [    x:core1] o.a.s.r.RestManager Initializing RestManager with initArgs: {}
   [junit4]   2> 761649 INFO  (TEST-TestIndexSearcher.testSearcherListeners-seed#[2B3BC06C8E2CDF6D]) [    x:core1] o.a.s.r.ManagedResourceStorage Reading _rest_managed.json using InMemoryStorage
   [junit4]   2> 761649 INFO  (TEST-TestIndexSearcher.testSearcherListeners-seed#[2B3BC06C8E2CDF6D]) [    x:core1] o.a.s.r.RestManager Initializing 0 registered ManagedResources
   [junit4]   2> 761649 INFO  (TEST-TestIndexSearcher.testSearcherListeners-seed#[2B3BC06C8E2CDF6D]) [    x:core1] o.a.s.h.ReplicationHandler Commits will be reserved for  10000
   [junit4]   2> 761649 INFO  (TEST-TestIndexSearcher.testSearcherListeners-seed#[2B3BC06C8E2CDF6D]) [    x:core1] o.a.s.c.CoreContainer registering core: core1
   [junit4]   2> 761650 INFO  (searcherExecutor-2632-thread-1-processing-x:core1) [    x:core1] o.a.s.c.SolrCore [core1] Registered new searcher Searcher@687d863e[core1] main{ExitableDirectoryReader(UninvertingDirectoryReader())}
   [junit4]   2> 761650 INFO  (TEST-TestIndexSearcher.testSearcherListeners-seed#[2B3BC06C8E2CDF6D]) [    x:core1] o.a.s.c.S.Request [core1]  webapp=null path=null params={q=*:*} hits=0 status=0 QTime=0
   [junit4]   2> 761651 INFO  (TEST-TestIndexSearcher.testSearcherListeners-seed#[2B3BC06C8E2CDF6D]) [    x:core1] o.a.s.u.p.LogUpdateProcessorFactory [core1]  webapp=null path=null params={}{add=[1]} 0 0
   [junit4]   2> 761653 INFO  (TEST-TestIndexSearcher.testSearcherListeners-seed#[2B3BC06C8E2CDF6D]) [    x:core1] o.a.s.s.SolrIndexSearcher Opening Searcher@6a975238[core1] main
   [junit4]   2> 761654 INFO  (searcherExecutor-2632-thread-1-processing-x:core1) [    x:core1] o.a.s.c.SolrCore [core1] Registered new searcher Searcher@6a975238[core1] main{ExitableDirectoryReader(UninvertingDirectoryReader(Uninverting(_0(5.5.0):c1)))}
   [junit4]   2> 761654 INFO  (TEST-TestIndexSearcher.testSearcherListeners-seed#[2B3BC06C8E2CDF6D]) [    x:core1] o.a.s.c.SolrCore [core1]  CLOSING SolrCore org.apache.solr.core.SolrCore@6c4a700a
   [junit4]   2> 761655 INFO  (TEST-TestIndexSearcher.testSearcherListeners-seed#[2B3BC06C8E2CDF6D]) [    x:core1] o.a.s.u.DirectUpdateHandler2 closing DirectUpdateHandler2{commits=0,autocommits=0,soft autocommits=0,optimizes=0,rollbacks=0,expungeDeletes=0,docsPending=1,adds=1,deletesById=0,deletesByQuery=0,errors=0,cumulative_adds=1,cumulative_deletesById=0,cumulative_deletesByQuery=0,cumulative_errors=0}
   [junit4]   2> 761655 INFO  (TEST-TestIndexSearcher.testSearcherListeners-seed#[2B3BC06C8E2CDF6D]) [    x:core1] o.a.s.u.SolrCoreState Closing SolrCoreState
   [junit4]   2> 761655 INFO  (TEST-TestIndexSearcher.testSearcherListeners-seed#[2B3BC06C8E2CDF6D]) [    x:core1] o.a.s.u.DefaultSolrCoreState SolrCoreState ref count has reached 0 - closing IndexWriter
   [junit4]   2> 761655 INFO  (TEST-TestIndexSearcher.testSearcherListeners-seed#[2B3BC06C8E2CDF6D]) [    x:core1] o.a.s.u.DefaultSolrCoreState closing IndexWriter with IndexWriterCloser
   [junit4]   2> 761655 INFO  (TEST-TestIndexSearcher.testSearcherListeners-seed#[2B3BC06C8E2CDF6D]) [    x:core1] o.a.s.c.SolrDeletionPolicy SolrDeletionPolicy.onCommit: commits: num=2
   [junit4]   2> 	commit{dir=MockDirectoryWrapper(RAMDirectory@5fb4ac84 lockFactory=org.apache.lucene.store.SingleInstanceLockFactory@250b8328),segFN=segments_1,generation=1}
   [junit4]   2> 	commit{dir=MockDirectoryWrapper(RAMDirectory@5fb4ac84 lockFactory=org.apache.lucene.store.SingleInstanceLockFactory@250b8328),segFN=segments_2,generation=2}
   [junit4]   2> 761655 INFO  (TEST-TestIndexSearcher.testSearcherListeners-seed#[2B3BC06C8E2CDF6D]) [    x:core1] o.a.s.c.SolrDeletionPolicy newest commit generation = 2
   [junit4]   2> 761656 INFO  (TEST-TestIndexSearcher.testSearcherListeners-seed#[2B3BC06C8E2CDF6D]) [    x:core1] o.a.s.c.SolrCore [core1] Closing main searcher on request.
   [junit4]   2> 761656 INFO  (TEST-TestIndexSearcher.testSearcherListeners-seed#[2B3BC06C8E2CDF6D]) [    x:core1] o.a.s.c.CachingDirectoryFactory Closing MockDirectoryFactory - 2 directories currently being tracked
   [junit4]   2> 761656 INFO  (TEST-TestIndexSearcher.testSearcherListeners-seed#[2B3BC06C8E2CDF6D]) [    x:core1] o.a.s.c.CachingDirectoryFactory looking to close /Users/jenkins/workspace/Lucene-Solr-5.x-MacOSX/solr/core/src/test-files/solr/collection1/data [CachedDir<<refCount=0;path=/Users/jenkins/workspace/Lucene-Solr-5.x-MacOSX/solr/core/src/test-files/solr/collection1/data;done=false>>]
   [junit4]   2> 761656 INFO  (TEST-TestIndexSearcher.testSearcherListeners-seed#[2B3BC06C8E2CDF6D]) [    x:core1] o.a.s.c.CachingDirectoryFactory Closing directory: /Users/jenkins/workspace/Lucene-Solr-5.x-MacOSX/solr/core/src/test-files/solr/collection1/data
   [junit4]   2> 761656 INFO  (TEST-TestIndexSearcher.testSearcherListeners-seed#[2B3BC06C8E2CDF6D]) [    x:core1] o.a.s.c.CachingDirectoryFactory looking to close /Users/jenkins/workspace/Lucene-Solr-5.x-MacOSX/solr/core/src/test-files/solr/collection1/data/index [CachedDir<<refCount=0;path=/Users/jenkins/workspace/Lucene-Solr-5.x-MacOSX/solr/core/src/test-files/solr/collection1/data/index;done=false>>]
   [junit4]   2> 761656 INFO  (TEST-TestIndexSearcher.testSearcherListeners-seed#[2B3BC06C8E2CDF6D]) [    x:core1] o.a.s.c.CachingDirectoryFactory Closing directory: /Users/jenkins/workspace/Lucene-Solr-5.x-MacOSX/solr/core/src/test-files/solr/collection1/data/index
   [junit4]   2> 761656 INFO  (TEST-TestIndexSearcher.testSearcherListeners-seed#[2B3BC06C8E2CDF6D]) [    x:core1] o.a.s.c.CoreDescriptor Created CoreDescriptor: {name=core1, config=solrconfig-searcher-listeners1.xml, loadOnStartup=true, schema=schema.xml, configSetProperties=configsetprops.json, transient=false, dataDir=data/}
   [junit4]   2> 761656 INFO  (TEST-TestIndexSearcher.testSearcherListeners-seed#[2B3BC06C8E2CDF6D]) [    x:core1] o.a.s.c.SolrResourceLoader new SolrResourceLoader for directory: '/Users/jenkins/workspace/Lucene-Solr-5.x-MacOSX/solr/core/src/test-files/solr/collection1'
   [junit4]   2> 761656 INFO  (TEST-TestIndexSearcher.testSearcherListeners-seed#[2B3BC06C8E2CDF6D]) [    x:core1] o.a.s.c.SolrResourceLoader JNDI not configured for solr (NoInitialContextEx)
   [junit4]   2> 761657 INFO  (TEST-TestIndexSearcher.testSearcherListeners-seed#[2B3BC06C8E2CDF6D]) [    x:core1] o.a.s.c.SolrResourceLoader using system property solr.solr.home: /Users/jenkins/workspace/Lucene-Solr-5.x-MacOSX/solr/core/src/test-files/solr
   [junit4]   2> 761657 INFO  (TEST-TestIndexSearcher.testSearcherListeners-seed#[2B3BC06C8E2CDF6D]) [    x:core1] o.a.s.c.SolrResourceLoader Adding 'file:/Users/jenkins/workspace/Lucene-Solr-5.x-MacOSX/solr/core/src/test-files/solr/collection1/lib/classes/' to classloader
   [junit4]   2> 761657 INFO  (TEST-TestIndexSearcher.testSearcherListeners-seed#[2B3BC06C8E2CDF6D]) [    x:core1] o.a.s.c.SolrResourceLoader Adding 'file:/Users/jenkins/workspace/Lucene-Solr-5.x-MacOSX/solr/core/src/test-files/solr/collection1/lib/README' to classloader
   [junit4]   2> 761730 INFO  (TEST-TestIndexSearcher.testSearcherListeners-seed#[2B3BC06C8E2CDF6D]) [    x:core1] o.a.s.c.SolrConfig current version of requestparams : -1
   [junit4]   2> 761733 INFO  (TEST-TestIndexSearcher.testSearcherListeners-seed#[2B3BC06C8E2CDF6D]) [    x:core1] o.a.s.c.SolrConfig Using Lucene MatchVersion: 5.5.0
   [junit4]   2> 761739 INFO  (TEST-TestIndexSearcher.testSearcherListeners-seed#[2B3BC06C8E2CDF6D]) [    x:core1] o.a.s.c.SolrConfig Loaded SolrConfig: solrconfig-searcher-listeners1.xml
   [junit4]   2> 761746 INFO  (TEST-TestIndexSearcher.testSearcherListeners-seed#[2B3BC06C8E2CDF6D]) [    x:core1] o.a.s.s.IndexSchema [core1] Schema name=test
   [junit4]   2> 761825 INFO  (TEST-TestIndexSearcher.testSearcherListeners-seed#[2B3BC06C8E2CDF6D]) [    x:core1] o.a.s.s.OpenExchangeRatesOrgProvider Initialized with rates=open-exchange-rates.json, refreshInterval=1440.
   [junit4]   2> 761831 INFO  (TEST-TestIndexSearcher.testSearcherListeners-seed#[2B3BC06C8E2CDF6D]) [    x:core1] o.a.s.s.IndexSchema default search field in schema is text
   [junit4]   2> 761831 INFO  (TEST-TestIndexSearcher.testSearcherListeners-seed#[2B3BC06C8E2CDF6D]) [    x:core1] o.a.s.s.IndexSchema unique key field: id
   [junit4]   2> 761835 INFO  (TEST-TestIndexSearcher.testSearcherListeners-seed#[2B3BC06C8E2CDF6D]) [    x:core1] o.a.s.s.FileExchangeRateProvider Reloading exchange rates from file currency.xml
   [junit4]   2> 761837 INFO  (TEST-TestIndexSearcher.testSearcherListeners-seed#[2B3BC06C8E2CDF6D]) [    x:core1] o.a.s.s.FileExchangeRateProvider Reloading exchange rates from file currency.xml
   [junit4]   2> 761838 INFO  (TEST-TestIndexSearcher.testSearcherListeners-seed#[2B3BC06C8E2CDF6D]) [    x:core1] o.a.s.s.OpenExchangeRatesOrgProvider Reloading exchange rates from open-exchange-rates.json
   [junit4]   2> 761838 INFO  (TEST-TestIndexSearcher.testSearcherListeners-seed#[2B3BC06C8E2CDF6D]) [    x:core1] o.a.s.s.OpenExchangeRatesOrgProvider Reloading exchange rates from open-exchange-rates.json
   [junit4]   2> 761842 INFO  (TEST-TestIndexSearcher.testSearcherListeners-seed#[2B3BC06C8E2CDF6D]) [    x:core1] o.a.s.c.ConfigSetProperties Did not find ConfigSet properties, assuming default properties: Can't find resource 'configsetprops.json' in classpath or '/Users/jenkins/workspace/Lucene-Solr-5.x-MacOSX/solr/core/src/test-files/solr/collection1'
   [junit4]   2> 761842 INFO  (TEST-TestIndexSearcher.testSearcherListeners-seed#[2B3BC06C8E2CDF6D]) [    x:core1] o.a.s.c.CoreContainer Creating SolrCore 'core1' using configuration from instancedir /Users/jenkins/workspace/Lucene-Solr-5.x-MacOSX/solr/core/src/test-files/solr/collection1
   [junit4]   2> 761842 INFO  (TEST-TestIndexSearcher.testSearcherListeners-seed#[2B3BC06C8E2CDF6D]) [    x:core1] o.a.s.c.SolrCore org.apache.solr.core.MockDirectoryFactory
   [junit4]   2> 761842 INFO  (TEST-TestIndexSearcher.testSearcherListeners-seed#[2B3BC06C8E2CDF6D]) [    x:core1] o.a.s.c.SolrCore [[core1] ] Opening new SolrCore at [/Users/jenkins/workspace/Lucene-Solr-5.x-MacOSX/solr/core/src/test-files/solr/collection1], dataDir=[/Users/jenkins/workspace/Lucene-Solr-5.x-MacOSX/solr/core/src/test-files/solr/collection1/data/]
   [junit4]   2> 761843 INFO  (TEST-TestIndexSearcher.testSearcherListeners-seed#[2B3BC06C8E2CDF6D]) [    x:core1] o.a.s.c.SolrCore JMX monitoring not detected for core: core1
   [junit4]   2> 761843 INFO  (TEST-TestIndexSearcher.testSearcherListeners-seed#[2B3BC06C8E2CDF6D]) [    x:core1] o.a.s.c.CachingDirectoryFactory return new directory for /Users/jenkins/workspace/Lucene-Solr-5.x-MacOSX/solr/core/src/test-files/solr/collection1/data
   [junit4]   2> 761843 INFO  (TEST-TestIndexSearcher.testSearcherListeners-seed#[2B3BC06C8E2CDF6D]) [    x:core1] o.a.s.c.SolrCore New index directory detected: old=null new=/Users/jenkins/workspace/Lucene-Solr-5.x-MacOSX/solr/core/src/test-files/solr/collection1/data/index/
   [junit4]   2> 761843 WARN  (TEST-TestIndexSearcher.testSearcherListeners-seed#[2B3BC06C8E2CDF6D]) [    x:core1] o.a.s.c.SolrCore [core1] Solr index directory '/Users/jenkins/workspace/Lucene-Solr-5.x-MacOSX/solr/core/src/test-files/solr/collection1/data/index' doesn't exist. Creating new index...
   [junit4]   2> 761843 INFO  (TEST-TestIndexSearcher.testSearcherListeners-seed#[2B3BC06C8E2CDF6D]) [    x:core1] o.a.s.c.CachingDirectoryFactory return new directory for /Users/jenkins/workspace/Lucene-Solr-5.x-MacOSX/solr/core/src/test-files/solr/collection1/data/index
   [junit4]   2> 761843 INFO  (TEST-TestIndexSearcher.testSearcherListeners-seed#[2B3BC06C8E2CDF6D]) [    x:core1] o.a.s.u.RandomMergePolicy RandomMergePolicy wrapping class org.apache.lucene.index.TieredMergePolicy: [TieredMergePolicy: maxMergeAtOnce=12, maxMergeAtOnceExplicit=30, maxMergedSegmentMB=89.1201171875, floorSegmentMB=1.0087890625, forceMergeDeletesPctAllowed=16.5537153614172, segmentsPerTier=10.0, maxCFSSegmentSizeMB=8.796093022207999E12, noCFSRatio=1.0
   [junit4]   2> 761844 INFO  (TEST-TestIndexSearcher.testSearcherListeners-seed#[2B3BC06C8E2CDF6D]) [    x:core1] o.a.s.c.SolrDeletionPolicy SolrDeletionPolicy.onCommit: commits: num=1
   [junit4]   2> 	commit{dir=MockDirectoryWrapper(RAMDirectory@53282b5a lockFactory=org.apache.lucene.store.SingleInstanceLockFactory@469e71fe),segFN=segments_1,generation=1}
   [junit4]   2> 761844 INFO  (TEST-TestIndexSearcher.testSearcherListeners-seed#[2B3BC06C8E2CDF6D]) [    x:core1] o.a.s.c.SolrDeletionPolicy newest commit generation = 1
   [junit4]   2> 761845 INFO  (OldIndexDirectoryCleanupThreadForCore-core1) [    x:core1] o.a.s.c.SolrCore Looking for old index directories to cleanup for core core1 in /Users/jenkins/workspace/Lucene-Solr-5.x-MacOSX/solr/core/src/test-files/solr/collection1/data/
   [junit4]   2> 761845 WARN  (OldIndexDirectoryCleanupThreadForCore-core1) [    x:core1] o.a.s.c.DirectoryFactory /Users/jenkins/workspace/Lucene-Solr-5.x-MacOSX/solr/core/src/test-files/solr/collection1/data/ does not point to a valid data directory; skipping clean-up of old index directories.
   [junit4]   2> 761846 INFO  (TEST-TestIndexSearcher.testSearcherListeners-seed#[2B3BC06C8E2CDF6D]) [    x:core1] o.a.s.c.SolrCore no updateRequestProcessorChain defined as default, creating implicit default
   [junit4]   2> 761850 INFO  (TEST-TestIndexSearcher.testSearcherListeners-seed#[2B3BC06C8E2CDF6D]) [    x:core1] o.a.s.h.l.XMLLoader xsltCacheLifetimeSeconds=60
   [junit4]   2> 761850 INFO  (TEST-TestIndexSearcher.testSearcherListeners-seed#[2B3BC06C8E2CDF6D]) [    x:core1] o.a.s.h.l.XMLLoader xsltCacheLifetimeSeconds=60
   [junit4]   2> 761851 INFO  (TEST-TestIndexSearcher.testSearcherListeners-seed#[2B3BC06C8E2CDF6D]) [    x:core1] o.a.s.h.l.XMLLoader xsltCacheLifetimeSeconds=60
   [junit4]   2> 761852 INFO  (TEST-TestIndexSearcher.testSearcherListeners-seed#[2B3BC06C8E2CDF6D]) [    x:core1] o.a.s.h.l.XMLLoader xsltCacheLifetimeSeconds=60
   [junit4]   2> 761853 INFO  (TEST-TestIndexSearcher.testSearcherListeners-seed#[2B3BC06C8E2CDF6D]) [    x:core1] o.a.s.c.RequestHandlers Registered paths: /admin/mbeans,standard,/update/csv,/update/json/docs,/admin/luke,/admin/segments,/get,/admin/system,/replication,/admin/properties,/config,/schema,/admin/plugins,/admin/logging,/update/json,/admin/threads,/admin/ping,/update,/admin/file
   [junit4]   2> 761853 INFO  (TEST-TestIndexSearcher.testSearcherListeners-seed#[2B3BC06C8E2CDF6D]) [    x:core1] o.a.s.c.SolrCore Using default statsCache cache: org.apache.solr.search.stats.LocalStatsCache
   [junit4]   2> 761854 INFO  (TEST-TestIndexSearcher.testSearcherListeners-seed#[2B3BC06C8E2CDF6D]) [    x:core1] o.a.s.u.CommitTracker Hard AutoCommit: disabled
   [junit4]   2> 761854 INFO  (TEST-TestIndexSearcher.testSearcherListeners-seed#[2B3BC06C8E2CDF6D]) [    x:core1] o.a.s.u.CommitTracker Soft AutoCommit: disabled
   [junit4]   2> 761854 INFO  (TEST-TestIndexSearcher.testSearcherListeners-seed#[2B3BC06C8E2CDF6D]) [    x:core1] o.a.s.u.RandomMergePolicy RandomMergePolicy wrapping class org.apache.lucene.index.TieredMergePolicy: [TieredMergePolicy: maxMergeAtOnce=14, maxMergeAtOnceExplicit=16, maxMergedSegmentMB=83.6591796875, floorSegmentMB=1.7421875, forceMergeDeletesPctAllowed=25.41777427609618, segmentsPerTier=14.0, maxCFSSegmentSizeMB=8.796093022207999E12, noCFSRatio=0.18945195816781313
   [junit4]   2> 761854 INFO  (TEST-TestIndexSearcher.testSearcherListeners-seed#[2B3BC06C8E2CDF6D]) [    x:core1] o.a.s.c.SolrDeletionPolicy SolrDeletionPolicy.onInit: commits: num=1
   [junit4]   2> 	commit{dir=MockDirectoryWrapper(RAMDirectory@53282b5a lockFactory=org.apache.lucene.store.SingleInstanceLockFactory@469e71fe),segFN=segments_1,generation=1}
   [junit4]   2> 761854 INFO  (TEST-TestIndexSearcher.testSearcherListeners-seed#[2B3BC06C8E2CDF6D]) [    x:core1] o.a.s.c.SolrDeletionPolicy newest commit generation = 1
   [junit4]   2> 761854 INFO  (TEST-TestIndexSearcher.testSearcherListeners-seed#[2B3BC06C8E2CDF6D]) [    x:core1] o.a.s.s.SolrIndexSearcher Opening Searcher@28da0b4e[core1] main
   [junit4]   2> 761855 WARN  (TEST-TestIndexSearcher.testSearcherListeners-seed#[2B3BC06C8E2CDF6D]) [    x:core1] o.a.s.r.ManagedResourceStorage Cannot write to config directory /Users/jenkins/workspace/Lucene-Solr-5.x-MacOSX/solr/core/src/test-files/solr/collection1/conf; switching to use InMemory storage instead.
   [junit4]   2> 761855 INFO  (TEST-TestIndexSearcher.testSearcherListeners-seed#[2B3BC06C8E2CDF6D]) [    x:core1] o.a.s.r.RestManager Initializing RestManager with initArgs: {}
   [junit4]   2> 761855 INFO  (TEST-TestIndexSearcher.testSearcherListeners-seed#[2B3BC06C8E2CDF6D]) [    x:core1] o.a.s.r.ManagedResourceStorage Reading _rest_managed.json using InMemoryStorage
   [junit4]   2> 761855 INFO  (TEST-TestIndexSearcher.testSearcherListeners-seed#[2B3BC06C8E2CDF6D]) [    x:core1] o.a.s.r.RestManager Initializing 0 registered ManagedResources
   [junit4]   2> 761855 INFO  (TEST-TestIndexSearcher.testSearcherListeners-seed#[2B3BC06C8E2CDF6D]) [    x:core1] o.a.s.h.ReplicationHandler Commits will be reserved for  10000
   [junit4]   2> 761855 INFO  (searcherExecutor-2636-thread-1-processing-x:core1) [    x:core1] o.a.s.c.SolrCore [core1] Registered new searcher Searcher@28da0b4e[core1] main{ExitableDirectoryReader(UninvertingDirectoryReader())}
   [junit4]   2> 761855 INFO  (TEST-TestIndexSearcher.testSearcherListeners-seed#[2B3BC06C8E2CDF6D]) [    x:core1] o.a.s.c.CoreContainer registering core: core1
   [junit4]   2> 761855 INFO  (TEST-TestIndexSearcher.testSearcherListeners-seed#[2B3BC06C8E2CDF6D]) [    x:core1] o.a.s.c.S.Request [core1]  webapp=null path=null params={q=*:*} hits=0 status=0 QTime=0
   [junit4]   2> 761856 INFO  (TEST-TestIndexSearcher.testSearcherListeners-seed#[2B3BC06C8E2CDF6D]) [    x:core1] o.a.s.u.p.LogUpdateProcessorFactory [core1]  webapp=null path=null params={}{add=[1]} 0 0
   [junit4]   2> 761858 INFO  (TEST-TestIndexSearcher.testSearcherListeners-seed#[2B3BC06C8E2CDF6D]) [    x:core1] o.a.s.s.SolrIndexSearcher Opening Searcher@3b8c8ca1[core1] main
   [junit4]   2> 761858 INFO  (searcherExecutor-2636-thread-1-processing-x:core1) [    x:core1] o.a.s.c.SolrCore [core1] Registered new searcher Searcher@3b8c8ca1[core1] main{ExitableDirectoryReader(UninvertingDirectoryReader(Uninverting(_0(5.5.0):c1)))}
   [junit4]   2> 761858 INFO  (TEST-TestIndexSearcher.testSearcherListeners-seed#[2B3BC06C8E2CDF6D]) [    x:core1] o.a.s.c.SolrCore [core1]  CLOSING SolrCore org.apache.solr.core.SolrCore@2411b38d
   [junit4]   2> 761858 INFO  (TEST-TestIndexSearcher.testSearcherListeners-seed#[2B3BC06C8E2CDF6D]) [    x:core1] o.a.s.u.DirectUpdateHandler2 closing DirectUpdateHandler2{commits=0,autocommits=0,soft autocommits=0,optimizes=0,rollbacks=0,expungeDeletes=0,docsPending=1,adds=1,deletesById=0,deletesByQuery=0,errors=0,cumulative_adds=1,cumulative_deletesById=0,cumulative_deletesByQuery=0,cumulative_errors=0}
   [junit4]   2> 761858 INFO  (TEST-TestIndexSearcher.testSearcherListeners-seed#[2B3BC06C8E2CDF6D]) [    x:core1] o.a.s.u.SolrCoreState Closing SolrCoreState
   [junit4]   2> 761858 INFO  (TEST-TestIndexSearcher.testSearcherListeners-seed#[2B3BC06C8E2CDF6D]) [    x:core1] o.a.s.u.DefaultSolrCoreState SolrCoreState ref count has reached 0 - closing IndexWriter
   [junit4]   2> 761858 INFO  (TEST-TestIndexSearcher.testSearcherListeners-seed#[2B3BC06C8E2CDF6D]) [    x:core1] o.a.s.u.DefaultSolrCoreState closing IndexWriter with IndexWriterCloser
   [junit4]   2> 761859 INFO  (TEST-TestIndexSearcher.testSearcherListeners-seed#[2B3BC06C8E2CDF6D]) [    x:core1] o.a.s.c.SolrDeletionPolicy SolrDeletionPolicy.onCommit: commits: num=2
   [junit4]   2> 	commit{dir=MockDirectoryWrapper(RAMDirectory@53282b5a lockFactory=org.apache.lucene.store.SingleInstanceLockFactory@469e71fe),segFN=segments_1,generation=1}
   [junit4]   2> 	commit{dir=MockDirectoryWrapper(RAMDirectory@53282b5a lockFactory=org.apache.lucene.store.SingleInstanceLockFactory@469e71fe),segFN=segments_2,generation=2}
   [junit4]   2> 761859 INFO  (TEST-TestIndexSearcher.testSearcherListeners-seed#[2B3BC06C8E2CDF6D]) [    x:core1] o.a.s.c.SolrDeletionPolicy newest commit generation = 2
   [junit4]   2> 761859 INFO  (TEST-TestIndexSearcher.testSearcherListeners-seed#[2B3BC06C8E2CDF6D]) [    x:core1] o.a.s.c.SolrCore [core1] Closing main searcher on request.
   [junit4]   2> 761859 INFO  (TEST-TestIndexSearcher.testSearcherListeners-seed#[2B3BC06C8E2CDF6D]) [    x:core1] o.a.s.c.CachingDirectoryFactory Closing MockDirectoryFactory - 2 directories currently being tracked
   [junit4]   2> 761859 INFO  (TEST-TestIndexSearcher.testSearcherListeners-seed#[2B3BC06C8E2CDF6D]) [    x:core1] o.a.s.c.CachingDirectoryFactory looking to close /Users/jenkins/workspace/Lucene-Solr-5.x-MacOSX/solr/core/src/test-files/solr/collection1/data/index [CachedDir<<refCount=0;path=/Users/jenkins/workspace/Lucene-Solr-5.x-MacOSX/solr/core/src/test-files/solr/collection1/data/index;done=false>>]
   [junit4]   2> 761859 INFO  (TEST-TestIndexSearcher.testSearcherListeners-seed#[2B3BC06C8E2CDF6D]) [    x:core1] o.a.s.c.CachingDirectoryFactory Closing directory: /Users/jenkins/workspace/Lucene-Solr-5.x-MacOSX/solr/core/src/test-files/solr/collection1/data/index
   [junit4]   2> 761859 INFO  (TEST-TestIndexSearcher.testSearcherListeners-seed#[2B3BC06C8E2CDF6D]) [    x:core1] o.a.s.c.CachingDirectoryFactory looking to close /Users/jenkins/workspace/Lucene-Solr-5.x-MacOSX/solr/core/src/test-files/solr/collection1/data [CachedDir<<refCount=0;path=/Users/jenkins/workspace/Lucene-Solr-5.x-MacOSX/solr/core/src/test-files/solr/collection1/data;done=false>>]
   [junit4]   2> 761859 INFO  (TEST-TestIndexSearcher.testSearcherListeners-seed#[2B3BC06C8E2CDF6D]) [    x:core1] o.a.s.c.CachingDirectoryFactory Closing directory: /Users/jenkins/workspace/Lucene-Solr-5.x-MacOSX/solr/core/src/test-files/solr/collection1/data
   [junit4]   2> 761860 INFO  (TEST-TestIndexSearcher.testSearcherListeners-seed#[2B3BC06C8E2CDF6D]) [    x:core1] o.a.s.c.CoreDescriptor Created CoreDescriptor: {name=core1, config=solrconfig-searcher-listeners1.xml, loadOnStartup=true, schema=schema.xml, configSetProperties=configsetprops.json, transient=false, dataDir=data/}
   [junit4]   2> 761860 INFO  (TEST-TestIndexSearcher.testSearcherListeners-seed#[2B3BC06C8E2CDF6D]) [    x:core1] o.a.s.c.SolrResourceLoader new SolrResourceLoader for directory: '/Users/jenkins/workspace/Lucene-Solr-5.x-MacOSX/solr/core/src/test-files/solr/collection1'
   [junit4]   2> 761860 INFO  (TEST-TestIndexSearcher.testSearcherListeners-seed#[2B3BC06C8E2CDF6D]) [    x:core1] o.a.s.c.SolrResourceLoader JNDI not configured for solr (NoInitialContextEx)
   [junit4]   2> 761860 INFO  (TEST-TestIndexSearcher.testSearcherListeners-seed#[2B3BC06C8E2CDF6D]) [    x:core1] o.a.s.c.SolrResourceLoader using system property solr.solr.home: /Users/jenkins/workspace/Lucene-Solr-5.x-MacOSX/solr/core/src/test-files/solr
   [junit4]   2> 761861 INFO  (TEST-TestIndexSearcher.testSearcherListeners-seed#[2B3BC06C8E2CDF6D]) [    x:core1] o.a.s.c.SolrResourceLoader Adding 'file:/Users/jenkins/workspace/Lucene-Solr-5.x-MacOSX/solr/core/src/test-files/solr/collection1/lib/classes/' to classloader
   [junit4]   2> 761861 INFO  (TEST-TestIndexSearcher.testSearcherListeners-seed#[2B3BC06C8E2CDF6D]) [    x:core1] o.a.s.c.SolrResourceLoader Adding 'file:/Users/jenkins/workspace/Lucene-Solr-5.x-MacOSX/solr/core/src/test-files/solr/collection1/lib/README' to classloader
   [junit4]   2> 761897 INFO  (TEST-TestIndexSearcher.testSearcherListeners-seed#[2B3BC06C8E2CDF6D]) [    x:core1] o.a.s.c.SolrConfig current version of requestparams : -1
   [junit4]   2> 761898 INFO  (TEST-TestIndexSearcher.testSearcherListeners-seed#[2B3BC06C8E2CDF6D]) [    x:core1] o.a.s.c.SolrConfig Using Lucene MatchVersion: 5.5.0
   [junit4]   2> 761907 INFO  (TEST-TestIndexSearcher.testSearcherListeners-seed#[2B3BC06C8E2CDF6D]) [    x:core1] o.a.s.c.SolrConfig Loaded SolrConfig: solrconfig-searcher-listeners1.xml
   [junit4]   2> 761911 INFO  (TEST-TestIndexSearcher.testSearcherListeners-seed#[2B3BC06C8E2CDF6D]) [    x:core1] o.a.s.s.IndexSchema [core1] Schema name=test
   [junit4]   2> 761980 INFO  (TEST-TestIndexSearcher.testSearcherListeners-seed#[2B3BC06C8E2CDF6D]) [    x:core1] o.a.s.s.OpenExchangeRatesOrgProvider Initialized with rates=open-exchange-rates.json, refreshInterval=1440.
   [junit4]   2> 761986 INFO  (TEST-TestIndexSearcher.testSearcherListeners-seed#[2B3BC06C8E2CDF6D]) [    x:core1] o.a.s.s.IndexSchema default search field in schema is text
   [junit4]   2> 761987 INFO  (TEST-TestIndexSearcher.testSearcherListeners-seed#[2B3BC06C8E2CDF6D]) [    x:core1] o.a.s.s.IndexSchema unique key field: id
   [junit4]   2> 761990 INFO  (TEST-TestIndexSearcher.testSearcherListeners-seed#[2B3BC06C8E2CDF6D]) [    x:core1] o.a.s.s.FileExchangeRateProvider Reloading exchange rates from file currency.xml
   [junit4]   2> 761992 INFO  (TEST-TestIndexSearcher.testSearcherListeners-seed#[2B3BC06C8E2CDF6D]) [    x:core1] o.a.s.s.FileExchangeRateProvider Reloading exchange rates from file currency.xml
   [junit4]   2> 761993 INFO  (TEST-TestIndexSearcher.testSearcherListeners-seed#[2B3BC06C8E2CDF6D]) [    x:core1] o.a.s.s.OpenExchangeRatesOrgProvider Reloading exchange rates from open-exchange-rates.json
   [junit4]   2> 761994 INFO  (TEST-TestIndexSearcher.testSearcherListeners-seed#[2B3BC06C8E2CDF6D]) [    x:core1] o.a.s.s.OpenExchangeRatesOrgProvider Reloading exchange rates from open-exchange-rates.json
   [junit4]   2> 761997 INFO  (TEST-TestIndexSearcher.testSearcherListeners-seed#[2B3BC06C8E2CDF6D]) [    x:core1] o.a.s.c.ConfigSetProperties Did not find ConfigSet properties, assuming default properties: Can't find resource 'configsetprops.json' in classpath or '/Users/jenkins/workspace/Lucene-Solr-5.x-MacOSX/solr/core/src/test-files/solr/collection1'
   [junit4]   2> 761997 INFO  (TEST-TestIndexSearcher.testSearcherListeners-seed#[2B3BC06C8E2CDF6D]) [    x:core1] o.a.s.c.CoreContainer Creating SolrCore 'core1' using configuration from instancedir /Users/jenkins/workspace/Lucene-Solr-5.x-MacOSX/solr/core/src/test-files/solr/collection1
   [junit4]   2> 761997 INFO  (TEST-TestIndexSearcher.testSearcherListeners-seed#[2B3BC06C8E2CDF6D]) [    x:core1] o.a.s.c.SolrCore org.apache.solr.core.MockDirectoryFactory
   [junit4]   2> 761998 INFO  (TEST-TestIndexSearcher.testSearcherListeners-seed#[2B3BC06C8E2CDF6D]) [    x:core1] o.a.s.c.SolrCore [[core1] ] Opening new SolrCore at [/Users/jenkins/workspace/Lucene-Solr-5.x-MacOSX/solr/core/src/test-files/solr/collection1], dataDir=[/Users/jenkins/workspace/Lucene-Solr-5.x-MacOSX/solr/core/src/test-files/solr/collection1/data/]
   [junit4]   2> 761998 INFO  (TEST-TestIndexSearcher.testSearcherListeners-seed#[2B3BC06C8E2CDF6D]) [    x:core1] o.a.s.c.SolrCore JMX monitoring not detected for core: core1
   [junit4]   2> 761998 INFO  (TEST-TestIndexSearcher.testSearcherListeners-seed#[2B3BC06C8E2CDF6D]) [    x:core1] o.a.s.c.CachingDirectoryFactory return new directory for /Users/jenkins/workspace/Lucene-Solr-5.x-MacOSX/solr/core/src/test-files/solr/collection1/data
   [junit4]   2> 761998 INFO  (TEST-TestIndexSearcher.testSearcherListeners-seed#[2B3BC06C8E2CDF6D]) [    x:core1] o.a.s.c.SolrCore New index directory detected: old=null new=/Users/jenkins/workspace/Lucene-Solr-5.x-MacOSX/solr/core/src/test-files/solr/collection1/data/index/
   [junit4]   2> 761998 WARN  (TEST-TestIndexSearcher.testSearcherListeners-seed#[2B3BC06C8E2CDF6D]) [    x:core1] o.a.s.c.SolrCore [core1] Solr index directory '/Users/jenkins/workspace/Lucene-Solr-5.x-MacOSX/solr/core/src/test-files/solr/collection1/data/index' doesn't exist. Creating new index...
   [junit4]   2> 761998 INFO  (TEST-TestIndexSearcher.testSearcherListeners-seed#[2B3BC06C8E2CDF6D]) [    x:core1] o.a.s.c.CachingDirectoryFactory return new directory for /Users/jenkins/workspace/Lucene-Solr-5.x-MacOSX/solr/core/src/test-files/solr/collection1/data/index
   [junit4]   2> 761999 INFO  (TEST-TestIndexSearcher.testSearcherListeners-seed#[2B3BC06C8E2CDF6D]) [    x:core1] o.a.s.u.RandomMergePolicy RandomMergePolicy wrapping class org.apache.lucene.index.LogDocMergePolicy: [LogDocMergePolicy: minMergeSize=1000, mergeFactor=49, maxMergeSize=9223372036854775807, maxMergeSizeForForcedMerge=9223372036854775807, calibrateSizeByDeletes=false, maxMergeDocs=2147483647, maxCFSSegmentSizeMB=8.796093022207999E12, noCFSRatio=1.0]
   [junit4]   2> 761999 INFO  (TEST-TestIndexSearcher.testSearcherListeners-seed#[2B3BC06C8E2CDF6D]) [    x:core1] o.a.s.c.SolrDeletionPolicy SolrDeletionPolicy.onCommit: commits: num=1
   [junit4]   2> 	commit{dir=MockDirectoryWrapper(RAMDirectory@50ebac99 lockFactory=org.apache.lucene.store.SingleInstanceLockFactory@3ff56f82),segFN=segments_1,generation=1}
   [junit4]   2> 761999 INFO  (TEST-TestIndexSearcher.testSearcherListeners-seed#[2B3BC06C8E2CDF6D]) [    x:core1] o.a.s.c.SolrDeletionPolicy newest commit generation = 1
   [junit4]   2> 762000 INFO  (OldIndexDirectoryCleanupThreadForCore-core1) [    x:core1] o.a.s.c.SolrCore Looking for old index directories to cleanup for core core1 in /Users/jenkins/workspace/Lucene-Solr-5.x-MacOSX/solr/core/src/test-files/solr/collection1/data/
   [junit4]   2> 762000 WARN  (OldIndexDirectoryCleanupThreadForCore-core1) [    x:core1] o.a.s.c.DirectoryFactory /Users/jenkins/workspace/Lucene-Solr-5.x-MacOSX/solr/core/src/test-files/solr/collection1/data/ does not point to a valid data directory; skipping clean-up of old index directories.
   [junit4]   2> 762001 INFO  (TEST-TestIndexSearcher.testSearcherListeners-seed#[2B3BC06C8E2CDF6D]) [    x:core1] o.a.s.c.SolrCore no updateRequestProcessorChain defined as default, creating implicit default
   [junit4]   2> 762005 INFO  (TEST-TestIndexSearcher.testSearcherListeners-seed#[2B3BC06C8E2CDF6D]) [    x:core1] o.a.s.h.l.XMLLoader xsltCacheLifetimeSeconds=60
   [junit4]   2> 762006 INFO  (TEST-TestIndexSearcher.testSearcherListeners-seed#[2B3BC06C8E2CDF6D]) [    x:core1] o.a.s.h.l.XMLLoader xsltCacheLifetimeSeconds=60
   [junit4]   2> 762006 INFO  (TEST-TestIndexSearcher.testSearcherListeners-seed#[2B3BC06C8E2CDF6D]) [    x:core1] o.a.s.h.l.XMLLoader xsltCacheLifetimeSeconds=60
   [junit4]   2> 762007 INFO  (TEST-TestIndexSearcher.testSearcherListeners-seed#[2B3BC06C8E2CDF6D]) [    x:core1] o.a.s.h.l.XMLLoader xsltCacheLifetimeSeconds=60
   [junit4]   2> 762008 INFO  (TEST-TestIndexSearcher.testSearcherListeners-seed#[2B3BC06C8E2CDF6D]) [    x:core1] o.a.s.c.RequestHandlers Registered paths: /admin/mbeans,standard,/update/csv,/update/json/docs,/admin/luke,/admin/segments,/get,/admin/system,/replication,/admin/properties,/config,/schema,/admin/plugins,/admin/logging,/update/json,/admin/threads,/admin/ping,/update,/admin/file
   [junit4]   2> 762009 INFO  (TEST-TestIndexSearcher.testSearcherListeners-seed#[2B3BC06C8E2CDF6D]) [    x:core1] o.a.s.c.SolrCore Using default statsCache cache: org.apache.solr.search.stats.LocalStatsCache
   [junit4]   2> 762009 INFO  (TEST-TestIndexSearcher.testSearcherListeners-seed#[2B3BC06C8E2CDF6D]) [    x:core1] o.a.s.u.CommitTracker Hard AutoCommit: disabled
   [junit4]   2> 762009 INFO  (TEST-TestIndexSearcher.testSearcherListeners-seed#[2B3BC06C8E2CDF6D]) [    x:core1] o.a.s.u.CommitTracker Soft AutoCommit: disabled
   [junit4]   2> 762009 INFO  (TEST-TestIndexSearcher.testSearcherListeners-seed#[2B3BC06C8E2CDF6D]) [    x:core1] o.a.s.u.RandomMergePolicy RandomMergePolicy wrapping class org.apache.lucene.index.LogByteSizeMergePolicy: [LogByteSizeMergePolicy: minMergeSize=1677721, mergeFactor=36, maxMergeSize=2147483648, maxMergeSizeForForcedMerge=9223372036854775807, calibrateSizeByDeletes=true, maxMergeDocs=2147483647, maxCFSSegmentSizeMB=8.796093022207999E12, noCFSRatio=0.7716295558815618]
   [junit4]   2> 762010 INFO  (TEST-TestIndexSearcher.testSearcherListeners-seed#[2B3BC06C8E2CDF6D]) [    x:core1] o.a.s.c.SolrDeletionPolicy SolrDeletionPolicy.onInit: commits: num=1
   [junit4]   2> 	commit{dir=MockDirectoryWrapper(RAMDirectory@50ebac99 lockFactory=org.apache.lucene.store.SingleInstanceLockFactory@3ff56f82),segFN=segments_1,generation=1}
   [junit4]   2> 762010 INFO  (TEST-TestIndexSearcher.testSearcherListeners-seed#[2B3BC06C8E2CDF6D]) [    x:core1] o.a.s.c.SolrDeletionPolicy newest commit generation = 1
   [junit4]   2> 762010 INFO  (TEST-TestIndexSearcher.testSearcherListeners-seed#[2B3BC06C8E2CDF6D]) [    x:core1] o.a.s.s.SolrIndexSearcher Opening Searcher@ec391d0[core1] main
   [junit4]   2> 762010 WARN  (TEST-TestIndexSearcher.testSearcherListeners-seed#[2B3BC06C8E2CDF6D]) [    x:core1] o.a.s.r.ManagedResourceStorage Cannot write to config directory /Users/jenkins/workspace/Lucene-Solr-5.x-MacOSX/solr/core/src/test-files/solr/collection1/conf; switching to use InMemory storage instead.
   [junit4]   2> 762010 INFO  (TEST-TestIndexSearcher.testSearcherListeners-seed#[2B3BC06C8E2CDF6D]) [    x:core1] o.a.s.r.RestManager Initializing RestManager with initArgs: {}
   [junit4]   2> 762010 INFO  (TEST-TestIndexSearcher.testSearcherListeners-seed#[2B3BC06C8E2CDF6D]) [    x:core1] o.a.s.r.ManagedResourceStorage Reading _rest_managed.json using InMemoryStorage
   [junit4]   2> 762010 INFO  (TEST-TestIndexSearcher.testSearcherListeners-seed#[2B3BC06C8E2CDF6D]) [    x:core1] o.a.s.r.RestManager Initializing 0 registered ManagedResources
   [junit4]   2> 762010 INFO  (TEST-TestIndexSearcher.testSearcherListeners-seed#[2B3BC06C8E2CDF6D]) [    x:core1] o.a.s.h.ReplicationHandler Commits will be reserved for  10000
   [junit4]   2> 762011 INFO  (searcherExecutor-2640-thread-1-processing-x:core1) [    x:core1] o.a.s.c.SolrCore [core1] Registered new searcher Searcher@ec391d0[core1] main{ExitableDirectoryReader(UninvertingDirectoryReader())}
   [junit4]   2> 762011 INFO  (TEST-TestIndexSearcher.testSearcherListeners-seed#[2B3BC06C8E2CDF6D]) [    x:core1] o.a.s.c.CoreContainer registering core: core1
   [junit4]   2> 762011 INFO  (TEST-TestIndexSearcher.testSearcherListeners-seed#[2B3BC06C8E2CDF6D]) [    x:core1] o.a.s.c.S.Request [core1]  webapp=null path=null params={q=*:*} hits=0 status=0 QTime=0
   [junit4]   2> 762011 INFO  (TEST-TestIndexSearcher.testSearcherListeners-seed#[2B3BC06C8E2CDF6D]) [    x:core1] o.a.s.u.p.LogUpdateProcessorFactory [core1]  webapp=null path=null params={}{add=[1]} 0 0
   [junit4]   2> 762013 INFO  (TEST-TestIndexSearcher.testSearcherListeners-seed#[2B3BC06C8E2CDF6D]) [    x:core1] o.a.s.s.SolrIndexSearcher Opening Searcher@2ca5c517[core1] main
   [junit4]   2> 762013 INFO  (searcherExecutor-2640-thread-1-processing-x:core1) [    x:core1] o.a.s.c.SolrCore [core1] Registered new searcher Searcher@2ca5c517[core1] main{ExitableDirectoryReader(UninvertingDirectoryReader(Uninverting(_0(5.5.0):c1)))}
   [junit4]   2> 762013 INFO  (TEST-TestIndexSearcher.testSearcherListeners-seed#[2B3BC06C8E2CDF6D]) [    x:core1] o.a.s.c.SolrCore [core1]  CLOSING SolrCore org.apache.solr.core.SolrCore@359d668
   [junit4]   2> 762013 INFO  (TEST-TestIndexSearcher.testSearcherListeners-seed#[2B3BC06C8E2CDF6D]) [    x:core1] o.a.s.u.DirectUpdateHandler2 closing DirectUpdateHandler2{commits=0,autocommits=0,soft autocommits=0,optimizes=0,rollbacks=0,expungeDeletes=0,docsPending=1,adds=1,deletesById=0,deletesByQuery=0,errors=0,cumulative_adds=1,cumulative_deletesById=0,cumulative_deletesByQuery=0,cumulative_errors=0}
   [junit4]   2> 762013 INFO  (TEST-TestIndexSearcher.testSearcherListeners-seed#[2B3BC06C8E2CDF6D]) [    x:core1] o.a.s.u.SolrCoreState Closing SolrCoreState
   [junit4]   2> 762014 INFO  (TEST-TestIndexSearcher.testSearcherListeners-seed#[2B3BC06C8E2CDF6D]) [    x:core1] o.a.s.u.DefaultSolrCoreState SolrCoreState ref count has reached 0 - closing IndexWriter
   [junit4]   2> 762014 INFO  (TEST-TestIndexSearcher.testSearcherListeners-seed#[2B3BC06C8E2CDF6D]) [    x:core1] o.a.s.u.DefaultSolrCoreState closing IndexWriter with IndexWriterCloser
   [junit4]   2> 762014 INFO  (TEST-TestIndexSearcher.testSearcherListeners-seed#[2B3BC06C8E2CDF6D]) [    x:core1] o.a.s.c.SolrDeletionPolicy SolrDeletionPolicy.onCommit: commits: num=2
   [junit4]   2> 	commit{dir=MockDirectoryWrapper(RAMDirectory@50ebac99 lockFactory=org.apache.lucene.store.SingleInstanceLockFactory@3ff56f82),segFN=segments_1,generation=1}
   [junit4]   2> 	commit{dir=MockDirectoryWrapper(RAMDirectory@50ebac99 lockFactory=org.apache.lucene.store.SingleInstanceLockFactory@3ff56f82),segFN=segments_2,generation=2}
   [junit4]   2> 762014 INFO  (TEST-TestIndexSearcher.testSearcherListeners-seed#[2B3BC06C8E2CDF6D]) [    x:core1] o.a.s.c.SolrDeletionPolicy newest commit generation = 2
   [junit4]   2> 762014 INFO  (TEST-TestIndexSearcher.testSearcherListeners-seed#[2B3BC06C8E2CDF6D]) [    x:core1] o.a.s.c.SolrCore [core1] Closing main searcher on request.
   [junit4]   2> 762014 INFO  (TEST-TestIndexSearcher.testSearcherListeners-seed#[2B3BC06C8E2CDF6D]) [    x:core1] o.a.s.c.CachingDirectoryFactory Closing MockDirectoryFactory - 2 directories currently being tracked
   [junit4]   2> 762014 INFO  (TEST-TestIndexSearcher.testSearcherListeners-seed#[2B3BC06C8E2CDF6D]) [    x:core1] o.a.s.c.CachingDirectoryFactory looking to close /Users/jenkins/workspace/Lucene-Solr-5.x-MacOSX/solr/core/src/test-files/solr/collection1/data [CachedDir<<refCount=0;path=/Users/jenkins/workspace/Lucene-Solr-5.x-MacOSX/solr/core/src/test-files/solr/collection1/data;done=false>>]
   [junit4]   2> 762014 INFO  (TEST-TestIndexSearcher.testSearcherListeners-seed#[2B3BC06C8E2CDF6D]) [    x:core1] o.a.s.c.CachingDirectoryFactory Closing directory: /Users/jenkins/workspace/Lucene-Solr-5.x-MacOSX/solr/core/src/test-files/solr/collection1/data
   [junit4]   2> 762014 INFO  (TEST-TestIndexSearcher.testSearcherListeners-seed#[2B3BC06C8E2CDF6D]) [    x:core1] o.a.s.c.CachingDirectoryFactory looking to close /Users/jenkins/workspace/Lucene-Solr-5.x-MacOSX/solr/core/src/test-files/solr/collection1/data/index [CachedDir<<refCount=0;path=/Users/jenkins/workspace/Lucene-Solr-5.x-MacOSX/solr/core/src/test-files/solr/collection1/data/index;done=false>>]
   [junit4]   2> 762014 INFO  (TEST-TestIndexSearcher.testSearcherListeners-seed#[2B3BC06C8E2CDF6D]) [    x:core1] o.a.s.c.CachingDirectoryFactory Closing directory: /Users/jenkins/workspace/Lucene-Solr-5.x-MacOSX/solr/core/src/test-files/solr/collection1/data/index
   [junit4]   2> 762014 INFO  (TEST-TestIndexSearcher.testSearcherListeners-seed#[2B3BC06C8E2CDF6D]) [    x:core1] o.a.s.SolrTestCaseJ4 ###Ending testSearcherListeners
   [junit4]   2> 762017 INFO  (TEST-TestIndexSearcher.testSearcherListeners-seed#[2B3BC06C8E2CDF6D]) [    x:core1] o.a.s.u.p.LogUpdateProcessorFactory [collection1]  webapp=null path=null params={}{deleteByQuery=*:* (-1526667159714922496)} 0 1
   [junit4]   2> 762018 INFO  (TEST-TestIndexSearcher.testSearcherListeners-seed#[2B3BC06C8E2CDF6D]) [    x:core1] o.a.s.u.DirectUpdateHandler2 start commit{,optimize=false,openSearcher=true,waitSearcher=true,expungeDeletes=false,softCommit=false,prepareCommit=false}
   [junit4]   2> 762018 INFO  (TEST-TestIndexSearcher.testSearcherListeners-seed#[2B3BC06C8E2CDF6D]) [    x:core1] o.a.s.u.DirectUpdateHandler2 No uncommitted changes. Skipping IW.commit.
   [junit4]   2> 762018 INFO  (TEST-TestIndexSearcher.testSearcherListeners-seed#[2B3BC06C8E2CDF6D]) [    x:core1] o.a.s.c.SolrCore SolrIndexSearcher has not changed - not re-opening: org.apache.solr.search.SolrIndexSearcher
   [junit4]   2> 762018 INFO  (TEST-TestIndexSearcher.testSearcherListeners-seed#[2B3BC06C8E2CDF6D]) [    x:core1] o.a.s.u.DirectUpdateHandler2 end_commit_flush
   [junit4]   2> 762019 INFO  (TEST-TestIndexSearcher.testSearcherListeners-seed#[2B3BC06C8E2CDF6D]) [    x:core1] o.a.s.u.p.LogUpdateProcessorFactory [collection1]  webapp=null path=null params={}{commit=} 0 0
   [junit4]   2> 762021 INFO  (TEST-TestIndexSearcher.testDontUseColdSearcher-seed#[2B3BC06C8E2CDF6D]) [    x:core1] o.a.s.SolrTestCaseJ4 ###Starting testDontUseColdSearcher
   [junit4]   2> 762022 INFO  (TEST-TestIndexSearcher.testDontUseColdSearcher-seed#[2B3BC06C8E2CDF6D]) [    x:core1] o.a.s.c.CoreDescriptor Created CoreDescriptor: {name=core1, config=solrconfig-searcher-listeners1.xml, loadOnStartup=true, schema=schema.xml, configSetProperties=configsetprops.json, transient=false, dataDir=data/}
   [junit4]   2> 762022 INFO  (TEST-TestIndexSearcher.testDontUseColdSearcher-seed#[2B3BC06C8E2CDF6D]) [    x:core1] o.a.s.c.SolrResourceLoader new SolrResourceLoader for directory: '/Users/jenkins/workspace/Lucene-Solr-5.x-MacOSX/solr/core/src/test-files/solr/collection1'
   [junit4]   2> 762022 INFO  (TEST-TestIndexSearcher.testDontUseColdSearcher-seed#[2B3BC06C8E2CDF6D]) [    x:core1] o.a.s.c.SolrResourceLoader JNDI not configured for solr (NoInitialContextEx)
   [junit4]   2> 762023 INFO  (TEST-TestIndexSearcher.testDontUseColdSearcher-seed#[2B3BC06C8E2CDF6D]) [    x:core1] o.a.s.c.SolrResourceLoader using system property solr.solr.home: /Users/jenkins/workspace/Lucene-Solr-5.x-MacOSX/solr/core/src/test-files/solr
   [junit4]   2> 762023 INFO  (TEST-TestIndexSearcher.testDontUseColdSearcher-seed#[2B3BC06C8E2CDF6D]) [    x:core1] o.a.s.c.SolrResourceLoader Adding 'file:/Users/jenkins/workspace/Lucene-Solr-5.x-MacOSX/solr/core/src/test-files/solr/collection1/lib/classes/' to classloader
   [junit4]   2> 762023 INFO  (TEST-TestIndexSearcher.testDontUseColdSearcher-seed#[2B3BC06C8E2CDF6D]) [    x:core1] o.a.s.c.SolrResourceLoader Adding 'file:/Users/jenkins/workspace/Lucene-Solr-5.x-MacOSX/solr/core/src/test-files/solr/collection1/lib/README' to classloader
   [junit4]   2> 762063 INFO  (TEST-TestIndexSearcher.testDontUseColdSearcher-seed#[2B3BC06C8E2CDF6D]) [    x:core1] o.a.s.c.SolrConfig current version of requestparams : -1
   [junit4]   2> 762065 INFO  (TEST-TestIndexSearcher.testDontUseColdSearcher-seed#[2B3BC06C8E2CDF6D]) [    x:core1] o.a.s.c.SolrConfig Using Lucene MatchVersion: 5.5.0
   [junit4]   2> 762078 INFO  (TEST-TestIndexSearcher.testDontUseColdSearcher-seed#[2B3BC06C8E2CDF6D]) [    x:core1] o.a.s.c.SolrConfig Loaded SolrConfig: solrconfig-searcher-listeners1.xml
   [junit4]   2> 762086 INFO  (TEST-TestIndexSearcher.testDontUseColdSearcher-seed#[2B3BC06C8E2CDF6D]) [    x:core1] o.a.s.s.IndexSchema [core1] Schema name=test
   [junit4]   2> 762161 INFO  (TEST-TestIndexSearcher.testDontUseColdSearcher-seed#[2B3BC06C8E2CDF6D]) [    x:core1] o.a.s.s.OpenExchangeRatesOrgProvider Initialized with rates=open-exchange-rates.json, refreshInterval=1440.
   [junit4]   2> 762166 INFO  (TEST-TestIndexSearcher.testDontUseColdSearcher-seed#[2B3BC06C8E2CDF6D]) [    x:core1] o.a.s.s.IndexSchema default search field in schema is text
   [junit4]   2> 762167 INFO  (TEST-TestIndexSearcher.testDontUseColdSearcher-seed#[2B3BC06C8E2CDF6D]) [    x:core1] o.a.s.s.IndexSchema unique key field: id
   [junit4]   2> 762170 INFO  (TEST-TestIndexSearcher.testDontUseColdSearcher-seed#[2B3BC06C8E2CDF6D]) [    x:core1] o.a.s.s.FileExchangeRateProvider Reloading exchange rates from file currency.xml
   [junit4]   2> 762171 INFO  (TEST-TestIndexSearcher.testDontUseColdSearcher-seed#[2B3BC06C8E2CDF6D]) [    x:core1] o.a.s.s.FileExchangeRateProvider Reloading exchange rates from file currency.xml
   [junit4]   2> 762172 INFO  (TEST-TestIndexSearcher.testDontUseColdSearcher-seed#[2B3BC06C8E2CDF6D]) [    x:core1] o.a.s.s.OpenExchangeRatesOrgProvider Reloading exchange rates from open-exchange-rates.json
   [junit4]   2> 762172 INFO  (TEST-TestIndexSearcher.testDontUseColdSearcher-seed#[2B3BC06C8E2CDF6D]) [    x:core1] o.a.s.s.OpenExchangeRatesOrgProvider Reloading exchange rates from open-exchange-rates.json
   [junit4]   2> 762176 INFO  (TEST-TestIndexSearcher.testDontUseColdSearcher-seed#[2B3BC06C8E2CDF6D]) [    x:core1] o.a.s.c.ConfigSetProperties Did not find ConfigSet properties, assuming default properties: Can't find resource 'configsetprops.json' in classpath or '/Users/jenkins/workspace/Lucene-Solr-5.x-MacOSX/solr/core/src/test-files/solr/collection1'
   [junit4]   2> 762176 INFO  (TEST-TestIndexSearcher.testDontUseColdSearcher-seed#[2B3BC06C8E2CDF6D]) [    x:core1] o.a.s.c.CoreContainer Creating SolrCore 'core1' using configuration from instancedir /Users/jenkins/workspace/Lucene-Solr-5.x-MacOSX/solr/core/src/test-files/solr/collection1
   [junit4]   2> 762176 INFO  (TEST-TestIndexSearcher.testDontUseColdSearcher-seed#[2B3BC06C8E2CDF6D]) [    x:core1] o.a.s.c.SolrCore org.apache.solr.core.MockDirectoryFactory
   [junit4]   2> 762176 INFO  (TEST-TestIndexSearcher.testDontUseColdSearcher-seed#[2B3BC06C8E2CDF6D]) [    x:core1] o.a.s.c.SolrCore [[core1] ] Opening new SolrCore at [/Users/jenkins/workspace/Lucene-Solr-5.x-MacOSX/solr/core/src/test-files/solr/collection1], dataDir=[/Users/jenkins/workspace/Lucene-Solr-5.x-MacOSX/solr/core/src/test-files/solr/collection1/data/]
   [junit4]   2> 762176 INFO  (TEST-TestIndexSearcher.testDontUseColdSearcher-seed#[2B3BC06C8E2CDF6D]) [    x:core1] o.a.s.c.SolrCore JMX monitoring not detected for core: core1
   [junit4]   2> 762177 INFO  (TEST-TestIndexSearcher.testDontUseColdSearcher-seed#[2B3BC06C8E2CDF6D]) [    x:core1] o.a.s.c.CachingDirectoryFactory return new directory for /Users/jenkins/workspace/Lucene-Solr-5.x-MacOSX/solr/core/src/test-files/solr/collection1/data
   [junit4]   2> 762177 INFO  (TEST-TestIndexSearcher.testDontUseColdSearcher-seed#[2B3BC06C8E2CDF6D]) [    x:core1] o.a.s.c.SolrCore New index directory detected: old=null new=/Users/jenkins/workspace/Lucene-Solr-5.x-MacOSX/solr/core/src/test-files/solr/collection1/data/index/
   [junit4]   2> 762177 WARN  (TEST-TestIndexSearcher.testDontUseColdSearcher-seed#[2B3BC06C8E2CDF6D]) [    x:core1] o.a.s.c.SolrCore [core1] Solr index directory '/Users/jenkins/workspace/Lucene-Solr-5.x-MacOSX/solr/core/src/test-files/solr/collection1/data/index' doesn't exist. Creating new index...
   [junit4]   2> 762177 INFO  (TEST-TestIndexSearcher.testDontUseColdSearcher-seed#[2B3BC06C8E2CDF6D]) [    x:core1] o.a.s.c.CachingDirectoryFactory return new directory for /Users/jenkins/workspace/Lucene-Solr-5.x-MacOSX/solr/core/src/test-files/solr/collection1/data/index
   [junit4]   2> 762177 INFO  (TEST-TestIndexSearcher.testDontUseColdSearcher-seed#[2B3BC06C8E2CDF6D]) [    x:core1] o.a.s.u.RandomMergePolicy RandomMergePolicy wrapping class org.apache.lucene.index.LogByteSizeMergePolicy: [LogByteSizeMergePolicy: minMergeSize=1677721, mergeFactor=21, maxMergeSize=2147483648, maxMergeSizeForForcedMerge=9223372036854775807, calibrateSizeByDeletes=true, maxMergeDocs=2147483647, maxCFSSegmentSizeMB=8.796093022207999E12, noCFSRatio=0.27209054508625813]
   [junit4]   2> 762178 INFO  (TEST-TestIndexSearcher.testDontUseColdSearcher-seed#[2B3BC06C8E2CDF6D]) [    x:core1] o.a.s.c.SolrDeletionPolicy SolrDeletionPolicy.onCommit: commits: num=1
   [junit4]   2> 	commit{dir=MockDirectoryWrapper(RAMDirectory@7aefa489 lockFactory=org.apache.lucene.store.SingleInstanceLockFactory@7d7edc36),segFN=segments_1,generation=1}
   [junit4]   2> 762178 INFO  (TEST-TestIndexSearcher.testDontUseColdSearcher-seed#[2B3BC06C8E2CDF6D]) [    x:core1] o.a.s.c.SolrDeletionPolicy newest commit generation = 1
   [junit4]   2> 762178 INFO  (OldIndexDirectoryCleanupThreadForCore-core1) [    x:core1] o.a.s.c.SolrCore Looking for old index directories to cleanup for core core1 in /Users/jenkins/workspace/Lucene-Solr-5.x-MacOSX/solr/core/src/test-files/solr/collection1/data/
   [junit4]   2> 762179 WARN  (OldIndexDirectoryCleanupThreadForCore-core1) [    x:core1] o.a.s.c.DirectoryFactory /Users/jenkins/workspace/Lucene-Solr-5.x-MacOSX/solr/core/src/test-files/solr/collection1/data/ does not point to a valid data directory; skipping clean-up of old index directories.
   [junit4]   2> 762180 INFO  (TEST-TestIndexSearcher.testDontUseColdSearcher-seed#[2B3BC06C8E2CDF6D]) [    x:core1] o.a.s.c.SolrCore no updateRequestProcessorChain defined as default, creating implicit default
   [junit4]   2> 762183 INFO  (TEST-TestIndexSearcher.testDontUseColdSearcher-seed#[2B3BC06C8E2CDF6D]) [    x:core1] o.a.s.h.l.XMLLoader xsltCacheLifetimeSeconds=60
   [junit4]   2> 762183 INFO  (TEST-TestIndexSearcher.testDontUseColdSearcher-seed#[2B3BC06C8E2CDF6D]) [    x:core1] o.a.s.h.l.XMLLoader xsltCacheLifetimeSeconds=60
   [junit4]   2> 762184 INFO  (TEST-TestIndexSearcher.testDontUseColdSearcher-seed#[2B3BC06C8E2CDF6D]) [    x:core1] o.a.s.h.l.XMLLoader xsltCacheLifetimeSeconds=60
   [junit4]   2> 762185 INFO  (TEST-TestIndexSearcher.testDontUseColdSearcher-seed#[2B3BC06C8E2CDF6D]) [    x:core1] o.a.s.h.l.XMLLoader xsltCacheLifetimeSeconds=60
   [junit4]   2> 762186 INFO  (TEST-TestIndexSearcher.testDontUseColdSearcher-seed#[2B3BC06C8E2CDF6D]) [    x:core1] o.a.s.c.RequestHandlers Registered paths: /admin/mbeans,standard,/update/csv,/update/json/docs,/admin/luke,/admin/segments,/get,/admin/system,/replication,/admin/properties,/config,/schema,/admin/plugins,/admin/logging,/update/json,/admin/threads,/admin/ping,/update,/admin/file
   [junit4]   2> 762186 INFO  (TEST-TestIndexSearcher.testDontUseColdSearcher-seed#[2B3BC06C8E2CDF6D]) [    x:core1] o.a.s.c.SolrCore Using default statsCache cache: org.apache.solr.search.stats.LocalStatsCache
   [junit4]   2> 762187 INFO  (TEST-TestIndexSearcher.testDontUseColdSearcher-seed#[2B3BC06C8E2CDF6D]) [    x:core1] o.a.s.u.CommitTracker Hard AutoCommit: disabled
   [junit4]   2> 762187 INFO  (TEST-TestIndexSearcher.testDontUseColdSearcher-seed#[2B3BC06C8E2CDF6D]) [    x:core1] o.a.s.u.CommitTracker Soft AutoCommit: disabled
   [junit4]   2> 762187 INFO  (TEST-TestIndexSearcher.testDontUseColdSearcher-seed#[2B3BC06C8E2CDF6D]) [    x:core1] o.a.s.u.RandomMergePolicy RandomMergePolicy wrapping class org.apache.lucene.index.LogByteSizeMergePolicy: [LogByteSizeMergePolicy: minMergeSize=1677721, mergeFactor=42, maxMergeSize=2147483648, maxMergeSizeForForcedMerge=9223372036854775807, calibrateSizeByDeletes=false, maxMergeDocs=2147483647, maxCFSSegmentSizeMB=8.796093022207999E12, noCFSRatio=0.13441235464685564]
   [junit4]   2> 762187 INFO  (TEST-TestIndexSearcher.testDontUseColdSearcher-seed#[2B3BC06C8E2CDF6D]) [    x:core1] o.a.s.c.SolrDeletionPolicy SolrDeletionPolicy.onInit: commits: num=1
   [junit4]   2> 	commit{dir=MockDirectoryWrapper(RAMDirectory@7aefa489 lockFactory=org.apache.lucene.store.SingleInstanceLockFactory@7d7edc36),segFN=segments_1,generation=1}
   [junit4]   2> 762187 INFO  (TEST-TestIndexSearcher.testDont

[...truncated too long message...]

izedtesting.RandomizedRunner.run(RandomizedRunner.java:450)
   [junit4]   2> 	at com.carrotsearch.ant.tasks.junit4.slave.SlaveMain.execute(SlaveMain.java:243)
   [junit4]   2> 	at com.carrotsearch.ant.tasks.junit4.slave.SlaveMain.main(SlaveMain.java:354)
   [junit4]   2> 	at com.carrotsearch.ant.tasks.junit4.slave.SlaveMainSafe.main(SlaveMainSafe.java:10)
   [junit4]   2> 
   [junit4]   2> ^^==============================================
   [junit4]   2> 
   [junit4]   2> NOTE: reproduce with: ant test  -Dtestcase=TestShardHandlerFactory -Dtests.method=testXML -Dtests.seed=2B3BC06C8E2CDF6D -Dtests.slow=true -Dtests.locale=ja-JP -Dtests.timezone=NZ -Dtests.asserts=true -Dtests.file.encoding=US-ASCII
   [junit4] ERROR   7199s J0 | TestShardHandlerFactory.testXML <<<
   [junit4]    > Throwable #1: java.lang.Exception: Test abandoned because suite timeout was reached.
   [junit4]    > 	at __randomizedtesting.SeedInfo.seed([2B3BC06C8E2CDF6D]:0)
   [junit4]   2> 2 20, 2016 7:28:16 ?? com.carrotsearch.randomizedtesting.ThreadLeakControl checkThreadLeaks
   [junit4]   2> ??: Will linger awaiting termination of 2 leaked thread(s).
   [junit4]   2> 2 20, 2016 7:28:36 ?? com.carrotsearch.randomizedtesting.ThreadLeakControl checkThreadLeaks
   [junit4]   2> ??: 2 threads leaked from SUITE scope at org.apache.solr.core.TestShardHandlerFactory: 
   [junit4]   2>    1) Thread[id=12, name=Thread-1, state=WAITING, group=TGRP-TestShardHandlerFactory]
   [junit4]   2>         at java.lang.Object.wait(Native Method)
   [junit4]   2>         at java.lang.Object.wait(Object.java:502)
   [junit4]   2>         at org.apache.solr.core.CloserThread.run(CoreContainer.java:1247)
   [junit4]   2>    2) Thread[id=11, name=TEST-TestShardHandlerFactory.testXML-seed#[2B3BC06C8E2CDF6D], state=WAITING, group=TGRP-TestShardHandlerFactory]
   [junit4]   2>         at java.lang.Object.wait(Native Method)
   [junit4]   2>         at java.lang.Thread.join(Thread.java:1245)
   [junit4]   2>         at java.lang.Thread.join(Thread.java:1319)
   [junit4]   2>         at org.apache.solr.core.CoreContainer.shutdown(CoreContainer.java:573)
   [junit4]   2>         at org.apache.solr.core.TestShardHandlerFactory.testXML(TestShardHandlerFactory.java:39)
   [junit4]   2>         at sun.reflect.NativeMethodAccessorImpl.invoke0(Native Method)
   [junit4]   2>         at sun.reflect.NativeMethodAccessorImpl.invoke(NativeMethodAccessorImpl.java:62)
   [junit4]   2>         at sun.reflect.DelegatingMethodAccessorImpl.invoke(DelegatingMethodAccessorImpl.java:43)
   [junit4]   2>         at java.lang.reflect.Method.invoke(Method.java:498)
   [junit4]   2>         at com.carrotsearch.randomizedtesting.RandomizedRunner.invoke(RandomizedRunner.java:1764)
   [junit4]   2>         at com.carrotsearch.randomizedtesting.RandomizedRunner$8.evaluate(RandomizedRunner.java:871)
   [junit4]   2>         at com.carrotsearch.randomizedtesting.RandomizedRunner$9.evaluate(RandomizedRunner.java:907)
   [junit4]   2>         at com.carrotsearch.randomizedtesting.RandomizedRunner$10.evaluate(RandomizedRunner.java:921)
   [junit4]   2>         at com.carrotsearch.randomizedtesting.rules.SystemPropertiesRestoreRule$1.evaluate(SystemPropertiesRestoreRule.java:57)
   [junit4]   2>         at org.apache.lucene.util.TestRuleSetupTeardownChained$1.evaluate(TestRuleSetupTeardownChained.java:49)
   [junit4]   2>         at org.apache.lucene.util.AbstractBeforeAfterRule$1.evaluate(AbstractBeforeAfterRule.java:45)
   [junit4]   2>         at org.apache.lucene.util.TestRuleThreadAndTestName$1.evaluate(TestRuleThreadAndTestName.java:48)
   [junit4]   2>         at org.apache.lucene.util.TestRuleIgnoreAfterMaxFailures$1.evaluate(TestRuleIgnoreAfterMaxFailures.java:64)
   [junit4]   2>         at org.apache.lucene.util.TestRuleMarkFailure$1.evaluate(TestRuleMarkFailure.java:47)
   [junit4]   2>         at com.carrotsearch.randomizedtesting.rules.StatementAdapter.evaluate(StatementAdapter.java:36)
   [junit4]   2>         at com.carrotsearch.randomizedtesting.ThreadLeakControl$StatementRunner.run(ThreadLeakControl.java:367)
   [junit4]   2>         at com.carrotsearch.randomizedtesting.ThreadLeakControl.forkTimeoutingTask(ThreadLeakControl.java:809)
   [junit4]   2>         at com.carrotsearch.randomizedtesting.ThreadLeakControl$3.evaluate(ThreadLeakControl.java:460)
   [junit4]   2>         at com.carrotsearch.randomizedtesting.RandomizedRunner.runSingleTest(RandomizedRunner.java:880)
   [junit4]   2>         at com.carrotsearch.randomizedtesting.RandomizedRunner$5.evaluate(RandomizedRunner.java:781)
   [junit4]   2>         at com.carrotsearch.randomizedtesting.RandomizedRunner$6.evaluate(RandomizedRunner.java:816)
   [junit4]   2>         at com.carrotsearch.randomizedtesting.RandomizedRunner$7.evaluate(RandomizedRunner.java:827)
   [junit4]   2>         at com.carrotsearch.randomizedtesting.rules.StatementAdapter.evaluate(StatementAdapter.java:36)
   [junit4]   2>         at com.carrotsearch.randomizedtesting.rules.SystemPropertiesRestoreRule$1.evaluate(SystemPropertiesRestoreRule.java:57)
   [junit4]   2>         at org.apache.lucene.util.AbstractBeforeAfterRule$1.evaluate(AbstractBeforeAfterRule.java:45)
   [junit4]   2>         at com.carrotsearch.randomizedtesting.rules.StatementAdapter.evaluate(StatementAdapter.java:36)
   [junit4]   2>         at org.apache.lucene.util.TestRuleStoreClassName$1.evaluate(TestRuleStoreClassName.java:41)
   [junit4]   2>         at com.carrotsearch.randomizedtesting.rules.NoShadowingOrOverridesOnMethodsRule$1.evaluate(NoShadowingOrOverridesOnMethodsRule.java:40)
   [junit4]   2>         at com.carrotsearch.randomizedtesting.rules.NoShadowingOrOverridesOnMethodsRule$1.evaluate(NoShadowingOrOverridesOnMethodsRule.java:40)
   [junit4]   2>         at com.carrotsearch.randomizedtesting.rules.StatementAdapter.evaluate(StatementAdapter.java:36)
   [junit4]   2>         at com.carrotsearch.randomizedtesting.rules.StatementAdapter.evaluate(StatementAdapter.java:36)
   [junit4]   2>         at com.carrotsearch.randomizedtesting.rules.StatementAdapter.evaluate(StatementAdapter.java:36)
   [junit4]   2>         at org.apache.lucene.util.TestRuleAssertionsRequired$1.evaluate(TestRuleAssertionsRequired.java:53)
   [junit4]   2>         at org.apache.lucene.util.TestRuleMarkFailure$1.evaluate(TestRuleMarkFailure.java:47)
   [junit4]   2>         at org.apache.lucene.util.TestRuleIgnoreAfterMaxFailures$1.evaluate(TestRuleIgnoreAfterMaxFailures.java:64)
   [junit4]   2>         at org.apache.lucene.util.TestRuleIgnoreTestSuites$1.evaluate(TestRuleIgnoreTestSuites.java:54)
   [junit4]   2>         at com.carrotsearch.randomizedtesting.rules.StatementAdapter.evaluate(StatementAdapter.java:36)
   [junit4]   2>         at com.carrotsearch.randomizedtesting.ThreadLeakControl$StatementRunner.run(ThreadLeakControl.java:367)
   [junit4]   2>         at java.lang.Thread.run(Thread.java:745)
   [junit4]   2> 2 20, 2016 7:28:36 ?? com.carrotsearch.randomizedtesting.ThreadLeakControl tryToInterruptAll
   [junit4]   2> ??: Starting to interrupt leaked threads:
   [junit4]   2>    1) Thread[id=12, name=Thread-1, state=WAITING, group=TGRP-TestShardHandlerFactory]
   [junit4]   2>    2) Thread[id=11, name=TEST-TestShardHandlerFactory.testXML-seed#[2B3BC06C8E2CDF6D], state=WAITING, group=TGRP-TestShardHandlerFactory]
   [junit4]   2> 7218875 INFO  (TEST-TestShardHandlerFactory.testXML-seed#[2B3BC06C8E2CDF6D]) [    ] o.a.s.SolrTestCaseJ4 ###Ending testXML
   [junit4]   2> 7218917 INFO  (SUITE-TestShardHandlerFactory-seed#[2B3BC06C8E2CDF6D]-worker) [    ] o.a.s.SolrTestCaseJ4 ###deleteCore
   [junit4]   2> Feb 20, 2016 6:28:36 AM com.carrotsearch.randomizedtesting.ThreadLeakControl tryToInterruptAll
   [junit4]   2> INFO: All leaked threads terminated.
   [junit4]   2> NOTE: test params are: codec=CheapBastard, sim=RandomSimilarity(queryNorm=false,coord=yes): {}, locale=ja-JP, timezone=NZ
   [junit4]   2> NOTE: Mac OS X 10.8.5 x86_64/Oracle Corporation 1.8.0_72 (64-bit)/cpus=3,threads=1,free=32568544,total=69206016
   [junit4]   2> NOTE: All tests run in this JVM: [TestShardHandlerFactory]
   [junit4]   2> NOTE: reproduce with: ant test  -Dtestcase=TestShardHandlerFactory -Dtests.seed=2B3BC06C8E2CDF6D -Dtests.slow=true -Dtests.locale=ja-JP -Dtests.timezone=NZ -Dtests.asserts=true -Dtests.file.encoding=US-ASCII
   [junit4] ERROR   0.00s J0 | TestShardHandlerFactory (suite) <<<
   [junit4]    > Throwable #1: java.lang.Exception: Suite timeout exceeded (>= 7200000 msec).
   [junit4]    > 	at __randomizedtesting.SeedInfo.seed([2B3BC06C8E2CDF6D]:0)
   [junit4] Completed [425/566 (2!)] on J0 in 7221.30s, 1 test, 2 errors <<< FAILURES!

[...truncated 456 lines...]
BUILD FAILED
/Users/jenkins/workspace/Lucene-Solr-5.x-MacOSX/build.xml:750: The following error occurred while executing this line:
/Users/jenkins/workspace/Lucene-Solr-5.x-MacOSX/build.xml:694: The following error occurred while executing this line:
/Users/jenkins/workspace/Lucene-Solr-5.x-MacOSX/build.xml:59: The following error occurred while executing this line:
/Users/jenkins/workspace/Lucene-Solr-5.x-MacOSX/solr/build.xml:233: The following error occurred while executing this line:
/Users/jenkins/workspace/Lucene-Solr-5.x-MacOSX/solr/common-build.xml:534: The following error occurred while executing this line:
/Users/jenkins/workspace/Lucene-Solr-5.x-MacOSX/lucene/common-build.xml:1477: The following error occurred while executing this line:
/Users/jenkins/workspace/Lucene-Solr-5.x-MacOSX/lucene/common-build.xml:1033: There were test failures: 566 suites (7 ignored), 2279 tests, 1 suite-level error, 1 error, 1 failure, 89 ignored (38 assumptions) [seed: 2B3BC06C8E2CDF6D]

Total time: 165 minutes 53 seconds
Build step 'Invoke Ant' marked build as failure
Archiving artifacts
[WARNINGS] Skipping publisher since build result is FAILURE
Recording test results
Email was triggered for: Failure - Any
Sending email for trigger: Failure - Any



Mime
View raw message