lucene-dev mailing list archives

Site index · List index
Message view « Date » · « Thread »
Top « Date » · « Thread »
From Policeman Jenkins Server <jenk...@thetaphi.de>
Subject [JENKINS] Lucene-Solr-trunk-Linux (32bit/jdk1.8.0_72) - Build # 15948 - Still Failing!
Date Sun, 21 Feb 2016 19:39:58 GMT
Build: http://jenkins.thetaphi.de/job/Lucene-Solr-trunk-Linux/15948/
Java: 32bit/jdk1.8.0_72 -client -XX:+UseSerialGC

1 tests failed.
FAILED:  org.apache.solr.cloud.TestAuthenticationFramework.testStopAllStartAll

Error Message:
Address already in use

Stack Trace:
java.net.BindException: Address already in use
	at __randomizedtesting.SeedInfo.seed([673967461D9E7F0D:110778355CA9D222]:0)
	at sun.nio.ch.Net.bind0(Native Method)
	at sun.nio.ch.Net.bind(Net.java:433)
	at sun.nio.ch.Net.bind(Net.java:425)
	at sun.nio.ch.ServerSocketChannelImpl.bind(ServerSocketChannelImpl.java:223)
	at sun.nio.ch.ServerSocketAdaptor.bind(ServerSocketAdaptor.java:74)
	at org.eclipse.jetty.server.ServerConnector.open(ServerConnector.java:326)
	at org.eclipse.jetty.server.AbstractNetworkConnector.doStart(AbstractNetworkConnector.java:80)
	at org.eclipse.jetty.server.ServerConnector.doStart(ServerConnector.java:244)
	at org.eclipse.jetty.util.component.AbstractLifeCycle.start(AbstractLifeCycle.java:68)
	at org.eclipse.jetty.server.Server.doStart(Server.java:384)
	at org.eclipse.jetty.util.component.AbstractLifeCycle.start(AbstractLifeCycle.java:68)
	at org.apache.solr.client.solrj.embedded.JettySolrRunner.start(JettySolrRunner.java:410)
	at org.apache.solr.cloud.MiniSolrCloudCluster.startJettySolrRunner(MiniSolrCloudCluster.java:356)
	at org.apache.solr.cloud.TestMiniSolrCloudCluster.testStopAllStartAll(TestMiniSolrCloudCluster.java:431)
	at sun.reflect.NativeMethodAccessorImpl.invoke0(Native Method)
	at sun.reflect.NativeMethodAccessorImpl.invoke(NativeMethodAccessorImpl.java:62)
	at sun.reflect.DelegatingMethodAccessorImpl.invoke(DelegatingMethodAccessorImpl.java:43)
	at java.lang.reflect.Method.invoke(Method.java:498)
	at com.carrotsearch.randomizedtesting.RandomizedRunner.invoke(RandomizedRunner.java:1764)
	at com.carrotsearch.randomizedtesting.RandomizedRunner$8.evaluate(RandomizedRunner.java:871)
	at com.carrotsearch.randomizedtesting.RandomizedRunner$9.evaluate(RandomizedRunner.java:907)
	at com.carrotsearch.randomizedtesting.RandomizedRunner$10.evaluate(RandomizedRunner.java:921)
	at com.carrotsearch.randomizedtesting.rules.SystemPropertiesRestoreRule$1.evaluate(SystemPropertiesRestoreRule.java:57)
	at org.apache.lucene.util.TestRuleSetupTeardownChained$1.evaluate(TestRuleSetupTeardownChained.java:49)
	at org.apache.lucene.util.AbstractBeforeAfterRule$1.evaluate(AbstractBeforeAfterRule.java:45)
	at org.apache.lucene.util.TestRuleThreadAndTestName$1.evaluate(TestRuleThreadAndTestName.java:48)
	at org.apache.lucene.util.TestRuleIgnoreAfterMaxFailures$1.evaluate(TestRuleIgnoreAfterMaxFailures.java:64)
	at org.apache.lucene.util.TestRuleMarkFailure$1.evaluate(TestRuleMarkFailure.java:47)
	at com.carrotsearch.randomizedtesting.rules.StatementAdapter.evaluate(StatementAdapter.java:36)
	at com.carrotsearch.randomizedtesting.ThreadLeakControl$StatementRunner.run(ThreadLeakControl.java:367)
	at com.carrotsearch.randomizedtesting.ThreadLeakControl.forkTimeoutingTask(ThreadLeakControl.java:809)
	at com.carrotsearch.randomizedtesting.ThreadLeakControl$3.evaluate(ThreadLeakControl.java:460)
	at com.carrotsearch.randomizedtesting.RandomizedRunner.runSingleTest(RandomizedRunner.java:880)
	at com.carrotsearch.randomizedtesting.RandomizedRunner$5.evaluate(RandomizedRunner.java:781)
	at com.carrotsearch.randomizedtesting.RandomizedRunner$6.evaluate(RandomizedRunner.java:816)
	at com.carrotsearch.randomizedtesting.RandomizedRunner$7.evaluate(RandomizedRunner.java:827)
	at com.carrotsearch.randomizedtesting.rules.StatementAdapter.evaluate(StatementAdapter.java:36)
	at com.carrotsearch.randomizedtesting.rules.SystemPropertiesRestoreRule$1.evaluate(SystemPropertiesRestoreRule.java:57)
	at org.apache.lucene.util.AbstractBeforeAfterRule$1.evaluate(AbstractBeforeAfterRule.java:45)
	at com.carrotsearch.randomizedtesting.rules.StatementAdapter.evaluate(StatementAdapter.java:36)
	at org.apache.lucene.util.TestRuleStoreClassName$1.evaluate(TestRuleStoreClassName.java:41)
	at com.carrotsearch.randomizedtesting.rules.NoShadowingOrOverridesOnMethodsRule$1.evaluate(NoShadowingOrOverridesOnMethodsRule.java:40)
	at com.carrotsearch.randomizedtesting.rules.NoShadowingOrOverridesOnMethodsRule$1.evaluate(NoShadowingOrOverridesOnMethodsRule.java:40)
	at com.carrotsearch.randomizedtesting.rules.StatementAdapter.evaluate(StatementAdapter.java:36)
	at com.carrotsearch.randomizedtesting.rules.StatementAdapter.evaluate(StatementAdapter.java:36)
	at com.carrotsearch.randomizedtesting.rules.StatementAdapter.evaluate(StatementAdapter.java:36)
	at org.apache.lucene.util.TestRuleAssertionsRequired$1.evaluate(TestRuleAssertionsRequired.java:53)
	at org.apache.lucene.util.TestRuleMarkFailure$1.evaluate(TestRuleMarkFailure.java:47)
	at org.apache.lucene.util.TestRuleIgnoreAfterMaxFailures$1.evaluate(TestRuleIgnoreAfterMaxFailures.java:64)
	at org.apache.lucene.util.TestRuleIgnoreTestSuites$1.evaluate(TestRuleIgnoreTestSuites.java:54)
	at com.carrotsearch.randomizedtesting.rules.StatementAdapter.evaluate(StatementAdapter.java:36)
	at com.carrotsearch.randomizedtesting.ThreadLeakControl$StatementRunner.run(ThreadLeakControl.java:367)
	at java.lang.Thread.run(Thread.java:745)




Build Log:
[...truncated 11068 lines...]
   [junit4] Suite: org.apache.solr.cloud.TestAuthenticationFramework
   [junit4]   2> 540349 INFO  (TEST-TestAuthenticationFramework.testCollectionCreateWithoutCoresThenDelete-seed#[673967461D9E7F0D]) [    ] o.a.s.c.ZkTestServer STARTING ZK TEST SERVER
   [junit4]   2> 540350 INFO  (Thread-2050) [    ] o.a.s.c.ZkTestServer client port:0.0.0.0/0.0.0.0:0
   [junit4]   2> 540350 INFO  (Thread-2050) [    ] o.a.s.c.ZkTestServer Starting server
   [junit4]   2> 540450 INFO  (TEST-TestAuthenticationFramework.testCollectionCreateWithoutCoresThenDelete-seed#[673967461D9E7F0D]) [    ] o.a.s.c.ZkTestServer start zk server on port:41943
   [junit4]   2> 540450 INFO  (TEST-TestAuthenticationFramework.testCollectionCreateWithoutCoresThenDelete-seed#[673967461D9E7F0D]) [    ] o.a.s.c.c.SolrZkClient Using default ZkCredentialsProvider
   [junit4]   2> 540450 INFO  (TEST-TestAuthenticationFramework.testCollectionCreateWithoutCoresThenDelete-seed#[673967461D9E7F0D]) [    ] o.a.s.c.c.ConnectionManager Waiting for client to connect to ZooKeeper
   [junit4]   2> 540489 INFO  (zkCallback-591-thread-1) [    ] o.a.s.c.c.ConnectionManager Watcher org.apache.solr.common.cloud.ConnectionManager@c8a501 name:ZooKeeperConnection Watcher:127.0.0.1:41943 got event WatchedEvent state:SyncConnected type:None path:null path:null type:None
   [junit4]   2> 540489 INFO  (TEST-TestAuthenticationFramework.testCollectionCreateWithoutCoresThenDelete-seed#[673967461D9E7F0D]) [    ] o.a.s.c.c.ConnectionManager Client is connected to ZooKeeper
   [junit4]   2> 540489 INFO  (TEST-TestAuthenticationFramework.testCollectionCreateWithoutCoresThenDelete-seed#[673967461D9E7F0D]) [    ] o.a.s.c.c.SolrZkClient Using default ZkACLProvider
   [junit4]   2> 540489 INFO  (TEST-TestAuthenticationFramework.testCollectionCreateWithoutCoresThenDelete-seed#[673967461D9E7F0D]) [    ] o.a.s.c.c.SolrZkClient makePath: /solr/solr.xml
   [junit4]   2> 540504 INFO  (jetty-launcher-590-thread-2) [    ] o.e.j.s.Server jetty-9.3.6.v20151106
   [junit4]   2> 540504 INFO  (jetty-launcher-590-thread-1) [    ] o.e.j.s.Server jetty-9.3.6.v20151106
   [junit4]   2> 540513 INFO  (jetty-launcher-590-thread-4) [    ] o.e.j.s.Server jetty-9.3.6.v20151106
   [junit4]   2> 540513 INFO  (jetty-launcher-590-thread-3) [    ] o.e.j.s.Server jetty-9.3.6.v20151106
   [junit4]   2> 540513 INFO  (jetty-launcher-590-thread-5) [    ] o.e.j.s.Server jetty-9.3.6.v20151106
   [junit4]   2> 540514 INFO  (jetty-launcher-590-thread-2) [    ] o.e.j.s.h.ContextHandler Started o.e.j.s.ServletContextHandler@19da84d{/solr,null,AVAILABLE}
   [junit4]   2> 540514 INFO  (jetty-launcher-590-thread-1) [    ] o.e.j.s.h.ContextHandler Started o.e.j.s.ServletContextHandler@1f41e9d{/solr,null,AVAILABLE}
   [junit4]   2> 540516 INFO  (jetty-launcher-590-thread-5) [    ] o.e.j.s.h.ContextHandler Started o.e.j.s.ServletContextHandler@eb974b{/solr,null,AVAILABLE}
   [junit4]   2> 540516 INFO  (jetty-launcher-590-thread-3) [    ] o.e.j.s.h.ContextHandler Started o.e.j.s.ServletContextHandler@8d4bc0{/solr,null,AVAILABLE}
   [junit4]   2> 540516 INFO  (jetty-launcher-590-thread-4) [    ] o.e.j.s.h.ContextHandler Started o.e.j.s.ServletContextHandler@1af55e9{/solr,null,AVAILABLE}
   [junit4]   2> 540516 INFO  (jetty-launcher-590-thread-2) [    ] o.e.j.s.ServerConnector Started ServerConnector@86badc{HTTP/1.1,[http/1.1]}{127.0.0.1:33819}
   [junit4]   2> 540516 INFO  (jetty-launcher-590-thread-1) [    ] o.e.j.s.ServerConnector Started ServerConnector@1f194dd{HTTP/1.1,[http/1.1]}{127.0.0.1:52365}
   [junit4]   2> 540516 INFO  (jetty-launcher-590-thread-2) [    ] o.e.j.s.Server Started @541636ms
   [junit4]   2> 540516 INFO  (jetty-launcher-590-thread-1) [    ] o.e.j.s.Server Started @541636ms
   [junit4]   2> 540516 INFO  (jetty-launcher-590-thread-5) [    ] o.e.j.s.ServerConnector Started ServerConnector@4a15c2{HTTP/1.1,[http/1.1]}{127.0.0.1:56343}
   [junit4]   2> 540516 INFO  (jetty-launcher-590-thread-1) [    ] o.a.s.c.s.e.JettySolrRunner Jetty properties: {hostContext=/solr, hostPort=52365}
   [junit4]   2> 540517 INFO  (jetty-launcher-590-thread-5) [    ] o.e.j.s.Server Started @541636ms
   [junit4]   2> 540517 INFO  (jetty-launcher-590-thread-4) [    ] o.e.j.s.ServerConnector Started ServerConnector@c5ce1f{HTTP/1.1,[http/1.1]}{127.0.0.1:57522}
   [junit4]   2> 540517 INFO  (jetty-launcher-590-thread-5) [    ] o.a.s.c.s.e.JettySolrRunner Jetty properties: {hostContext=/solr, hostPort=56343}
   [junit4]   2> 540517 INFO  (jetty-launcher-590-thread-4) [    ] o.e.j.s.Server Started @541636ms
   [junit4]   2> 540516 INFO  (jetty-launcher-590-thread-2) [    ] o.a.s.c.s.e.JettySolrRunner Jetty properties: {hostContext=/solr, hostPort=33819}
   [junit4]   2> 540517 INFO  (jetty-launcher-590-thread-4) [    ] o.a.s.c.s.e.JettySolrRunner Jetty properties: {hostContext=/solr, hostPort=57522}
   [junit4]   2> 540517 INFO  (jetty-launcher-590-thread-5) [    ] o.a.s.s.SolrDispatchFilter SolrDispatchFilter.init(): sun.misc.Launcher$AppClassLoader@1d16e93
   [junit4]   2> 540517 INFO  (jetty-launcher-590-thread-1) [    ] o.a.s.s.SolrDispatchFilter SolrDispatchFilter.init(): sun.misc.Launcher$AppClassLoader@1d16e93
   [junit4]   2> 540517 INFO  (jetty-launcher-590-thread-5) [    ] o.a.s.c.SolrResourceLoader new SolrResourceLoader for directory: '/home/jenkins/workspace/Lucene-Solr-trunk-Linux/solr/build/solr-core/test/J0/temp/solr.cloud.TestAuthenticationFramework_673967461D9E7F0D-001/tempDir-001/node5'
   [junit4]   2> 540517 INFO  (jetty-launcher-590-thread-4) [    ] o.a.s.s.SolrDispatchFilter SolrDispatchFilter.init(): sun.misc.Launcher$AppClassLoader@1d16e93
   [junit4]   2> 540517 INFO  (jetty-launcher-590-thread-3) [    ] o.e.j.s.ServerConnector Started ServerConnector@6f9b7e{HTTP/1.1,[http/1.1]}{127.0.0.1:58999}
   [junit4]   2> 540517 INFO  (jetty-launcher-590-thread-4) [    ] o.a.s.c.SolrResourceLoader new SolrResourceLoader for directory: '/home/jenkins/workspace/Lucene-Solr-trunk-Linux/solr/build/solr-core/test/J0/temp/solr.cloud.TestAuthenticationFramework_673967461D9E7F0D-001/tempDir-001/node4'
   [junit4]   2> 540517 INFO  (jetty-launcher-590-thread-3) [    ] o.e.j.s.Server Started @541636ms
   [junit4]   2> 540517 INFO  (jetty-launcher-590-thread-5) [    ] o.a.s.c.SolrResourceLoader JNDI not configured for solr (NoInitialContextEx)
   [junit4]   2> 540517 INFO  (jetty-launcher-590-thread-1) [    ] o.a.s.c.SolrResourceLoader new SolrResourceLoader for directory: '/home/jenkins/workspace/Lucene-Solr-trunk-Linux/solr/build/solr-core/test/J0/temp/solr.cloud.TestAuthenticationFramework_673967461D9E7F0D-001/tempDir-001/node1'
   [junit4]   2> 540517 INFO  (jetty-launcher-590-thread-2) [    ] o.a.s.s.SolrDispatchFilter SolrDispatchFilter.init(): sun.misc.Launcher$AppClassLoader@1d16e93
   [junit4]   2> 540517 INFO  (jetty-launcher-590-thread-4) [    ] o.a.s.c.SolrResourceLoader JNDI not configured for solr (NoInitialContextEx)
   [junit4]   2> 540517 INFO  (jetty-launcher-590-thread-2) [    ] o.a.s.c.SolrResourceLoader new SolrResourceLoader for directory: '/home/jenkins/workspace/Lucene-Solr-trunk-Linux/solr/build/solr-core/test/J0/temp/solr.cloud.TestAuthenticationFramework_673967461D9E7F0D-001/tempDir-001/node2'
   [junit4]   2> 540517 INFO  (jetty-launcher-590-thread-5) [    ] o.a.s.c.SolrResourceLoader solr home defaulted to 'solr/' (could not find system property or JNDI)
   [junit4]   2> 540517 INFO  (jetty-launcher-590-thread-3) [    ] o.a.s.c.s.e.JettySolrRunner Jetty properties: {hostContext=/solr, hostPort=58999}
   [junit4]   2> 540518 INFO  (jetty-launcher-590-thread-2) [    ] o.a.s.c.SolrResourceLoader JNDI not configured for solr (NoInitialContextEx)
   [junit4]   2> 540517 INFO  (jetty-launcher-590-thread-4) [    ] o.a.s.c.SolrResourceLoader solr home defaulted to 'solr/' (could not find system property or JNDI)
   [junit4]   2> 540518 INFO  (jetty-launcher-590-thread-2) [    ] o.a.s.c.SolrResourceLoader solr home defaulted to 'solr/' (could not find system property or JNDI)
   [junit4]   2> 540517 INFO  (jetty-launcher-590-thread-1) [    ] o.a.s.c.SolrResourceLoader JNDI not configured for solr (NoInitialContextEx)
   [junit4]   2> 540518 INFO  (jetty-launcher-590-thread-3) [    ] o.a.s.s.SolrDispatchFilter SolrDispatchFilter.init(): sun.misc.Launcher$AppClassLoader@1d16e93
   [junit4]   2> 540518 INFO  (jetty-launcher-590-thread-5) [    ] o.a.s.c.c.SolrZkClient Using default ZkCredentialsProvider
   [junit4]   2> 540518 INFO  (jetty-launcher-590-thread-3) [    ] o.a.s.c.SolrResourceLoader new SolrResourceLoader for directory: '/home/jenkins/workspace/Lucene-Solr-trunk-Linux/solr/build/solr-core/test/J0/temp/solr.cloud.TestAuthenticationFramework_673967461D9E7F0D-001/tempDir-001/node3'
   [junit4]   2> 540518 INFO  (jetty-launcher-590-thread-2) [    ] o.a.s.c.c.SolrZkClient Using default ZkCredentialsProvider
   [junit4]   2> 540518 INFO  (jetty-launcher-590-thread-1) [    ] o.a.s.c.SolrResourceLoader solr home defaulted to 'solr/' (could not find system property or JNDI)
   [junit4]   2> 540518 INFO  (jetty-launcher-590-thread-3) [    ] o.a.s.c.SolrResourceLoader JNDI not configured for solr (NoInitialContextEx)
   [junit4]   2> 540518 INFO  (jetty-launcher-590-thread-5) [    ] o.a.s.c.c.ConnectionManager Waiting for client to connect to ZooKeeper
   [junit4]   2> 540518 INFO  (jetty-launcher-590-thread-4) [    ] o.a.s.c.c.SolrZkClient Using default ZkCredentialsProvider
   [junit4]   2> 540518 INFO  (jetty-launcher-590-thread-1) [    ] o.a.s.c.c.SolrZkClient Using default ZkCredentialsProvider
   [junit4]   2> 540518 INFO  (jetty-launcher-590-thread-2) [    ] o.a.s.c.c.ConnectionManager Waiting for client to connect to ZooKeeper
   [junit4]   2> 540518 INFO  (jetty-launcher-590-thread-3) [    ] o.a.s.c.SolrResourceLoader solr home defaulted to 'solr/' (could not find system property or JNDI)
   [junit4]   2> 540519 INFO  (jetty-launcher-590-thread-1) [    ] o.a.s.c.c.ConnectionManager Waiting for client to connect to ZooKeeper
   [junit4]   2> 540519 INFO  (jetty-launcher-590-thread-3) [    ] o.a.s.c.c.SolrZkClient Using default ZkCredentialsProvider
   [junit4]   2> 540519 INFO  (jetty-launcher-590-thread-3) [    ] o.a.s.c.c.ConnectionManager Waiting for client to connect to ZooKeeper
   [junit4]   2> 540519 INFO  (jetty-launcher-590-thread-4) [    ] o.a.s.c.c.ConnectionManager Waiting for client to connect to ZooKeeper
   [junit4]   2> 540528 INFO  (zkCallback-592-thread-1) [    ] o.a.s.c.c.ConnectionManager Watcher org.apache.solr.common.cloud.ConnectionManager@4fce63 name:ZooKeeperConnection Watcher:127.0.0.1:41943/solr got event WatchedEvent state:SyncConnected type:None path:null path:null type:None
   [junit4]   2> 540528 INFO  (jetty-launcher-590-thread-5) [    ] o.a.s.c.c.ConnectionManager Client is connected to ZooKeeper
   [junit4]   2> 540529 INFO  (jetty-launcher-590-thread-5) [    ] o.a.s.c.c.SolrZkClient Using default ZkACLProvider
   [junit4]   2> 540536 INFO  (zkCallback-594-thread-1) [    ] o.a.s.c.c.ConnectionManager Watcher org.apache.solr.common.cloud.ConnectionManager@7ded38 name:ZooKeeperConnection Watcher:127.0.0.1:41943/solr got event WatchedEvent state:SyncConnected type:None path:null path:null type:None
   [junit4]   2> 540537 INFO  (jetty-launcher-590-thread-2) [    ] o.a.s.c.c.ConnectionManager Client is connected to ZooKeeper
   [junit4]   2> 540537 INFO  (zkCallback-595-thread-1) [    ] o.a.s.c.c.ConnectionManager Watcher org.apache.solr.common.cloud.ConnectionManager@683c60 name:ZooKeeperConnection Watcher:127.0.0.1:41943/solr got event WatchedEvent state:SyncConnected type:None path:null path:null type:None
   [junit4]   2> 540537 INFO  (jetty-launcher-590-thread-1) [    ] o.a.s.c.c.ConnectionManager Client is connected to ZooKeeper
   [junit4]   2> 540537 INFO  (zkCallback-596-thread-1) [    ] o.a.s.c.c.ConnectionManager Watcher org.apache.solr.common.cloud.ConnectionManager@6abb89 name:ZooKeeperConnection Watcher:127.0.0.1:41943/solr got event WatchedEvent state:SyncConnected type:None path:null path:null type:None
   [junit4]   2> 540537 INFO  (jetty-launcher-590-thread-2) [    ] o.a.s.c.c.SolrZkClient Using default ZkACLProvider
   [junit4]   2> 540537 INFO  (jetty-launcher-590-thread-1) [    ] o.a.s.c.c.SolrZkClient Using default ZkACLProvider
   [junit4]   2> 540537 INFO  (jetty-launcher-590-thread-3) [    ] o.a.s.c.c.ConnectionManager Client is connected to ZooKeeper
   [junit4]   2> 540537 INFO  (zkCallback-593-thread-1) [    ] o.a.s.c.c.ConnectionManager Watcher org.apache.solr.common.cloud.ConnectionManager@5c9d0 name:ZooKeeperConnection Watcher:127.0.0.1:41943/solr got event WatchedEvent state:SyncConnected type:None path:null path:null type:None
   [junit4]   2> 540537 INFO  (jetty-launcher-590-thread-5) [    ] o.a.s.s.SolrDispatchFilter solr.xml found in ZooKeeper. Loading...
   [junit4]   2> 540537 INFO  (jetty-launcher-590-thread-2) [    ] o.a.s.s.SolrDispatchFilter solr.xml found in ZooKeeper. Loading...
   [junit4]   2> 540537 INFO  (jetty-launcher-590-thread-1) [    ] o.a.s.s.SolrDispatchFilter solr.xml found in ZooKeeper. Loading...
   [junit4]   2> 540537 INFO  (jetty-launcher-590-thread-3) [    ] o.a.s.c.c.SolrZkClient Using default ZkACLProvider
   [junit4]   2> 540537 INFO  (jetty-launcher-590-thread-4) [    ] o.a.s.c.c.ConnectionManager Client is connected to ZooKeeper
   [junit4]   2> 540537 INFO  (jetty-launcher-590-thread-3) [    ] o.a.s.s.SolrDispatchFilter solr.xml found in ZooKeeper. Loading...
   [junit4]   2> 540537 INFO  (jetty-launcher-590-thread-4) [    ] o.a.s.c.c.SolrZkClient Using default ZkACLProvider
   [junit4]   2> 540538 INFO  (jetty-launcher-590-thread-4) [    ] o.a.s.s.SolrDispatchFilter solr.xml found in ZooKeeper. Loading...
   [junit4]   2> 540555 INFO  (jetty-launcher-590-thread-3) [    ] o.a.s.c.CorePropertiesLocator Config-defined core root directory: /home/jenkins/workspace/Lucene-Solr-trunk-Linux/solr/build/solr-core/test/J0/temp/solr.cloud.TestAuthenticationFramework_673967461D9E7F0D-001/tempDir-001/node3/.
   [junit4]   2> 540555 INFO  (jetty-launcher-590-thread-1) [    ] o.a.s.c.CorePropertiesLocator Config-defined core root directory: /home/jenkins/workspace/Lucene-Solr-trunk-Linux/solr/build/solr-core/test/J0/temp/solr.cloud.TestAuthenticationFramework_673967461D9E7F0D-001/tempDir-001/node1/.
   [junit4]   2> 540555 INFO  (jetty-launcher-590-thread-3) [    ] o.a.s.c.CoreContainer New CoreContainer 22760766
   [junit4]   2> 540555 INFO  (jetty-launcher-590-thread-1) [    ] o.a.s.c.CoreContainer New CoreContainer 15074951
   [junit4]   2> 540555 INFO  (jetty-launcher-590-thread-5) [    ] o.a.s.c.CorePropertiesLocator Config-defined core root directory: /home/jenkins/workspace/Lucene-Solr-trunk-Linux/solr/build/solr-core/test/J0/temp/solr.cloud.TestAuthenticationFramework_673967461D9E7F0D-001/tempDir-001/node5/.
   [junit4]   2> 540555 INFO  (jetty-launcher-590-thread-1) [    ] o.a.s.c.CoreContainer Loading cores into CoreContainer [instanceDir=/home/jenkins/workspace/Lucene-Solr-trunk-Linux/solr/build/solr-core/test/J0/temp/solr.cloud.TestAuthenticationFramework_673967461D9E7F0D-001/tempDir-001/node1]
   [junit4]   2> 540555 INFO  (jetty-launcher-590-thread-5) [    ] o.a.s.c.CoreContainer New CoreContainer 17033242
   [junit4]   2> 540555 INFO  (jetty-launcher-590-thread-3) [    ] o.a.s.c.CoreContainer Loading cores into CoreContainer [instanceDir=/home/jenkins/workspace/Lucene-Solr-trunk-Linux/solr/build/solr-core/test/J0/temp/solr.cloud.TestAuthenticationFramework_673967461D9E7F0D-001/tempDir-001/node3]
   [junit4]   2> 540556 INFO  (jetty-launcher-590-thread-5) [    ] o.a.s.c.CoreContainer Loading cores into CoreContainer [instanceDir=/home/jenkins/workspace/Lucene-Solr-trunk-Linux/solr/build/solr-core/test/J0/temp/solr.cloud.TestAuthenticationFramework_673967461D9E7F0D-001/tempDir-001/node5]
   [junit4]   2> 540556 WARN  (jetty-launcher-590-thread-1) [    ] o.a.s.c.CoreContainer Couldn't add files from /home/jenkins/workspace/Lucene-Solr-trunk-Linux/solr/build/solr-core/test/J0/temp/solr.cloud.TestAuthenticationFramework_673967461D9E7F0D-001/tempDir-001/node1/lib to classpath: /home/jenkins/workspace/Lucene-Solr-trunk-Linux/solr/build/solr-core/test/J0/temp/solr.cloud.TestAuthenticationFramework_673967461D9E7F0D-001/tempDir-001/node1/lib
   [junit4]   2> 540556 WARN  (jetty-launcher-590-thread-5) [    ] o.a.s.c.CoreContainer Couldn't add files from /home/jenkins/workspace/Lucene-Solr-trunk-Linux/solr/build/solr-core/test/J0/temp/solr.cloud.TestAuthenticationFramework_673967461D9E7F0D-001/tempDir-001/node5/lib to classpath: /home/jenkins/workspace/Lucene-Solr-trunk-Linux/solr/build/solr-core/test/J0/temp/solr.cloud.TestAuthenticationFramework_673967461D9E7F0D-001/tempDir-001/node5/lib
   [junit4]   2> 540556 WARN  (jetty-launcher-590-thread-3) [    ] o.a.s.c.CoreContainer Couldn't add files from /home/jenkins/workspace/Lucene-Solr-trunk-Linux/solr/build/solr-core/test/J0/temp/solr.cloud.TestAuthenticationFramework_673967461D9E7F0D-001/tempDir-001/node3/lib to classpath: /home/jenkins/workspace/Lucene-Solr-trunk-Linux/solr/build/solr-core/test/J0/temp/solr.cloud.TestAuthenticationFramework_673967461D9E7F0D-001/tempDir-001/node3/lib
   [junit4]   2> 540556 INFO  (jetty-launcher-590-thread-5) [    ] o.a.s.h.c.HttpShardHandlerFactory created with socketTimeout : 90000,urlScheme : ,connTimeout : 15000,maxConnectionsPerHost : 20,maxConnections : 10000,corePoolSize : 0,maximumPoolSize : 2147483647,maxThreadIdleTime : 5,sizeOfQueue : -1,fairnessPolicy : false,useRetries : false,
   [junit4]   2> 540556 INFO  (jetty-launcher-590-thread-1) [    ] o.a.s.h.c.HttpShardHandlerFactory created with socketTimeout : 90000,urlScheme : ,connTimeout : 15000,maxConnectionsPerHost : 20,maxConnections : 10000,corePoolSize : 0,maximumPoolSize : 2147483647,maxThreadIdleTime : 5,sizeOfQueue : -1,fairnessPolicy : false,useRetries : false,
   [junit4]   2> 540556 INFO  (jetty-launcher-590-thread-3) [    ] o.a.s.h.c.HttpShardHandlerFactory created with socketTimeout : 90000,urlScheme : ,connTimeout : 15000,maxConnectionsPerHost : 20,maxConnections : 10000,corePoolSize : 0,maximumPoolSize : 2147483647,maxThreadIdleTime : 5,sizeOfQueue : -1,fairnessPolicy : false,useRetries : false,
   [junit4]   2> 540557 INFO  (jetty-launcher-590-thread-3) [    ] o.a.s.u.UpdateShardHandler Creating UpdateShardHandler HTTP client with params: socketTimeout=340000&connTimeout=45000&retry=true
   [junit4]   2> 540557 INFO  (jetty-launcher-590-thread-1) [    ] o.a.s.u.UpdateShardHandler Creating UpdateShardHandler HTTP client with params: socketTimeout=340000&connTimeout=45000&retry=true
   [junit4]   2> 540557 INFO  (jetty-launcher-590-thread-5) [    ] o.a.s.u.UpdateShardHandler Creating UpdateShardHandler HTTP client with params: socketTimeout=340000&connTimeout=45000&retry=true
   [junit4]   2> 540557 INFO  (jetty-launcher-590-thread-3) [    ] o.a.s.l.LogWatcher SLF4J impl is org.slf4j.impl.Log4jLoggerFactory
   [junit4]   2> 540557 INFO  (jetty-launcher-590-thread-3) [    ] o.a.s.l.LogWatcher Registering Log Listener [Log4j (org.slf4j.impl.Log4jLoggerFactory)]
   [junit4]   2> 540557 INFO  (jetty-launcher-590-thread-1) [    ] o.a.s.l.LogWatcher SLF4J impl is org.slf4j.impl.Log4jLoggerFactory
   [junit4]   2> 540558 INFO  (jetty-launcher-590-thread-1) [    ] o.a.s.l.LogWatcher Registering Log Listener [Log4j (org.slf4j.impl.Log4jLoggerFactory)]
   [junit4]   2> 540558 INFO  (jetty-launcher-590-thread-3) [    ] o.a.s.c.ZkContainer Zookeeper client=127.0.0.1:41943/solr
   [junit4]   2> 540557 INFO  (jetty-launcher-590-thread-5) [    ] o.a.s.l.LogWatcher SLF4J impl is org.slf4j.impl.Log4jLoggerFactory
   [junit4]   2> 540558 INFO  (jetty-launcher-590-thread-3) [    ] o.a.s.c.ZkController zkHost includes chroot
   [junit4]   2> 540558 INFO  (jetty-launcher-590-thread-5) [    ] o.a.s.l.LogWatcher Registering Log Listener [Log4j (org.slf4j.impl.Log4jLoggerFactory)]
   [junit4]   2> 540558 INFO  (jetty-launcher-590-thread-3) [    ] o.a.s.c.c.SolrZkClient Using default ZkCredentialsProvider
   [junit4]   2> 540558 INFO  (jetty-launcher-590-thread-5) [    ] o.a.s.c.ZkContainer Zookeeper client=127.0.0.1:41943/solr
   [junit4]   2> 540558 INFO  (jetty-launcher-590-thread-1) [    ] o.a.s.c.ZkContainer Zookeeper client=127.0.0.1:41943/solr
   [junit4]   2> 540558 INFO  (jetty-launcher-590-thread-5) [    ] o.a.s.c.ZkController zkHost includes chroot
   [junit4]   2> 540558 INFO  (jetty-launcher-590-thread-1) [    ] o.a.s.c.ZkController zkHost includes chroot
   [junit4]   2> 540558 INFO  (jetty-launcher-590-thread-5) [    ] o.a.s.c.c.SolrZkClient Using default ZkCredentialsProvider
   [junit4]   2> 540558 INFO  (jetty-launcher-590-thread-1) [    ] o.a.s.c.c.SolrZkClient Using default ZkCredentialsProvider
   [junit4]   2> 540558 INFO  (jetty-launcher-590-thread-3) [    ] o.a.s.c.c.ConnectionManager Waiting for client to connect to ZooKeeper
   [junit4]   2> 540558 INFO  (jetty-launcher-590-thread-5) [    ] o.a.s.c.c.ConnectionManager Waiting for client to connect to ZooKeeper
   [junit4]   2> 540558 INFO  (jetty-launcher-590-thread-1) [    ] o.a.s.c.c.ConnectionManager Waiting for client to connect to ZooKeeper
   [junit4]   2> 540563 INFO  (jetty-launcher-590-thread-4) [    ] o.a.s.c.CorePropertiesLocator Config-defined core root directory: /home/jenkins/workspace/Lucene-Solr-trunk-Linux/solr/build/solr-core/test/J0/temp/solr.cloud.TestAuthenticationFramework_673967461D9E7F0D-001/tempDir-001/node4/.
   [junit4]   2> 540563 WARN  (NIOServerCxn.Factory:0.0.0.0/0.0.0.0:0) [    ] o.a.z.s.NIOServerCnxn caught end of stream exception
   [junit4]   2> EndOfStreamException: Unable to read additional data from client sessionid 0x15305433fd30002, likely client has closed socket
   [junit4]   2> 	at org.apache.zookeeper.server.NIOServerCnxn.doIO(NIOServerCnxn.java:228)
   [junit4]   2> 	at org.apache.zookeeper.server.NIOServerCnxnFactory.run(NIOServerCnxnFactory.java:208)
   [junit4]   2> 	at java.lang.Thread.run(Thread.java:745)
   [junit4]   2> 540563 INFO  (jetty-launcher-590-thread-2) [    ] o.a.s.c.CorePropertiesLocator Config-defined core root directory: /home/jenkins/workspace/Lucene-Solr-trunk-Linux/solr/build/solr-core/test/J0/temp/solr.cloud.TestAuthenticationFramework_673967461D9E7F0D-001/tempDir-001/node2/.
   [junit4]   2> 540564 INFO  (jetty-launcher-590-thread-4) [    ] o.a.s.c.CoreContainer New CoreContainer 10067730
   [junit4]   2> 540564 INFO  (jetty-launcher-590-thread-2) [    ] o.a.s.c.CoreContainer New CoreContainer 27530938
   [junit4]   2> 540564 INFO  (jetty-launcher-590-thread-4) [    ] o.a.s.c.CoreContainer Loading cores into CoreContainer [instanceDir=/home/jenkins/workspace/Lucene-Solr-trunk-Linux/solr/build/solr-core/test/J0/temp/solr.cloud.TestAuthenticationFramework_673967461D9E7F0D-001/tempDir-001/node4]
   [junit4]   2> 540564 INFO  (jetty-launcher-590-thread-2) [    ] o.a.s.c.CoreContainer Loading cores into CoreContainer [instanceDir=/home/jenkins/workspace/Lucene-Solr-trunk-Linux/solr/build/solr-core/test/J0/temp/solr.cloud.TestAuthenticationFramework_673967461D9E7F0D-001/tempDir-001/node2]
   [junit4]   2> 540564 WARN  (jetty-launcher-590-thread-4) [    ] o.a.s.c.CoreContainer Couldn't add files from /home/jenkins/workspace/Lucene-Solr-trunk-Linux/solr/build/solr-core/test/J0/temp/solr.cloud.TestAuthenticationFramework_673967461D9E7F0D-001/tempDir-001/node4/lib to classpath: /home/jenkins/workspace/Lucene-Solr-trunk-Linux/solr/build/solr-core/test/J0/temp/solr.cloud.TestAuthenticationFramework_673967461D9E7F0D-001/tempDir-001/node4/lib
   [junit4]   2> 540564 WARN  (jetty-launcher-590-thread-2) [    ] o.a.s.c.CoreContainer Couldn't add files from /home/jenkins/workspace/Lucene-Solr-trunk-Linux/solr/build/solr-core/test/J0/temp/solr.cloud.TestAuthenticationFramework_673967461D9E7F0D-001/tempDir-001/node2/lib to classpath: /home/jenkins/workspace/Lucene-Solr-trunk-Linux/solr/build/solr-core/test/J0/temp/solr.cloud.TestAuthenticationFramework_673967461D9E7F0D-001/tempDir-001/node2/lib
   [junit4]   2> 540564 INFO  (jetty-launcher-590-thread-4) [    ] o.a.s.h.c.HttpShardHandlerFactory created with socketTimeout : 90000,urlScheme : ,connTimeout : 15000,maxConnectionsPerHost : 20,maxConnections : 10000,corePoolSize : 0,maximumPoolSize : 2147483647,maxThreadIdleTime : 5,sizeOfQueue : -1,fairnessPolicy : false,useRetries : false,
   [junit4]   2> 540564 INFO  (jetty-launcher-590-thread-2) [    ] o.a.s.h.c.HttpShardHandlerFactory created with socketTimeout : 90000,urlScheme : ,connTimeout : 15000,maxConnectionsPerHost : 20,maxConnections : 10000,corePoolSize : 0,maximumPoolSize : 2147483647,maxThreadIdleTime : 5,sizeOfQueue : -1,fairnessPolicy : false,useRetries : false,
   [junit4]   2> 540565 INFO  (jetty-launcher-590-thread-4) [    ] o.a.s.u.UpdateShardHandler Creating UpdateShardHandler HTTP client with params: socketTimeout=340000&connTimeout=45000&retry=true
   [junit4]   2> 540565 INFO  (jetty-launcher-590-thread-2) [    ] o.a.s.u.UpdateShardHandler Creating UpdateShardHandler HTTP client with params: socketTimeout=340000&connTimeout=45000&retry=true
   [junit4]   2> 540565 INFO  (zkCallback-603-thread-1) [    ] o.a.s.c.c.ConnectionManager Watcher org.apache.solr.common.cloud.ConnectionManager@129ea0f name:ZooKeeperConnection Watcher:127.0.0.1:41943 got event WatchedEvent state:SyncConnected type:None path:null path:null type:None
   [junit4]   2> 540565 INFO  (jetty-launcher-590-thread-3) [    ] o.a.s.c.c.ConnectionManager Client is connected to ZooKeeper
   [junit4]   2> 540566 INFO  (zkCallback-604-thread-1) [    ] o.a.s.c.c.ConnectionManager Watcher org.apache.solr.common.cloud.ConnectionManager@7adad6 name:ZooKeeperConnection Watcher:127.0.0.1:41943 got event WatchedEvent state:SyncConnected type:None path:null path:null type:None
   [junit4]   2> 540566 INFO  (jetty-launcher-590-thread-4) [    ] o.a.s.l.LogWatcher SLF4J impl is org.slf4j.impl.Log4jLoggerFactory
   [junit4]   2> 540566 INFO  (jetty-launcher-590-thread-5) [    ] o.a.s.c.c.ConnectionManager Client is connected to ZooKeeper
   [junit4]   2> 540566 INFO  (jetty-launcher-590-thread-4) [    ] o.a.s.l.LogWatcher Registering Log Listener [Log4j (org.slf4j.impl.Log4jLoggerFactory)]
   [junit4]   2> 540566 INFO  (jetty-launcher-590-thread-3) [    ] o.a.s.c.c.SolrZkClient Using default ZkACLProvider
   [junit4]   2> 540566 INFO  (zkCallback-605-thread-1) [    ] o.a.s.c.c.ConnectionManager Watcher org.apache.solr.common.cloud.ConnectionManager@f1cec4 name:ZooKeeperConnection Watcher:127.0.0.1:41943 got event WatchedEvent state:SyncConnected type:None path:null path:null type:None
   [junit4]   2> 540566 INFO  (jetty-launcher-590-thread-1) [    ] o.a.s.c.c.ConnectionManager Client is connected to ZooKeeper
   [junit4]   2> 540566 INFO  (jetty-launcher-590-thread-4) [    ] o.a.s.c.ZkContainer Zookeeper client=127.0.0.1:41943/solr
   [junit4]   2> 540566 INFO  (jetty-launcher-590-thread-2) [    ] o.a.s.l.LogWatcher SLF4J impl is org.slf4j.impl.Log4jLoggerFactory
   [junit4]   2> 540566 INFO  (jetty-launcher-590-thread-4) [    ] o.a.s.c.ZkController zkHost includes chroot
   [junit4]   2> 540566 INFO  (jetty-launcher-590-thread-2) [    ] o.a.s.l.LogWatcher Registering Log Listener [Log4j (org.slf4j.impl.Log4jLoggerFactory)]
   [junit4]   2> 540566 INFO  (jetty-launcher-590-thread-4) [    ] o.a.s.c.c.SolrZkClient Using default ZkCredentialsProvider
   [junit4]   2> 540566 INFO  (jetty-launcher-590-thread-5) [    ] o.a.s.c.c.SolrZkClient Using default ZkACLProvider
   [junit4]   2> 540566 INFO  (jetty-launcher-590-thread-1) [    ] o.a.s.c.c.SolrZkClient Using default ZkACLProvider
   [junit4]   2> 540566 INFO  (jetty-launcher-590-thread-2) [    ] o.a.s.c.ZkContainer Zookeeper client=127.0.0.1:41943/solr
   [junit4]   2> 540566 INFO  (jetty-launcher-590-thread-2) [    ] o.a.s.c.ZkController zkHost includes chroot
   [junit4]   2> 540566 INFO  (jetty-launcher-590-thread-2) [    ] o.a.s.c.c.SolrZkClient Using default ZkCredentialsProvider
   [junit4]   2> 540566 INFO  (jetty-launcher-590-thread-4) [    ] o.a.s.c.c.ConnectionManager Waiting for client to connect to ZooKeeper
   [junit4]   2> 540567 INFO  (jetty-launcher-590-thread-2) [    ] o.a.s.c.c.ConnectionManager Waiting for client to connect to ZooKeeper
   [junit4]   2> 540577 INFO  (jetty-launcher-590-thread-3) [n:127.0.0.1:58999_solr    ] o.a.s.c.c.ConnectionManager Waiting for client to connect to ZooKeeper
   [junit4]   2> 540584 INFO  (zkCallback-610-thread-1) [    ] o.a.s.c.c.ConnectionManager Watcher org.apache.solr.common.cloud.ConnectionManager@1c11c4 name:ZooKeeperConnection Watcher:127.0.0.1:41943 got event WatchedEvent state:SyncConnected type:None path:null path:null type:None
   [junit4]   2> 540584 INFO  (jetty-launcher-590-thread-4) [    ] o.a.s.c.c.ConnectionManager Client is connected to ZooKeeper
   [junit4]   2> 540584 INFO  (zkCallback-611-thread-1) [    ] o.a.s.c.c.ConnectionManager Watcher org.apache.solr.common.cloud.ConnectionManager@fcc41 name:ZooKeeperConnection Watcher:127.0.0.1:41943 got event WatchedEvent state:SyncConnected type:None path:null path:null type:None
   [junit4]   2> 540585 INFO  (jetty-launcher-590-thread-2) [    ] o.a.s.c.c.ConnectionManager Client is connected to ZooKeeper
   [junit4]   2> 540585 INFO  (jetty-launcher-590-thread-4) [    ] o.a.s.c.c.SolrZkClient Using default ZkACLProvider
   [junit4]   2> 540585 INFO  (jetty-launcher-590-thread-2) [    ] o.a.s.c.c.SolrZkClient Using default ZkACLProvider
   [junit4]   2> 540591 INFO  (zkCallback-612-thread-1-processing-n:127.0.0.1:58999_solr) [n:127.0.0.1:58999_solr    ] o.a.s.c.c.ConnectionManager Watcher org.apache.solr.common.cloud.ConnectionManager@3cd374 name:ZooKeeperConnection Watcher:127.0.0.1:41943/solr got event WatchedEvent state:SyncConnected type:None path:null path:null type:None
   [junit4]   2> 540591 INFO  (jetty-launcher-590-thread-1) [n:127.0.0.1:52365_solr    ] o.a.s.c.c.ConnectionManager Waiting for client to connect to ZooKeeper
   [junit4]   2> 540591 INFO  (jetty-launcher-590-thread-5) [n:127.0.0.1:56343_solr    ] o.a.s.c.c.ConnectionManager Waiting for client to connect to ZooKeeper
   [junit4]   2> 540591 INFO  (jetty-launcher-590-thread-3) [n:127.0.0.1:58999_solr    ] o.a.s.c.c.ConnectionManager Client is connected to ZooKeeper
   [junit4]   2> 540601 WARN  (NIOServerCxn.Factory:0.0.0.0/0.0.0.0:0) [    ] o.a.z.s.NIOServerCnxn caught end of stream exception
   [junit4]   2> EndOfStreamException: Unable to read additional data from client sessionid 0x15305433fd3000a, likely client has closed socket
   [junit4]   2> 	at org.apache.zookeeper.server.NIOServerCnxn.doIO(NIOServerCnxn.java:228)
   [junit4]   2> 	at org.apache.zookeeper.server.NIOServerCnxnFactory.run(NIOServerCnxnFactory.java:208)
   [junit4]   2> 	at java.lang.Thread.run(Thread.java:745)
   [junit4]   2> 540601 INFO  (jetty-launcher-590-thread-4) [n:127.0.0.1:57522_solr    ] o.a.s.c.c.ConnectionManager Waiting for client to connect to ZooKeeper
   [junit4]   2> 540601 INFO  (jetty-launcher-590-thread-2) [n:127.0.0.1:33819_solr    ] o.a.s.c.c.ConnectionManager Waiting for client to connect to ZooKeeper
   [junit4]   2> 540604 INFO  (zkCallback-614-thread-1-processing-n:127.0.0.1:52365_solr) [n:127.0.0.1:52365_solr    ] o.a.s.c.c.ConnectionManager Watcher org.apache.solr.common.cloud.ConnectionManager@1fc1e7c name:ZooKeeperConnection Watcher:127.0.0.1:41943/solr got event WatchedEvent state:SyncConnected type:None path:null path:null type:None
   [junit4]   2> 540604 INFO  (jetty-launcher-590-thread-1) [n:127.0.0.1:52365_solr    ] o.a.s.c.c.ConnectionManager Client is connected to ZooKeeper
   [junit4]   2> 540604 INFO  (zkCallback-613-thread-1-processing-n:127.0.0.1:56343_solr) [n:127.0.0.1:56343_solr    ] o.a.s.c.c.ConnectionManager Watcher org.apache.solr.common.cloud.ConnectionManager@1bc54b7 name:ZooKeeperConnection Watcher:127.0.0.1:41943/solr got event WatchedEvent state:SyncConnected type:None path:null path:null type:None
   [junit4]   2> 540604 INFO  (jetty-launcher-590-thread-5) [n:127.0.0.1:56343_solr    ] o.a.s.c.c.ConnectionManager Client is connected to ZooKeeper
   [junit4]   2> 540618 INFO  (zkCallback-616-thread-1-processing-n:127.0.0.1:33819_solr) [n:127.0.0.1:33819_solr    ] o.a.s.c.c.ConnectionManager Watcher org.apache.solr.common.cloud.ConnectionManager@e69477 name:ZooKeeperConnection Watcher:127.0.0.1:41943/solr got event WatchedEvent state:SyncConnected type:None path:null path:null type:None
   [junit4]   2> 540618 INFO  (jetty-launcher-590-thread-3) [n:127.0.0.1:58999_solr    ] o.a.s.c.c.SolrZkClient makePath: /overseer/queue
   [junit4]   2> 540618 INFO  (jetty-launcher-590-thread-2) [n:127.0.0.1:33819_solr    ] o.a.s.c.c.ConnectionManager Client is connected to ZooKeeper
   [junit4]   2> 540618 INFO  (zkCallback-615-thread-1-processing-n:127.0.0.1:57522_solr) [n:127.0.0.1:57522_solr    ] o.a.s.c.c.ConnectionManager Watcher org.apache.solr.common.cloud.ConnectionManager@1cdf2b1 name:ZooKeeperConnection Watcher:127.0.0.1:41943/solr got event WatchedEvent state:SyncConnected type:None path:null path:null type:None
   [junit4]   2> 540618 INFO  (jetty-launcher-590-thread-4) [n:127.0.0.1:57522_solr    ] o.a.s.c.c.ConnectionManager Client is connected to ZooKeeper
   [junit4]   2> 540630 INFO  (jetty-launcher-590-thread-1) [n:127.0.0.1:52365_solr    ] o.a.s.c.c.SolrZkClient makePath: /overseer/queue
   [junit4]   2> 540630 INFO  (jetty-launcher-590-thread-5) [n:127.0.0.1:56343_solr    ] o.a.s.c.c.SolrZkClient makePath: /overseer/queue
   [junit4]   2> 540630 INFO  (jetty-launcher-590-thread-2) [n:127.0.0.1:33819_solr    ] o.a.s.c.c.SolrZkClient makePath: /overseer/queue
   [junit4]   2> 540648 INFO  (jetty-launcher-590-thread-4) [n:127.0.0.1:57522_solr    ] o.a.s.c.c.SolrZkClient makePath: /overseer/collection-queue-work
   [junit4]   2> 540651 INFO  (jetty-launcher-590-thread-3) [n:127.0.0.1:58999_solr    ] o.a.s.c.c.SolrZkClient makePath: /overseer/collection-queue-work
   [junit4]   2> 540662 INFO  (jetty-launcher-590-thread-5) [n:127.0.0.1:56343_solr    ] o.a.s.c.c.SolrZkClient makePath: /overseer/collection-queue-work
   [junit4]   2> 540662 INFO  (jetty-launcher-590-thread-1) [n:127.0.0.1:52365_solr    ] o.a.s.c.c.SolrZkClient makePath: /overseer/collection-queue-work
   [junit4]   2> 540662 INFO  (jetty-launcher-590-thread-2) [n:127.0.0.1:33819_solr    ] o.a.s.c.c.SolrZkClient makePath: /overseer/collection-queue-work
   [junit4]   2> 540771 INFO  (jetty-launcher-590-thread-3) [n:127.0.0.1:58999_solr    ] o.a.s.c.c.SolrZkClient makePath: /overseer/collection-map-running
   [junit4]   2> 540771 INFO  (jetty-launcher-590-thread-5) [n:127.0.0.1:56343_solr    ] o.a.s.c.c.SolrZkClient makePath: /overseer/collection-map-running
   [junit4]   2> 540771 INFO  (jetty-launcher-590-thread-4) [n:127.0.0.1:57522_solr    ] o.a.s.c.c.SolrZkClient makePath: /overseer/collection-map-running
   [junit4]   2> 540771 INFO  (jetty-launcher-590-thread-1) [n:127.0.0.1:52365_solr    ] o.a.s.c.c.SolrZkClient makePath: /overseer/collection-map-running
   [junit4]   2> 540774 INFO  (jetty-launcher-590-thread-2) [n:127.0.0.1:33819_solr    ] o.a.s.c.c.SolrZkClient makePath: /overseer/collection-map-running
   [junit4]   2> 540804 INFO  (jetty-launcher-590-thread-5) [n:127.0.0.1:56343_solr    ] o.a.s.c.c.SolrZkClient makePath: /overseer/collection-map-completed
   [junit4]   2> 540806 INFO  (jetty-launcher-590-thread-3) [n:127.0.0.1:58999_solr    ] o.a.s.c.c.SolrZkClient makePath: /overseer/collection-map-completed
   [junit4]   2> 540806 INFO  (jetty-launcher-590-thread-4) [n:127.0.0.1:57522_solr    ] o.a.s.c.c.SolrZkClient makePath: /overseer/collection-map-completed
   [junit4]   2> 540806 INFO  (jetty-launcher-590-thread-1) [n:127.0.0.1:52365_solr    ] o.a.s.c.c.SolrZkClient makePath: /overseer/collection-map-completed
   [junit4]   2> 540869 INFO  (jetty-launcher-590-thread-2) [n:127.0.0.1:33819_solr    ] o.a.s.c.c.SolrZkClient makePath: /overseer/collection-map-failure
   [junit4]   2> 540870 INFO  (jetty-launcher-590-thread-3) [n:127.0.0.1:58999_solr    ] o.a.s.c.c.SolrZkClient makePath: /overseer/collection-map-failure
   [junit4]   2> 540870 INFO  (jetty-launcher-590-thread-5) [n:127.0.0.1:56343_solr    ] o.a.s.c.c.SolrZkClient makePath: /overseer/collection-map-failure
   [junit4]   2> 540870 INFO  (jetty-launcher-590-thread-4) [n:127.0.0.1:57522_solr    ] o.a.s.c.c.SolrZkClient makePath: /overseer/collection-map-failure
   [junit4]   2> 540870 INFO  (jetty-launcher-590-thread-1) [n:127.0.0.1:52365_solr    ] o.a.s.c.c.SolrZkClient makePath: /overseer/collection-map-failure
   [junit4]   2> 540883 INFO  (jetty-launcher-590-thread-3) [n:127.0.0.1:58999_solr    ] o.a.s.c.c.SolrZkClient makePath: /live_nodes
   [junit4]   2> 540884 INFO  (jetty-launcher-590-thread-5) [n:127.0.0.1:56343_solr    ] o.a.s.c.c.SolrZkClient makePath: /live_nodes
   [junit4]   2> 540884 INFO  (jetty-launcher-590-thread-4) [n:127.0.0.1:57522_solr    ] o.a.s.c.c.SolrZkClient makePath: /live_nodes
   [junit4]   2> 540884 INFO  (jetty-launcher-590-thread-2) [n:127.0.0.1:33819_solr    ] o.a.s.c.c.SolrZkClient makePath: /live_nodes
   [junit4]   2> 540884 INFO  (jetty-launcher-590-thread-1) [n:127.0.0.1:52365_solr    ] o.a.s.c.c.SolrZkClient makePath: /live_nodes
   [junit4]   2> 540912 INFO  (jetty-launcher-590-thread-3) [n:127.0.0.1:58999_solr    ] o.a.s.c.c.SolrZkClient makePath: /collections
   [junit4]   2> 540912 INFO  (jetty-launcher-590-thread-5) [n:127.0.0.1:56343_solr    ] o.a.s.c.c.SolrZkClient makePath: /collections
   [junit4]   2> 540912 INFO  (jetty-launcher-590-thread-2) [n:127.0.0.1:33819_solr    ] o.a.s.c.c.SolrZkClient makePath: /collections
   [junit4]   2> 540912 INFO  (jetty-launcher-590-thread-1) [n:127.0.0.1:52365_solr    ] o.a.s.c.c.SolrZkClient makePath: /collections
   [junit4]   2> 540912 INFO  (jetty-launcher-590-thread-4) [n:127.0.0.1:57522_solr    ] o.a.s.c.c.SolrZkClient makePath: /collections
   [junit4]   2> 540926 INFO  (jetty-launcher-590-thread-5) [n:127.0.0.1:56343_solr    ] o.a.s.c.c.SolrZkClient makePath: /aliases.json
   [junit4]   2> 540926 INFO  (jetty-launcher-590-thread-1) [n:127.0.0.1:52365_solr    ] o.a.s.c.c.SolrZkClient makePath: /aliases.json
   [junit4]   2> 540926 INFO  (jetty-launcher-590-thread-3) [n:127.0.0.1:58999_solr    ] o.a.s.c.c.SolrZkClient makePath: /aliases.json
   [junit4]   2> 540926 INFO  (jetty-launcher-590-thread-2) [n:127.0.0.1:33819_solr    ] o.a.s.c.c.SolrZkClient makePath: /aliases.json
   [junit4]   2> 540926 INFO  (jetty-launcher-590-thread-4) [n:127.0.0.1:57522_solr    ] o.a.s.c.c.SolrZkClient makePath: /aliases.json
   [junit4]   2> 540947 INFO  (jetty-launcher-590-thread-1) [n:127.0.0.1:52365_solr    ] o.a.s.c.c.SolrZkClient makePath: /clusterstate.json
   [junit4]   2> 540947 INFO  (jetty-launcher-590-thread-3) [n:127.0.0.1:58999_solr    ] o.a.s.c.c.SolrZkClient makePath: /clusterstate.json
   [junit4]   2> 540947 INFO  (jetty-launcher-590-thread-2) [n:127.0.0.1:33819_solr    ] o.a.s.c.c.SolrZkClient makePath: /clusterstate.json
   [junit4]   2> 540947 INFO  (jetty-launcher-590-thread-5) [n:127.0.0.1:56343_solr    ] o.a.s.c.c.SolrZkClient makePath: /clusterstate.json
   [junit4]   2> 540947 INFO  (jetty-launcher-590-thread-4) [n:127.0.0.1:57522_solr    ] o.a.s.c.c.SolrZkClient makePath: /clusterstate.json
   [junit4]   2> 540968 INFO  (jetty-launcher-590-thread-1) [n:127.0.0.1:52365_solr    ] o.a.s.c.c.SolrZkClient makePath: /security.json
   [junit4]   2> 540968 INFO  (jetty-launcher-590-thread-3) [n:127.0.0.1:58999_solr    ] o.a.s.c.c.SolrZkClient makePath: /security.json
   [junit4]   2> 540968 INFO  (jetty-launcher-590-thread-5) [n:127.0.0.1:56343_solr    ] o.a.s.c.c.SolrZkClient makePath: /security.json
   [junit4]   2> 540968 INFO  (jetty-launcher-590-thread-2) [n:127.0.0.1:33819_solr    ] o.a.s.c.c.SolrZkClient makePath: /security.json
   [junit4]   2> 540968 INFO  (jetty-launcher-590-thread-4) [n:127.0.0.1:57522_solr    ] o.a.s.c.c.SolrZkClient makePath: /security.json
   [junit4]   2> 540981 INFO  (jetty-launcher-590-thread-3) [n:127.0.0.1:58999_solr    ] o.a.s.c.ZkController Register node as live in ZooKeeper:/live_nodes/127.0.0.1:58999_solr
   [junit4]   2> 540981 INFO  (jetty-launcher-590-thread-5) [n:127.0.0.1:56343_solr    ] o.a.s.c.ZkController Register node as live in ZooKeeper:/live_nodes/127.0.0.1:56343_solr
   [junit4]   2> 540981 INFO  (jetty-launcher-590-thread-1) [n:127.0.0.1:52365_solr    ] o.a.s.c.ZkController Register node as live in ZooKeeper:/live_nodes/127.0.0.1:52365_solr
   [junit4]   2> 540989 INFO  (jetty-launcher-590-thread-4) [n:127.0.0.1:57522_solr    ] o.a.s.c.ZkController Register node as live in ZooKeeper:/live_nodes/127.0.0.1:57522_solr
   [junit4]   2> 540991 INFO  (jetty-launcher-590-thread-2) [n:127.0.0.1:33819_solr    ] o.a.s.c.ZkController Register node as live in ZooKeeper:/live_nodes/127.0.0.1:33819_solr
   [junit4]   2> 540991 INFO  (jetty-launcher-590-thread-3) [n:127.0.0.1:58999_solr    ] o.a.s.c.c.SolrZkClient makePath: /live_nodes/127.0.0.1:58999_solr
   [junit4]   2> 540991 INFO  (jetty-launcher-590-thread-5) [n:127.0.0.1:56343_solr    ] o.a.s.c.c.SolrZkClient makePath: /live_nodes/127.0.0.1:56343_solr
   [junit4]   2> 540991 INFO  (jetty-launcher-590-thread-1) [n:127.0.0.1:52365_solr    ] o.a.s.c.c.SolrZkClient makePath: /live_nodes/127.0.0.1:52365_solr
   [junit4]   2> 540999 INFO  (jetty-launcher-590-thread-4) [n:127.0.0.1:57522_solr    ] o.a.s.c.c.SolrZkClient makePath: /live_nodes/127.0.0.1:57522_solr
   [junit4]   2> 541001 INFO  (jetty-launcher-590-thread-2) [n:127.0.0.1:33819_solr    ] o.a.s.c.c.SolrZkClient makePath: /live_nodes/127.0.0.1:33819_solr
   [junit4]   2> 541021 INFO  (jetty-launcher-590-thread-3) [n:127.0.0.1:58999_solr    ] o.a.s.c.c.SolrZkClient makePath: /overseer_elect
   [junit4]   2> 541021 INFO  (jetty-launcher-590-thread-1) [n:127.0.0.1:52365_solr    ] o.a.s.c.c.SolrZkClient makePath: /overseer_elect
   [junit4]   2> 541021 INFO  (jetty-launcher-590-thread-5) [n:127.0.0.1:56343_solr    ] o.a.s.c.c.SolrZkClient makePath: /overseer_elect
   [junit4]   2> 541022 INFO  (jetty-launcher-590-thread-4) [n:127.0.0.1:57522_solr    ] o.a.s.c.c.SolrZkClient makePath: /overseer_elect
   [junit4]   2> 541022 INFO  (jetty-launcher-590-thread-2) [n:127.0.0.1:33819_solr    ] o.a.s.c.c.SolrZkClient makePath: /overseer_elect
   [junit4]   2> 541044 INFO  (jetty-launcher-590-thread-1) [n:127.0.0.1:52365_solr    ] o.a.s.c.c.SolrZkClient makePath: /overseer_elect/election
   [junit4]   2> 541044 INFO  (jetty-launcher-590-thread-5) [n:127.0.0.1:56343_solr    ] o.a.s.c.c.SolrZkClient makePath: /overseer_elect/election
   [junit4]   2> 541047 INFO  (jetty-launcher-590-thread-4) [n:127.0.0.1:57522_solr    ] o.a.s.c.c.SolrZkClient makePath: /overseer_elect/election
   [junit4]   2> 541047 INFO  (jetty-launcher-590-thread-3) [n:127.0.0.1:58999_solr    ] o.a.s.c.c.SolrZkClient makePath: /overseer_elect/election
   [junit4]   2> 541047 INFO  (jetty-launcher-590-thread-2) [n:127.0.0.1:33819_solr    ] o.a.s.c.c.SolrZkClient makePath: /overseer_elect/election
   [junit4]   2> 541060 INFO  (jetty-launcher-590-thread-1) [n:127.0.0.1:52365_solr    ] o.a.s.c.Overseer Overseer (id=null) closing
   [junit4]   2> 541060 INFO  (jetty-launcher-590-thread-5) [n:127.0.0.1:56343_solr    ] o.a.s.c.Overseer Overseer (id=null) closing
   [junit4]   2> 541070 INFO  (jetty-launcher-590-thread-3) [n:127.0.0.1:58999_solr    ] o.a.s.c.Overseer Overseer (id=null) closing
   [junit4]   2> 541073 INFO  (jetty-launcher-590-thread-4) [n:127.0.0.1:57522_solr    ] o.a.s.c.Overseer Overseer (id=null) closing
   [junit4]   2> 541073 INFO  (jetty-launcher-590-thread-2) [n:127.0.0.1:33819_solr    ] o.a.s.c.Overseer Overseer (id=null) closing
   [junit4]   2> 541073 INFO  (jetty-launcher-590-thread-1) [n:127.0.0.1:52365_solr    ] o.a.s.c.LeaderElector Joined leadership election with path: /overseer_elect/election/95425803496652812-127.0.0.1:52365_solr-n_0000000000
   [junit4]   2> 541073 INFO  (jetty-launcher-590-thread-5) [n:127.0.0.1:56343_solr    ] o.a.s.c.LeaderElector Joined leadership election with path: /overseer_elect/election/95425803496652813-127.0.0.1:56343_solr-n_0000000001
   [junit4]   2> 541083 INFO  (jetty-launcher-590-thread-3) [n:127.0.0.1:58999_solr    ] o.a.s.c.LeaderElector Joined leadership election with path: /overseer_elect/election/95425803496652811-127.0.0.1:58999_solr-n_0000000002
   [junit4]   2> 541092 INFO  (jetty-launcher-590-thread-4) [n:127.0.0.1:57522_solr    ] o.a.s.c.LeaderElector Joined leadership election with path: /overseer_elect/election/95425803496652815-127.0.0.1:57522_solr-n_0000000003
   [junit4]   2> 541092 INFO  (jetty-launcher-590-thread-2) [n:127.0.0.1:33819_solr    ] o.a.s.c.LeaderElector Joined leadership election with path: /overseer_elect/election/95425803496652814-127.0.0.1:33819_solr-n_0000000004
   [junit4]   2> 541092 INFO  (jetty-launcher-590-thread-1) [n:127.0.0.1:52365_solr    ] o.a.s.c.OverseerElectionContext I am going to be the leader 127.0.0.1:52365_solr
   [junit4]   2> 541092 INFO  (jetty-launcher-590-thread-1) [n:127.0.0.1:52365_solr    ] o.a.s.c.c.SolrZkClient makePath: /overseer_elect/leader
   [junit4]   2> 541092 INFO  (jetty-launcher-590-thread-3) [n:127.0.0.1:58999_solr    ] o.a.s.c.LeaderElector Watching path /overseer_elect/election/95425803496652813-127.0.0.1:56343_solr-n_0000000001 to know if I could be the leader
   [junit4]   2> 541092 INFO  (jetty-launcher-590-thread-4) [n:127.0.0.1:57522_solr    ] o.a.s.c.LeaderElector Watching path /overseer_elect/election/95425803496652811-127.0.0.1:58999_solr-n_0000000002 to know if I could be the leader
   [junit4]   2> 541092 INFO  (jetty-launcher-590-thread-2) [n:127.0.0.1:33819_solr    ] o.a.s.c.LeaderElector Watching path /overseer_elect/election/95425803496652815-127.0.0.1:57522_solr-n_0000000003 to know if I could be the leader
   [junit4]   2> 541092 INFO  (jetty-launcher-590-thread-4) [n:127.0.0.1:57522_solr    ] o.a.s.c.c.ZkStateReader Updating cluster state from ZooKeeper... 
   [junit4]   2> 541092 INFO  (jetty-launcher-590-thread-5) [n:127.0.0.1:56343_solr    ] o.a.s.c.LeaderElector Watching path /overseer_elect/election/95425803496652812-127.0.0.1:52365_solr-n_0000000000 to know if I could be the leader
   [junit4]   2> 541092 INFO  (jetty-launcher-590-thread-3) [n:127.0.0.1:58999_solr    ] o.a.s.c.c.ZkStateReader Updating cluster state from ZooKeeper... 
   [junit4]   2> 541093 INFO  (jetty-launcher-590-thread-5) [n:127.0.0.1:56343_solr    ] o.a.s.c.c.ZkStateReader Updating cluster state from ZooKeeper... 
   [junit4]   2> 541092 INFO  (jetty-launcher-590-thread-2) [n:127.0.0.1:33819_solr    ] o.a.s.c.c.ZkStateReader Updating cluster state from ZooKeeper... 
   [junit4]   2> 541102 INFO  (jetty-launcher-590-thread-1) [n:127.0.0.1:52365_solr    ] o.a.s.c.Overseer Overseer (id=95425803496652812-127.0.0.1:52365_solr-n_0000000000) starting
   [junit4]   2> 541112 INFO  (jetty-launcher-590-thread-3) [n:127.0.0.1:58999_solr    ] o.a.s.c.c.ZkStateReader Updated live nodes from ZooKeeper... (0) -> (5)
   [junit4]   2> 541112 INFO  (jetty-launcher-590-thread-5) [n:127.0.0.1:56343_solr    ] o.a.s.c.c.ZkStateReader Updated live nodes from ZooKeeper... (0) -> (5)
   [junit4]   2> 541112 INFO  (jetty-launcher-590-thread-4) [n:127.0.0.1:57522_solr    ] o.a.s.c.c.ZkStateReader Updated live nodes from ZooKeeper... (0) -> (5)
   [junit4]   2> 541112 INFO  (jetty-launcher-590-thread-2) [n:127.0.0.1:33819_solr    ] o.a.s.c.c.ZkStateReader Updated live nodes from ZooKeeper... (0) -> (5)
   [junit4]   2> 541126 INFO  (jetty-launcher-590-thread-1) [n:127.0.0.1:52365_solr    ] o.a.s.c.c.SolrZkClient makePath: /overseer/queue-work
   [junit4]   2> 541148 INFO  (jetty-launcher-590-thread-5) [n:127.0.0.1:56343_solr    ] o.a.s.c.CoreContainer Security conf doesn't exist. Skipping setup for authorization module.
   [junit4]   2> 541148 INFO  (jetty-launcher-590-thread-5) [n:127.0.0.1:56343_solr    ] o.a.s.c.CoreContainer Authentication plugin class obtained from system property 'authenticationPlugin': org.apache.solr.cloud.TestAuthenticationFramework$MockAuthenticationPlugin
   [junit4]   2> 541148 INFO  (jetty-launcher-590-thread-4) [n:127.0.0.1:57522_solr    ] o.a.s.c.CoreContainer Security conf doesn't exist. Skipping setup for authorization module.
   [junit4]   2> 541148 INFO  (jetty-launcher-590-thread-4) [n:127.0.0.1:57522_solr    ] o.a.s.c.CoreContainer Authentication plugin class obtained from system property 'authenticationPlugin': org.apache.solr.cloud.TestAuthenticationFramework$MockAuthenticationPlugin
   [junit4]   2> 541149 INFO  (jetty-launcher-590-thread-5) [n:127.0.0.1:56343_solr    ] o.a.s.c.CoreContainer Reconfiguring the shard handler factory and update shard handler.
   [junit4]   2> 541149 INFO  (jetty-launcher-590-thread-4) [n:127.0.0.1:57522_solr    ] o.a.s.c.CoreContainer Reconfiguring the shard handler factory and update shard handler.
   [junit4]   2> 541149 INFO  (jetty-launcher-590-thread-5) [n:127.0.0.1:56343_solr    ] o.a.s.h.c.HttpShardHandlerFactory Reconfiguring the default client with: org.apache.solr.cloud.TestAuthenticationFramework$MockAuthenticationPlugin$MockClientConfigurer@1cc3d4
   [junit4]   2> 541149 INFO  (jetty-launcher-590-thread-4) [n:127.0.0.1:57522_solr    ] o.a.s.h.c.HttpShardHandlerFactory Reconfiguring the default client with: org.apache.solr.cloud.TestAuthenticationFramework$MockAuthenticationPlugin$MockClientConfigurer@febd1a
   [junit4]   2> 541149 INFO  (jetty-launcher-590-thread-5) [n:127.0.0.1:56343_solr    ] o.a.s.u.UpdateShardHandler Reconfiguring the default client with: org.apache.solr.cloud.TestAuthenticationFramework$MockAuthenticationPlugin$MockClientConfigurer@1cc3d4
   [junit4]   2> 541149 INFO  (jetty-launcher-590-thread-4) [n:127.0.0.1:57522_solr    ] o.a.s.u.UpdateShardHandler Reconfiguring the default client with: org.apache.solr.cloud.TestAuthenticationFramework$MockAuthenticationPlugin$MockClientConfigurer@febd1a
   [junit4]   2> 541150 INFO  (jetty-launcher-590-thread-2) [n:127.0.0.1:33819_solr    ] o.a.s.c.CoreContainer Security conf doesn't exist. Skipping setup for authorization module.
   [junit4]   2> 541150 INFO  (jetty-launcher-590-thread-2) [n:127.0.0.1:33819_solr    ] o.a.s.c.CoreContainer Authentication plugin class obtained from system property 'authenticationPlugin': org.apache.solr.cloud.TestAuthenticationFramework$MockAuthenticationPlugin
   [junit4]   2> 541150 INFO  (jetty-launcher-590-thread-2) [n:127.0.0.1:33819_solr    ] o.a.s.c.CoreContainer Reconfiguring the shard handler factory and update shard handler.
   [junit4]   2> 541150 INFO  (jetty-launcher-590-thread-2) [n:127.0.0.1:33819_solr    ] o.a.s.h.c.HttpShardHandlerFactory Reconfiguring the default client with: org.apache.solr.cloud.TestAuthenticationFramework$MockAuthenticationPlugin$MockClientConfigurer@973ee6
   [junit4]   2> 541150 INFO  (jetty-launcher-590-thread-2) [n:127.0.0.1:33819_solr    ] o.a.s.u.UpdateShardHandler Reconfiguring the default client with: org.apache.solr.cloud.TestAuthenticationFramework$MockAuthenticationPlugin$MockClientConfigurer@973ee6
   [junit4]   2> 541150 INFO  (jetty-launcher-590-thread-4) [n:127.0.0.1:57522_solr    ] o.a.s.c.CorePropertiesLocator Looking for core definitions underneath /home/jenkins/workspace/Lucene-Solr-trunk-Linux/solr/build/solr-core/test/J0/temp/solr.cloud.TestAuthenticationFramework_673967461D9E7F0D-001/tempDir-001/node4/.
   [junit4]   2> 541150 INFO  (jetty-launcher-590-thread-5) [n:127.0.0.1:56343_solr    ] o.a.s.c.CorePropertiesLocator Looking for core definitions underneath /home/jenkins/workspace/Lucene-Solr-trunk-Linux/solr/build/solr-core/test/J0/temp/solr.cloud.TestAuthenticationFramework_673967461D9E7F0D-001/tempDir-001/node5/.
   [junit4]   2> 541150 INFO  (jetty-launcher-590-thread-2) [n:127.0.0.1:33819_solr    ] o.a.s.c.CorePropertiesLocator Looking for core definitions underneath /home/jenkins/workspace/Lucene-Solr-trunk-Linux/solr/build/solr-core/test/J0/temp/solr.cloud.TestAuthenticationFramework_673967461D9E7F0D-001/tempDir-001/node2/.
   [junit4]   2> 541150 INFO  (jetty-launcher-590-thread-5) [n:127.0.0.1:56343_solr    ] o.a.s.c.CorePropertiesLocator Found 0 core definitions
   [junit4]   2> 541150 INFO  (jetty-launcher-590-thread-4) [n:127.0.0.1:57522_solr    ] o.a.s.c.CorePropertiesLocator Found 0 core definitions
   [junit4]   2> 541150 INFO  (jetty-launcher-590-thread-2) [n:127.0.0.1:33819_solr    ] o.a.s.c.CorePropertiesLocator Found 0 core definitions
   [junit4]   2> 541153 INFO  (jetty-launcher-590-thread-5) [n:127.0.0.1:56343_solr    ] o.a.s.s.SolrDispatchFilter user.dir=/home/jenkins/workspace/Lucene-Solr-trunk-Linux/solr/build/solr-core/test/J0
   [junit4]   2> 541153 INFO  (jetty-launcher-590-thread-5) [n:127.0.0.1:56343_solr    ] o.a.s.s.SolrDispatchFilter SolrDispatchFilter.init() done
   [junit4]   2> 541153 INFO  (jetty-launcher-590-thread-4) [n:127.0.0.1:57522_solr    ] o.a.s.s.SolrDispatchFilter user.dir=/home/jenkins/workspace/Lucene-Solr-trunk-Linux/solr/build/solr-core/test/J0
   [junit4]   2> 541153 INFO  (jetty-launcher-590-thread-4) [n:127.0.0.1:57522_solr    ] o.a.s.s.SolrDispatchFilter SolrDispatchFilter.init() done
   [junit4]   2> 541153 INFO  (jetty-launcher-590-thread-2) [n:127.0.0.1:33819_solr    ] o.a.s.s.SolrDispatchFilter user.dir=/home/jenkins/workspace/Lucene-Solr-trunk-Linux/solr/build/solr-core/test/J0
   [junit4]   2> 541153 INFO  (jetty-launcher-590-thread-2) [n:127.0.0.1:33819_solr    ] o.a.s.s.SolrDispatchFilter SolrDispatchFilter.init() done
   [junit4]   2> 541170 INFO  (jetty-launcher-590-thread-3) [n:127.0.0.1:58999_solr    ] o.a.s.c.CoreContainer Security conf doesn't exist. Skipping setup for authorization module.
   [junit4]   2> 541170 INFO  (jetty-launcher-590-thread-3) [n:127.0.0.1:58999_solr    ] o.a.s.c.CoreContainer Authentication plugin class obtained from system property 'authenticationPlugin': org.apache.solr.cloud.TestAuthenticationFramework$MockAuthenticationPlugin
   [junit4]   2> 541170 INFO  (jetty-launcher-590-thread-3) [n:127.0.0.1:58999_solr    ] o.a.s.c.CoreContainer Reconfiguring the shard handler factory and update shard handler.
   [junit4]   2> 541170 INFO  (jetty-launcher-590-thread-3) [n:127.0.0.1:58999_solr    ] o.a.s.h.c.HttpShardHandlerFactory Reconfiguring the default client with: org.apache.solr.cloud.TestAuthenticationFramework$MockAuthenticationPlugin$MockClientConfigurer@1570ee9
   [junit4]   2> 541171 INFO  (jetty-launcher-590-thread-3) [n:127.0.0.1:58999_solr    ] o.a.s.u.UpdateShardHandler Reconfiguring the default client with: org.apache.solr.cloud.TestAuthenticationFramework$MockAuthenticationPlugin$MockClientConfigurer@1570ee9
   [junit4]   2> 541171 INFO  (jetty-launcher-590-thread-3) [n:127.0.0.1:58999_solr    ] o.a.s.c.CorePropertiesLocator Looking for core definitions underneath /home/jenkins/workspace/Lucene-Solr-trunk-Linux/solr/build/solr-core/test/J0/temp/solr.cloud.TestAuthenticationFramework_673967461D9E7F0D-001/tempDir-001/node3/.
   [junit4]   2> 541171 INFO  (jetty-launcher-590-thread-3) [n:127.0.0.1:58999_solr    ] o.a.s.c.CorePropertiesLocator Found 0 core definitions
   [junit4]   2> 541173 INFO  (jetty-launcher-590-thread-3) [n:127.0.0.1:58999_solr    ] o.a.s.s.SolrDispatchFilter user.dir=/home/jenkins/workspace/Lucene-Solr-trunk-Linux/solr/build/solr-core/test/J0
   [junit4]   2> 541173 INFO  (jetty-launcher-590-thread-3) [n:127.0.0.1:58999_solr    ] o.a.s.s.SolrDispatchFilter SolrDispatchFilter.init() done
   [junit4]   2> 541210 INFO  (jetty-launcher-590-thread-1) [n:127.0.0.1:52365_solr    ] o.a.s.c.OverseerAutoReplicaFailoverThread Starting OverseerAutoReplicaFailoverThread autoReplicaFailoverWorkLoopDelay=10000 autoReplicaFailoverWaitAfterExpiration=30000 autoReplicaFailoverBadNodeExpiration=60000
   [junit4]   2> 541210 INFO  (OverseerCollectionConfigSetProcessor-95425803496652812-127.0.0.1:52365_solr-n_0000000000) [n:127.0.0.1:52365_solr    ] o.a.s.c.OverseerTaskProcessor Process current queue of overseer operations
   [junit4]   2> 541210 INFO  (jetty-launcher-590-thread-1) [n:127.0.0.1:52365_solr    ] o.a.s.c.c.ZkStateReader Updating cluster state from ZooKeeper... 
   [junit4]   2> 541211 INFO  (OverseerStateUpdate-95425803496652812-127.0.0.1:52365_solr-n_0000000000) [n:127.0.0.1:52365_solr    ] o.a.s.c.Overseer Starting to work on the main queue
   [junit4]   2> 541212 INFO  (jetty-launcher-590-thread-1) [n:127.0.0.1:52365_solr    ] o.a.s.c.c.ZkStateReader Updated live nodes from ZooKeeper... (0) -> (5)
   [junit4]   2> 541213 INFO  (OverseerStateUpdate-95425803496652812-127.0.0.1:52365_solr-n_0000000000) [n:127.0.0.1:52365_solr    ] o.a.s.c.c.ZkStateReader Updated live nodes from ZooKeeper... (5) -> (5)
   [junit4]   2> 541275 INFO  (jetty-launcher-590-thread-1) [n:127.0.0.1:52365_solr    ] o.a.s.c.CoreContainer Security conf doesn't exist. Skipping setup for authorization module.
   [junit4]   2> 541275 INFO  (jetty-launcher-590-thread-1) [n:127.0.0.1:52365_solr    ] o.a.s.c.CoreContainer Authentication plugin class obtained from system property 'authenticationPlugin': org.apache.solr.cloud.TestAuthenticationFramework$MockAuthenticationPlugin
   [junit4]   2> 541275 INFO  (jetty-launcher-590-thread-1) [n:127.0.0.1:52365_solr    ] o.a.s.c.CoreContainer Reconfiguring the shard handler factory and update shard handler.
   [junit4]   2> 541275 INFO  (jetty-launcher-590-thread-1) [n:127.0.0.1:52365_solr    ] o.a.s.h.c.HttpShardHandlerFactory Reconfiguring the default client with: org.apache.solr.cloud.TestAuthenticationFramework$MockAuthenticationPlugin$MockClientConfigurer@a9b17a
   [junit4]   2> 541275 INFO  (jetty-launcher-590-thread-1) [n:127.0.0.1:52365_solr    ] o.a.s.u.UpdateShardHandler Reconfiguring the default client with: org.apache.solr.cloud.TestAuthenticationFramework$MockAuthenticationPlugin$MockClientConfigurer@a9b17a
   [junit4]   2> 541276 INFO  (jetty-launcher-590-thread-1) [n:127.0.0.1:52365_solr    ] o.a.s.c.CorePropertiesLocator Looking for core definitions underneath /home/jenkins/workspace/Lucene-Solr-trunk-Linux/solr/build/solr-core/test/J0/temp/solr.cloud.TestAuthenticationFramework_673967461D9E7F0D-001/tempDir-001/node1/.
   [junit4]   2> 541276 INFO  (jetty-launcher-590-thread-1) [n:127.0.0.1:52365_solr    ] o.a.s.c.CorePropertiesLocator Found 0 core definitions
   [junit4]   2> 541276 INFO  (jetty-launcher-590-thread-1) [n:127.0.0.1:52365_solr    ] o.a.s.s.SolrDispatchFilter user.dir=/home/jenkins/workspace/Lucene-Solr-trunk-Linux/solr/build/solr-core/test/J0
   [junit4]   2> 541276 INFO  (jetty-launcher-590-thread-1) [n:127.0.0.1:52365_solr    ] o.a.s.s.SolrDispatchFilter SolrDispatchFilter.init() done
   [junit4]   2> 541277 INFO  (TEST-TestAuthenticationFramework.testCollectionCreateWithoutCoresThenDelete-seed#[673967461D9E7F0D]) [    ] o.a.s.c.c.SolrZkClient Using default ZkCredentialsProvider
   [junit4]   2> 541277 INFO  (TEST-TestAuthenticationFramework.testCollectionCreateWithoutCoresThenDelete-seed#[673967461D9E7F0D]) [    ] o.a.s.c.c.ConnectionManager Waiting for client to connect to ZooKeeper
   [junit4]   2> 541294 INFO  (zkCallback-617-thread-1) [    ] o.a.s.c.c.ConnectionManager Watcher org.apache.solr.common.cloud.ConnectionManager@15ef0b2 name:ZooKeeperConnection Watcher:127.0.0.1:41943 got event WatchedEvent state:SyncConnected type:None path:null path:null type:None
   [junit4]   2> 541294 INFO  (TEST-TestAuthenticationFramework.testCollectionCreateWithoutCoresThenDelete-seed#[673967461D9E7F0D]) [    ] o.a.s.c.c.ConnectionManager Client is connected to ZooKeeper
   [junit4]   2> 541294 INFO  (TEST-TestAuthenticationFramework.testCollectionCreateWithoutCoresThenDelete-seed#[673967461D9E7F0D]) [    ] o.a.s.c.c.SolrZkClient Using default ZkACLProvider
   [junit4]   2> 541304 INFO  (TEST-TestAuthenticationFramework.testCollectionCreateWithoutCoresThenDelete-seed#[673967461D9E7F0D]) [    ] o.a.s.c.c.SolrZkClient Using default ZkCredentialsProvider
   [junit4]   2> 541305 INFO  (TEST-TestAuthenticationFramework.testCollectionCreateWithoutCoresThenDelete-seed#[673967461D9E7F0D]) [    ] o.a.s.c.c.ConnectionManager Waiting for client to connect to ZooKeeper
   [junit4]   2> 541315 INFO  (zkCallback-619-thread-1) [    ] o.a.s.c.c.ConnectionManager Watcher org.apache.solr.common.cloud.ConnectionManager@c651ec name:ZooKeeperConnection Watcher:127.0.0.1:41943/solr got event WatchedEvent state:SyncConnected type:None path:null path:null type:None
   [junit4]   2> 541315 INFO  (TEST-TestAuthenticationFramework.testCollectionCreateWithoutCoresThenDelete-seed#[673967461D9E7F0D]) [    ] o.a.s.c.c.ConnectionManager Client is connected to ZooKeeper
   [junit4]   2> 541316 INFO  (TEST-TestAuthenticationFramework.testCollectionCreateWithoutCoresThenDelete-seed#[673967461D9E7F0D]) [    ] o.a.s.c.c.SolrZkClient Using default ZkACLProvider
   [junit4]   2> 541316 INFO  (TEST-TestAuthenticationFramework.testCollectionCreateWithoutCoresThenDelete-seed#[673967461D9E7F0D]) [    ] o.a.s.c.c.SolrZkClient makePath: /configs/solrCloudCollectionConfig/protwords.txt
   [junit4]   2> 541346 INFO  (TEST-TestAuthenticationFramework.testCollectionCreateWithoutCoresThenDelete-seed#[673967461D9E7F0D]) [    ] o.a.s.c.c.SolrZkClient makePath: /configs/solrCloudCollectionConfig/solrconfig-delaying-component.xml
   [junit4]   2> 541371 INFO  (TEST-TestAuthenticationFramework.testCollectionCreateWithoutCoresThenDelete-seed#[673967461D9E7F0D]) [    ] o.a.s.c.c.SolrZkClient makePath: /configs/solrCloudCollectionConfig/bad_solrconfig.xml
   [junit4]   2> 541374 INFO  (TEST-TestAuthenticationFramework.testCollectionCreateWithoutCoresThenDelete-seed#[673967461D9E7F0D]) [    ] o.a.s.c.c.SolrZkClient makePath: /configs/solrCloudCollectionConfig/solrconfig-sortingmergepolicyfactory.xml
   [junit4]   2> 541388 INFO  (TEST-TestAuthenticationFramework.testCollectionCreateWithoutCoresThenDelete-seed#[673967461D9E7F0D]) [    ] o.a.s.c.c.SolrZkClient makePath: /configs/solrCloudCollectionConfig/solrconfig-nocache.xml
   [junit4]   2> 541390 INFO  (TEST-TestAuthenticationFramework.testCollectionCreateWithoutCoresThenDelete-seed#[673967461D9E7F0D]) [    ] o.a.s.c.c.SolrZkClient makePath: /configs/solrCloudCollectionConfig/solrconfig-implicitproperties.xml
   [junit4]   2> 541396 INFO  (TEST-TestAuthenticationFramework.testCollectionCreateWithoutCoresThenDelete-seed#[673967461D9E7F0D]) [    ] o.a.s.c.c.SolrZkClient makePath: /configs/solrCloudCollectionConfig/solrconfig-mergepolicy-legacy.xml
   [junit4]   2> 541398 INFO  (TEST-TestAuthenticationFramework.testCollectionCreateWithoutCoresThenDelete-seed#[673967461D9E7F0D]) [    ] o.a.s.c.c.SolrZkClient makePath: /configs/solrCloudCollectionConfig/bad-schema-uniquekey-uses-default.xml
   [junit4]   2> 541410 INFO  (TEST-TestAuthenticationFramework.testCollectionCreateWithoutCoresThenDelete-seed#[673967461D9E7F0D]) [    ] o.a.s.c.c.SolrZkClient makePath: /configs/solrCloudCollectionConfig/bad-schema-sim-default-has-no-explicit-sim.xml
   [junit4]   2> 541413 INFO  (TEST-TestAuthenticationFramework.testCollectionCreateWithoutCoresThenDelete-seed#[673967461D9E7F0D]) [    ] o.a.s.c.c.SolrZkClient makePath: /configs/solrCloudCollectionConfig/bad-schema-uniquekey-multivalued.xml
   [junit4]   2> 541415 INFO  (TEST-TestAuthenticationFramework.testCollectionCreateWithoutCoresThenDelete-seed#[673967461D9E7F0D]) [    ] o.a.s.c.c.SolrZkClient makePath: /configs/solrCloudCollectionConfig/analyzingInfixSuggest.txt
   [junit4]   2> 541417 INFO  (TEST-TestAuthenticationFramework.testCollectionCreateWithoutCoresThenDelete-seed#[673967461D9E7F0D]) [    ] o.a.s.c.c.SolrZkClient makePath: /configs/solrCloudCollectionConfig/missleading.extension.updateprocessor.js.txt
   [junit4]   2> 541422 INFO  (TEST-TestAuthenticationFramework.testCollectionCreateWithoutCoresThenDelete-seed#[673967461D9E7F0D]) [    ] o.a.s.c.c.SolrZkClient makePath: /configs/solrCloudCollectionConfig/bad-schema-multiple-asterisk-copyfield-source-should-fail-test.xml
   [junit4]   2> 541432 INFO  (TEST-TestAuthenticationFramework.testCollectionCreateWithoutCoresThenDelete-seed#[673967461D9E7F0D]) [    ] o.a.s.c.c.SolrZkClient makePath: /configs/solrCloudCollectionConfig/schema-replication2.xml
   [junit4]   2> 541441 INFO  (TEST-TestAuthenticationFramework.testCollectionCreateWithoutCoresThenDelete-seed#[673967461D9E7F0D]) [    ] o.a.s.c.c.SolrZkClient makePath: /configs/solrCloudCollectionConfig/solrconfig-infostream-logging.xml
   [junit4]   2> 541446 INFO  (TEST-TestAuthenticationFramework.testCollectionCreateWithoutCoresThenDelete-seed#[673967461D9E7F0D]) [    ] o.a.s.c.c.SolrZkClient makePath: /configs/solrCloudCollectionConfig/solrconfig-collapseqparser.xml
   [junit4]   2> 541452 INFO  (TEST-TestAuthenticationFramework.testCollectionCreateWithoutCoresThenDelete-seed#[673967461D9E7F0D]) [    ] o.a.s.c.c.SolrZkClient makePath: /configs/solrCloudCollectionConfig/bad-schema-currency-ft-bogus-code-in-xml.xml
   [junit4]   2> 541455 INFO  (TEST-TestAuthenticationFramework.testCollectionCreateWithoutCoresThenDelete-seed#[673967461D9E7F0D]) [    ] o.a.s.c.c.SolrZkClient makePath: /configs/solrCloudCollectionConfig/old_synonyms.txt
   [junit4]   2> 541460 INFO  (TEST-TestAuthenticationFramework.testCollectionCreateWithoutCoresThenDelete-seed#[673967461D9E7F0D]) [    ] o.a.s.c.c.SolrZkClient makePath: /configs/solrCloudCollectionConfig/enumsConfig.xml
   [junit4]   2> 541462 INFO  (TEST-TestAuthenticationFramework.testCollectionCreateWithoutCoresThenDelete-seed#[673967461D9E7F0D]) [    ] o.a.s.c.c.SolrZkClient makePath: /configs/solrCloudCollectionConfig/solrconfig-script-updateprocessor.xml
   [junit4]   2> 541468 INFO  (TEST-TestAuthenticationFramework.testCollectionCreateWithoutCoresThenDelete-seed#[673967461D9E7F0D]) [    ] o.a.s.c.c.SolrZkClient makePath: /configs/solrCloudCollectionConfig/schema-add-schema-fields-update-processor.xml
   [junit4]   2> 541480 INFO  (TEST-TestAuthenticationFramework.testCollectionCreateWithoutCoresThenDelete-seed#[673967461D9E7F0D]) [    ] o.a.s.c.c.SolrZkClient makePath: /configs/solrCloudCollectionConfig/solrconfig-mergepolicyfactory-nocfs.xml
   [junit4]   2> 541482 INFO  (TEST-TestAuthenticationFramework.testCollectionCreateWithoutCoresThenDelete-seed#[673967461D9E7F0D]) [    ] o.a.s.c.c.SolrZkClient makePath: /configs/solrCloudCollectionConfig/bad-schema-sweetspot-both-tf.xml
   [junit4]   2> 541488 INFO  (TEST-TestAuthenticationFramework.testCollectionCreateWithoutCoresThenDelete-seed#[673967461D9E7F0D]) [    ] o.a.s.c.c.SolrZkClient makePath: /configs/solrCloudCollectionConfig/schema-phrasesuggest.xml
   [junit4]   2> 541490 INFO  (TEST-TestAuthenticationFramework.testCollectionCreateWithoutCoresThenDelete-seed#[673967461D9E7F0D]) [    ] o.a.s.c.c.SolrZkClient makePath: /configs/solrCloudCollectionConfig/solrconfig.xml
   [junit4]   2> 541496 INFO  (TEST-TestAuthenticationFramework.testCollectionCreateWithoutCoresThenDelete-seed#[673967461D9E7F0D]) [    ] o.a.s.c.c.SolrZkClient makePath: /configs/solrCloudCollectionConfig/solrconfig-delpolicy1.xml
   [junit4]   2> 541498 INFO  (TEST-TestAuthenticationFramework.testCollectionCreateWithoutCoresThenDelete-seed#[673967461D9E7F0D]) [    ] o.a.s.c.c.SolrZkClient makePath: /configs/solrCloudCollectionConfig/schema-sim.xml
   [junit4]   2> 541512 INFO  (TEST-TestAuthenticationFramework.testCollectionCreateWithoutCoresThenDelete-seed#[673967461D9E7F0D]) [    ] o.a.s.c.c.SolrZkClient makePath: /configs/solrCloudCollectionConfig/schema15.xml
   [junit4]   2> 541518 INFO  (TEST-TestAuthenticationFramework.testCollectionCreateWithoutCoresThenDelete-seed#[673967461D9E7F0D]) [    ] o.a.s.c.c.SolrZkClient makePath: /configs/solrCloudCollectionConfig/schema-sql.xml
   [junit4]   2> 541531 INFO  (TEST-TestAuthenticationFramework.testCollectionCreateWithoutCoresThenDelete-seed#[673967461D9E7F0D]) [    ] o.a.s.c.c.SolrZkClient makePath: /configs/solrCloudCollectionConfig/bad-schema-misplaced-asterisk-copyfield-source-should-fail-test.xml
   [junit4]   2> 541533 INFO  (TEST-TestAuthenticationFramework.testCollectionCreateWithoutCoresThenDelete-seed#[673967461D9E7F0D]) [    ] o.a.s.c.c.SolrZkClient makePath: /configs/solrCloudCollectionConfig/stemdict.txt
   [junit4]   2> 541536 INFO  (TEST-TestAuthenticationFramework.testCollectionCreateWithoutCoresThenDelete-seed#[673967461D9E7F0D]) [    ] o.a.s.c.c.SolrZkClient makePath: /configs/solrCloudCollectionConfig/hunspell-test.aff
   [junit4]   2> 541538 INFO  (TEST-TestAuthenticationFramework.testCollectionCreateWithoutCoresThenDelete-seed#[673967461D9E7F0D]) [    ] o.a.s.c.c.SolrZkClient makePath: /configs/solrCloudCollectionConfig/solrconfig-sql.xml
   [junit4]   2> 541550 INFO  (TEST-TestAuthenticationFramework.testCollectionCreateWithoutCoresThenDelete-seed#[673967461D9E7F0D]) [    ] o.a.s.c.c.SolrZkClient makePath: /configs/solrCloudCollectionConfig/solrconfig-spatial.xml
   [junit4]   2> 541553 INFO  (TEST-TestAuthenticationFramework.testCollectionCreateWithoutCoresThenDelete-seed#[673967461D9E7F0D]) [    ] o.a.s.c.c.SolrZkClient makePath: /configs/solrCloudCollectionConfig/solrconfig-slave1.xml
   [junit4]   2> 541589 INFO  (TEST-TestAuthenticationFramework.testCollectionCreateWithoutCoresThenDelete-seed#[673967461D9E7F0D]) [    ] o.a.s.c.c.SolrZkClient makePath: /configs/solrCloudCollectionConfig/bad-schema-dup-fieldType.xml
   [junit4]   2> 541602 INFO  (TEST-TestAuthenticationFramework.testCollectionCreateWithoutCoresThenDelete-seed#[673967461D9E7F0D]) [    ] o.a.s.c.c.SolrZkClient makePath: /configs/solrCloudCollectionConfig/bad-schema-external-filefield.xml
   [junit4]   2> 541607 INFO  (TEST-TestAuthenticationFramework.testCollectionCreateWithoutCoresThenDelete-seed#[673967461D9E7F0D]) [    ] o.a.s.c.c.SolrZkClient makePath: /configs/solrCloudCollectionConfig/solrconfig-query-parser-init.xml
   [junit4]   2> 541616 INFO  (TEST-TestAuthenticationFramework.testCollectionCreateWithoutCoresThenDelete-seed#[673967461D9E7F0D]) [    ] o.a.s.c.c.SolrZkClient makePath: /configs/solrCloudCollectionConfig/bad-solrconfig-nrtmode.xml
   [junit4]   2> 541635 INFO  (TEST-TestAuthenticationFramework.testCollectionCreateWithoutCoresThenDelete-seed#[673967461D9E7F0D]) [    ] o.a.s.c.c.SolrZkClient makePath: /configs/solrCloudCollectionConfig/schema-complex-phrase.xml
   [junit4]   2> 541637 INFO  (TEST-TestAuthenticationFramework.testCollectionCreateWithoutCoresThenDelete-seed#[673967461D9E7F0D]) [    ] o.a.s.c.c.SolrZkClient makePath: /configs/solrCloudCollectionConfig/conditional.updateprocessor.js
   [junit4]   2> 541639 INFO  (TEST-TestAuthenticationFramework.testCollectionCreateWithoutCoresThenDelete-seed#[673967461D9E7F0D]) [    ] o.a.s.c.c.SolrZkClient makePath: /configs/solrCloudCollectionConfig/bad-schema-analyzer-class-and-nested.xml
   [junit4]   2> 541641 INFO  (TEST-TestAuthenticationFramework.testCollectionCreateWithoutCoresThenDelete-seed#[673967461D9E7F0D]) [    ] o.a.s.c.c.SolrZkClient makePath: /configs/solrCloudCollectionConfig/schema-eff.xml
   [junit4]   2> 541653 INFO  (TEST-TestAuthenticationFramework.testCollectionCreateWithoutCoresThenDelete-seed#[673967461D9E7F0D]) [    ] o.a.s.c.c.SolrZkClient makePath: /configs/solrCloudCollectionConfig/schema-folding.xml
   [junit4]   2> 541680 INFO  (TEST-TestAuthenticationFramework.testCollectionCreateWithoutCoresThenDelete-seed#[673967461D9E7F0D]) [    ] o.a.s.c.c.SolrZkClient makePath: /configs/solrCloudCollectionConfig/solrconfig-tieredmergepolicyfactory.xml
   [junit4]   2> 541683 INFO  (TEST-TestAuthenticationFramework.testCollectionCreateWithoutCoresThenDelete-seed#[673967461D9E7F0D]) [    ] o.a.s.c.c.SolrZkClient makePath: /configs/solrCloudCollectionConfig/schema-simpleqpplugin.xml
   [junit4]   2> 541704 INFO  (TEST-TestAuthenticationFramework.testCollectionCreateWithoutCoresThenDelete-seed#[673967461D9E7F0D]) [    ] o.a.s.c.c.SolrZkClient makePath: /configs/solrCloudCollectionConfig/solrconfig-hash.xml
   [junit4]   2> 541713 INFO  (TEST-TestAuthenticationFramework.testCollectionCreateWithoutCoresThenDelete-seed#[673967461D9E7F0D]) [    ] o.a.s.c.c.SolrZkClient makePath: /configs/solrCloudCollectionConfig/stopwords.txt
   [junit4]   2> 541725 INFO  (TEST-TestAuthenticationFramework.testCollectionCreateWithoutCoresThenDelete-seed#[673967461D9E7F0D]) [    ] o.a.s.c.c.SolrZkClient makePath: /configs/solrCloudCollectionConfig/bad-schema-dynamicfield-required.xml
   [junit4]   2> 541728 INFO  (TEST-TestAuthenticationFramework.testCollectionCreateWithoutCoresThenDelete-seed#[673967461D9E7F0D]) [    ] o.a.s.c.c.SolrZkClient makePath: /configs/solrCloudCollectionConfig/solrconfig-mergepolicy-nocfs.xml
   [junit4]   2> 541730 INFO  (TEST-TestAuthenticationFramework.testCollectionCreateWithoutCoresThenDelete-seed#[673967461D9E7F0D]) [    ] o.a.s.c.c.SolrZkClient makePath: /configs/solrCloudCollectionConfig/bad-solrconfig-bogus-scriptengine-name.xml
   [junit4]   2> 541742 INFO  (TEST-TestAuthenticationFramework.testCollectionCreateWithoutCoresThenDelete-seed#[673967461D9E7F0D]) [    ] o.a.s.c.c.SolrZkClient makePath: /configs/solrCloudCollectionConfig/throw.error.on.add.updateprocessor.js
   [junit4]   2> 541745 INFO  (TEST-TestAuthenticationFramework.testCollectionCreateWithoutCoresThenDelete-seed#[673967461D9E7F0D]) [    ] o.a.s.c.c.SolrZkClient makePath: /configs/solrCloudCollectionConfig/solrconfig-minimal.xml
   [junit4]   2> 541747 INFO  (TEST-TestAuthenticationFramework.testCollectionCreateWithoutCoresThenDelete-seed#[673967461D9E7F0D]) [    ] o.a.s.c.c.SolrZkClient makePath: /configs/solrCloudCollectionConfig/solrconfig-defaults.xml
   [junit4]   2> 541765 INFO  (TEST-TestAuthenticationFramework.testCollectionCreateWithoutCoresThenDelete-seed#[673967461D9E7F0D]) [    ] o.a.s.c.c.SolrZkClient makePath: /configs/solrCloudCollectionConfig/blendedInfixSuggest.txt
   [junit4]   2> 541768 INFO  (TEST-TestAuthenticationFramework.testCollectionCreateWithoutCoresThenDelete-seed#[673967461D9E7F0D]) [    ] o.a.s.c.c.SolrZkClient makePath: /configs/solrCloudCollectionConfig/solrconfig-postingshighlight.xml
   [junit4]   2> 541770 INFO  (TEST-TestAuthenticationFramework.testCollectionCreateWithoutCoresThenDelete-seed#[673967461D9E7F0D]) [    ] o.a.s.c.c.SolrZkClient makePath: /configs/solrCloudCollectionConfig/schema-docValuesJoin.xml
   [junit4]   2> 541776 INFO  (TEST-TestAuthenticationFramework.testCollectionCreateWithoutCoresThenDelete-seed#[673967461D9E7F0D]) [    ] o.a.s.c.c.SolrZkClient makePath: /configs/solrCloudCollectionConfig/schema-docValues.xml
   [junit4]   2> 541803 INFO  (TEST-TestAuthenticationFramework.testCollectionCreateWithoutCoresThenDelete-seed#[673967461D9E7F0D]) [    ] o.a.s.c.c.SolrZkClient makePath: /configs/solrCloudCollectionConfig/bad-schema-misplaced-asterisk-copyfield-dest-should-fail-test.xml
   [junit4]   2> 541805 INFO  (TEST-TestAuthenticationFramework.testCollectionCreateWithoutCoresThenDelete-seed#[673967461D9E7F0D]) [    ] o.a.s.c.c.SolrZkClient makePath: /configs/solrCloudCollectionConfig/schema-snippet-types.incl
   [junit4]   2> 541808 INFO  (TEST-TestAuthenticationFramework.testCollectionCreateWithoutCoresThenDelete-seed#[673967461D9E7F0D]) [    ] o.a.s.c.c.SolrZkClient makePath: /configs/solrCloudCollectionConfig/schema-minimal.xml
   [junit4]   2> 541819 INFO  (TEST-TestAuthenticationFramework.testCollectionCreateWithoutCoresThenDelete-seed#[673967461D9E7F0D]) [    ] o.a.s.c.c.SolrZkClient makePath: /configs/solrCloudCollectionConfig/solrconfig.snippet.randomindexconfig.xml
   [junit4]   2> 541828 INFO  (TEST-TestAuthenticationFramework.testCollectionCreateWithoutCoresThenDelete-seed#[673967461D9E7F0D]) [    ] o.a.s.c.c.SolrZkClient makePath: /configs/solrCloudCollectionConfig/schema-collate.xml
   [junit4]   2> 541841 INFO  (TEST-TestAuthenticationFramework.testCollectionCreateWithoutCoresThenDelete-seed#[673967461D9E7F0D]) [    ] o.a.s.c.c.SolrZkClient makePath: /configs/solrCloudCollectionConfig/schema-rest.xml
   [junit4]   2> 541867 INFO  (TEST-TestAuthenticationFramework.testCollectionCreateWithoutCoresThenDelete-seed#[673967461D9E7F0D]) [    ] o.a.s.c.c.SolrZkClient makePath: /configs/solrCloudCollectionConfig/bad-schema-codec-global-vs-ft-mismatch.xml
   [junit4]   2> 541869 INFO  (TEST-TestAuthenticationFramework.testCollectionCreateWithoutCoresThenDelete-seed#[673967461D9E7F0D]) [    ] o.a.s.c.c.SolrZkClient makePath: /configs/solrCloudCollectionConfig/bad-schema-not-indexed-but-norms.xml
   [junit4]   2> 541874 INFO  (TEST-TestAuthenticationFramework.testCollectionCreateWithoutCoresThenDelete-seed#[673967461D9E7F0D]) [    ] o.a.s.c.c.SolrZkClient makePath: /configs/solrCloudCollectionConfig/phrasesuggest.txt
   [junit4]   2> 541877 INFO  (TEST-TestAuthenticationFramework.testCollectionCreateWithoutCoresThenDelete-seed#[673967461D9E7F0D]) [    ] o.a.s.c.c.SolrZkClient makePath: /configs/solrCloudCollectionConfig/stopwordsWrongEncoding.txt
   [junit4]   2> 541879 INFO  (TEST-TestAuthenticationFramework.testCollectionCreateWithoutCoresThenDelete-seed#[673967461D9E7F0D]) [    ] o.a.s.c.c.SolrZkClient makePath: /configs/solrCloudCollectionConfig/solrconfig-logmergepolicy.xml
   [junit4]   2> 541881 INFO  (TEST-TestAuthenticationFramework.testCollectionCreateWithoutCoresThenDelete-seed#[673967461D9E7F0D]) [    ] o.a.s.c.c.SolrZkClient makePath: /configs/solrCloudCollectionConfig/solrconfig-plugcollector.xml
   [junit4]   2> 541910 INFO  (TEST-TestAuthenticationFramework.testCollectionCreateWithoutCoresThenDelete-seed#[673967461D9E7F0D]) [    ] o.a.s.c.c.SolrZkClient makePath: /configs/solrCloudCollectionConfig/solrconfig-noopregen.xml
   [junit4]   2> 541912 INFO  (TEST-TestAuthenticationFramework.testCollectionCreateWithoutCoresThenDelete-seed#[673967461D9E7F0D]) [    ] o.a.s.c.c.SolrZkClient makePath: /configs/solrCloudCollectionConfig/solrconfig-analytics-query.xml
   [junit4]   2> 541930 INFO  (TEST-TestAuthenticationFramework.testCollectionCreateWithoutCoresThenDelete-seed#[673967461D9E7F0D]) [    ] o.a.s.c.c.SolrZkClient makePath: /configs/solrCloudCollectionConfig/stoptypes-1.txt
   [junit4]   2> 541932 INFO  (TEST-TestAuthenticationFramework.testCollectionCreateWithoutCoresThenDelete-seed#[673967461D9E7F0D]) [    ] o.a.s.c.c.SolrZkClient makePath: /configs/solrCloudCollectionConfig/solrconfig-warmer-randommergepolicyfactory.xml
   [junit4]   2> 541935 INFO  (TEST-TestAuthenticationFramework.testCollectionCreateWithoutCoresThenDelete-seed#[673967461D9E7F0D]) [    ] o.a.s.c.c.SolrZkClient makePath: /configs/solrCloudCollectionConfig/schema-spatial.xml
   [junit4]   2> 541940 INFO  (TEST-TestAuthenticationFramework.testCollectionCreateWithoutCoresThenDelete-seed#[673967461D9E7F0D]) [    ] o.a.s.c.c.SolrZkClient makePath: /configs/solrCloudCollectionConfig/schema-spellchecker.xml
   [junit4]   2> 541945 INFO  (TEST-TestAuthenticationFramework.testCollectionCreateWithoutCoresThenDelete-seed#[673967461D9E7F0D]) [    ] o.a.s.c.c.SolrZkClient makePath: /configs/solrCloudCollectionConfig/schema-non-stored-docvalues.xml
   [junit4]   2> 541960 INFO  (TEST-TestAuthenticationFramework.testCollectionCreateWithoutCoresThenDelete-seed#[673967461D9E7F0D]) [    ] o.a.s.c.c.SolrZkClient makePath: /configs/solrCloudCollectionConfig/schema-distrib-interval-faceting.xml
   [junit4]   2> 541972 INFO  (TEST-TestAuthenticationFramework.testCollectionCreateWithoutCoresThenDelete-seed#[673967461D9E7F0D]) [    ] o.a.s.c.c.SolrZkClient makePath: /configs/solrCloudCollectionConfig/stop-1.txt
   [junit4]   2> 541975 INFO  (TEST-TestAuthenticationFramework.testCollectionCreateWithoutCoresThenDelete-seed#[673967461D9E7F0D]) [    ] o.a.s.c.c.SolrZkClient makePath: /configs/solrCloudCollectionConfig/schema-docValuesMissing.xml
   [junit4]   2> 541981 INFO  (TEST-TestAuthenticationFramework.testCollectionCreateWithoutCoresThenDelete-seed#[673967461D9E7F0D]) [    ] o.a.s.c.c.SolrZkClient makePath: /configs/solrCloudCollectionConfig/solrconfig-caching.xml
   [junit4]   2> 541983 INFO  (TEST-TestAuthenticationFramework.testCollectionCreateWithoutCoresThenDelete-seed#[673967461D9E7F0D]) [    ] o.a.s.c.c.SolrZkClient makePath: /configs/solrCloudCollectionConfig/solrconfig-doctransformers.xml
   [junit4]   2> 541989 INFO  (TEST-TestAuthenticationFramework.testCollectionCreateWithoutCoresThenDelete-seed#[673967461D9E7F0D]) [    ] o.a.s.c.c.SolrZkClient makePath: /configs/solrCloudCollectionConfig/freeTextSuggest.txt
   [junit4]   2> 542000 INFO  (TEST-TestAuthenticationFramework.testCollectionCreateWithoutCoresThenDelete-seed#[673967461D9E7F0D]) [    ] o.a.s.c.c.SolrZkClient makePath: /configs/solrCloudCollectionConfig/schema.xml
   [junit4]   2> 542015 INFO  (TEST-TestAuthenticationFramework.testCollectionCreateWithoutCoresThenDelete-seed#[673967461D9E7F0D]) [    ] o.a.s.c.c.SolrZkClient makePath: /configs/solrCloudCollectionConfig/solrconfig-querysender-noquery.xml
   [junit4]   2> 542021 INFO  (TEST-TestAuthenticationFramework.testCollectionCreateWithoutCoresThenDelete-seed#[673967461D9E7F0D]) [    ] o.a.s.c.c.SolrZkClient makePath: /configs/solrCloudCollectionConfig/schema-sortingresponse.xml
   [junit4]   2> 542023 INFO  (TEST-TestAuthenticationFramework.testCollectionCreateWithoutCoresThenDelete-seed#[673967461D9E7F0D]) [    ] o.a.s.c.c.SolrZkClient makePath: /configs/solrCloudCollectionConfig/trivial.updateprocessor1.js
   [junit4]   2> 542028 INFO  (TEST-TestAuthenticationFramework.testCollectionCreateWithoutCoresThenDelete-seed#[673967461D9E7F0D]) [    ] o.a.s.c.c.SolrZkClient makePath: /configs/solrCloudCollectionConfig/bad-solrconfig-managed-schema-named-schema.xml.xml
   [junit4]   2> 542031 INFO  (TEST-TestAuthenticationFramework.testCollectionCreateWithoutCoresThenDelete-seed#[673967461D9E7F0D]) [    ] o.a.s.c.c.SolrZkClient makePath: /configs/solrCloudCollectionConfig/solrconfig-paramset.xml
   [junit4]   2> 542050 INFO  (TEST-TestAuthenticationFramework.testCollectionCreateWithoutCoresThenDelete-seed#[673967461D9E7F0D]) [    ] o.a.s.c.c.SolrZkClient makePath: /configs/solrCloudCollectionConfig/schema-lmdirichlet.xml
   [junit4]   2> 542052 INFO  (TEST-TestAuthenticationFramework.testCollectionCreateWithoutCoresThenDelete-seed#[673967461D9E7F0D]) [    ] o.a.s.c.c.SolrZkClient makePath: /configs/solrCloudCollectionConfig/bad-solrconfig-multiple-dirfactory.xml
   [junit4]   2> 542057 INFO  (TEST-TestAuthenticationFramework.testCollectionCreateWithoutCoresThenDelete-seed#[673967461D9E7F0D]) [    ] o.a.s.c.c.SolrZkClient makePath: /configs/solrCloudCollectionConfig/bad-schema-init-error.xml
   [junit4]   2> 542060 INFO  (TEST-TestAuthenticationFramework.testCollectionCreateWithoutCoresThenDelete-seed#[673967461D9E7F0D]) [    ] o.a.s.c.c.SolrZkClient makePath: /configs/solrCloudCollectionConfig/solrconfig-altdirectory.xml
   [junit4]   2> 542062 INFO  (TEST-TestAuthenticationFramework.testCollectionCreateWithoutCoresThenDelete-seed#[673967461D9E7F0D]) [    ] o.a.s.c.c.SolrZkClient makePath: /configs/solrCloudCollectionConfig/solrconfig-tlog.xml
   [junit4]   2> 542084 INFO  (TEST-TestAuthenticationFramework.testCollectionCreateWithoutCoresThenDelete-seed#[673967461D9E7F0D]) [    ] o.a.s.c.c.SolrZkClient makePath: /configs/solrCloudCollectionConfig/hyphenation.dtd
   [junit4]   2> 542093 INFO  (TEST-TestAuthenticationFramework.testCollectionCreateWithoutCoresThenDelete-seed#[673967461D9E7F0D]) [    ] o.a.s.c.c.SolrZkClient makePath: /configs/solrCloudCollectionConfig/schema-sweetspot.xml
   [junit4]   2> 542117 INFO  (TEST-TestAuthenticationFramework.testCollectionCreateWithoutCoresThenDelete-seed#[673967461D9E7F0D]) [    ] o.a.s.c.c.SolrZkClient makePath: /configs/solrCloudCollectionConfig/solrconfig-xinclude.xml
   [junit4]   2> 542141 INFO  (TEST-TestAuthenticationFramework.testCollectionCreateWithoutCoresThenDelete-seed#[673967461D9E7F0D]) [    ] o.a.s.c.c.SolrZkClient makePath: /configs/solrCloudCollectionConfig/solrconfig-schemaless.xml
   [junit4]   2> 542160 INFO  (TEST-TestAuthenticationFramework.testCollectionCreateWithoutCoresThenDelete-seed#[673967461D9E7F0D]) [    ] o.a.s.c.c.SolrZkClient makePath: /configs/solrCloudCollectionConfig/schemasurround.xml
   [junit4]   2> 542187 INFO  (TEST-TestAuthenticationFramework.testCollectionCreateWithoutCoresThenDelete-seed#[673967461D9E7F0D]) [    ] o.a.s.c.c.SolrZkClient makePath: /configs/solrCloudCollectionConfig/schema-binaryfield.xml
   [junit4]   2> 542192 INFO  (TEST-TestAuthenticationFramework.testCollecti

[...truncated too long message...]

n-seed#[673967461D9E7F0D]) [    ] o.a.s.c.c.SolrZkClient Using default ZkACLProvider
   [junit4]   2> 682766 INFO  (jetty-launcher-864-thread-3) [    ] o.e.j.s.ServerConnector Stopped ServerConnector@5561bd{HTTP/1.1,[http/1.1]}{127.0.0.1:0}
   [junit4]   2> 682766 INFO  (jetty-launcher-864-thread-2) [    ] o.e.j.s.ServerConnector Stopped ServerConnector@19c3086{HTTP/1.1,[http/1.1]}{127.0.0.1:0}
   [junit4]   2> 682767 INFO  (jetty-launcher-864-thread-3) [    ] o.a.s.c.CoreContainer Shutting down CoreContainer instance=17366860
   [junit4]   2> 682767 INFO  (jetty-launcher-864-thread-2) [    ] o.a.s.c.CoreContainer Shutting down CoreContainer instance=30174184
   [junit4]   2> 682766 INFO  (jetty-launcher-864-thread-1) [    ] o.e.j.s.ServerConnector Stopped ServerConnector@4f7394{HTTP/1.1,[http/1.1]}{127.0.0.1:0}
   [junit4]   2> 682767 INFO  (jetty-launcher-864-thread-3) [    ] o.a.s.c.ZkController Publish node=127.0.0.1:34474_solr as DOWN
   [junit4]   2> 682767 INFO  (jetty-launcher-864-thread-1) [    ] o.a.s.c.CoreContainer Shutting down CoreContainer instance=6896397
   [junit4]   2> 682767 INFO  (jetty-launcher-864-thread-2) [    ] o.a.s.c.ZkController Publish node=127.0.0.1:53858_solr as DOWN
   [junit4]   2> 682767 INFO  (jetty-launcher-864-thread-1) [    ] o.a.s.c.ZkController Publish node=127.0.0.1:50438_solr as DOWN
   [junit4]   2> 682820 INFO  (jetty-launcher-864-thread-1) [    ] o.a.s.c.Overseer Overseer (id=95425812748173319-127.0.0.1:50438_solr-n_0000000000) closing
   [junit4]   2> 682820 INFO  (OverseerStateUpdate-95425812748173319-127.0.0.1:50438_solr-n_0000000000) [n:127.0.0.1:50438_solr    ] o.a.s.c.Overseer Overseer Loop exiting : 127.0.0.1:50438_solr
   [junit4]   2> 682864 INFO  (zkCallback-879-thread-1-processing-n:127.0.0.1:53858_solr) [n:127.0.0.1:53858_solr    ] o.a.s.c.c.ZkStateReader A live node change: [WatchedEvent state:SyncConnected type:NodeChildrenChanged path:/live_nodes], has occurred - updating... (live nodes size: [3])
   [junit4]   2> 682864 INFO  (zkCallback-880-thread-1-processing-n:127.0.0.1:34474_solr) [n:127.0.0.1:34474_solr    ] o.a.s.c.c.ZkStateReader A live node change: [WatchedEvent state:SyncConnected type:NodeChildrenChanged path:/live_nodes], has occurred - updating... (live nodes size: [3])
   [junit4]   2> 682864 INFO  (zkCallback-878-thread-1-processing-n:127.0.0.1:50438_solr) [n:127.0.0.1:50438_solr    ] o.a.s.c.c.ZkStateReader A live node change: [WatchedEvent state:SyncConnected type:NodeChildrenChanged path:/live_nodes], has occurred - updating... (live nodes size: [3])
   [junit4]   2> 682865 WARN  (zkCallback-880-thread-1-processing-n:127.0.0.1:34474_solr) [n:127.0.0.1:34474_solr    ] o.a.s.c.c.ZkStateReader ZooKeeper watch triggered, but Solr cannot talk to ZK: [KeeperErrorCode = Session expired for /live_nodes]
   [junit4]   2> 682865 INFO  (jetty-launcher-864-thread-3) [    ] o.e.j.s.h.ContextHandler Stopped o.e.j.s.ServletContextHandler@16ba088{/solr,null,UNAVAILABLE}
   [junit4]   2> 682874 WARN  (NIOServerCxn.Factory:0.0.0.0/0.0.0.0:0) [    ] o.a.z.s.NIOServerCnxn caught end of stream exception
   [junit4]   2> EndOfStreamException: Unable to read additional data from client sessionid 0x153054567420007, likely client has closed socket
   [junit4]   2> 	at org.apache.zookeeper.server.NIOServerCnxn.doIO(NIOServerCnxn.java:228)
   [junit4]   2> 	at org.apache.zookeeper.server.NIOServerCnxnFactory.run(NIOServerCnxnFactory.java:208)
   [junit4]   2> 	at java.lang.Thread.run(Thread.java:745)
   [junit4]   2> 684365 WARN  (zkCallback-879-thread-1-processing-n:127.0.0.1:53858_solr) [n:127.0.0.1:53858_solr    ] o.a.s.c.c.ZkStateReader ZooKeeper watch triggered, but Solr cannot talk to ZK: [KeeperErrorCode = Session expired for /live_nodes]
   [junit4]   2> 684365 WARN  (zkCallback-878-thread-1-processing-n:127.0.0.1:50438_solr) [n:127.0.0.1:50438_solr    ] o.a.s.c.c.ZkStateReader ZooKeeper watch triggered, but Solr cannot talk to ZK: [KeeperErrorCode = Session expired for /live_nodes]
   [junit4]   2> 684365 INFO  (jetty-launcher-864-thread-2) [    ] o.e.j.s.h.ContextHandler Stopped o.e.j.s.ServletContextHandler@18fb1a4{/solr,null,UNAVAILABLE}
   [junit4]   2> 684365 INFO  (jetty-launcher-864-thread-1) [    ] o.e.j.s.h.ContextHandler Stopped o.e.j.s.ServletContextHandler@174df90{/solr,null,UNAVAILABLE}
   [junit4]   2> 684366 INFO  (TEST-TestAuthenticationFramework.testErrorsInShutdown-seed#[673967461D9E7F0D]) [    ] o.a.s.c.ZkTestServer connecting to 127.0.0.1:41505 41505
   [junit4]   2> 684421 INFO  (Thread-2659) [    ] o.a.s.c.ZkTestServer connecting to 127.0.0.1:41505 41505
   [junit4]   2> 684422 WARN  (Thread-2659) [    ] o.a.s.c.ZkTestServer Watch limit violations: 
   [junit4]   2> Maximum concurrent create/delete watches above limit:
   [junit4]   2> 
   [junit4]   2> 	3	/solr/aliases.json
   [junit4]   2> 	3	/solr/security.json
   [junit4]   2> 
   [junit4]   2> Maximum concurrent data watches above limit:
   [junit4]   2> 
   [junit4]   2> 	3	/solr/clusterstate.json
   [junit4]   2> 
   [junit4]   2> Maximum concurrent children watches above limit:
   [junit4]   2> 
   [junit4]   2> 	3	/solr/live_nodes
   [junit4]   2> 	3	/solr/collections
   [junit4]   2> 
   [junit4]   2> NOTE: leaving temporary files on disk at: /home/jenkins/workspace/Lucene-Solr-trunk-Linux/solr/build/solr-core/test/J0/temp/solr.cloud.TestAuthenticationFramework_673967461D9E7F0D-001
   [junit4]   2> Feb 21, 2016 7:19:10 PM com.carrotsearch.randomizedtesting.ThreadLeakControl checkThreadLeaks
   [junit4]   2> WARNING: Will linger awaiting termination of 1 leaked thread(s).
   [junit4]   2> NOTE: test params are: codec=Asserting(Lucene60): {quad_l1=Lucene50(blocksize=128), range_facet_l_dv=PostingsFormat(name=LuceneVarGapFixedInterval), _version_=PostingsFormat(name=Memory doPackFST= false), multiDefault=TestBloomFilteredLucenePostings(BloomFilteringPostingsFormat(Lucene50(blocksize=128))), intDefault=PostingsFormat(name=Memory doPackFST= false), id=PostingsFormat(name=LuceneVarGapFixedInterval), range_facet_i_dv=PostingsFormat(name=Memory doPackFST= false), range_facet_l=PostingsFormat(name=Memory doPackFST= false), timestamp=PostingsFormat(name=Memory doPackFST= false), odd_l1=PostingsFormat(name=LuceneVarGapFixedInterval)}, docValues:{range_facet_l_dv=DocValuesFormat(name=Lucene54), range_facet_i_dv=DocValuesFormat(name=Asserting), timestamp=DocValuesFormat(name=Asserting)}, sim=ClassicSimilarity, locale=hu-HU, timezone=America/Asuncion
   [junit4]   2> NOTE: Linux 3.19.0-47-generic i386/Oracle Corporation 1.8.0_72 (32-bit)/cpus=12,threads=1,free=99380232,total=234971136
   [junit4]   2> NOTE: All tests run in this JVM: [BlockJoinFacetSimpleTest, RuleEngineTest, TestFastOutputStream, QueryElevationComponentTest, DistributedFacetPivotLongTailTest, ResourceLoaderTest, QueryResultKeyTest, RAMDirectoryFactoryTest, SolrCoreTest, ResponseHeaderTest, RankQueryTest, MigrateRouteKeyTest, LeaderElectionIntegrationTest, SuggestComponentContextFilterQueryTest, IndexSchemaRuntimeFieldTest, TestUseDocValuesAsStored, TestFieldResource, DistributedSuggestComponentTest, TlogReplayBufferedWhileIndexingTest, CollectionTooManyReplicasTest, TestRemoteStreaming, OverriddenZkACLAndCredentialsProvidersTest, TestSolrQueryResponse, TestImplicitCoreProperties, QueryEqualityTest, TestIBSimilarityFactory, HdfsRecoverLeaseTest, TestConfigSetsAPIZkFailure, TestManagedSchemaDynamicFieldResource, DateFieldTest, TestFoldingMultitermQuery, TestLMDirichletSimilarityFactory, TestRangeQuery, TestAnalyzedSuggestions, SimpleCollectionCreateDeleteTest, TestIntervalFaceting, AddBlockUpdateTest, TestComponentsName, TestReplicationHandler, HdfsUnloadDistributedZkTest, TestClusterStateMutator, CopyFieldTest, TestRealTimeGet, JsonLoaderTest, TestTestInjection, TestManagedResourceStorage, TestConfigSetProperties, TestRemoveLastDynamicCopyField, PreAnalyzedFieldTest, CacheHeaderTest, OverseerStatusTest, BufferStoreTest, HdfsBasicDistributedZk2Test, SolrRequestParserTest, CheckHdfsIndexTest, HLLSerializationTest, URLClassifyProcessorTest, DisMaxRequestHandlerTest, TestFaceting, DistributedVersionInfoTest, TestStressLucene, TestBinaryField, TestRandomDVFaceting, JavabinLoaderTest, SignatureUpdateProcessorFactoryTest, CurrencyFieldOpenExchangeTest, DistributedDebugComponentTest, DirectoryFactoryTest, DataDrivenBlockJoinTest, ResponseLogComponentTest, TestExactSharedStatsCache, PeerSyncTest, TestRTGBase, TestSchemaSimilarityResource, CursorPagingTest, TestCrossCoreJoin, TestCollationFieldDocValues, TestBadConfig, AnalyticsQueryTest, DeleteShardTest, TestArbitraryIndexDir, TestAuthenticationFramework]
   [junit4] Completed [235/579 (1!)] on J0 in 144.59s, 8 tests, 1 error <<< FAILURES!

[...truncated 1153 lines...]
BUILD FAILED
/home/jenkins/workspace/Lucene-Solr-trunk-Linux/build.xml:740: The following error occurred while executing this line:
/home/jenkins/workspace/Lucene-Solr-trunk-Linux/build.xml:684: The following error occurred while executing this line:
/home/jenkins/workspace/Lucene-Solr-trunk-Linux/build.xml:59: The following error occurred while executing this line:
/home/jenkins/workspace/Lucene-Solr-trunk-Linux/solr/build.xml:233: The following error occurred while executing this line:
/home/jenkins/workspace/Lucene-Solr-trunk-Linux/solr/common-build.xml:524: The following error occurred while executing this line:
/home/jenkins/workspace/Lucene-Solr-trunk-Linux/lucene/common-build.xml:1457: The following error occurred while executing this line:
/home/jenkins/workspace/Lucene-Solr-trunk-Linux/lucene/common-build.xml:1014: There were test failures: 579 suites (8 ignored), 2331 tests, 1 error, 117 ignored (72 assumptions) [seed: 673967461D9E7F0D]

Total time: 54 minutes 51 seconds
Build step 'Invoke Ant' marked build as failure
Archiving artifacts
[WARNINGS] Skipping publisher since build result is FAILURE
Recording test results
Email was triggered for: Failure - Any
Sending email for trigger: Failure - Any



Mime
View raw message