lucene-dev mailing list archives

Site index · List index
Message view « Date » · « Thread »
Top « Date » · « Thread »
From Policeman Jenkins Server <jenk...@thetaphi.de>
Subject [JENKINS-EA] Lucene-Solr-trunk-Linux (64bit/jdk-9-ea+105) - Build # 15945 - Still Failing!
Date Sun, 21 Feb 2016 14:42:57 GMT
Build: http://jenkins.thetaphi.de/job/Lucene-Solr-trunk-Linux/15945/
Java: 64bit/jdk-9-ea+105 -XX:+UseCompressedOops -XX:+UseSerialGC -XX:-UseSuperWord

2 tests failed.
FAILED:  junit.framework.TestSuite.org.apache.lucene.codecs.perfield.TestPerFieldPostingsFormat

Error Message:
The test or suite printed 21596 bytes to stdout and stderr, even though the limit was set
to 8192 bytes. Increase the limit with @Limit, ignore it completely with @SuppressSysoutChecks
or run with -Dtests.verbose=true

Stack Trace:
java.lang.AssertionError: The test or suite printed 21596 bytes to stdout and stderr, even
though the limit was set to 8192 bytes. Increase the limit with @Limit, ignore it completely
with @SuppressSysoutChecks or run with -Dtests.verbose=true
	at __randomizedtesting.SeedInfo.seed([92443B942CA01CB0]:0)
	at org.apache.lucene.util.TestRuleLimitSysouts.afterIfSuccessful(TestRuleLimitSysouts.java:211)
	at com.carrotsearch.randomizedtesting.rules.TestRuleAdapter$1.afterIfSuccessful(TestRuleAdapter.java:36)
	at com.carrotsearch.randomizedtesting.rules.StatementAdapter.evaluate(StatementAdapter.java:37)
	at org.apache.lucene.util.TestRuleAssertionsRequired$1.evaluate(TestRuleAssertionsRequired.java:53)
	at org.apache.lucene.util.TestRuleMarkFailure$1.evaluate(TestRuleMarkFailure.java:47)
	at org.apache.lucene.util.TestRuleIgnoreAfterMaxFailures$1.evaluate(TestRuleIgnoreAfterMaxFailures.java:64)
	at org.apache.lucene.util.TestRuleIgnoreTestSuites$1.evaluate(TestRuleIgnoreTestSuites.java:54)
	at com.carrotsearch.randomizedtesting.rules.StatementAdapter.evaluate(StatementAdapter.java:36)
	at com.carrotsearch.randomizedtesting.ThreadLeakControl$StatementRunner.run(ThreadLeakControl.java:367)
	at java.lang.Thread.run(Thread.java:804)


FAILED:  org.apache.lucene.codecs.perfield.TestPerFieldPostingsFormat.testDocsAndFreqsAndPositionsAndOffsets

Error Message:
Captured an uncaught exception in thread: Thread[id=1862, name=Thread-1635, state=RUNNABLE,
group=TGRP-TestPerFieldPostingsFormat]

Stack Trace:
com.carrotsearch.randomizedtesting.UncaughtExceptionError: Captured an uncaught exception
in thread: Thread[id=1862, name=Thread-1635, state=RUNNABLE, group=TGRP-TestPerFieldPostingsFormat]
Caused by: java.lang.RuntimeException: java.lang.IllegalArgumentException: source=3 is out
of bounds (maxState is 2)
	at __randomizedtesting.SeedInfo.seed([92443B942CA01CB0]:0)
	at org.apache.lucene.index.RandomPostingsTester$TestThread.run(RandomPostingsTester.java:1006)
Caused by: java.lang.IllegalArgumentException: source=3 is out of bounds (maxState is 2)
	at org.apache.lucene.util.automaton.Automaton.addTransition(Automaton.java:165)
	at org.apache.lucene.util.automaton.MinimizationOperations.minimize(MinimizationOperations.java:245)
	at org.apache.lucene.util.automaton.RegExp.toAutomatonInternal(RegExp.java:537)
	at org.apache.lucene.util.automaton.RegExp.findLeaves(RegExp.java:617)
	at org.apache.lucene.util.automaton.RegExp.findLeaves(RegExp.java:614)
	at org.apache.lucene.util.automaton.RegExp.findLeaves(RegExp.java:614)
	at org.apache.lucene.util.automaton.RegExp.toAutomatonInternal(RegExp.java:521)
	at org.apache.lucene.util.automaton.RegExp.findLeaves(RegExp.java:617)
	at org.apache.lucene.util.automaton.RegExp.toAutomatonInternal(RegExp.java:512)
	at org.apache.lucene.util.automaton.RegExp.toAutomaton(RegExp.java:495)
	at org.apache.lucene.util.automaton.RegExp.toAutomaton(RegExp.java:426)
	at org.apache.lucene.util.automaton.AutomatonTestUtil.randomSingleAutomaton(AutomatonTestUtil.java:262)
	at org.apache.lucene.util.automaton.AutomatonTestUtil.randomAutomaton(AutomatonTestUtil.java:276)
	at org.apache.lucene.index.RandomPostingsTester.testTermsOneThread(RandomPostingsTester.java:1167)
	at org.apache.lucene.index.RandomPostingsTester.access$000(RandomPostingsTester.java:61)
	at org.apache.lucene.index.RandomPostingsTester$TestThread.run(RandomPostingsTester.java:1004)




Build Log:
[...truncated 922 lines...]
   [junit4] Suite: org.apache.lucene.codecs.perfield.TestPerFieldPostingsFormat
   [junit4] IGNOR/A 0.00s J2 | TestPerFieldPostingsFormat.testMergeStability
   [junit4]    > Assumption #1: The MockRandom PF randomizes content on the fly, so we
can't check it
   [junit4] IGNOR/A 0.00s J2 | TestPerFieldPostingsFormat.testPostingsEnumReuse
   [junit4]    > Assumption #1: The MockRandom PF randomizes content on the fly, so we
can't check it
   [junit4]   2> 2-? ??? 21, 2016 3:40:50 ?? com.carrotsearch.randomizedtesting.RandomizedRunner$QueueUncaughtExceptionsHandler
uncaughtException
   [junit4]   2> WARNING: Uncaught exception in thread: Thread[Thread-1633,5,TGRP-TestPerFieldPostingsFormat]
   [junit4]   2> java.lang.RuntimeException: java.lang.IllegalArgumentException: source=3
is out of bounds (maxState is 2)
   [junit4]   2> 	at __randomizedtesting.SeedInfo.seed([92443B942CA01CB0]:0)
   [junit4]   2> 	at org.apache.lucene.index.RandomPostingsTester$TestThread.run(RandomPostingsTester.java:1006)
   [junit4]   2> Caused by: java.lang.IllegalArgumentException: source=3 is out of bounds
(maxState is 2)
   [junit4]   2> 	at org.apache.lucene.util.automaton.Automaton.addTransition(Automaton.java:165)
   [junit4]   2> 	at org.apache.lucene.util.automaton.MinimizationOperations.minimize(MinimizationOperations.java:245)
   [junit4]   2> 	at org.apache.lucene.util.automaton.RegExp.toAutomatonInternal(RegExp.java:537)
   [junit4]   2> 	at org.apache.lucene.util.automaton.RegExp.findLeaves(RegExp.java:617)
   [junit4]   2> 	at org.apache.lucene.util.automaton.RegExp.findLeaves(RegExp.java:612)
   [junit4]   2> 	at org.apache.lucene.util.automaton.RegExp.findLeaves(RegExp.java:614)
   [junit4]   2> 	at org.apache.lucene.util.automaton.RegExp.toAutomatonInternal(RegExp.java:521)
   [junit4]   2> 	at org.apache.lucene.util.automaton.RegExp.findLeaves(RegExp.java:617)
   [junit4]   2> 	at org.apache.lucene.util.automaton.RegExp.toAutomatonInternal(RegExp.java:512)
   [junit4]   2> 	at org.apache.lucene.util.automaton.RegExp.toAutomaton(RegExp.java:495)
   [junit4]   2> 	at org.apache.lucene.util.automaton.RegExp.toAutomaton(RegExp.java:426)
   [junit4]   2> 	at org.apache.lucene.util.automaton.AutomatonTestUtil.randomSingleAutomaton(AutomatonTestUtil.java:262)
   [junit4]   2> 	at org.apache.lucene.util.automaton.AutomatonTestUtil.randomAutomaton(AutomatonTestUtil.java:276)
   [junit4]   2> 	at org.apache.lucene.index.RandomPostingsTester.testTermsOneThread(RandomPostingsTester.java:1167)
   [junit4]   2> 	at org.apache.lucene.index.RandomPostingsTester.access$000(RandomPostingsTester.java:61)
   [junit4]   2> 	at org.apache.lucene.index.RandomPostingsTester$TestThread.run(RandomPostingsTester.java:1004)
   [junit4]   2> 
   [junit4]   2> 2-? ??? 21, 2016 3:40:50 ?? com.carrotsearch.randomizedtesting.RandomizedRunner$QueueUncaughtExceptionsHandler
uncaughtException
   [junit4]   2> WARNING: Uncaught exception in thread: Thread[Thread-1632,5,TGRP-TestPerFieldPostingsFormat]
   [junit4]   2> java.lang.RuntimeException: java.lang.IllegalArgumentException: source=3
is out of bounds (maxState is 2)
   [junit4]   2> 	at __randomizedtesting.SeedInfo.seed([92443B942CA01CB0]:0)
   [junit4]   2> 	at org.apache.lucene.index.RandomPostingsTester$TestThread.run(RandomPostingsTester.java:1006)
   [junit4]   2> Caused by: java.lang.IllegalArgumentException: source=3 is out of bounds
(maxState is 2)
   [junit4]   2> 	at org.apache.lucene.util.automaton.Automaton.addTransition(Automaton.java:165)
   [junit4]   2> 	at org.apache.lucene.util.automaton.MinimizationOperations.minimize(MinimizationOperations.java:245)
   [junit4]   2> 	at org.apache.lucene.util.automaton.RegExp.toAutomatonInternal(RegExp.java:537)
   [junit4]   2> 	at org.apache.lucene.util.automaton.RegExp.findLeaves(RegExp.java:617)
   [junit4]   2> 	at org.apache.lucene.util.automaton.RegExp.toAutomatonInternal(RegExp.java:519)
   [junit4]   2> 	at org.apache.lucene.util.automaton.RegExp.toAutomaton(RegExp.java:495)
   [junit4]   2> 	at org.apache.lucene.util.automaton.RegExp.toAutomaton(RegExp.java:426)
   [junit4]   2> 	at org.apache.lucene.util.automaton.AutomatonTestUtil.randomSingleAutomaton(AutomatonTestUtil.java:262)
   [junit4]   2> 	at org.apache.lucene.util.automaton.AutomatonTestUtil.randomAutomaton(AutomatonTestUtil.java:277)
   [junit4]   2> 	at org.apache.lucene.index.RandomPostingsTester.testTermsOneThread(RandomPostingsTester.java:1167)
   [junit4]   2> 	at org.apache.lucene.index.RandomPostingsTester.access$000(RandomPostingsTester.java:61)
   [junit4]   2> 	at org.apache.lucene.index.RandomPostingsTester$TestThread.run(RandomPostingsTester.java:1004)
   [junit4]   2> 
   [junit4]   2> 2-? ??? 21, 2016 3:40:50 ?? com.carrotsearch.randomizedtesting.RandomizedRunner$QueueUncaughtExceptionsHandler
uncaughtException
   [junit4]   2> WARNING: Uncaught exception in thread: Thread[Thread-1635,5,TGRP-TestPerFieldPostingsFormat]
   [junit4]   2> java.lang.RuntimeException: java.lang.IllegalArgumentException: source=3
is out of bounds (maxState is 2)
   [junit4]   2> 	at __randomizedtesting.SeedInfo.seed([92443B942CA01CB0]:0)
   [junit4]   2> 	at org.apache.lucene.index.RandomPostingsTester$TestThread.run(RandomPostingsTester.java:1006)
   [junit4]   2> Caused by: java.lang.IllegalArgumentException: source=3 is out of bounds
(maxState is 2)
   [junit4]   2> 	at org.apache.lucene.util.automaton.Automaton.addTransition(Automaton.java:165)
   [junit4]   2> 	at org.apache.lucene.util.automaton.MinimizationOperations.minimize(MinimizationOperations.java:245)
   [junit4]   2> 	at org.apache.lucene.util.automaton.RegExp.toAutomatonInternal(RegExp.java:537)
   [junit4]   2> 	at org.apache.lucene.util.automaton.RegExp.findLeaves(RegExp.java:617)
   [junit4]   2> 	at org.apache.lucene.util.automaton.RegExp.findLeaves(RegExp.java:614)
   [junit4]   2> 	at org.apache.lucene.util.automaton.RegExp.findLeaves(RegExp.java:614)
   [junit4]   2> 	at org.apache.lucene.util.automaton.RegExp.toAutomatonInternal(RegExp.java:521)
   [junit4]   2> 	at org.apache.lucene.util.automaton.RegExp.findLeaves(RegExp.java:617)
   [junit4]   2> 	at org.apache.lucene.util.automaton.RegExp.toAutomatonInternal(RegExp.java:512)
   [junit4]   2> 	at org.apache.lucene.util.automaton.RegExp.toAutomaton(RegExp.java:495)
   [junit4]   2> 	at org.apache.lucene.util.automaton.RegExp.toAutomaton(RegExp.java:426)
   [junit4]   2> 	at org.apache.lucene.util.automaton.AutomatonTestUtil.randomSingleAutomaton(AutomatonTestUtil.java:262)
   [junit4]   2> 	at org.apache.lucene.util.automaton.AutomatonTestUtil.randomAutomaton(AutomatonTestUtil.java:276)
   [junit4]   2> 	at org.apache.lucene.index.RandomPostingsTester.testTermsOneThread(RandomPostingsTester.java:1167)
   [junit4]   2> 	at org.apache.lucene.index.RandomPostingsTester.access$000(RandomPostingsTester.java:61)
   [junit4]   2> 	at org.apache.lucene.index.RandomPostingsTester$TestThread.run(RandomPostingsTester.java:1004)
   [junit4]   2> 
   [junit4]   2> 2-? ??? 21, 2016 3:40:50 ?? com.carrotsearch.randomizedtesting.RandomizedRunner$QueueUncaughtExceptionsHandler
uncaughtException
   [junit4]   2> WARNING: Uncaught exception in thread: Thread[Thread-1634,5,TGRP-TestPerFieldPostingsFormat]
   [junit4]   2> java.lang.RuntimeException: java.lang.IllegalArgumentException: source=3
is out of bounds (maxState is 2)
   [junit4]   2> 	at __randomizedtesting.SeedInfo.seed([92443B942CA01CB0]:0)
   [junit4]   2> 	at org.apache.lucene.index.RandomPostingsTester$TestThread.run(RandomPostingsTester.java:1006)
   [junit4]   2> Caused by: java.lang.IllegalArgumentException: source=3 is out of bounds
(maxState is 2)
   [junit4]   2> 	at org.apache.lucene.util.automaton.Automaton.addTransition(Automaton.java:165)
   [junit4]   2> 	at org.apache.lucene.util.automaton.MinimizationOperations.minimize(MinimizationOperations.java:245)
   [junit4]   2> 	at org.apache.lucene.util.automaton.RegExp.toAutomatonInternal(RegExp.java:537)
   [junit4]   2> 	at org.apache.lucene.util.automaton.RegExp.findLeaves(RegExp.java:617)
   [junit4]   2> 	at org.apache.lucene.util.automaton.RegExp.findLeaves(RegExp.java:612)
   [junit4]   2> 	at org.apache.lucene.util.automaton.RegExp.findLeaves(RegExp.java:614)
   [junit4]   2> 	at org.apache.lucene.util.automaton.RegExp.findLeaves(RegExp.java:614)
   [junit4]   2> 	at org.apache.lucene.util.automaton.RegExp.toAutomatonInternal(RegExp.java:521)
   [junit4]   2> 	at org.apache.lucene.util.automaton.RegExp.toAutomaton(RegExp.java:495)
   [junit4]   2> 	at org.apache.lucene.util.automaton.RegExp.toAutomaton(RegExp.java:426)
   [junit4]   2> 	at org.apache.lucene.util.automaton.AutomatonTestUtil.randomSingleAutomaton(AutomatonTestUtil.java:262)
   [junit4]   2> 	at org.apache.lucene.util.automaton.AutomatonTestUtil.randomAutomaton(AutomatonTestUtil.java:277)
   [junit4]   2> 	at org.apache.lucene.index.RandomPostingsTester.testTermsOneThread(RandomPostingsTester.java:1167)
   [junit4]   2> 	at org.apache.lucene.index.RandomPostingsTester.access$000(RandomPostingsTester.java:61)
   [junit4]   2> 	at org.apache.lucene.index.RandomPostingsTester$TestThread.run(RandomPostingsTester.java:1004)
   [junit4]   2> 
   [junit4]   2> 2-? ??? 21, 2016 3:40:50 ?? com.carrotsearch.randomizedtesting.RandomizedRunner$QueueUncaughtExceptionsHandler
uncaughtException
   [junit4]   2> WARNING: Uncaught exception in thread: Thread[Thread-1637,5,TGRP-TestPerFieldPostingsFormat]
   [junit4]   2> java.lang.RuntimeException: java.lang.IllegalArgumentException: source=3
is out of bounds (maxState is 2)
   [junit4]   2> 	at __randomizedtesting.SeedInfo.seed([92443B942CA01CB0]:0)
   [junit4]   2> 	at org.apache.lucene.index.RandomPostingsTester$TestThread.run(RandomPostingsTester.java:1006)
   [junit4]   2> Caused by: java.lang.IllegalArgumentException: source=3 is out of bounds
(maxState is 2)
   [junit4]   2> 	at org.apache.lucene.util.automaton.Automaton.addTransition(Automaton.java:165)
   [junit4]   2> 	at org.apache.lucene.util.automaton.MinimizationOperations.minimize(MinimizationOperations.java:245)
   [junit4]   2> 	at org.apache.lucene.util.automaton.RegExp.toAutomatonInternal(RegExp.java:537)
   [junit4]   2> 	at org.apache.lucene.util.automaton.RegExp.toAutomatonInternal(RegExp.java:540)
   [junit4]   2> 	at org.apache.lucene.util.automaton.RegExp.findLeaves(RegExp.java:617)
   [junit4]   2> 	at org.apache.lucene.util.automaton.RegExp.toAutomatonInternal(RegExp.java:519)
   [junit4]   2> 	at org.apache.lucene.util.automaton.RegExp.findLeaves(RegExp.java:617)
   [junit4]   2> 	at org.apache.lucene.util.automaton.RegExp.toAutomatonInternal(RegExp.java:510)
   [junit4]   2> 	at org.apache.lucene.util.automaton.RegExp.toAutomaton(RegExp.java:495)
   [junit4]   2> 	at org.apache.lucene.util.automaton.RegExp.toAutomaton(RegExp.java:426)
   [junit4]   2> 	at org.apache.lucene.util.automaton.AutomatonTestUtil.randomSingleAutomaton(AutomatonTestUtil.java:262)
   [junit4]   2> 	at org.apache.lucene.util.automaton.AutomatonTestUtil.randomAutomaton(AutomatonTestUtil.java:276)
   [junit4]   2> 	at org.apache.lucene.index.RandomPostingsTester.testTermsOneThread(RandomPostingsTester.java:1167)
   [junit4]   2> 	at org.apache.lucene.index.RandomPostingsTester.access$000(RandomPostingsTester.java:61)
   [junit4]   2> 	at org.apache.lucene.index.RandomPostingsTester$TestThread.run(RandomPostingsTester.java:1004)
   [junit4]   2> 
   [junit4]   2> 2-? ??? 21, 2016 3:40:50 ?? com.carrotsearch.randomizedtesting.RandomizedRunner$QueueUncaughtExceptionsHandler
uncaughtException
   [junit4]   2> WARNING: Uncaught exception in thread: Thread[Thread-1640,5,TGRP-TestPerFieldPostingsFormat]
   [junit4]   2> java.lang.RuntimeException: java.lang.ArrayIndexOutOfBoundsException:
8
   [junit4]   2> 	at __randomizedtesting.SeedInfo.seed([92443B942CA01CB0]:0)
   [junit4]   2> 	at org.apache.lucene.index.RandomPostingsTester$TestThread.run(RandomPostingsTester.java:1006)
   [junit4]   2> Caused by: java.lang.ArrayIndexOutOfBoundsException: 8
   [junit4]   2> 	at org.apache.lucene.util.automaton.MinimizationOperations.minimize(MinimizationOperations.java:235)
   [junit4]   2> 	at org.apache.lucene.util.automaton.RegExp.toAutomatonInternal(RegExp.java:524)
   [junit4]   2> 	at org.apache.lucene.util.automaton.RegExp.toAutomaton(RegExp.java:495)
   [junit4]   2> 	at org.apache.lucene.util.automaton.RegExp.toAutomaton(RegExp.java:426)
   [junit4]   2> 	at org.apache.lucene.util.automaton.AutomatonTestUtil.randomSingleAutomaton(AutomatonTestUtil.java:262)
   [junit4]   2> 	at org.apache.lucene.util.automaton.AutomatonTestUtil.randomAutomaton(AutomatonTestUtil.java:276)
   [junit4]   2> 	at org.apache.lucene.index.RandomPostingsTester.testTermsOneThread(RandomPostingsTester.java:1167)
   [junit4]   2> 	at org.apache.lucene.index.RandomPostingsTester.access$000(RandomPostingsTester.java:61)
   [junit4]   2> 	at org.apache.lucene.index.RandomPostingsTester$TestThread.run(RandomPostingsTester.java:1004)
   [junit4]   2> 
   [junit4]   2> NOTE: reproduce with: ant test  -Dtestcase=TestPerFieldPostingsFormat
-Dtests.method=testDocsAndFreqsAndPositionsAndOffsets -Dtests.seed=92443B942CA01CB0 -Dtests.multiplier=3
-Dtests.slow=true -Dtests.locale=mn-Cyrl -Dtests.timezone=US/Samoa -Dtests.asserts=true -Dtests.file.encoding=US-ASCII
   [junit4] ERROR   0.26s J2 | TestPerFieldPostingsFormat.testDocsAndFreqsAndPositionsAndOffsets
<<<
   [junit4]    > Throwable #1: com.carrotsearch.randomizedtesting.UncaughtExceptionError:
Captured an uncaught exception in thread: Thread[id=1862, name=Thread-1635, state=RUNNABLE,
group=TGRP-TestPerFieldPostingsFormat]
   [junit4]    > Caused by: java.lang.RuntimeException: java.lang.IllegalArgumentException:
source=3 is out of bounds (maxState is 2)
   [junit4]    > 	at __randomizedtesting.SeedInfo.seed([92443B942CA01CB0]:0)
   [junit4]    > 	at org.apache.lucene.index.RandomPostingsTester$TestThread.run(RandomPostingsTester.java:1006)
   [junit4]    > Caused by: java.lang.IllegalArgumentException: source=3 is out of bounds
(maxState is 2)
   [junit4]    > 	at org.apache.lucene.util.automaton.Automaton.addTransition(Automaton.java:165)
   [junit4]    > 	at org.apache.lucene.util.automaton.MinimizationOperations.minimize(MinimizationOperations.java:245)
   [junit4]    > 	at org.apache.lucene.util.automaton.RegExp.toAutomatonInternal(RegExp.java:537)
   [junit4]    > 	at org.apache.lucene.util.automaton.RegExp.findLeaves(RegExp.java:617)
   [junit4]    > 	at org.apache.lucene.util.automaton.RegExp.findLeaves(RegExp.java:614)
   [junit4]    > 	at org.apache.lucene.util.automaton.RegExp.findLeaves(RegExp.java:614)
   [junit4]    > 	at org.apache.lucene.util.automaton.RegExp.toAutomatonInternal(RegExp.java:521)
   [junit4]    > 	at org.apache.lucene.util.automaton.RegExp.findLeaves(RegExp.java:617)
   [junit4]    > 	at org.apache.lucene.util.automaton.RegExp.toAutomatonInternal(RegExp.java:512)
   [junit4]    > 	at org.apache.lucene.util.automaton.RegExp.toAutomaton(RegExp.java:495)
   [junit4]    > 	at org.apache.lucene.util.automaton.RegExp.toAutomaton(RegExp.java:426)
   [junit4]    > 	at org.apache.lucene.util.automaton.AutomatonTestUtil.randomSingleAutomaton(AutomatonTestUtil.java:262)
   [junit4]    > 	at org.apache.lucene.util.automaton.AutomatonTestUtil.randomAutomaton(AutomatonTestUtil.java:276)
   [junit4]    > 	at org.apache.lucene.index.RandomPostingsTester.testTermsOneThread(RandomPostingsTester.java:1167)
   [junit4]    > 	at org.apache.lucene.index.RandomPostingsTester.access$000(RandomPostingsTester.java:61)
   [junit4]    > 	at org.apache.lucene.index.RandomPostingsTester$TestThread.run(RandomPostingsTester.java:1004)Throwable
#2: com.carrotsearch.randomizedtesting.UncaughtExceptionError: Captured an uncaught exception
in thread: Thread[id=1860, name=Thread-1633, state=RUNNABLE, group=TGRP-TestPerFieldPostingsFormat]
   [junit4]    > Caused by: java.lang.RuntimeException: java.lang.IllegalArgumentException:
source=3 is out of bounds (maxState is 2)
   [junit4]    > 	at __randomizedtesting.SeedInfo.seed([92443B942CA01CB0]:0)
   [junit4]    > 	at org.apache.lucene.index.RandomPostingsTester$TestThread.run(RandomPostingsTester.java:1006)
   [junit4]    > Caused by: java.lang.IllegalArgumentException: source=3 is out of bounds
(maxState is 2)
   [junit4]    > 	at org.apache.lucene.util.automaton.Automaton.addTransition(Automaton.java:165)
   [junit4]    > 	at org.apache.lucene.util.automaton.MinimizationOperations.minimize(MinimizationOperations.java:245)
   [junit4]    > 	at org.apache.lucene.util.automaton.RegExp.toAutomatonInternal(RegExp.java:537)
   [junit4]    > 	at org.apache.lucene.util.automaton.RegExp.findLeaves(RegExp.java:617)
   [junit4]    > 	at org.apache.lucene.util.automaton.RegExp.findLeaves(RegExp.java:612)
   [junit4]    > 	at org.apache.lucene.util.automaton.RegExp.findLeaves(RegExp.java:614)
   [junit4]    > 	at org.apache.lucene.util.automaton.RegExp.toAutomatonInternal(RegExp.java:521)
   [junit4]    > 	at org.apache.lucene.util.automaton.RegExp.findLeaves(RegExp.java:617)
   [junit4]    > 	at org.apache.lucene.util.automaton.RegExp.toAutomatonInternal(RegExp.java:512)
   [junit4]    > 	at org.apache.lucene.util.automaton.RegExp.toAutomaton(RegExp.java:495)
   [junit4]    > 	at org.apache.lucene.util.automaton.RegExp.toAutomaton(RegExp.java:426)
   [junit4]    > 	at org.apache.lucene.util.automaton.AutomatonTestUtil.randomSingleAutomaton(AutomatonTestUtil.java:262)
   [junit4]    > 	at org.apache.lucene.util.automaton.AutomatonTestUtil.randomAutomaton(AutomatonTestUtil.java:276)
   [junit4]    > 	at org.apache.lucene.index.RandomPostingsTester.testTermsOneThread(RandomPostingsTester.java:1167)
   [junit4]    > 	at org.apache.lucene.index.RandomPostingsTester.access$000(RandomPostingsTester.java:61)
   [junit4]    > 	at org.apache.lucene.index.RandomPostingsTester$TestThread.run(RandomPostingsTester.java:1004)Throwable
#3: com.carrotsearch.randomizedtesting.UncaughtExceptionError: Captured an uncaught exception
in thread: Thread[id=1861, name=Thread-1634, state=RUNNABLE, group=TGRP-TestPerFieldPostingsFormat]
   [junit4]    > Caused by: java.lang.RuntimeException: java.lang.IllegalArgumentException:
source=3 is out of bounds (maxState is 2)
   [junit4]    > 	at __randomizedtesting.SeedInfo.seed([92443B942CA01CB0]:0)
   [junit4]    > 	at org.apache.lucene.index.RandomPostingsTester$TestThread.run(RandomPostingsTester.java:1006)
   [junit4]    > Caused by: java.lang.IllegalArgumentException: source=3 is out of bounds
(maxState is 2)
   [junit4]    > 	at org.apache.lucene.util.automaton.Automaton.addTransition(Automaton.java:165)
   [junit4]    > 	at org.apache.lucene.util.automaton.MinimizationOperations.minimize(MinimizationOperations.java:245)
   [junit4]    > 	at org.apache.lucene.util.automaton.RegExp.toAutomatonInternal(RegExp.java:537)
   [junit4]    > 	at org.apache.lucene.util.automaton.RegExp.findLeaves(RegExp.java:617)
   [junit4]    > 	at org.apache.lucene.util.automaton.RegExp.findLeaves(RegExp.java:612)
   [junit4]    > 	at org.apache.lucene.util.automaton.RegExp.findLeaves(RegExp.java:614)
   [junit4]    > 	at org.apache.lucene.util.automaton.RegExp.findLeaves(RegExp.java:614)
   [junit4]    > 	at org.apache.lucene.util.automaton.RegExp.toAutomatonInternal(RegExp.java:521)
   [junit4]    > 	at org.apache.lucene.util.automaton.RegExp.toAutomaton(RegExp.java:495)
   [junit4]    > 	at org.apache.lucene.util.automaton.RegExp.toAutomaton(RegExp.java:426)
   [junit4]    > 	at org.apache.lucene.util.automaton.AutomatonTestUtil.randomSingleAutomaton(AutomatonTestUtil.java:262)
   [junit4]    > 	at org.apache.lucene.util.automaton.AutomatonTestUtil.randomAutomaton(AutomatonTestUtil.java:277)
   [junit4]    > 	at org.apache.lucene.index.RandomPostingsTester.testTermsOneThread(RandomPostingsTester.java:1167)
   [junit4]    > 	at org.apache.lucene.index.RandomPostingsTester.access$000(RandomPostingsTester.java:61)
   [junit4]    > 	at org.apache.lucene.index.RandomPostingsTester$TestThread.run(RandomPostingsTester.java:1004)Throwable
#4: com.carrotsearch.randomizedtesting.UncaughtExceptionError: Captured an uncaught exception
in thread: Thread[id=1859, name=Thread-1632, state=RUNNABLE, group=TGRP-TestPerFieldPostingsFormat]
   [junit4]    > Caused by: java.lang.RuntimeException: java.lang.IllegalArgumentException:
source=3 is out of bounds (maxState is 2)
   [junit4]    > 	at __randomizedtesting.SeedInfo.seed([92443B942CA01CB0]:0)
   [junit4]    > 	at org.apache.lucene.index.RandomPostingsTester$TestThread.run(RandomPostingsTester.java:1006)
   [junit4]    > Caused by: java.lang.IllegalArgumentException: source=3 is out of bounds
(maxState is 2)
   [junit4]    > 	at org.apache.lucene.util.automaton.Automaton.addTransition(Automaton.java:165)
   [junit4]    > 	at org.apache.lucene.util.automaton.MinimizationOperations.minimize(MinimizationOperations.java:245)
   [junit4]    > 	at org.apache.lucene.util.automaton.RegExp.toAutomatonInternal(RegExp.java:537)
   [junit4]    > 	at org.apache.lucene.util.automaton.RegExp.findLeaves(RegExp.java:617)
   [junit4]    > 	at org.apache.lucene.util.automaton.RegExp.toAutomatonInternal(RegExp.java:519)
   [junit4]    > 	at org.apache.lucene.util.automaton.RegExp.toAutomaton(RegExp.java:495)
   [junit4]    > 	at org.apache.lucene.util.automaton.RegExp.toAutomaton(RegExp.java:426)
   [junit4]    > 	at org.apache.lucene.util.automaton.AutomatonTestUtil.randomSingleAutomaton(AutomatonTestUtil.java:262)
   [junit4]    > 	at org.apache.lucene.util.automaton.AutomatonTestUtil.randomAutomaton(AutomatonTestUtil.java:277)
   [junit4]    > 	at org.apache.lucene.index.RandomPostingsTester.testTermsOneThread(RandomPostingsTester.java:1167)
   [junit4]    > 	at org.apache.lucene.index.RandomPostingsTester.access$000(RandomPostingsTester.java:61)
   [junit4]    > 	at org.apache.lucene.index.RandomPostingsTester$TestThread.run(RandomPostingsTester.java:1004)Throwable
#5: com.carrotsearch.randomizedtesting.UncaughtExceptionError: Captured an uncaught exception
in thread: Thread[id=1864, name=Thread-1637, state=RUNNABLE, group=TGRP-TestPerFieldPostingsFormat]
   [junit4]    > Caused by: java.lang.RuntimeException: java.lang.IllegalArgumentException:
source=3 is out of bounds (maxState is 2)
   [junit4]    > 	at __randomizedtesting.SeedInfo.seed([92443B942CA01CB0]:0)
   [junit4]    > 	at org.apache.lucene.index.RandomPostingsTester$TestThread.run(RandomPostingsTester.java:1006)
   [junit4]    > Caused by: java.lang.IllegalArgumentException: source=3 is out of bounds
(maxState is 2)
   [junit4]    > 	at org.apache.lucene.util.automaton.Automaton.addTransition(Automaton.java:165)
   [junit4]    > 	at org.apache.lucene.util.automaton.MinimizationOperations.minimize(MinimizationOperations.java:245)
   [junit4]    > 	at org.apache.lucene.util.automaton.RegExp.toAutomatonInternal(RegExp.java:537)
   [junit4]    > 	at org.apache.lucene.util.automaton.RegExp.toAutomatonInternal(RegExp.java:540)
   [junit4]    > 	at org.apache.lucene.util.automaton.RegExp.findLeaves(RegExp.java:617)
   [junit4]    > 	at org.apache.lucene.util.automaton.RegExp.toAutomatonInternal(RegExp.java:519)
   [junit4]    > 	at org.apache.lucene.util.automaton.RegExp.findLeaves(RegExp.java:617)
   [junit4]    > 	at org.apache.lucene.util.automaton.RegExp.toAutomatonInternal(RegExp.java:510)
   [junit4]    > 	at org.apache.lucene.util.automaton.RegExp.toAutomaton(RegExp.java:495)
   [junit4]    > 	at org.apache.lucene.util.automaton.RegExp.toAutomaton(RegExp.java:426)
   [junit4]    > 	at org.apache.lucene.util.automaton.AutomatonTestUtil.randomSingleAutomaton(AutomatonTestUtil.java:262)
   [junit4]    > 	at org.apache.lucene.util.automaton.AutomatonTestUtil.randomAutomaton(AutomatonTestUtil.java:276)
   [junit4]    > 	at org.apache.lucene.index.RandomPostingsTester.testTermsOneThread(RandomPostingsTester.java:1167)
   [junit4]    > 	at org.apache.lucene.index.RandomPostingsTester.access$000(RandomPostingsTester.java:61)
   [junit4]    > 	at org.apache.lucene.index.RandomPostingsTester$TestThread.run(RandomPostingsTester.java:1004)Throwable
#6: com.carrotsearch.randomizedtesting.UncaughtExceptionError: Captured an uncaught exception
in thread: Thread[id=1867, name=Thread-1640, state=RUNNABLE, group=TGRP-TestPerFieldPostingsFormat]
   [junit4]    > Caused by: java.lang.RuntimeException: java.lang.ArrayIndexOutOfBoundsException:
8
   [junit4]    > 	at __randomizedtesting.SeedInfo.seed([92443B942CA01CB0]:0)
   [junit4]    > 	at org.apache.lucene.index.RandomPostingsTester$TestThread.run(RandomPostingsTester.java:1006)
   [junit4]    > Caused by: java.lang.ArrayIndexOutOfBoundsException: 8
   [junit4]    > 	at org.apache.lucene.util.automaton.MinimizationOperations.minimize(MinimizationOperations.java:235)
   [junit4]    > 	at org.apache.lucene.util.automaton.RegExp.toAutomatonInternal(RegExp.java:524)
   [junit4]    > 	at org.apache.lucene.util.automaton.RegExp.toAutomaton(RegExp.java:495)
   [junit4]    > 	at org.apache.lucene.util.automaton.RegExp.toAutomaton(RegExp.java:426)
   [junit4]    > 	at org.apache.lucene.util.automaton.AutomatonTestUtil.randomSingleAutomaton(AutomatonTestUtil.java:262)
   [junit4]    > 	at org.apache.lucene.util.automaton.AutomatonTestUtil.randomAutomaton(AutomatonTestUtil.java:276)
   [junit4]    > 	at org.apache.lucene.index.RandomPostingsTester.testTermsOneThread(RandomPostingsTester.java:1167)
   [junit4]    > 	at org.apache.lucene.index.RandomPostingsTester.access$000(RandomPostingsTester.java:61)
   [junit4]    > 	at org.apache.lucene.index.RandomPostingsTester$TestThread.run(RandomPostingsTester.java:1004)
   [junit4]   2> NOTE: test params are: codec=CheapBastard, sim=ClassicSimilarity, locale=mn-Cyrl,
timezone=US/Samoa
   [junit4]   2> NOTE: Linux 3.19.0-47-generic amd64/Oracle Corporation 9-ea (64-bit)/cpus=12,threads=1,free=317895872,total=508952576
   [junit4]   2> NOTE: All tests run in this JVM: [TestBlockPostingsFormat, TestSpanOrQuery,
TestTotalHitCountCollector, TestBytesStore, TestMixedCodecs, TestCustomSearcherSort, TestIndexInput,
TestDirectPacked, TestDemoParallelLeafReader, TestPhrasePrefixQuery, TestTopDocsMerge, TestPointQueries,
TestForceMergeForever, TestMultiMMap, TestSegmentInfos, TestDocBoost, TestSearchForDuplicates,
TestConsistentFieldNumbers, TestWildcard, TestTermsEnum2, TestSearch, Test2BNumericDocValues,
TestSimpleFSDirectory, TestCachingCollector, TestTwoPhaseCommitTool, TestCharTermAttributeImpl,
TestTimSorterWorstCase, TestFastCompressionMode, TestTermVectorsReader, TestMathUtil, TestAtomicUpdate,
TestSpanContainQuery, TestSimpleSearchEquivalence, TestNot, TestFuzzyQuery, TestParallelReaderEmptyIndex,
TestDocValuesScoring, TestManyFields, TestIndexWriterThreadsToSegments, TestSpanFirstQuery,
TestConjunctions, TestBufferedIndexInput, Test2BPagedBytes, TestExternalCodecs, TestNumericTokenStream,
TestFastDecompressionMode, TestBufferedChecksum, TestDuelingCodecsAtNight, TestNoMergeScheduler,
TestSloppyPhraseQuery, TestMultiThreadTermVectors, TestPackedTokenAttributeImpl, TestConcurrentMergeScheduler,
TestRollingUpdates, TestControlledRealTimeReopenThread, TestSPIClassIterator, TestMergeSchedulerExternal,
TestMaxTermFrequency, TestField, TestIndexCommit, TestReqExclBulkScorer, TestLucene50SegmentInfoFormat,
TestCrashCausesCorruptIndex, TestPointValues, TestPrefixQuery, TestDemo, TestLazyProxSkipping,
TestNRTThreads, TestFrequencyTrackingRingBuffer, TestSortedSetSelector, TestIndexWriterReader,
TestIndexWriterMerging, TestFSTs, TestPackedInts, TestNumericRangeQuery32, TestDeletionPolicy,
TestBooleanOr, TestBasics, TestFlushByRamOrCountsPolicy, TestIndexWriterMergePolicy, TestPersistentSnapshotDeletionPolicy,
TestNorms, TestIndexWriterCommit, TestSearchWithThreads, TestHighCompressionMode, TestLongPostings,
TestStressIndexing, TestMinimize, TestSnapshotDeletionPolicy, TestIndexWriterUnicode, TestNRTReaderWithThreads,
TestTieredMergePolicy, TestIndexWriterForceMerge, TestPerFieldPostingsFormat]
   [junit4]   2> NOTE: reproduce with: ant test  -Dtestcase=TestPerFieldPostingsFormat
-Dtests.seed=92443B942CA01CB0 -Dtests.multiplier=3 -Dtests.slow=true -Dtests.locale=mn-Cyrl
-Dtests.timezone=US/Samoa -Dtests.asserts=true -Dtests.file.encoding=US-ASCII
   [junit4] ERROR   0.00s J2 | TestPerFieldPostingsFormat (suite) <<<
   [junit4]    > Throwable #1: java.lang.AssertionError: The test or suite printed 21596
bytes to stdout and stderr, even though the limit was set to 8192 bytes. Increase the limit
with @Limit, ignore it completely with @SuppressSysoutChecks or run with -Dtests.verbose=true
   [junit4]    > 	at __randomizedtesting.SeedInfo.seed([92443B942CA01CB0]:0)
   [junit4]    > 	at java.lang.Thread.run(Thread.java:804)
   [junit4] Completed [218/411 (1!)] on J2 in 11.76s, 24 tests, 1 failure, 1 error, 2 skipped
<<< FAILURES!

[...truncated 637 lines...]
BUILD FAILED
/home/jenkins/workspace/Lucene-Solr-trunk-Linux/build.xml:740: The following error occurred
while executing this line:
/home/jenkins/workspace/Lucene-Solr-trunk-Linux/build.xml:684: The following error occurred
while executing this line:
/home/jenkins/workspace/Lucene-Solr-trunk-Linux/build.xml:59: The following error occurred
while executing this line:
/home/jenkins/workspace/Lucene-Solr-trunk-Linux/lucene/build.xml:50: The following error occurred
while executing this line:
/home/jenkins/workspace/Lucene-Solr-trunk-Linux/lucene/common-build.xml:1457: The following
error occurred while executing this line:
/home/jenkins/workspace/Lucene-Solr-trunk-Linux/lucene/common-build.xml:1014: There were test
failures: 411 suites (1 ignored), 3395 tests, 1 suite-level error, 1 error, 59 ignored (55
assumptions) [seed: 92443B942CA01CB0]

Total time: 5 minutes 53 seconds
Build step 'Invoke Ant' marked build as failure
Archiving artifacts
[WARNINGS] Skipping publisher since build result is FAILURE
Recording test results
Email was triggered for: Failure - Any
Sending email for trigger: Failure - Any



Mime
View raw message