lucene-dev mailing list archives

Site index · List index
Message view « Date » · « Thread »
Top « Date » · « Thread »
From Policeman Jenkins Server <jenk...@thetaphi.de>
Subject [JENKINS-EA] Lucene-Solr-trunk-Linux (64bit/jdk-9-ea+105) - Build # 15950 - Still Failing!
Date Sun, 21 Feb 2016 22:43:49 GMT
Build: http://jenkins.thetaphi.de/job/Lucene-Solr-trunk-Linux/15950/
Java: 64bit/jdk-9-ea+105 -XX:+UseCompressedOops -XX:+UseConcMarkSweepGC -XX:-UseSuperWord

6 tests failed.
FAILED:  org.apache.lucene.search.TestDocValuesRewriteMethod.testRegexps

Error Message:
source=3 is out of bounds (maxState is 2)

Stack Trace:
java.lang.IllegalArgumentException: source=3 is out of bounds (maxState is 2)
	at __randomizedtesting.SeedInfo.seed([64FE4B52F8B49E63:85A20A43261EC9EB]:0)
	at org.apache.lucene.util.automaton.Automaton.addTransition(Automaton.java:165)
	at org.apache.lucene.util.automaton.MinimizationOperations.minimize(MinimizationOperations.java:245)
	at org.apache.lucene.util.automaton.RegExp.toAutomatonInternal(RegExp.java:537)
	at org.apache.lucene.util.automaton.RegExp.toAutomatonInternal(RegExp.java:535)
	at org.apache.lucene.util.automaton.RegExp.toAutomatonInternal(RegExp.java:535)
	at org.apache.lucene.util.automaton.RegExp.findLeaves(RegExp.java:617)
	at org.apache.lucene.util.automaton.RegExp.findLeaves(RegExp.java:614)
	at org.apache.lucene.util.automaton.RegExp.findLeaves(RegExp.java:614)
	at org.apache.lucene.util.automaton.RegExp.toAutomatonInternal(RegExp.java:521)
	at org.apache.lucene.util.automaton.RegExp.findLeaves(RegExp.java:617)
	at org.apache.lucene.util.automaton.RegExp.toAutomatonInternal(RegExp.java:510)
	at org.apache.lucene.util.automaton.RegExp.toAutomaton(RegExp.java:495)
	at org.apache.lucene.util.automaton.RegExp.toAutomaton(RegExp.java:466)
	at org.apache.lucene.search.RegexpQuery.<init>(RegexpQuery.java:109)
	at org.apache.lucene.search.RegexpQuery.<init>(RegexpQuery.java:79)
	at org.apache.lucene.search.TestDocValuesRewriteMethod.assertSame(TestDocValuesRewriteMethod.java:117)
	at org.apache.lucene.search.TestDocValuesRewriteMethod.testRegexps(TestDocValuesRewriteMethod.java:109)
	at sun.reflect.NativeMethodAccessorImpl.invoke0(Native Method)
	at sun.reflect.NativeMethodAccessorImpl.invoke(NativeMethodAccessorImpl.java:62)
	at sun.reflect.DelegatingMethodAccessorImpl.invoke(DelegatingMethodAccessorImpl.java:43)
	at java.lang.reflect.Method.invoke(Method.java:520)
	at com.carrotsearch.randomizedtesting.RandomizedRunner.invoke(RandomizedRunner.java:1764)
	at com.carrotsearch.randomizedtesting.RandomizedRunner$8.evaluate(RandomizedRunner.java:871)
	at com.carrotsearch.randomizedtesting.RandomizedRunner$9.evaluate(RandomizedRunner.java:907)
	at com.carrotsearch.randomizedtesting.RandomizedRunner$10.evaluate(RandomizedRunner.java:921)
	at org.apache.lucene.util.TestRuleSetupTeardownChained$1.evaluate(TestRuleSetupTeardownChained.java:49)
	at org.apache.lucene.util.AbstractBeforeAfterRule$1.evaluate(AbstractBeforeAfterRule.java:45)
	at org.apache.lucene.util.TestRuleThreadAndTestName$1.evaluate(TestRuleThreadAndTestName.java:48)
	at org.apache.lucene.util.TestRuleIgnoreAfterMaxFailures$1.evaluate(TestRuleIgnoreAfterMaxFailures.java:64)
	at org.apache.lucene.util.TestRuleMarkFailure$1.evaluate(TestRuleMarkFailure.java:47)
	at com.carrotsearch.randomizedtesting.rules.StatementAdapter.evaluate(StatementAdapter.java:36)
	at com.carrotsearch.randomizedtesting.ThreadLeakControl$StatementRunner.run(ThreadLeakControl.java:367)
	at com.carrotsearch.randomizedtesting.ThreadLeakControl.forkTimeoutingTask(ThreadLeakControl.java:809)
	at com.carrotsearch.randomizedtesting.ThreadLeakControl$3.evaluate(ThreadLeakControl.java:460)
	at com.carrotsearch.randomizedtesting.RandomizedRunner.runSingleTest(RandomizedRunner.java:880)
	at com.carrotsearch.randomizedtesting.RandomizedRunner$5.evaluate(RandomizedRunner.java:781)
	at com.carrotsearch.randomizedtesting.RandomizedRunner$6.evaluate(RandomizedRunner.java:816)
	at com.carrotsearch.randomizedtesting.RandomizedRunner$7.evaluate(RandomizedRunner.java:827)
	at org.apache.lucene.util.AbstractBeforeAfterRule$1.evaluate(AbstractBeforeAfterRule.java:45)
	at com.carrotsearch.randomizedtesting.rules.StatementAdapter.evaluate(StatementAdapter.java:36)
	at org.apache.lucene.util.TestRuleStoreClassName$1.evaluate(TestRuleStoreClassName.java:41)
	at com.carrotsearch.randomizedtesting.rules.NoShadowingOrOverridesOnMethodsRule$1.evaluate(NoShadowingOrOverridesOnMethodsRule.java:40)
	at com.carrotsearch.randomizedtesting.rules.NoShadowingOrOverridesOnMethodsRule$1.evaluate(NoShadowingOrOverridesOnMethodsRule.java:40)
	at com.carrotsearch.randomizedtesting.rules.StatementAdapter.evaluate(StatementAdapter.java:36)
	at com.carrotsearch.randomizedtesting.rules.StatementAdapter.evaluate(StatementAdapter.java:36)
	at com.carrotsearch.randomizedtesting.rules.StatementAdapter.evaluate(StatementAdapter.java:36)
	at org.apache.lucene.util.TestRuleAssertionsRequired$1.evaluate(TestRuleAssertionsRequired.java:53)
	at org.apache.lucene.util.TestRuleMarkFailure$1.evaluate(TestRuleMarkFailure.java:47)
	at org.apache.lucene.util.TestRuleIgnoreAfterMaxFailures$1.evaluate(TestRuleIgnoreAfterMaxFailures.java:64)
	at org.apache.lucene.util.TestRuleIgnoreTestSuites$1.evaluate(TestRuleIgnoreTestSuites.java:54)
	at com.carrotsearch.randomizedtesting.rules.StatementAdapter.evaluate(StatementAdapter.java:36)
	at com.carrotsearch.randomizedtesting.ThreadLeakControl$StatementRunner.run(ThreadLeakControl.java:367)
	at java.lang.Thread.run(Thread.java:804)


FAILED:  org.apache.lucene.search.TestFieldCacheRewriteMethod.testRegexps

Error Message:
Unequal lengths: hits1=0,hits2=2

Stack Trace:
junit.framework.AssertionFailedError: Unequal lengths: hits1=0,hits2=2
	at __randomizedtesting.SeedInfo.seed([64FE4B52F8B49E63:85A20A43261EC9EB]:0)
	at junit.framework.Assert.fail(Assert.java:50)
	at org.apache.lucene.search.CheckHits.checkEqual(CheckHits.java:211)
	at org.apache.lucene.search.TestFieldCacheRewriteMethod.assertSame(TestFieldCacheRewriteMethod.java:42)
	at org.apache.lucene.search.TestRegexpRandom2.testRegexps(TestRegexpRandom2.java:160)
	at sun.reflect.NativeMethodAccessorImpl.invoke0(Native Method)
	at sun.reflect.NativeMethodAccessorImpl.invoke(NativeMethodAccessorImpl.java:62)
	at sun.reflect.DelegatingMethodAccessorImpl.invoke(DelegatingMethodAccessorImpl.java:43)
	at java.lang.reflect.Method.invoke(Method.java:520)
	at com.carrotsearch.randomizedtesting.RandomizedRunner.invoke(RandomizedRunner.java:1764)
	at com.carrotsearch.randomizedtesting.RandomizedRunner$8.evaluate(RandomizedRunner.java:871)
	at com.carrotsearch.randomizedtesting.RandomizedRunner$9.evaluate(RandomizedRunner.java:907)
	at com.carrotsearch.randomizedtesting.RandomizedRunner$10.evaluate(RandomizedRunner.java:921)
	at org.apache.lucene.util.TestRuleSetupTeardownChained$1.evaluate(TestRuleSetupTeardownChained.java:49)
	at org.apache.lucene.util.AbstractBeforeAfterRule$1.evaluate(AbstractBeforeAfterRule.java:45)
	at org.apache.lucene.util.TestRuleThreadAndTestName$1.evaluate(TestRuleThreadAndTestName.java:48)
	at org.apache.lucene.util.TestRuleIgnoreAfterMaxFailures$1.evaluate(TestRuleIgnoreAfterMaxFailures.java:64)
	at org.apache.lucene.util.TestRuleMarkFailure$1.evaluate(TestRuleMarkFailure.java:47)
	at com.carrotsearch.randomizedtesting.rules.StatementAdapter.evaluate(StatementAdapter.java:36)
	at com.carrotsearch.randomizedtesting.ThreadLeakControl$StatementRunner.run(ThreadLeakControl.java:367)
	at com.carrotsearch.randomizedtesting.ThreadLeakControl.forkTimeoutingTask(ThreadLeakControl.java:809)
	at com.carrotsearch.randomizedtesting.ThreadLeakControl$3.evaluate(ThreadLeakControl.java:460)
	at com.carrotsearch.randomizedtesting.RandomizedRunner.runSingleTest(RandomizedRunner.java:880)
	at com.carrotsearch.randomizedtesting.RandomizedRunner$5.evaluate(RandomizedRunner.java:781)
	at com.carrotsearch.randomizedtesting.RandomizedRunner$6.evaluate(RandomizedRunner.java:816)
	at com.carrotsearch.randomizedtesting.RandomizedRunner$7.evaluate(RandomizedRunner.java:827)
	at org.apache.lucene.util.AbstractBeforeAfterRule$1.evaluate(AbstractBeforeAfterRule.java:45)
	at com.carrotsearch.randomizedtesting.rules.StatementAdapter.evaluate(StatementAdapter.java:36)
	at org.apache.lucene.util.TestRuleStoreClassName$1.evaluate(TestRuleStoreClassName.java:41)
	at com.carrotsearch.randomizedtesting.rules.NoShadowingOrOverridesOnMethodsRule$1.evaluate(NoShadowingOrOverridesOnMethodsRule.java:40)
	at com.carrotsearch.randomizedtesting.rules.NoShadowingOrOverridesOnMethodsRule$1.evaluate(NoShadowingOrOverridesOnMethodsRule.java:40)
	at com.carrotsearch.randomizedtesting.rules.StatementAdapter.evaluate(StatementAdapter.java:36)
	at com.carrotsearch.randomizedtesting.rules.StatementAdapter.evaluate(StatementAdapter.java:36)
	at com.carrotsearch.randomizedtesting.rules.StatementAdapter.evaluate(StatementAdapter.java:36)
	at org.apache.lucene.util.TestRuleAssertionsRequired$1.evaluate(TestRuleAssertionsRequired.java:53)
	at org.apache.lucene.util.TestRuleMarkFailure$1.evaluate(TestRuleMarkFailure.java:47)
	at org.apache.lucene.util.TestRuleIgnoreAfterMaxFailures$1.evaluate(TestRuleIgnoreAfterMaxFailures.java:64)
	at org.apache.lucene.util.TestRuleIgnoreTestSuites$1.evaluate(TestRuleIgnoreTestSuites.java:54)
	at com.carrotsearch.randomizedtesting.rules.StatementAdapter.evaluate(StatementAdapter.java:36)
	at com.carrotsearch.randomizedtesting.ThreadLeakControl$StatementRunner.run(ThreadLeakControl.java:367)
	at java.lang.Thread.run(Thread.java:804)


FAILED:  org.apache.lucene.util.automaton.TestAutomaton.testMakeBinaryIntervalFiniteCasesRandom

Error Message:
automaton was not minimal

Stack Trace:
java.lang.AssertionError: automaton was not minimal
	at __randomizedtesting.SeedInfo.seed([64FE4B52F8B49E63:1CFF5BAA5B5CA032]:0)
	at org.junit.Assert.fail(Assert.java:93)
	at org.apache.lucene.util.automaton.TestAutomaton.makeBinaryInterval(TestAutomaton.java:1167)
	at org.apache.lucene.util.automaton.TestAutomaton.testMakeBinaryIntervalFiniteCasesRandom(TestAutomaton.java:1243)
	at sun.reflect.NativeMethodAccessorImpl.invoke0(Native Method)
	at sun.reflect.NativeMethodAccessorImpl.invoke(NativeMethodAccessorImpl.java:62)
	at sun.reflect.DelegatingMethodAccessorImpl.invoke(DelegatingMethodAccessorImpl.java:43)
	at java.lang.reflect.Method.invoke(Method.java:520)
	at com.carrotsearch.randomizedtesting.RandomizedRunner.invoke(RandomizedRunner.java:1764)
	at com.carrotsearch.randomizedtesting.RandomizedRunner$8.evaluate(RandomizedRunner.java:871)
	at com.carrotsearch.randomizedtesting.RandomizedRunner$9.evaluate(RandomizedRunner.java:907)
	at com.carrotsearch.randomizedtesting.RandomizedRunner$10.evaluate(RandomizedRunner.java:921)
	at org.apache.lucene.util.TestRuleSetupTeardownChained$1.evaluate(TestRuleSetupTeardownChained.java:49)
	at org.apache.lucene.util.AbstractBeforeAfterRule$1.evaluate(AbstractBeforeAfterRule.java:45)
	at org.apache.lucene.util.TestRuleThreadAndTestName$1.evaluate(TestRuleThreadAndTestName.java:48)
	at org.apache.lucene.util.TestRuleIgnoreAfterMaxFailures$1.evaluate(TestRuleIgnoreAfterMaxFailures.java:64)
	at org.apache.lucene.util.TestRuleMarkFailure$1.evaluate(TestRuleMarkFailure.java:47)
	at com.carrotsearch.randomizedtesting.rules.StatementAdapter.evaluate(StatementAdapter.java:36)
	at com.carrotsearch.randomizedtesting.ThreadLeakControl$StatementRunner.run(ThreadLeakControl.java:367)
	at com.carrotsearch.randomizedtesting.ThreadLeakControl.forkTimeoutingTask(ThreadLeakControl.java:809)
	at com.carrotsearch.randomizedtesting.ThreadLeakControl$3.evaluate(ThreadLeakControl.java:460)
	at com.carrotsearch.randomizedtesting.RandomizedRunner.runSingleTest(RandomizedRunner.java:880)
	at com.carrotsearch.randomizedtesting.RandomizedRunner$5.evaluate(RandomizedRunner.java:781)
	at com.carrotsearch.randomizedtesting.RandomizedRunner$6.evaluate(RandomizedRunner.java:816)
	at com.carrotsearch.randomizedtesting.RandomizedRunner$7.evaluate(RandomizedRunner.java:827)
	at org.apache.lucene.util.AbstractBeforeAfterRule$1.evaluate(AbstractBeforeAfterRule.java:45)
	at com.carrotsearch.randomizedtesting.rules.StatementAdapter.evaluate(StatementAdapter.java:36)
	at org.apache.lucene.util.TestRuleStoreClassName$1.evaluate(TestRuleStoreClassName.java:41)
	at com.carrotsearch.randomizedtesting.rules.NoShadowingOrOverridesOnMethodsRule$1.evaluate(NoShadowingOrOverridesOnMethodsRule.java:40)
	at com.carrotsearch.randomizedtesting.rules.NoShadowingOrOverridesOnMethodsRule$1.evaluate(NoShadowingOrOverridesOnMethodsRule.java:40)
	at com.carrotsearch.randomizedtesting.rules.StatementAdapter.evaluate(StatementAdapter.java:36)
	at com.carrotsearch.randomizedtesting.rules.StatementAdapter.evaluate(StatementAdapter.java:36)
	at com.carrotsearch.randomizedtesting.rules.StatementAdapter.evaluate(StatementAdapter.java:36)
	at org.apache.lucene.util.TestRuleAssertionsRequired$1.evaluate(TestRuleAssertionsRequired.java:53)
	at org.apache.lucene.util.TestRuleMarkFailure$1.evaluate(TestRuleMarkFailure.java:47)
	at org.apache.lucene.util.TestRuleIgnoreAfterMaxFailures$1.evaluate(TestRuleIgnoreAfterMaxFailures.java:64)
	at org.apache.lucene.util.TestRuleIgnoreTestSuites$1.evaluate(TestRuleIgnoreTestSuites.java:54)
	at com.carrotsearch.randomizedtesting.rules.StatementAdapter.evaluate(StatementAdapter.java:36)
	at com.carrotsearch.randomizedtesting.ThreadLeakControl$StatementRunner.run(ThreadLeakControl.java:367)
	at java.lang.Thread.run(Thread.java:804)


FAILED:  org.apache.lucene.util.automaton.TestAutomaton.testRandomFinite

Error Message:
failed to accept term=358︄︌︄︁︌︋︈︆️️︎︋︄︇︄︅𝅓𝅓𝅍𝅓𝅍𝄶𝅓𝅍𝄶𝇒𝅓𝅍𝄶𝇒𝄰𝅓𝅍𝄶𝇒𝄰𝇬𝅓𝅍𝄶𝇒𝄰𝇬𝄟𝅓𝅍𝄶𝇒𝄰𝇬𝄟𝄂້໺ຘໟ໓ຽະ໽໢໺໛໚຀ຩ

Stack Trace:
java.lang.AssertionError: failed to accept term=358︄︌︄︁︌︋︈︆️️︎︋︄︇︄︅𝅓𝅍𝄶𝇒𝄰𝇬𝄟𝄂້໺ຘໟ໓ຽະ໽໢໺໛໚຀ຩ
	at __randomizedtesting.SeedInfo.seed([64FE4B52F8B49E63:23482D6F4724FB42]:0)
	at org.junit.Assert.fail(Assert.java:93)
	at org.junit.Assert.assertTrue(Assert.java:43)
	at org.apache.lucene.util.automaton.TestAutomaton.assertSame(TestAutomaton.java:1087)
	at org.apache.lucene.util.automaton.TestAutomaton.testRandomFinite(TestAutomaton.java:1031)
	at sun.reflect.NativeMethodAccessorImpl.invoke0(Native Method)
	at sun.reflect.NativeMethodAccessorImpl.invoke(NativeMethodAccessorImpl.java:62)
	at sun.reflect.DelegatingMethodAccessorImpl.invoke(DelegatingMethodAccessorImpl.java:43)
	at java.lang.reflect.Method.invoke(Method.java:520)
	at com.carrotsearch.randomizedtesting.RandomizedRunner.invoke(RandomizedRunner.java:1764)
	at com.carrotsearch.randomizedtesting.RandomizedRunner$8.evaluate(RandomizedRunner.java:871)
	at com.carrotsearch.randomizedtesting.RandomizedRunner$9.evaluate(RandomizedRunner.java:907)
	at com.carrotsearch.randomizedtesting.RandomizedRunner$10.evaluate(RandomizedRunner.java:921)
	at org.apache.lucene.util.TestRuleSetupTeardownChained$1.evaluate(TestRuleSetupTeardownChained.java:49)
	at org.apache.lucene.util.AbstractBeforeAfterRule$1.evaluate(AbstractBeforeAfterRule.java:45)
	at org.apache.lucene.util.TestRuleThreadAndTestName$1.evaluate(TestRuleThreadAndTestName.java:48)
	at org.apache.lucene.util.TestRuleIgnoreAfterMaxFailures$1.evaluate(TestRuleIgnoreAfterMaxFailures.java:64)
	at org.apache.lucene.util.TestRuleMarkFailure$1.evaluate(TestRuleMarkFailure.java:47)
	at com.carrotsearch.randomizedtesting.rules.StatementAdapter.evaluate(StatementAdapter.java:36)
	at com.carrotsearch.randomizedtesting.ThreadLeakControl$StatementRunner.run(ThreadLeakControl.java:367)
	at com.carrotsearch.randomizedtesting.ThreadLeakControl.forkTimeoutingTask(ThreadLeakControl.java:809)
	at com.carrotsearch.randomizedtesting.ThreadLeakControl$3.evaluate(ThreadLeakControl.java:460)
	at com.carrotsearch.randomizedtesting.RandomizedRunner.runSingleTest(RandomizedRunner.java:880)
	at com.carrotsearch.randomizedtesting.RandomizedRunner$5.evaluate(RandomizedRunner.java:781)
	at com.carrotsearch.randomizedtesting.RandomizedRunner$6.evaluate(RandomizedRunner.java:816)
	at com.carrotsearch.randomizedtesting.RandomizedRunner$7.evaluate(RandomizedRunner.java:827)
	at org.apache.lucene.util.AbstractBeforeAfterRule$1.evaluate(AbstractBeforeAfterRule.java:45)
	at com.carrotsearch.randomizedtesting.rules.StatementAdapter.evaluate(StatementAdapter.java:36)
	at org.apache.lucene.util.TestRuleStoreClassName$1.evaluate(TestRuleStoreClassName.java:41)
	at com.carrotsearch.randomizedtesting.rules.NoShadowingOrOverridesOnMethodsRule$1.evaluate(NoShadowingOrOverridesOnMethodsRule.java:40)
	at com.carrotsearch.randomizedtesting.rules.NoShadowingOrOverridesOnMethodsRule$1.evaluate(NoShadowingOrOverridesOnMethodsRule.java:40)
	at com.carrotsearch.randomizedtesting.rules.StatementAdapter.evaluate(StatementAdapter.java:36)
	at com.carrotsearch.randomizedtesting.rules.StatementAdapter.evaluate(StatementAdapter.java:36)
	at com.carrotsearch.randomizedtesting.rules.StatementAdapter.evaluate(StatementAdapter.java:36)
	at org.apache.lucene.util.TestRuleAssertionsRequired$1.evaluate(TestRuleAssertionsRequired.java:53)
	at org.apache.lucene.util.TestRuleMarkFailure$1.evaluate(TestRuleMarkFailure.java:47)
	at org.apache.lucene.util.TestRuleIgnoreAfterMaxFailures$1.evaluate(TestRuleIgnoreAfterMaxFailures.java:64)
	at org.apache.lucene.util.TestRuleIgnoreTestSuites$1.evaluate(TestRuleIgnoreTestSuites.java:54)
	at com.carrotsearch.randomizedtesting.rules.StatementAdapter.evaluate(StatementAdapter.java:36)
	at com.carrotsearch.randomizedtesting.ThreadLeakControl$StatementRunner.run(ThreadLeakControl.java:367)
	at java.lang.Thread.run(Thread.java:804)


FAILED:  org.apache.lucene.util.automaton.TestOperations.testIsFinite

Error Message:
source=3 is out of bounds (maxState is 2)

Stack Trace:
java.lang.IllegalArgumentException: source=3 is out of bounds (maxState is 2)
	at __randomizedtesting.SeedInfo.seed([64FE4B52F8B49E63:44C7BA42B4FD41F5]:0)
	at org.apache.lucene.util.automaton.Automaton.addTransition(Automaton.java:165)
	at org.apache.lucene.util.automaton.MinimizationOperations.minimize(MinimizationOperations.java:245)
	at org.apache.lucene.util.automaton.RegExp.toAutomatonInternal(RegExp.java:537)
	at org.apache.lucene.util.automaton.RegExp.toAutomatonInternal(RegExp.java:546)
	at org.apache.lucene.util.automaton.RegExp.findLeaves(RegExp.java:617)
	at org.apache.lucene.util.automaton.RegExp.toAutomatonInternal(RegExp.java:521)
	at org.apache.lucene.util.automaton.RegExp.findLeaves(RegExp.java:617)
	at org.apache.lucene.util.automaton.RegExp.toAutomatonInternal(RegExp.java:512)
	at org.apache.lucene.util.automaton.RegExp.toAutomaton(RegExp.java:495)
	at org.apache.lucene.util.automaton.RegExp.toAutomaton(RegExp.java:426)
	at org.apache.lucene.util.automaton.AutomatonTestUtil.randomSingleAutomaton(AutomatonTestUtil.java:262)
	at org.apache.lucene.util.automaton.AutomatonTestUtil.randomAutomaton(AutomatonTestUtil.java:276)
	at org.apache.lucene.util.automaton.TestOperations.testIsFinite(TestOperations.java:122)
	at sun.reflect.NativeMethodAccessorImpl.invoke0(Native Method)
	at sun.reflect.NativeMethodAccessorImpl.invoke(NativeMethodAccessorImpl.java:62)
	at sun.reflect.DelegatingMethodAccessorImpl.invoke(DelegatingMethodAccessorImpl.java:43)
	at java.lang.reflect.Method.invoke(Method.java:520)
	at com.carrotsearch.randomizedtesting.RandomizedRunner.invoke(RandomizedRunner.java:1764)
	at com.carrotsearch.randomizedtesting.RandomizedRunner$8.evaluate(RandomizedRunner.java:871)
	at com.carrotsearch.randomizedtesting.RandomizedRunner$9.evaluate(RandomizedRunner.java:907)
	at com.carrotsearch.randomizedtesting.RandomizedRunner$10.evaluate(RandomizedRunner.java:921)
	at org.apache.lucene.util.TestRuleSetupTeardownChained$1.evaluate(TestRuleSetupTeardownChained.java:49)
	at org.apache.lucene.util.AbstractBeforeAfterRule$1.evaluate(AbstractBeforeAfterRule.java:45)
	at org.apache.lucene.util.TestRuleThreadAndTestName$1.evaluate(TestRuleThreadAndTestName.java:48)
	at org.apache.lucene.util.TestRuleIgnoreAfterMaxFailures$1.evaluate(TestRuleIgnoreAfterMaxFailures.java:64)
	at org.apache.lucene.util.TestRuleMarkFailure$1.evaluate(TestRuleMarkFailure.java:47)
	at com.carrotsearch.randomizedtesting.rules.StatementAdapter.evaluate(StatementAdapter.java:36)
	at com.carrotsearch.randomizedtesting.ThreadLeakControl$StatementRunner.run(ThreadLeakControl.java:367)
	at com.carrotsearch.randomizedtesting.ThreadLeakControl.forkTimeoutingTask(ThreadLeakControl.java:809)
	at com.carrotsearch.randomizedtesting.ThreadLeakControl$3.evaluate(ThreadLeakControl.java:460)
	at com.carrotsearch.randomizedtesting.RandomizedRunner.runSingleTest(RandomizedRunner.java:880)
	at com.carrotsearch.randomizedtesting.RandomizedRunner$5.evaluate(RandomizedRunner.java:781)
	at com.carrotsearch.randomizedtesting.RandomizedRunner$6.evaluate(RandomizedRunner.java:816)
	at com.carrotsearch.randomizedtesting.RandomizedRunner$7.evaluate(RandomizedRunner.java:827)
	at org.apache.lucene.util.AbstractBeforeAfterRule$1.evaluate(AbstractBeforeAfterRule.java:45)
	at com.carrotsearch.randomizedtesting.rules.StatementAdapter.evaluate(StatementAdapter.java:36)
	at org.apache.lucene.util.TestRuleStoreClassName$1.evaluate(TestRuleStoreClassName.java:41)
	at com.carrotsearch.randomizedtesting.rules.NoShadowingOrOverridesOnMethodsRule$1.evaluate(NoShadowingOrOverridesOnMethodsRule.java:40)
	at com.carrotsearch.randomizedtesting.rules.NoShadowingOrOverridesOnMethodsRule$1.evaluate(NoShadowingOrOverridesOnMethodsRule.java:40)
	at com.carrotsearch.randomizedtesting.rules.StatementAdapter.evaluate(StatementAdapter.java:36)
	at com.carrotsearch.randomizedtesting.rules.StatementAdapter.evaluate(StatementAdapter.java:36)
	at com.carrotsearch.randomizedtesting.rules.StatementAdapter.evaluate(StatementAdapter.java:36)
	at org.apache.lucene.util.TestRuleAssertionsRequired$1.evaluate(TestRuleAssertionsRequired.java:53)
	at org.apache.lucene.util.TestRuleMarkFailure$1.evaluate(TestRuleMarkFailure.java:47)
	at org.apache.lucene.util.TestRuleIgnoreAfterMaxFailures$1.evaluate(TestRuleIgnoreAfterMaxFailures.java:64)
	at org.apache.lucene.util.TestRuleIgnoreTestSuites$1.evaluate(TestRuleIgnoreTestSuites.java:54)
	at com.carrotsearch.randomizedtesting.rules.StatementAdapter.evaluate(StatementAdapter.java:36)
	at com.carrotsearch.randomizedtesting.ThreadLeakControl$StatementRunner.run(ThreadLeakControl.java:367)
	at java.lang.Thread.run(Thread.java:804)


FAILED:  org.apache.lucene.util.automaton.TestOperations.testGetRandomAcceptedString

Error Message:
source=3 is out of bounds (maxState is 2)

Stack Trace:
java.lang.IllegalArgumentException: source=3 is out of bounds (maxState is 2)
	at __randomizedtesting.SeedInfo.seed([64FE4B52F8B49E63:C181B959110B53F6]:0)
	at org.apache.lucene.util.automaton.Automaton.addTransition(Automaton.java:165)
	at org.apache.lucene.util.automaton.MinimizationOperations.minimize(MinimizationOperations.java:245)
	at org.apache.lucene.util.automaton.RegExp.toAutomatonInternal(RegExp.java:515)
	at org.apache.lucene.util.automaton.RegExp.toAutomaton(RegExp.java:495)
	at org.apache.lucene.util.automaton.RegExp.toAutomaton(RegExp.java:426)
	at org.apache.lucene.util.automaton.TestOperations.testGetRandomAcceptedString(TestOperations.java:91)
	at sun.reflect.NativeMethodAccessorImpl.invoke0(Native Method)
	at sun.reflect.NativeMethodAccessorImpl.invoke(NativeMethodAccessorImpl.java:62)
	at sun.reflect.DelegatingMethodAccessorImpl.invoke(DelegatingMethodAccessorImpl.java:43)
	at java.lang.reflect.Method.invoke(Method.java:520)
	at com.carrotsearch.randomizedtesting.RandomizedRunner.invoke(RandomizedRunner.java:1764)
	at com.carrotsearch.randomizedtesting.RandomizedRunner$8.evaluate(RandomizedRunner.java:871)
	at com.carrotsearch.randomizedtesting.RandomizedRunner$9.evaluate(RandomizedRunner.java:907)
	at com.carrotsearch.randomizedtesting.RandomizedRunner$10.evaluate(RandomizedRunner.java:921)
	at org.apache.lucene.util.TestRuleSetupTeardownChained$1.evaluate(TestRuleSetupTeardownChained.java:49)
	at org.apache.lucene.util.AbstractBeforeAfterRule$1.evaluate(AbstractBeforeAfterRule.java:45)
	at org.apache.lucene.util.TestRuleThreadAndTestName$1.evaluate(TestRuleThreadAndTestName.java:48)
	at org.apache.lucene.util.TestRuleIgnoreAfterMaxFailures$1.evaluate(TestRuleIgnoreAfterMaxFailures.java:64)
	at org.apache.lucene.util.TestRuleMarkFailure$1.evaluate(TestRuleMarkFailure.java:47)
	at com.carrotsearch.randomizedtesting.rules.StatementAdapter.evaluate(StatementAdapter.java:36)
	at com.carrotsearch.randomizedtesting.ThreadLeakControl$StatementRunner.run(ThreadLeakControl.java:367)
	at com.carrotsearch.randomizedtesting.ThreadLeakControl.forkTimeoutingTask(ThreadLeakControl.java:809)
	at com.carrotsearch.randomizedtesting.ThreadLeakControl$3.evaluate(ThreadLeakControl.java:460)
	at com.carrotsearch.randomizedtesting.RandomizedRunner.runSingleTest(RandomizedRunner.java:880)
	at com.carrotsearch.randomizedtesting.RandomizedRunner$5.evaluate(RandomizedRunner.java:781)
	at com.carrotsearch.randomizedtesting.RandomizedRunner$6.evaluate(RandomizedRunner.java:816)
	at com.carrotsearch.randomizedtesting.RandomizedRunner$7.evaluate(RandomizedRunner.java:827)
	at org.apache.lucene.util.AbstractBeforeAfterRule$1.evaluate(AbstractBeforeAfterRule.java:45)
	at com.carrotsearch.randomizedtesting.rules.StatementAdapter.evaluate(StatementAdapter.java:36)
	at org.apache.lucene.util.TestRuleStoreClassName$1.evaluate(TestRuleStoreClassName.java:41)
	at com.carrotsearch.randomizedtesting.rules.NoShadowingOrOverridesOnMethodsRule$1.evaluate(NoShadowingOrOverridesOnMethodsRule.java:40)
	at com.carrotsearch.randomizedtesting.rules.NoShadowingOrOverridesOnMethodsRule$1.evaluate(NoShadowingOrOverridesOnMethodsRule.java:40)
	at com.carrotsearch.randomizedtesting.rules.StatementAdapter.evaluate(StatementAdapter.java:36)
	at com.carrotsearch.randomizedtesting.rules.StatementAdapter.evaluate(StatementAdapter.java:36)
	at com.carrotsearch.randomizedtesting.rules.StatementAdapter.evaluate(StatementAdapter.java:36)
	at org.apache.lucene.util.TestRuleAssertionsRequired$1.evaluate(TestRuleAssertionsRequired.java:53)
	at org.apache.lucene.util.TestRuleMarkFailure$1.evaluate(TestRuleMarkFailure.java:47)
	at org.apache.lucene.util.TestRuleIgnoreAfterMaxFailures$1.evaluate(TestRuleIgnoreAfterMaxFailures.java:64)
	at org.apache.lucene.util.TestRuleIgnoreTestSuites$1.evaluate(TestRuleIgnoreTestSuites.java:54)
	at com.carrotsearch.randomizedtesting.rules.StatementAdapter.evaluate(StatementAdapter.java:36)
	at com.carrotsearch.randomizedtesting.ThreadLeakControl$StatementRunner.run(ThreadLeakControl.java:367)
	at java.lang.Thread.run(Thread.java:804)




Build Log:
[...truncated 1009 lines...]
   [junit4] Suite: org.apache.lucene.search.TestFieldCacheRewriteMethod
   [junit4]   2> NOTE: reproduce with: ant test  -Dtestcase=TestFieldCacheRewriteMethod -Dtests.method=testRegexps -Dtests.seed=64FE4B52F8B49E63 -Dtests.multiplier=3 -Dtests.slow=true -Dtests.locale=pa-Guru-IN -Dtests.timezone=America/Argentina/Jujuy -Dtests.asserts=true -Dtests.file.encoding=ISO-8859-1
   [junit4] FAILURE 0.24s J2 | TestFieldCacheRewriteMethod.testRegexps <<<
   [junit4]    > Throwable #1: junit.framework.AssertionFailedError: Unequal lengths: hits1=0,hits2=2
   [junit4]    > 	at __randomizedtesting.SeedInfo.seed([64FE4B52F8B49E63:85A20A43261EC9EB]:0)
   [junit4]    > 	at junit.framework.Assert.fail(Assert.java:50)
   [junit4]    > 	at org.apache.lucene.search.CheckHits.checkEqual(CheckHits.java:211)
   [junit4]    > 	at org.apache.lucene.search.TestFieldCacheRewriteMethod.assertSame(TestFieldCacheRewriteMethod.java:42)
   [junit4]    > 	at org.apache.lucene.search.TestRegexpRandom2.testRegexps(TestRegexpRandom2.java:160)
   [junit4]    > 	at java.lang.Thread.run(Thread.java:804)
   [junit4]   2> NOTE: test params are: codec=Asserting(Lucene60): {=PostingsFormat(name=MockRandom), field=Lucene50(blocksize=128)}, docValues:{=DocValuesFormat(name=SimpleText), field=DocValuesFormat(name=Asserting)}, sim=RandomSimilarity(queryNorm=false,coord=no): {}, locale=pa-Guru-IN, timezone=America/Argentina/Jujuy
   [junit4]   2> NOTE: Linux 3.19.0-47-generic amd64/Oracle Corporation 9-ea (64-bit)/cpus=12,threads=1,free=473165648,total=508952576
   [junit4]   2> NOTE: All tests run in this JVM: [TestNRTReaderCleanup, TestSparseFixedBitSet, TestNumericTokenStream, TestLucene50TermVectorsFormat, TestMixedCodecs, TestFastDecompressionMode, TestMultiThreadTermVectors, TestMathUtil, TestConcurrentMergeScheduler, TestPhrasePrefixQuery, TestElevationComparator, TestNot, TestIndexCommit, TestTopDocsMerge, TestCharsRef, TestCharsRefBuilder, TestIndexInput, TestFuzzyQuery, TestLucene60PointFormat, TestCharTermAttributeImpl, TestForUtil, TestNoMergeScheduler, TestNearSpansOrdered, TestOfflineSorter, TestSpanContainQuery, TestApproximationSearchEquivalence, TestManyFields, TestWildcard, TestComplexExplanationsOfNonMatches, TestMergeSchedulerExternal, TestDirectoryReader, TestSort, TestAttributeSource, TestTimSorterWorstCase, TestSearch, TestTransactions, TestArrayUtil, TestNRTThreads, TestSloppyPhraseQuery, TestDirectory, TestDirectPacked, TestSpanExplanationsOfNonMatches, TestSortedSetSelector, TestDemo, TestControlledRealTimeReopenThread, TestCodecHoldsOpenFiles, TestSegmentInfos, TestConsistentFieldNumbers, TestPackedTokenAttributeImpl, TestTermsEnum2, TestTotalHitCountCollector, TestMultiMMap, TestDocBoost, TestFrequencyTrackingRingBuffer, TestBlockPostingsFormat, TestForceMergeForever, TestTieredMergePolicy, TestBytesStore, TestConjunctions, TestIndexWriterReader, TestExternalCodecs, TestIndexWriterDeleteByQuery, TestPointValues, TestTwoPhaseCommitTool, TestPointQueries, TestBKD, Test2BSortedDocValuesOrds, TestTermVectors, TestCrashCausesCorruptIndex, TestIndexWriterMerging, TestFSTs, TestNumericRangeQuery64, TestIndexWriterDelete, TestAtomicUpdate, TestLongPostings, TestRollingUpdates, TestIndexWriterUnicode, TestBufferedIndexInput, TestWeakIdentityMap, TestPhraseQuery, TestOmitNorms, TestComplexExplanations, TestRegexpRandom2, TestNRTCachingDirectory, TestSegmentReader, TestIndexWriterNRTIsCurrent, TestFieldCacheRewriteMethod]
   [junit4] Completed [246/411 (1!)] on J2 in 0.28s, 2 tests, 1 failure <<< FAILURES!

[...truncated 412 lines...]
   [junit4] Suite: org.apache.lucene.search.TestDocValuesRewriteMethod
   [junit4]   2> NOTE: reproduce with: ant test  -Dtestcase=TestDocValuesRewriteMethod -Dtests.method=testRegexps -Dtests.seed=64FE4B52F8B49E63 -Dtests.multiplier=3 -Dtests.slow=true -Dtests.locale=ebu-KE -Dtests.timezone=America/Knox_IN -Dtests.asserts=true -Dtests.file.encoding=ISO-8859-1
   [junit4] ERROR   1.26s J0 | TestDocValuesRewriteMethod.testRegexps <<<
   [junit4]    > Throwable #1: java.lang.IllegalArgumentException: source=3 is out of bounds (maxState is 2)
   [junit4]    > 	at __randomizedtesting.SeedInfo.seed([64FE4B52F8B49E63:85A20A43261EC9EB]:0)
   [junit4]    > 	at org.apache.lucene.util.automaton.Automaton.addTransition(Automaton.java:165)
   [junit4]    > 	at org.apache.lucene.util.automaton.MinimizationOperations.minimize(MinimizationOperations.java:245)
   [junit4]    > 	at org.apache.lucene.util.automaton.RegExp.toAutomatonInternal(RegExp.java:537)
   [junit4]    > 	at org.apache.lucene.util.automaton.RegExp.toAutomatonInternal(RegExp.java:535)
   [junit4]    > 	at org.apache.lucene.util.automaton.RegExp.toAutomatonInternal(RegExp.java:535)
   [junit4]    > 	at org.apache.lucene.util.automaton.RegExp.findLeaves(RegExp.java:617)
   [junit4]    > 	at org.apache.lucene.util.automaton.RegExp.findLeaves(RegExp.java:614)
   [junit4]    > 	at org.apache.lucene.util.automaton.RegExp.findLeaves(RegExp.java:614)
   [junit4]    > 	at org.apache.lucene.util.automaton.RegExp.toAutomatonInternal(RegExp.java:521)
   [junit4]    > 	at org.apache.lucene.util.automaton.RegExp.findLeaves(RegExp.java:617)
   [junit4]    > 	at org.apache.lucene.util.automaton.RegExp.toAutomatonInternal(RegExp.java:510)
   [junit4]    > 	at org.apache.lucene.util.automaton.RegExp.toAutomaton(RegExp.java:495)
   [junit4]    > 	at org.apache.lucene.util.automaton.RegExp.toAutomaton(RegExp.java:466)
   [junit4]    > 	at org.apache.lucene.search.RegexpQuery.<init>(RegexpQuery.java:109)
   [junit4]    > 	at org.apache.lucene.search.RegexpQuery.<init>(RegexpQuery.java:79)
   [junit4]    > 	at org.apache.lucene.search.TestDocValuesRewriteMethod.assertSame(TestDocValuesRewriteMethod.java:117)
   [junit4]    > 	at org.apache.lucene.search.TestDocValuesRewriteMethod.testRegexps(TestDocValuesRewriteMethod.java:109)
   [junit4]    > 	at java.lang.Thread.run(Thread.java:804)
   [junit4]   2> NOTE: test params are: codec=Asserting(Lucene60): {=PostingsFormat(name=MockRandom), field=PostingsFormat(name=Memory doPackFST= true), id=Lucene50(blocksize=128)}, docValues:{=DocValuesFormat(name=Lucene54), field=DocValuesFormat(name=Memory)}, sim=RandomSimilarity(queryNorm=true,coord=crazy): {}, locale=ebu-KE, timezone=America/Knox_IN
   [junit4]   2> NOTE: Linux 3.19.0-47-generic amd64/Oracle Corporation 9-ea (64-bit)/cpus=12,threads=1,free=305105992,total=508887040
   [junit4]   2> NOTE: All tests run in this JVM: [TestReadOnlyIndex, TestAutomatonQuery, TestSizeBoundedForceMerge, TestDocCount, TestRecyclingByteBlockAllocator, TestBooleanQueryVisitSubscorers, TestNewestSegment, TestParallelCompositeReader, TestTimeLimitingCollector, TestUnicodeUtil, TestSpanNearQuery, TestTermVectorsWriter, TestSloppyPhraseQuery2, TestMultiset, TestDisjunctionMaxQuery, Test4GBStoredFields, TestTermScorer, TestLSBRadixSorter, TestShardSearching, TestNoMergePolicy, TestPersistentSnapshotDeletionPolicy, TestIndexSearcher, TestLucene53NormsFormat, TestSentinelIntSet, TestIndexWriterForceMerge, TestMultiValuedNumericRangeQuery, TestIndexWriterCommit, TestMinShouldMatch2, TestMixedDocValuesUpdates, TestSimilarityProvider, TestBoostQuery, TestDeletionPolicy, TestFilterLeafReader, TestSpanTermQuery, TestDocValuesIndexing, TestCrash, TestBytesRef, TestTransactionRollback, TestCodecs, TestMultiFields, TestSortRandom, TestMutableValues, TestBinaryTerms, TestSortedSetSortField, FiniteStringsIteratorTest, TestFilterIterator, TestTerm, TestSimilarity2, TestExceedMaxTermLength, TestMaxPosition, TestFieldType, TestInPlaceMergeSorter, TestNativeFSLockFactory, TestDeterminism, TestTermsEnum, TestNoDeletionPolicy, TestIndexWriter, TestFilterDirectoryReader, TestFixedBitSet, TestInfoStream, TestBlockPostingsFormat2, TestStressDeletes, TestQueryBuilder, TestDocInverterPerFieldErrorInfo, TestRegexpRandom, TestSimpleFSLockFactory, TestMergedIterator, TestIndexWriterWithThreads, TestNumericRangeQuery32, TestSearcherManager, TestIndexWriterMergePolicy, TestStressAdvance, TestSearchWithThreads, TestStressIndexing, TestPerFieldPostingsFormat, TestSimpleExplanations, TestLockFactory, TestCollectionUtil, TestSegmentTermDocs, TestMultiDocValues, TestToken, TestSimpleSearchEquivalence, TestBooleanMinShouldMatch, TestIndexWriterOnDiskFull, TestSpans, TestUTF32ToUTF8, TestDocumentsWriterDeleteQueue, TestMultiTermConstantScore, TestSimpleExplanationsOfNonMatches, TestTermVectorsReader, TestIntBlockPool, TestBooleanQuery, TestAllFilesHaveCodecHeader, TestDocument, TestSumDocFreq, TestDocValuesScoring, TestPayloadsOnVectors, TestIndexFileDeleter, TestDateSort, TestVirtualMethod, TestSetOnce, TestDateTools, Test2BPostings, TestCachingCollector, TestRamUsageEstimator, TestIsCurrent, TestAssertions, TestCloseableThreadLocal, TestVersion, TestNGramPhraseQuery, TestTermdocPerf, TestIOUtils, Test2BNumericDocValues, TestReusableStringReader, TestLucene50CompoundFormat, Test2BSortedDocValuesFixedSorted, TestAllFilesCheckIndexHeader, TestAllFilesDetectTruncation, TestAllFilesHaveChecksumFooter, TestBinaryDocValuesUpdates, TestDemoParallelLeafReader, TestDocValues, TestDuelingCodecsAtNight, TestFieldReuse, TestIndexReaderClose, TestIndexWriterExceptions2, TestIndexWriterMaxDocs, TestIndexWriterOnVMError, TestIndexWriterThreadsToSegments, TestLogMergePolicy, TestMergePolicyWrapper, TestMergeRateLimiter, TestMultiTermsEnum, TestNumericDocValuesUpdates, TestTerms, TestTryDelete, TestUpgradeIndexMergePolicy, TestBlendedTermQuery, TestBooleanRewrites, TestDocValuesRewriteMethod]
   [junit4] Completed [372/411 (2!)] on J0 in 1.32s, 2 tests, 1 error <<< FAILURES!

[...truncated 112 lines...]
   [junit4] Suite: org.apache.lucene.util.automaton.TestOperations
   [junit4]   2> NOTE: reproduce with: ant test  -Dtestcase=TestOperations -Dtests.method=testIsFinite -Dtests.seed=64FE4B52F8B49E63 -Dtests.multiplier=3 -Dtests.slow=true -Dtests.locale=fr-TG -Dtests.timezone=Asia/Kuching -Dtests.asserts=true -Dtests.file.encoding=ISO-8859-1
   [junit4] ERROR   0.00s J0 | TestOperations.testIsFinite <<<
   [junit4]    > Throwable #1: java.lang.IllegalArgumentException: source=3 is out of bounds (maxState is 2)
   [junit4]    > 	at __randomizedtesting.SeedInfo.seed([64FE4B52F8B49E63:44C7BA42B4FD41F5]:0)
   [junit4]    > 	at org.apache.lucene.util.automaton.Automaton.addTransition(Automaton.java:165)
   [junit4]    > 	at org.apache.lucene.util.automaton.MinimizationOperations.minimize(MinimizationOperations.java:245)
   [junit4]    > 	at org.apache.lucene.util.automaton.RegExp.toAutomatonInternal(RegExp.java:537)
   [junit4]    > 	at org.apache.lucene.util.automaton.RegExp.toAutomatonInternal(RegExp.java:546)
   [junit4]    > 	at org.apache.lucene.util.automaton.RegExp.findLeaves(RegExp.java:617)
   [junit4]    > 	at org.apache.lucene.util.automaton.RegExp.toAutomatonInternal(RegExp.java:521)
   [junit4]    > 	at org.apache.lucene.util.automaton.RegExp.findLeaves(RegExp.java:617)
   [junit4]    > 	at org.apache.lucene.util.automaton.RegExp.toAutomatonInternal(RegExp.java:512)
   [junit4]    > 	at org.apache.lucene.util.automaton.RegExp.toAutomaton(RegExp.java:495)
   [junit4]    > 	at org.apache.lucene.util.automaton.RegExp.toAutomaton(RegExp.java:426)
   [junit4]    > 	at org.apache.lucene.util.automaton.AutomatonTestUtil.randomSingleAutomaton(AutomatonTestUtil.java:262)
   [junit4]    > 	at org.apache.lucene.util.automaton.AutomatonTestUtil.randomAutomaton(AutomatonTestUtil.java:276)
   [junit4]    > 	at org.apache.lucene.util.automaton.TestOperations.testIsFinite(TestOperations.java:122)
   [junit4]    > 	at java.lang.Thread.run(Thread.java:804)
   [junit4]   2> NOTE: reproduce with: ant test  -Dtestcase=TestOperations -Dtests.method=testGetRandomAcceptedString -Dtests.seed=64FE4B52F8B49E63 -Dtests.multiplier=3 -Dtests.slow=true -Dtests.locale=fr-TG -Dtests.timezone=Asia/Kuching -Dtests.asserts=true -Dtests.file.encoding=ISO-8859-1
   [junit4] ERROR   0.00s J0 | TestOperations.testGetRandomAcceptedString <<<
   [junit4]    > Throwable #1: java.lang.IllegalArgumentException: source=3 is out of bounds (maxState is 2)
   [junit4]    > 	at __randomizedtesting.SeedInfo.seed([64FE4B52F8B49E63:C181B959110B53F6]:0)
   [junit4]    > 	at org.apache.lucene.util.automaton.Automaton.addTransition(Automaton.java:165)
   [junit4]    > 	at org.apache.lucene.util.automaton.MinimizationOperations.minimize(MinimizationOperations.java:245)
   [junit4]    > 	at org.apache.lucene.util.automaton.RegExp.toAutomatonInternal(RegExp.java:515)
   [junit4]    > 	at org.apache.lucene.util.automaton.RegExp.toAutomaton(RegExp.java:495)
   [junit4]    > 	at org.apache.lucene.util.automaton.RegExp.toAutomaton(RegExp.java:426)
   [junit4]    > 	at org.apache.lucene.util.automaton.TestOperations.testGetRandomAcceptedString(TestOperations.java:91)
   [junit4]    > 	at java.lang.Thread.run(Thread.java:804)
   [junit4]   2> NOTE: test params are: codec=Lucene60, sim=ClassicSimilarity, locale=fr-TG, timezone=Asia/Kuching
   [junit4]   2> NOTE: Linux 3.19.0-47-generic amd64/Oracle Corporation 9-ea (64-bit)/cpus=12,threads=1,free=232086176,total=508887040
   [junit4]   2> NOTE: All tests run in this JVM: [TestReadOnlyIndex, TestAutomatonQuery, TestSizeBoundedForceMerge, TestDocCount, TestRecyclingByteBlockAllocator, TestBooleanQueryVisitSubscorers, TestNewestSegment, TestParallelCompositeReader, TestTimeLimitingCollector, TestUnicodeUtil, TestSpanNearQuery, TestTermVectorsWriter, TestSloppyPhraseQuery2, TestMultiset, TestDisjunctionMaxQuery, Test4GBStoredFields, TestTermScorer, TestLSBRadixSorter, TestShardSearching, TestNoMergePolicy, TestPersistentSnapshotDeletionPolicy, TestIndexSearcher, TestLucene53NormsFormat, TestSentinelIntSet, TestIndexWriterForceMerge, TestMultiValuedNumericRangeQuery, TestIndexWriterCommit, TestMinShouldMatch2, TestMixedDocValuesUpdates, TestSimilarityProvider, TestBoostQuery, TestDeletionPolicy, TestFilterLeafReader, TestSpanTermQuery, TestDocValuesIndexing, TestCrash, TestBytesRef, TestTransactionRollback, TestCodecs, TestMultiFields, TestSortRandom, TestMutableValues, TestBinaryTerms, TestSortedSetSortField, FiniteStringsIteratorTest, TestFilterIterator, TestTerm, TestSimilarity2, TestExceedMaxTermLength, TestMaxPosition, TestFieldType, TestInPlaceMergeSorter, TestNativeFSLockFactory, TestDeterminism, TestTermsEnum, TestNoDeletionPolicy, TestIndexWriter, TestFilterDirectoryReader, TestFixedBitSet, TestInfoStream, TestBlockPostingsFormat2, TestStressDeletes, TestQueryBuilder, TestDocInverterPerFieldErrorInfo, TestRegexpRandom, TestSimpleFSLockFactory, TestMergedIterator, TestIndexWriterWithThreads, TestNumericRangeQuery32, TestSearcherManager, TestIndexWriterMergePolicy, TestStressAdvance, TestSearchWithThreads, TestStressIndexing, TestPerFieldPostingsFormat, TestSimpleExplanations, TestLockFactory, TestCollectionUtil, TestSegmentTermDocs, TestMultiDocValues, TestToken, TestSimpleSearchEquivalence, TestBooleanMinShouldMatch, TestIndexWriterOnDiskFull, TestSpans, TestUTF32ToUTF8, TestDocumentsWriterDeleteQueue, TestMultiTermConstantScore, TestSimpleExplanationsOfNonMatches, TestTermVectorsReader, TestIntBlockPool, TestBooleanQuery, TestAllFilesHaveCodecHeader, TestDocument, TestSumDocFreq, TestDocValuesScoring, TestPayloadsOnVectors, TestIndexFileDeleter, TestDateSort, TestVirtualMethod, TestSetOnce, TestDateTools, Test2BPostings, TestCachingCollector, TestRamUsageEstimator, TestIsCurrent, TestAssertions, TestCloseableThreadLocal, TestVersion, TestNGramPhraseQuery, TestTermdocPerf, TestIOUtils, Test2BNumericDocValues, TestReusableStringReader, TestLucene50CompoundFormat, Test2BSortedDocValuesFixedSorted, TestAllFilesCheckIndexHeader, TestAllFilesDetectTruncation, TestAllFilesHaveChecksumFooter, TestBinaryDocValuesUpdates, TestDemoParallelLeafReader, TestDocValues, TestDuelingCodecsAtNight, TestFieldReuse, TestIndexReaderClose, TestIndexWriterExceptions2, TestIndexWriterMaxDocs, TestIndexWriterOnVMError, TestIndexWriterThreadsToSegments, TestLogMergePolicy, TestMergePolicyWrapper, TestMergeRateLimiter, TestMultiTermsEnum, TestNumericDocValuesUpdates, TestTerms, TestTryDelete, TestUpgradeIndexMergePolicy, TestBlendedTermQuery, TestBooleanRewrites, TestDocValuesRewriteMethod, TestEarlyTermination, TestFieldValueQuery, TestMatchNoDocsQuery, TestMultiCollector, TestMultiPhraseEnum, TestNeedsScores, TestQueryCachingPolicy, TestQueryRescorer, TestReqExclBulkScorer, TestSortRescorer, TestSynonymQuery, TestUsageTrackingFilterCachingPolicy, TestBM25Similarity, TestFilterSpans, TestSpanBoostQuery, TestSpanCollection, TestSpanOrQuery, TestBufferedChecksum, TestFilterDirectory, TestMmapDirectory, TestNIOFSDirectory, TestSimpleFSDirectory, TestSingleInstanceLockFactory, TestSleepingLockWrapper, TestTrackingDirectoryWrapper, TestDocIdSetBuilder, TestOperations]
   [junit4] Completed [407/411 (3!)] on J0 in 0.06s, 5 tests, 2 errors <<< FAILURES!

[...truncated 4 lines...]
   [junit4] Suite: org.apache.lucene.util.automaton.TestAutomaton
   [junit4]   1> Original was not minimal:
   [junit4]   1> Original:
   [junit4]   1> digraph Automaton {
   [junit4]   1>   rankdir = LR
   [junit4]   1>   initial [shape=plaintext,label="0"]
   [junit4]   1>   initial -> 0
   [junit4]   1>   0 [shape=circle,label="0"]
   [junit4]   1>   0 -> 1 [label="\\U000000e3"]
   [junit4]   1>   1 [shape=circle,label="1"]
   [junit4]   1>   1 -> 2 [label="\\U0000008c"]
   [junit4]   1>   2 [shape=circle,label="2"]
   [junit4]   1>   2 -> 3 [label="\\U00000097"]
   [junit4]   1>   3 [shape=circle,label="3"]
   [junit4]   1>   3 -> 4 [label="\\U000000e3"]
   [junit4]   1>   4 [shape=circle,label="4"]
   [junit4]   1>   4 -> 5 [label="\\U0000008d"]
   [junit4]   1>   5 [shape=circle,label="5"]
   [junit4]   1>   5 -> 6 [label="\\U00000087"]
   [junit4]   1>   6 [shape=circle,label="6"]
   [junit4]   1>   6 -> 7 [label="\\U000000e3"]
   [junit4]   1>   7 [shape=circle,label="7"]
   [junit4]   1>   7 -> 8 [label="\\U0000008f"]
   [junit4]   1>   8 [shape=circle,label="8"]
   [junit4]   1>   8 -> 9 [label="\\U0000008f"]
   [junit4]   1>   9 [shape=circle,label="9"]
   [junit4]   1>   9 -> 10 [label="\\U000000e3"]
   [junit4]   1>   10 [shape=circle,label="10"]
   [junit4]   1>   10 -> 11 [label="\\U0000008c"]
   [junit4]   1>   11 [shape=circle,label="11"]
   [junit4]   1>   11 -> 12 [label="\\U00000097"]
   [junit4]   1>   12 [shape=circle,label="12"]
   [junit4]   1>   12 -> 13 [label="\\U000000e3"]
   [junit4]   1>   13 [shape=circle,label="13"]
   [junit4]   1>   13 -> 14 [label="\\U0000008d"]
   [junit4]   1>   14 [shape=circle,label="14"]
   [junit4]   1>   14 -> 15 [label="\\U0000008e"]
   [junit4]   1>   15 [shape=circle,label="15"]
   [junit4]   1>   15 -> 16 [label="\\U000000e3"]
   [junit4]   1>   16 [shape=circle,label="16"]
   [junit4]   1>   16 -> 17 [label="\\U0000008c"]
   [junit4]   1>   17 [shape=circle,label="17"]
   [junit4]   1>   17 -> 18 [label="\\U000000b6"]
   [junit4]   1>   18 [shape=circle,label="18"]
   [junit4]   1>   18 -> 19 [label="\\U000000e3"]
   [junit4]   1>   19 [shape=circle,label="19"]
   [junit4]   1>   19 -> 20 [label="\\U0000008c"]
   [junit4]   1>   20 [shape=circle,label="20"]
   [junit4]   1>   20 -> 21 [label="\\U00000086"]
   [junit4]   1>   21 [shape=circle,label="21"]
   [junit4]   1>   21 -> 22 [label="\\U000000e3"]
   [junit4]   1>   22 [shape=circle,label="22"]
   [junit4]   1>   22 -> 23 [label="\\U0000008f"]
   [junit4]   1>   23 [shape=circle,label="23"]
   [junit4]   1>   23 -> 24 [label="\\U00000081"]
   [junit4]   1>   24 [shape=circle,label="24"]
   [junit4]   1>   24 -> 25 [label="\\U000000e3"]
   [junit4]   1>   25 [shape=circle,label="25"]
   [junit4]   1>   25 -> 26 [label="\\U0000008e"]
   [junit4]   1>   26 [shape=circle,label="26"]
   [junit4]   1>   26 -> 27 [label="\\U00000099"]
   [junit4]   1>   27 [shape=circle,label="27"]
   [junit4]   1>   27 -> 28 [label="\\U000000e3"]
   [junit4]   1>   28 [shape=circle,label="28"]
   [junit4]   1>   28 -> 29 [label="\\U0000008e"]
   [junit4]   1>   29 [shape=circle,label="29"]
   [junit4]   1>   29 -> 30 [label="\\U000000bd"]
   [junit4]   1>   30 [shape=circle,label="30"]
   [junit4]   1>   30 -> 31 [label="\\U000000e3"]
   [junit4]   1>   31 [shape=circle,label="31"]
   [junit4]   1>   31 -> 32 [label="\\U0000008d"]
   [junit4]   1>   32 [shape=circle,label="32"]
   [junit4]   1>   32 -> 33 [label="\\U00000091"]
   [junit4]   1>   33 [shape=circle,label="33"]
   [junit4]   1>   33 -> 34 [label="\\U000000e3"]
   [junit4]   1>   34 [shape=circle,label="34"]
   [junit4]   1>   34 -> 35 [label="\\U0000008c"]
   [junit4]   1>   35 [shape=circle,label="35"]
   [junit4]   1>   35 -> 36 [label="\\U000000be"]
   [junit4]   1>   36 [shape=circle,label="36"]
   [junit4]   1>   36 -> 37 [label="\\U000000e3"]
   [junit4]   1>   37 [shape=circle,label="37"]
   [junit4]   1>   37 -> 38 [label="\\U0000008d"]
   [junit4]   1>   38 [shape=circle,label="38"]
   [junit4]   1>   38 -> 39 [label="\\U000000ac"]
   [junit4]   1>   39 [shape=circle,label="39"]
   [junit4]   1>   39 -> 40 [label="\\U000000e3"]
   [junit4]   1>   40 [shape=circle,label="40"]
   [junit4]   1>   40 -> 41 [label="\\U0000008c"]
   [junit4]   1>   41 [shape=circle,label="41"]
   [junit4]   1>   41 -> 42 [label="\\U0000009c"]
   [junit4]   1>   42 [shape=circle,label="42"]
   [junit4]   1>   42 -> 43 [label="\\U000000e3"]
   [junit4]   1>   43 [shape=circle,label="43"]
   [junit4]   1>   43 -> 44 [label="\\U0000008e"]
   [junit4]   1>   44 [shape=circle,label="44"]
   [junit4]   1>   44 -> 45 [label="\\U00000092"]
   [junit4]   1>   45 [shape=circle,label="45"]
   [junit4]   1>   45 -> 46 [label="\\U00000000"]
   [junit4]   1>   46 [shape=circle,label="46"]
   [junit4]   1>   46 -> 47 [label="\\U00000000"]
   [junit4]   1>   47 [shape=circle,label="47"]
   [junit4]   1>   47 -> 48 [label="\\U00000000"]
   [junit4]   1>   48 [shape=circle,label="48"]
   [junit4]   1>   48 -> 49 [label="\\U00000000"]
   [junit4]   1>   49 [shape=circle,label="49"]
   [junit4]   1>   49 -> 50 [label="\\U00000000"]
   [junit4]   1>   50 [shape=doublecircle,label="50"]
   [junit4]   1>   50 -> 51 [label="\\U00000000"]
   [junit4]   1>   51 [shape=doublecircle,label="51"]
   [junit4]   1> }
   [junit4]   1> Minimized:
   [junit4]   1> digraph Automaton {
   [junit4]   1>   rankdir = LR
   [junit4]   1> }
   [junit4]   1> minTerm=[e3 8c 97 e3 8d 87 e3 8f 8f e3 8c 97 e3 8d 8e e3 8c b6 e3 8c 86 e3 8f 81 e3 8e 99 e3 8e bd e3 8d 91 e3 8c be e3 8d ac e3 8c 9c e3 8e 92 0 0 0 0 0] minInclusive=true
   [junit4]   1> maxTerm=[e3 8c 97 e3 8d 87 e3 8f 8f e3 8c 97 e3 8d 8e e3 8c b6 e3 8c 86 e3 8f 81 e3 8e 99 e3 8e bd e3 8d 91 e3 8c be e3 8d ac e3 8c 9c e3 8e 92 0 0 0 0 0 0] maxInclusive=true
   [junit4]   2> NOTE: reproduce with: ant test  -Dtestcase=TestAutomaton -Dtests.method=testMakeBinaryIntervalFiniteCasesRandom -Dtests.seed=64FE4B52F8B49E63 -Dtests.multiplier=3 -Dtests.slow=true -Dtests.locale=da -Dtests.timezone=Asia/Kuching -Dtests.asserts=true -Dtests.file.encoding=ISO-8859-1
   [junit4] FAILURE 0.01s J2 | TestAutomaton.testMakeBinaryIntervalFiniteCasesRandom <<<
   [junit4]    > Throwable #1: java.lang.AssertionError: automaton was not minimal
   [junit4]    > 	at __randomizedtesting.SeedInfo.seed([64FE4B52F8B49E63:1CFF5BAA5B5CA032]:0)
   [junit4]    > 	at org.apache.lucene.util.automaton.TestAutomaton.makeBinaryInterval(TestAutomaton.java:1167)
   [junit4]    > 	at org.apache.lucene.util.automaton.TestAutomaton.testMakeBinaryIntervalFiniteCasesRandom(TestAutomaton.java:1243)
   [junit4]    > 	at java.lang.Thread.run(Thread.java:804)
   [junit4]   1> TEST: FAILED: not same
   [junit4]   1>   terms (count=51):
   [junit4]   1>     [33 35 38 ef b8 84 ef b8 8c ef b8 84 ef b8 81 ef b8 8c ef b8 8b ef b8 88 ef b8 86 ef b8 8f ef b8 8f ef b8 8e ef b8 8b ef b8 84 ef b8 87 ef b8 84 ef b8 85 f0 9d 85 93 f0 9d 85 8d f0 9d 84 b6 f0 9d 87 92 f0 9d 84 b0 f0 9d 87 ac f0 9d 84 9f f0 9d 84 82 e0 bb 89 e0 bb ba e0 ba 98 e0 bb 9f e0 bb 93 e0 ba bd e0 ba b0 e0 bb bd e0 bb a2 e0 bb ba e0 bb 9b e0 bb 9a e0 ba 80 e0 ba a9]
   [junit4]   1>     [33 36 33 ef b8 84 ef b8 8c ef b8 84 ef b8 81 ef b8 8c ef b8 8b ef b8 88 ef b8 86 ef b8 8f ef b8 8f ef b8 8e ef b8 8b ef b8 84 ef b8 87 ef b8 84 ef b8 85 f0 9d 85 93 f0 9d 85 8d f0 9d 84 b6 f0 9d 87 92 f0 9d 84 b0 f0 9d 87 ac f0 9d 84 9f f0 9d 84 82 f0 90 b9 b3 f0 90 b9 b7 f0 90 b9 bf f0 90 b9 b9 f0 90 b9 b4 f0 90 b9 bb f0 90 b9 be f0 90 b9 a2 f0 90 b9 a2 f0 90 b9 b9 f0 90 b9 a3]
   [junit4]   1>     [33 36 35 ef b8 84 ef b8 8c ef b8 84 ef b8 81 ef b8 8c ef b8 8b ef b8 88 ef b8 86 ef b8 8f ef b8 8f ef b8 8e ef b8 8b ef b8 84 ef b8 87 ef b8 84 ef b8 85 f0 9d 85 93 f0 9d 85 8d f0 9d 84 b6 f0 9d 87 92 f0 9d 84 b0 f0 9d 87 ac f0 9d 84 9f f0 9d 84 82 f0 90 b9 b3 f0 90 b9 b7 f0 90 b9 bf f0 90 b9 b9 f0 90 b9 b4 f0 90 b9 bb f0 90 b9 be f0 90 b9 a2 f0 90 b9 a2 f0 90 b9 b9 f0 90 b9 a3]
   [junit4]   1>     [33 36 31 ef b8 84 ef b8 8c ef b8 84 ef b8 81 ef b8 8c ef b8 8b ef b8 88 ef b8 86 ef b8 8f ef b8 8f ef b8 8e ef b8 8b ef b8 84 ef b8 87 ef b8 84 ef b8 85 f0 9d 85 93 f0 9d 85 8d f0 9d 84 b6 f0 9d 87 92 f0 9d 84 b0 f0 9d 87 ac f0 9d 84 9f f0 9d 84 82 f0 90 b9 b3 f0 90 b9 b7 f0 90 b9 bf f0 90 b9 b9 f0 90 b9 b4 f0 90 b9 bb f0 90 b9 be f0 90 b9 a2 f0 90 b9 a2 f0 90 b9 b9 f0 90 b9 a3]
   [junit4]   1>     [33 35 37 ef b8 84 ef b8 8c ef b8 84 ef b8 81 ef b8 8c ef b8 8b ef b8 88 ef b8 86 ef b8 8f ef b8 8f ef b8 8e ef b8 8b ef b8 84 ef b8 87 ef b8 84 ef b8 85 f0 9d 85 93 f0 9d 85 8d f0 9d 84 b6 f0 9d 87 92 f0 9d 84 b0 f0 9d 87 ac f0 9d 84 9f f0 9d 84 82 f0 90 8f 91 f0 90 8f 9a f0 90 8f 9b f0 90 8e bd f0 90 8e b9 f0 90 8e a7 f0 90 8f 81 f0 90 8f 95]
   [junit4]   1>     [33 35 39 ef b8 84 ef b8 8c ef b8 84 ef b8 81 ef b8 8c ef b8 8b ef b8 88 ef b8 86 ef b8 8f ef b8 8f ef b8 8e ef b8 8b ef b8 84 ef b8 87 ef b8 84 ef b8 85 f0 9d 85 93 f0 9d 85 8d f0 9d 84 b6 f0 9d 87 92 f0 9d 84 b0 f0 9d 87 ac f0 9d 84 9f f0 9d 84 82 f0 90 b9 b3 f0 90 b9 b7 f0 90 b9 bf f0 90 b9 b9 f0 90 b9 b4 f0 90 b9 bb f0 90 b9 be f0 90 b9 a2 f0 90 b9 a2 f0 90 b9 b9 f0 90 b9 a3]
   [junit4]   1>     [33 36 33 ef b8 84 ef b8 8c ef b8 84 ef b8 81 ef b8 8c ef b8 8b ef b8 88 ef b8 86 ef b8 8f ef b8 8f ef b8 8e ef b8 8b ef b8 84 ef b8 87 ef b8 84 ef b8 85 f0 9d 85 93 f0 9d 85 8d f0 9d 84 b6 f0 9d 87 92 f0 9d 84 b0 f0 9d 87 ac f0 9d 84 9f f0 9d 84 82 e0 bb 89 e0 bb ba e0 ba 98 e0 bb 9f e0 bb 93 e0 ba bd e0 ba b0 e0 bb bd e0 bb a2 e0 bb ba e0 bb 9b e0 bb 9a e0 ba 80 e0 ba a9]
   [junit4]   1>     [33 35 34 ef b8 84 ef b8 8c ef b8 84 ef b8 81 ef b8 8c ef b8 8b ef b8 88 ef b8 86 ef b8 8f ef b8 8f ef b8 8e ef b8 8b ef b8 84 ef b8 87 ef b8 84 ef b8 85 f0 9d 85 93 f0 9d 85 8d f0 9d 84 b6 f0 9d 87 92 f0 9d 84 b0 f0 9d 87 ac f0 9d 84 9f f0 9d 84 82 e0 bb 89 e0 bb ba e0 ba 98 e0 bb 9f e0 bb 93 e0 ba bd e0 ba b0 e0 bb bd e0 bb a2 e0 bb ba e0 bb 9b e0 bb 9a e0 ba 80 e0 ba a9]
   [junit4]   1>     [33 36 32 ef b8 84 ef b8 8c ef b8 84 ef b8 81 ef b8 8c ef b8 8b ef b8 88 ef b8 86 ef b8 8f ef b8 8f ef b8 8e ef b8 8b ef b8 84 ef b8 87 ef b8 84 ef b8 85 f0 9d 85 93 f0 9d 85 8d f0 9d 84 b6 f0 9d 87 92 f0 9d 84 b0 f0 9d 87 ac f0 9d 84 9f f0 9d 84 82 f0 90 8f 91 f0 90 8f 9a f0 90 8f 9b f0 90 8e bd f0 90 8e b9 f0 90 8e a7 f0 90 8f 81 f0 90 8f 95]
   [junit4]   1>     [33 35 33 ef b8 84 ef b8 8c ef b8 84 ef b8 81 ef b8 8c ef b8 8b ef b8 88 ef b8 86 ef b8 8f ef b8 8f ef b8 8e ef b8 8b ef b8 84 ef b8 87 ef b8 84 ef b8 85 f0 9d 85 93 f0 9d 85 8d f0 9d 84 b6 f0 9d 87 92 f0 9d 84 b0 f0 9d 87 ac f0 9d 84 9f f0 9d 84 82 f0 90 8f 91 f0 90 8f 9a f0 90 8f 9b f0 90 8e bd f0 90 8e b9 f0 90 8e a7 f0 90 8f 81 f0 90 8f 95]
   [junit4]   1>     [33 35 36 ef b8 84 ef b8 8c ef b8 84 ef b8 81 ef b8 8c ef b8 8b ef b8 88 ef b8 86 ef b8 8f ef b8 8f ef b8 8e ef b8 8b ef b8 84 ef b8 87 ef b8 84 ef b8 85 f0 9d 85 93 f0 9d 85 8d f0 9d 84 b6 f0 9d 87 92 f0 9d 84 b0 f0 9d 87 ac f0 9d 84 9f f0 9d 84 82 f0 90 b9 b3 f0 90 b9 b7 f0 90 b9 bf f0 90 b9 b9 f0 90 b9 b4 f0 90 b9 bb f0 90 b9 be f0 90 b9 a2 f0 90 b9 a2 f0 90 b9 b9 f0 90 b9 a3]
   [junit4]   1>     [33 36 35 ef b8 84 ef b8 8c ef b8 84 ef b8 81 ef b8 8c ef b8 8b ef b8 88 ef b8 86 ef b8 8f ef b8 8f ef b8 8e ef b8 8b ef b8 84 ef b8 87 ef b8 84 ef b8 85 f0 9d 85 93 f0 9d 85 8d f0 9d 84 b6 f0 9d 87 92 f0 9d 84 b0 f0 9d 87 ac f0 9d 84 9f f0 9d 84 82 f0 90 8f 91 f0 90 8f 9a f0 90 8f 9b f0 90 8e bd f0 90 8e b9 f0 90 8e a7 f0 90 8f 81 f0 90 8f 95]
   [junit4]   1>     [33 35 39 ef b8 84 ef b8 8c ef b8 84 ef b8 81 ef b8 8c ef b8 8b ef b8 88 ef b8 86 ef b8 8f ef b8 8f ef b8 8e ef b8 8b ef b8 84 ef b8 87 ef b8 84 ef b8 85 f0 9d 85 93 f0 9d 85 8d f0 9d 84 b6 f0 9d 87 92 f0 9d 84 b0 f0 9d 87 ac f0 9d 84 9f f0 9d 84 82 e0 bb 89 e0 bb ba e0 ba 98 e0 bb 9f e0 bb 93 e0 ba bd e0 ba b0 e0 bb bd e0 bb a2 e0 bb ba e0 bb 9b e0 bb 9a e0 ba 80 e0 ba a9]
   [junit4]   1>     [33 35 34 ef b8 84 ef b8 8c ef b8 84 ef b8 81 ef b8 8c ef b8 8b ef b8 88 ef b8 86 ef b8 8f ef b8 8f ef b8 8e ef b8 8b ef b8 84 ef b8 87 ef b8 84 ef b8 85 f0 9d 85 93 f0 9d 85 8d f0 9d 84 b6 f0 9d 87 92 f0 9d 84 b0 f0 9d 87 ac f0 9d 84 9f f0 9d 84 82 f0 90 b9 b3 f0 90 b9 b7 f0 90 b9 bf f0 90 b9 b9 f0 90 b9 b4 f0 90 b9 bb f0 90 b9 be f0 90 b9 a2 f0 90 b9 a2 f0 90 b9 b9 f0 90 b9 a3]
   [junit4]   1>     [33 35 33 ef b8 84 ef b8 8c ef b8 84 ef b8 81 ef b8 8c ef b8 8b ef b8 88 ef b8 86 ef b8 8f ef b8 8f ef b8 8e ef b8 8b ef b8 84 ef b8 87 ef b8 84 ef b8 85 f0 9d 85 93 f0 9d 85 8d f0 9d 84 b6 f0 9d 87 92 f0 9d 84 b0 f0 9d 87 ac f0 9d 84 9f f0 9d 84 82 e0 bb 89 e0 bb ba e0 ba 98 e0 bb 9f e0 bb 93 e0 ba bd e0 ba b0 e0 bb bd e0 bb a2 e0 bb ba e0 bb 9b e0 bb 9a e0 ba 80 e0 ba a9]
   [junit4]   1>     [33 35 33 ef b8 84 ef b8 8c ef b8 84 ef b8 81 ef b8 8c ef b8 8b ef b8 88 ef b8 86 ef b8 8f ef b8 8f ef b8 8e ef b8 8b ef b8 84 ef b8 87 ef b8 84 ef b8 85 f0 9d 85 93 f0 9d 85 8d f0 9d 84 b6 f0 9d 87 92 f0 9d 84 b0 f0 9d 87 ac f0 9d 84 9f f0 9d 84 82 f0 90 b9 b3 f0 90 b9 b7 f0 90 b9 bf f0 90 b9 b9 f0 90 b9 b4 f0 90 b9 bb f0 90 b9 be f0 90 b9 a2 f0 90 b9 a2 f0 90 b9 b9 f0 90 b9 a3]
   [junit4]   1>     [33 36 32 ef b8 84 ef b8 8c ef b8 84 ef b8 81 ef b8 8c ef b8 8b ef b8 88 ef b8 86 ef b8 8f ef b8 8f ef b8 8e ef b8 8b ef b8 84 ef b8 87 ef b8 84 ef b8 85 f0 9d 85 93 f0 9d 85 8d f0 9d 84 b6 f0 9d 87 92 f0 9d 84 b0 f0 9d 87 ac f0 9d 84 9f f0 9d 84 82 e0 bb 89 e0 bb ba e0 ba 98 e0 bb 9f e0 bb 93 e0 ba bd e0 ba b0 e0 bb bd e0 bb a2 e0 bb ba e0 bb 9b e0 bb 9a e0 ba 80 e0 ba a9]
   [junit4]   1>     [33 36 30 ef b8 84 ef b8 8c ef b8 84 ef b8 81 ef b8 8c ef b8 8b ef b8 88 ef b8 86 ef b8 8f ef b8 8f ef b8 8e ef b8 8b ef b8 84 ef b8 87 ef b8 84 ef b8 85 f0 9d 85 93 f0 9d 85 8d f0 9d 84 b6 f0 9d 87 92 f0 9d 84 b0 f0 9d 87 ac f0 9d 84 9f f0 9d 84 82 f0 90 b9 b3 f0 90 b9 b7 f0 90 b9 bf f0 90 b9 b9 f0 90 b9 b4 f0 90 b9 bb f0 90 b9 be f0 90 b9 a2 f0 90 b9 a2 f0 90 b9 b9 f0 90 b9 a3]
   [junit4]   1>     [33 35 38 ef b8 84 ef b8 8c ef b8 84 ef b8 81 ef b8 8c ef b8 8b ef b8 88 ef b8 86 ef b8 8f ef b8 8f ef b8 8e ef b8 8b ef b8 84 ef b8 87 ef b8 84 ef b8 85 f0 9d 85 93 f0 9d 85 8d f0 9d 84 b6 f0 9d 87 92 f0 9d 84 b0 f0 9d 87 ac f0 9d 84 9f f0 9d 84 82 f0 90 b9 b3 f0 90 b9 b7 f0 90 b9 bf f0 90 b9 b9 f0 90 b9 b4 f0 90 b9 bb f0 90 b9 be f0 90 b9 a2 f0 90 b9 a2 f0 90 b9 b9 f0 90 b9 a3]
   [junit4]   1>     [e2 b5 95 e2 b5 9e e2 b4 b7 e2 b5 bf e2 b5 96 e2 b5 a7 e2 b5 b3 e2 b5 94 e2 b5 99 e2 b5 8b ef b8 84 ef b8 8c ef b8 84 ef b8 81 ef b8 8c ef b8 8b ef b8 88 ef b8 86 ef b8 8f ef b8 8f ef b8 8e ef b8 8b ef b8 84 ef b8 87 ef b8 84 ef b8 85 f0 9d 85 93 f0 9d 85 8d f0 9d 84 b6 f0 9d 87 92 f0 9d 84 b0 f0 9d 87 ac f0 9d 84 9f f0 9d 84 82 f0 90 b9 b3 f0 90 b9 b7 f0 90 b9 bf f0 90 b9 b9 f0 90 b9 b4 f0 90 b9 bb f0 90 b9 be f0 90 b9 a2 f0 90 b9 a2 f0 90 b9 b9 f0 90 b9 a3]
   [junit4]   1>     [33 36 34 ef b8 84 ef b8 8c ef b8 84 ef b8 81 ef b8 8c ef b8 8b ef b8 88 ef b8 86 ef b8 8f ef b8 8f ef b8 8e ef b8 8b ef b8 84 ef b8 87 ef b8 84 ef b8 85 f0 9d 85 93 f0 9d 85 8d f0 9d 84 b6 f0 9d 87 92 f0 9d 84 b0 f0 9d 87 ac f0 9d 84 9f f0 9d 84 82 f0 90 8f 91 f0 90 8f 9a f0 90 8f 9b f0 90 8e bd f0 90 8e b9 f0 90 8e a7 f0 90 8f 81 f0 90 8f 95]
   [junit4]   1>     [33 36 32 ef b8 84 ef b8 8c ef b8 84 ef b8 81 ef b8 8c ef b8 8b ef b8 88 ef b8 86 ef b8 8f ef b8 8f ef b8 8e ef b8 8b ef b8 84 ef b8 87 ef b8 84 ef b8 85 f0 9d 85 93 f0 9d 85 8d f0 9d 84 b6 f0 9d 87 92 f0 9d 84 b0 f0 9d 87 ac f0 9d 84 9f f0 9d 84 82 f0 90 b9 b3 f0 90 b9 b7 f0 90 b9 bf f0 90 b9 b9 f0 90 b9 b4 f0 90 b9 bb f0 90 b9 be f0 90 b9 a2 f0 90 b9 a2 f0 90 b9 b9 f0 90 b9 a3]
   [junit4]   1>     [33 35 36 ef b8 84 ef b8 8c ef b8 84 ef b8 81 ef b8 8c ef b8 8b ef b8 88 ef b8 86 ef b8 8f ef b8 8f ef b8 8e ef b8 8b ef b8 84 ef b8 87 ef b8 84 ef b8 85 f0 9d 85 93 f0 9d 85 8d f0 9d 84 b6 f0 9d 87 92 f0 9d 84 b0 f0 9d 87 ac f0 9d 84 9f f0 9d 84 82 e0 bb 89 e0 bb ba e0 ba 98 e0 bb 9f e0 bb 93 e0 ba bd e0 ba b0 e0 bb bd e0 bb a2 e0 bb ba e0 bb 9b e0 bb 9a e0 ba 80 e0 ba a9]
   [junit4]   1>     [f0 9d 85 93 f0 9d 85 8d f0 9d 84 b6 f0 9d 87 92 f0 9d 84 b0 f0 9d 87 ac f0 9d 84 9f f0 9d 84 82 e0 bb 89 e0 bb ba e0 ba 98 e0 bb 9f e0 bb 93 e0 ba bd e0 ba b0 e0 bb bd e0 bb a2 e0 bb ba e0 bb 9b e0 bb 9a e0 ba 80 e0 ba a9]
   [junit4]   1>     [e2 b5 95 e2 b5 9e e2 b4 b7 e2 b5 bf e2 b5 96 e2 b5 a7 e2 b5 b3 e2 b5 94 e2 b5 99 e2 b5 8b ef b8 84 ef b8 8c ef b8 84 ef b8 81 ef b8 8c ef b8 8b ef b8 88 ef b8 86 ef b8 8f ef b8 8f ef b8 8e ef b8 8b ef b8 84 ef b8 87 ef b8 84 ef b8 85 f0 9d 85 93 f0 9d 85 8d f0 9d 84 b6 f0 9d 87 92 f0 9d 84 b0 f0 9d 87 ac f0 9d 84 9f f0 9d 84 82 e0 bb 89 e0 bb ba e0 ba 98 e0 bb 9f e0 bb 93 e0 ba bd e0 ba b0 e0 bb bd e0 bb a2 e0 bb ba e0 bb 9b e0 bb 9a e0 ba 80 e0 ba a9]
   [junit4]   1>     [33 36 31 ef b8 84 ef b8 8c ef b8 84 ef b8 81 ef b8 8c ef b8 8b ef b8 88 ef b8 86 ef b8 8f ef b8 8f ef b8 8e ef b8 8b ef b8 84 ef b8 87 ef b8 84 ef b8 85 f0 9d 85 93 f0 9d 85 8d f0 9d 84 b6 f0 9d 87 92 f0 9d 84 b0 f0 9d 87 ac f0 9d 84 9f f0 9d 84 82 e0 bb 89 e0 bb ba e0 ba 98 e0 bb 9f e0 bb 93 e0 ba bd e0 ba b0 e0 bb bd e0 bb a2 e0 bb ba e0 bb 9b e0 bb 9a e0 ba 80 e0 ba a9]
   [junit4]   1>     [33 35 32 ef b8 84 ef b8 8c ef b8 84 ef b8 81 ef b8 8c ef b8 8b ef b8 88 ef b8 86 ef b8 8f ef b8 8f ef b8 8e ef b8 8b ef b8 84 ef b8 87 ef b8 84 ef b8 85 f0 9d 85 93 f0 9d 85 8d f0 9d 84 b6 f0 9d 87 92 f0 9d 84 b0 f0 9d 87 ac f0 9d 84 9f f0 9d 84 82 f0 90 8f 91 f0 90 8f 9a f0 90 8f 9b f0 90 8e bd f0 90 8e b9 f0 90 8e a7 f0 90 8f 81 f0 90 8f 95]
   [junit4]   1>     [33 36 33 ef b8 84 ef b8 8c ef b8 84 ef b8 81 ef b8 8c ef b8 8b ef b8 88 ef b8 86 ef b8 8f ef b8 8f ef b8 8e ef b8 8b ef b8 84 ef b8 87 ef b8 84 ef b8 85 f0 9d 85 93 f0 9d 85 8d f0 9d 84 b6 f0 9d 87 92 f0 9d 84 b0 f0 9d 87 ac f0 9d 84 9f f0 9d 84 82 f0 90 8f 91 f0 90 8f 9a f0 90 8f 9b f0 90 8e bd f0 90 8e b9 f0 90 8e a7 f0 90 8f 81 f0 90 8f 95]
   [junit4]   1>     [f0 9d 85 93 f0 9d 85 8d f0 9d 84 b6 f0 9d 87 92 f0 9d 84 b0 f0 9d 87 ac f0 9d 84 9f f0 9d 84 82 f0 90 8f 91 f0 90 8f 9a f0 90 8f 9b f0 90 8e bd f0 90 8e b9 f0 90 8e a7 f0 90 8f 81 f0 90 8f 95]
   [junit4]   1>     [33 35 39 ef b8 84 ef b8 8c ef b8 84 ef b8 81 ef b8 8c ef b8 8b ef b8 88 ef b8 86 ef b8 8f ef b8 8f ef b8 8e ef b8 8b ef b8 84 ef b8 87 ef b8 84 ef b8 85 f0 9d 85 93 f0 9d 85 8d f0 9d 84 b6 f0 9d 87 92 f0 9d 84 b0 f0 9d 87 ac f0 9d 84 9f f0 9d 84 82 f0 90 8f 91 f0 90 8f 9a f0 90 8f 9b f0 90 8e bd f0 90 8e b9 f0 90 8e a7 f0 90 8f 81 f0 90 8f 95]
   [junit4]   1>     [e2 b5 95 e2 b5 9e e2 b4 b7 e2 b5 bf e2 b5 96 e2 b5 a7 e2 b5 b3 e2 b5 94 e2 b5 99 e2 b5 8b ef b8 84 ef b8 8c ef b8 84 ef b8 81 ef b8 8c ef b8 8b ef b8 88 ef b8 86 ef b8 8f ef b8 8f ef b8 8e ef b8 8b ef b8 84 ef b8 87 ef b8 84 ef b8 85 f0 9d 85 93 f0 9d 85 8d f0 9d 84 b6 f0 9d 87 92 f0 9d 84 b0 f0 9d 87 ac f0 9d 84 9f f0 9d 84 82 f0 90 8f 91 f0 90 8f 9a f0 90 8f 9b f0 90 8e bd f0 90 8e b9 f0 90 8e a7 f0 90 8f 81 f0 90 8f 95]
   [junit4]   1>     [33 36 30 ef b8 84 ef b8 8c ef b8 84 ef b8 81 ef b8 8c ef b8 8b ef b8 88 ef b8 86 ef b8 8f ef b8 8f ef b8 8e ef b8 8b ef b8 84 ef b8 87 ef b8 84 ef b8 85 f0 9d 85 93 f0 9d 85 8d f0 9d 84 b6 f0 9d 87 92 f0 9d 84 b0 f0 9d 87 ac f0 9d 84 9f f0 9d 84 82 f0 90 8f 91 f0 90 8f 9a f0 90 8f 9b f0 90 8e bd f0 90 8e b9 f0 90 8e a7 f0 90 8f 81 f0 90 8f 95]
   [junit4]   1>     [33 35 34 ef b8 84 ef b8 8c ef b8 84 ef b8 81 ef b8 8c ef b8 8b ef b8 88 ef b8 86 ef b8 8f ef b8 8f ef b8 8e ef b8 8b ef b8 84 ef b8 87 ef b8 84 ef b8 85 f0 9d 85 93 f0 9d 85 8d f0 9d 84 b6 f0 9d 87 92 f0 9d 84 b0 f0 9d 87 ac f0 9d 84 9f f0 9d 84 82 f0 90 8f 91 f0 90 8f 9a f0 90 8f 9b f0 90 8e bd f0 90 8e b9 f0 90 8e a7 f0 90 8f 81 f0 90 8f 95]
   [junit4]   1>     [33 36 35 ef b8 84 ef b8 8c ef b8 84 ef b8 81 ef b8 8c ef b8 8b ef b8 88 ef b8 86 ef b8 8f ef b8 8f ef b8 8e ef b8 8b ef b8 84 ef b8 87 ef b8 84 ef b8 85 f0 9d 85 93 f0 9d 85 8d f0 9d 84 b6 f0 9d 87 92 f0 9d 84 b0 f0 9d 87 ac f0 9d 84 9f f0 9d 84 82 e0 bb 89 e0 bb ba e0 ba 98 e0 bb 9f e0 bb 93 e0 ba bd e0 ba b0 e0 bb bd e0 bb a2 e0 bb ba e0 bb 9b e0 bb 9a e0 ba 80 e0 ba a9]
   [junit4]   1>     [33 36 34 ef b8 84 ef b8 8c ef b8 84 ef b8 81 ef b8 8c ef b8 8b ef b8 88 ef b8 86 ef b8 8f ef b8 8f ef b8 8e ef b8 8b ef b8 84 ef b8 87 ef b8 84 ef b8 85 f0 9d 85 93 f0 9d 85 8d f0 9d 84 b6 f0 9d 87 92 f0 9d 84 b0 f0 9d 87 ac f0 9d 84 9f f0 9d 84 82 e0 bb 89 e0 bb ba e0 ba 98 e0 bb 9f e0 bb 93 e0 ba bd e0 ba b0 e0 bb bd e0 bb a2 e0 bb ba e0 bb 9b e0 bb 9a e0 ba 80 e0 ba a9]
   [junit4]   1>     [33 35 32 ef b8 84 ef b8 8c ef b8 84 ef b8 81 ef b8 8c ef b8 8b ef b8 88 ef b8 86 ef b8 8f ef b8 8f ef b8 8e ef b8 8b ef b8 84 ef b8 87 ef b8 84 ef b8 85 f0 9d 85 93 f0 9d 85 8d f0 9d 84 b6 f0 9d 87 92 f0 9d 84 b0 f0 9d 87 ac f0 9d 84 9f f0 9d 84 82 e0 bb 89 e0 bb ba e0 ba 98 e0 bb 9f e0 bb 93 e0 ba bd e0 ba b0 e0 bb bd e0 bb a2 e0 bb ba e0 bb 9b e0 bb 9a e0 ba 80 e0 ba a9]
   [junit4]   1>     [33 36 31 ef b8 84 ef b8 8c ef b8 84 ef b8 81 ef b8 8c ef b8 8b ef b8 88 ef b8 86 ef b8 8f ef b8 8f ef b8 8e ef b8 8b ef b8 84 ef b8 87 ef b8 84 ef b8 85 f0 9d 85 93 f0 9d 85 8d f0 9d 84 b6 f0 9d 87 92 f0 9d 84 b0 f0 9d 87 ac f0 9d 84 9f f0 9d 84 82 f0 90 8f 91 f0 90 8f 9a f0 90 8f 9b f0 90 8e bd f0 90 8e b9 f0 90 8e a7 f0 90 8f 81 f0 90 8f 95]
   [junit4]   1>     [33 35 36 ef b8 84 ef b8 8c ef b8 84 ef b8 81 ef b8 8c ef b8 8b ef b8 88 ef b8 86 ef b8 8f ef b8 8f ef b8 8e ef b8 8b ef b8 84 ef b8 87 ef b8 84 ef b8 85 f0 9d 85 93 f0 9d 85 8d f0 9d 84 b6 f0 9d 87 92 f0 9d 84 b0 f0 9d 87 ac f0 9d 84 9f f0 9d 84 82 f0 90 8f 91 f0 90 8f 9a f0 90 8f 9b f0 90 8e bd f0 90 8e b9 f0 90 8e a7 f0 90 8f 81 f0 90 8f 95]
   [junit4]   1>     [33 35 37 ef b8 84 ef b8 8c ef b8 84 ef b8 81 ef b8 8c ef b8 8b ef b8 88 ef b8 86 ef b8 8f ef b8 8f ef b8 8e ef b8 8b ef b8 84 ef b8 87 ef b8 84 ef b8 85 f0 9d 85 93 f0 9d 85 8d f0 9d 84 b6 f0 9d 87 92 f0 9d 84 b0 f0 9d 87 ac f0 9d 84 9f f0 9d 84 82 e0 bb 89 e0 bb ba e0 ba 98 e0 bb 9f e0 bb 93 e0 ba bd e0 ba b0 e0 bb bd e0 bb a2 e0 bb ba e0 bb 9b e0 bb 9a e0 ba 80 e0 ba a9]
   [junit4]   1>     [33 35 35 ef b8 84 ef b8 8c ef b8 84 ef b8 81 ef b8 8c ef b8 8b ef b8 88 ef b8 86 ef b8 8f ef b8 8f ef b8 8e ef b8 8b ef b8 84 ef b8 87 ef b8 84 ef b8 85 f0 9d 85 93 f0 9d 85 8d f0 9d 84 b6 f0 9d 87 92 f0 9d 84 b0 f0 9d 87 ac f0 9d 84 9f f0 9d 84 82 f0 90 b9 b3 f0 90 b9 b7 f0 90 b9 bf f0 90 b9 b9 f0 90 b9 b4 f0 90 b9 bb f0 90 b9 be f0 90 b9 a2 f0 90 b9 a2 f0 90 b9 b9 f0 90 b9 a3]
   [junit4]   1>     [33 35 37 ef b8 84 ef b8 8c ef b8 84 ef b8 81 ef b8 8c ef b8 8b ef b8 88 ef b8 86 ef b8 8f ef b8 8f ef b8 8e ef b8 8b ef b8 84 ef b8 87 ef b8 84 ef b8 85 f0 9d 85 93 f0 9d 85 8d f0 9d 84 b6 f0 9d 87 92 f0 9d 84 b0 f0 9d 87 ac f0 9d 84 9f f0 9d 84 82 f0 90 b9 b3 f0 90 b9 b7 f0 90 b9 bf f0 90 b9 b9 f0 90 b9 b4 f0 90 b9 bb f0 90 b9 be f0 90 b9 a2 f0 90 b9 a2 f0 90 b9 b9 f0 90 b9 a3]
   [junit4]   1>     [33 35 35 ef b8 84 ef b8 8c ef b8 84 ef b8 81 ef b8 8c ef b8 8b ef b8 88 ef b8 86 ef b8 8f ef b8 8f ef b8 8e ef b8 8b ef b8 84 ef b8 87 ef b8 84 ef b8 85 f0 9d 85 93 f0 9d 85 8d f0 9d 84 b6 f0 9d 87 92 f0 9d 84 b0 f0 9d 87 ac f0 9d 84 9f f0 9d 84 82 f0 90 8f 91 f0 90 8f 9a f0 90 8f 9b f0 90 8e bd f0 90 8e b9 f0 90 8e a7 f0 90 8f 81 f0 90 8f 95]
   [junit4]   1>     [33 36 30 ef b8 84 ef b8 8c ef b8 84 ef b8 81 ef b8 8c ef b8 8b ef b8 88 ef b8 86 ef b8 8f ef b8 8f ef b8 8e ef b8 8b ef b8 84 ef b8 87 ef b8 84 ef b8 85 f0 9d 85 93 f0 9d 85 8d f0 9d 84 b6 f0 9d 87 92 f0 9d 84 b0 f0 9d 87 ac f0 9d 84 9f f0 9d 84 82 e0 bb 89 e0 bb ba e0 ba 98 e0 bb 9f e0 bb 93 e0 ba bd e0 ba b0 e0 bb bd e0 bb a2 e0 bb ba e0 bb 9b e0 bb 9a e0 ba 80 e0 ba a9]
   [junit4]   1>     [33 35 35 ef b8 84 ef b8 8c ef b8 84 ef b8 81 ef b8 8c ef b8 8b ef b8 88 ef b8 86 ef b8 8f ef b8 8f ef b8 8e ef b8 8b ef b8 84 ef b8 87 ef b8 84 ef b8 85 f0 9d 85 93 f0 9d 85 8d f0 9d 84 b6 f0 9d 87 92 f0 9d 84 b0 f0 9d 87 ac f0 9d 84 9f f0 9d 84 82 e0 bb 89 e0 bb ba e0 ba 98 e0 bb 9f e0 bb 93 e0 ba bd e0 ba b0 e0 bb bd e0 bb a2 e0 bb ba e0 bb 9b e0 bb 9a e0 ba 80 e0 ba a9]
   [junit4]   1>     [33 35 31 ef b8 84 ef b8 8c ef b8 84 ef b8 81 ef b8 8c ef b8 8b ef b8 88 ef b8 86 ef b8 8f ef b8 8f ef b8 8e ef b8 8b ef b8 84 ef b8 87 ef b8 84 ef b8 85 f0 9d 85 93 f0 9d 85 8d f0 9d 84 b6 f0 9d 87 92 f0 9d 84 b0 f0 9d 87 ac f0 9d 84 9f f0 9d 84 82 f0 90 8f 91 f0 90 8f 9a f0 90 8f 9b f0 90 8e bd f0 90 8e b9 f0 90 8e a7 f0 90 8f 81 f0 90 8f 95]
   [junit4]   1>     [33 35 31 ef b8 84 ef b8 8c ef b8 84 ef b8 81 ef b8 8c ef b8 8b ef b8 88 ef b8 86 ef b8 8f ef b8 8f ef b8 8e ef b8 8b ef b8 84 ef b8 87 ef b8 84 ef b8 85 f0 9d 85 93 f0 9d 85 8d f0 9d 84 b6 f0 9d 87 92 f0 9d 84 b0 f0 9d 87 ac f0 9d 84 9f f0 9d 84 82 e0 bb 89 e0 bb ba e0 ba 98 e0 bb 9f e0 bb 93 e0 ba bd e0 ba b0 e0 bb bd e0 bb a2 e0 bb ba e0 bb 9b e0 bb 9a e0 ba 80 e0 ba a9]
   [junit4]   1>     [33 35 38 ef b8 84 ef b8 8c ef b8 84 ef b8 81 ef b8 8c ef b8 8b ef b8 88 ef b8 86 ef b8 8f ef b8 8f ef b8 8e ef b8 8b ef b8 84 ef b8 87 ef b8 84 ef b8 85 f0 9d 85 93 f0 9d 85 8d f0 9d 84 b6 f0 9d 87 92 f0 9d 84 b0 f0 9d 87 ac f0 9d 84 9f f0 9d 84 82 f0 90 8f 91 f0 90 8f 9a f0 90 8f 9b f0 90 8e bd f0 90 8e b9 f0 90 8e a7 f0 90 8f 81 f0 90 8f 95]
   [junit4]   1>     [33 36 34 ef b8 84 ef b8 8c ef b8 84 ef b8 81 ef b8 8c ef b8 8b ef b8 88 ef b8 86 ef b8 8f ef b8 8f ef b8 8e ef b8 8b ef b8 84 ef b8 87 ef b8 84 ef b8 85 f0 9d 85 93 f0 9d 85 8d f0 9d 84 b6 f0 9d 87 92 f0 9d 84 b0 f0 9d 87 ac f0 9d 84 9f f0 9d 84 82 f0 90 b9 b3 f0 90 b9 b7 f0 90 b9 bf f0 90 b9 b9 f0 90 b9 b4 f0 90 b9 bb f0 90 b9 be f0 90 b9 a2 f0 90 b9 a2 f0 90 b9 b9 f0 90 b9 a3]
   [junit4]   1>     [33 35 32 ef b8 84 ef b8 8c ef b8 84 ef b8 81 ef b8 8c ef b8 8b ef b8 88 ef b8 86 ef b8 8f ef b8 8f ef b8 8e ef b8 8b ef b8 84 ef b8 87 ef b8 84 ef b8 85 f0 9d 85 93 f0 9d 85 8d f0 9d 84 b6 f0 9d 87 92 f0 9d 84 b0 f0 9d 87 ac f0 9d 84 9f f0 9d 84 82 f0 90 b9 b3 f0 90 b9 b7 f0 90 b9 bf f0 90 b9 b9 f0 90 b9 b4 f0 90 b9 bb f0 90 b9 be f0 90 b9 a2 f0 90 b9 a2 f0 90 b9 b9 f0 90 b9 a3]
   [junit4]   1>     [33 35 31 ef b8 84 ef b8 8c ef b8 84 ef b8 81 ef b8 8c ef b8 8b ef b8 88 ef b8 86 ef b8 8f ef b8 8f ef b8 8e ef b8 8b ef b8 84 ef b8 87 ef b8 84 ef b8 85 f0 9d 85 93 f0 9d 85 8d f0 9d 84 b6 f0 9d 87 92 f0 9d 84 b0 f0 9d 87 ac f0 9d 84 9f f0 9d 84 82 f0 90 b9 b3 f0 90 b9 b7 f0 90 b9 bf f0 90 b9 b9 f0 90 b9 b4 f0 90 b9 bb f0 90 b9 be f0 90 b9 a2 f0 90 b9 a2 f0 90 b9 b9 f0 90 b9 a3]
   [junit4]   1>     [f0 9d 85 93 f0 9d 85 8d f0 9d 84 b6 f0 9d 87 92 f0 9d 84 b0 f0 9d 87 ac f0 9d 84 9f f0 9d 84 82 f0 90 b9 b3 f0 90 b9 b7 f0 90 b9 bf f0 90 b9 b9 f0 90 b9 b4 f0 90 b9 bb f0 90 b9 be f0 90 b9 a2 f0 90 b9 a2 f0 90 b9 b9 f0 90 b9 a3]
   [junit4]   1>   automaton:
   [junit4]   1> digraph Automaton {
   [junit4]   1>   rankdir = LR
   [junit4]   1> }
   [junit4]   2> NOTE: reproduce with: ant test  -Dtestcase=TestAutomaton -Dtests.method=testRandomFinite -Dtests.seed=64FE4B52F8B49E63 -Dtests.multiplier=3 -Dtests.slow=true -Dtests.locale=da -Dtests.timezone=Asia/Kuching -Dtests.asserts=true -Dtests.file.encoding=ISO-8859-1
   [junit4] FAILURE 0.14s J2 | TestAutomaton.testRandomFinite <<<
   [junit4]    > Throwable #1: java.lang.AssertionError: failed to accept term=358︄︌︄︁︌︋︈︆️️︎︋︄︇︄︅𝅓𝅍𝄶𝇒𝄰𝇬𝄟𝄂້໺ຘໟ໓ຽະ໽໢໺໛໚຀ຩ
   [junit4]    > 	at __randomizedtesting.SeedInfo.seed([64FE4B52F8B49E63:23482D6F4724FB42]:0)
   [junit4]    > 	at org.apache.lucene.util.automaton.TestAutomaton.assertSame(TestAutomaton.java:1087)
   [junit4]    > 	at org.apache.lucene.util.automaton.TestAutomaton.testRandomFinite(TestAutomaton.java:1031)
   [junit4]    > 	at java.lang.Thread.run(Thread.java:804)
   [junit4]   2> NOTE: test params are: codec=Asserting(Lucene60), sim=ClassicSimilarity, locale=da, timezone=Asia/Kuching
   [junit4]   2> NOTE: Linux 3.19.0-47-generic amd64/Oracle Corporation 9-ea (64-bit)/cpus=12,threads=1,free=356107664,total=508952576
   [junit4]   2> NOTE: All tests run in this JVM: [TestNRTReaderCleanup, TestSparseFixedBitSet, TestNumericTokenStream, TestLucene50TermVectorsFormat, TestMixedCodecs, TestFastDecompressionMode, TestMultiThreadTermVectors, TestMathUtil, TestConcurrentMergeScheduler, TestPhrasePrefixQuery, TestElevationComparator, TestNot, TestIndexCommit, TestTopDocsMerge, TestCharsRef, TestCharsRefBuilder, TestIndexInput, TestFuzzyQuery, TestLucene60PointFormat, TestCharTermAttributeImpl, TestForUtil, TestNoMergeScheduler, TestNearSpansOrdered, TestOfflineSorter, TestSpanContainQuery, TestApproximationSearchEquivalence, TestManyFields, TestWildcard, TestComplexExplanationsOfNonMatches, TestMergeSchedulerExternal, TestDirectoryReader, TestSort, TestAttributeSource, TestTimSorterWorstCase, TestSearch, TestTransactions, TestArrayUtil, TestNRTThreads, TestSloppyPhraseQuery, TestDirectory, TestDirectPacked, TestSpanExplanationsOfNonMatches, TestSortedSetSelector, TestDemo, TestControlledRealTimeReopenThread, TestCodecHoldsOpenFiles, TestSegmentInfos, TestConsistentFieldNumbers, TestPackedTokenAttributeImpl, TestTermsEnum2, TestTotalHitCountCollector, TestMultiMMap, TestDocBoost, TestFrequencyTrackingRingBuffer, TestBlockPostingsFormat, TestForceMergeForever, TestTieredMergePolicy, TestBytesStore, TestConjunctions, TestIndexWriterReader, TestExternalCodecs, TestIndexWriterDeleteByQuery, TestPointValues, TestTwoPhaseCommitTool, TestPointQueries, TestBKD, Test2BSortedDocValuesOrds, TestTermVectors, TestCrashCausesCorruptIndex, TestIndexWriterMerging, TestFSTs, TestNumericRangeQuery64, TestIndexWriterDelete, TestAtomicUpdate, TestLongPostings, TestRollingUpdates, TestIndexWriterUnicode, TestBufferedIndexInput, TestWeakIdentityMap, TestPhraseQuery, TestOmitNorms, TestComplexExplanations, TestRegexpRandom2, TestNRTCachingDirectory, TestSegmentReader, TestIndexWriterNRTIsCurrent, TestFieldCacheRewriteMethod, TestPagedBytes, TestCustomSearcherSort, TestDeterminizeLexicon, TestCustomNorms, TestStressIndexing2, TestMultiPhraseQuery, TestBytesRefHash, TestForTooMuchCloning, TestDoc, TestRegexpQuery, TestPerSegmentDeletes, TestTopDocsCollector, TestUniqueTermCount, TestPrefixCodedTerms, TestParallelReaderEmptyIndex, TestMaxTermFrequency, TestIndexableField, TestCheckIndex, TestParallelTermEnum, TestSubScorerFreqs, TestIndexWriterConfig, TestMultiTermQueryRewrites, TestField, TestSimilarity, TestSmallFloat, TestCachingTokenFilter, TestPriorityQueue, TestBooleanScorer, MultiCollectorTest, TestSimpleAttributeImpl, TestPositiveScoresOnlyCollector, TestByteArrayDataInput, Test2BPagedBytes, TestGrowableByteArrayDataOutput, TestBytesRefArray, TestIntroSorter, TestNotDocIdSet, TestSPIClassIterator, TestSloppyMath, TestStringHelper, TestTimSorter, TestAutomaton]
   [junit4] Completed [409/411 (4!)] on J2 in 1.14s, 56 tests, 2 failures <<< FAILURES!

[...truncated 28 lines...]
BUILD FAILED
/home/jenkins/workspace/Lucene-Solr-trunk-Linux/build.xml:740: The following error occurred while executing this line:
/home/jenkins/workspace/Lucene-Solr-trunk-Linux/build.xml:684: The following error occurred while executing this line:
/home/jenkins/workspace/Lucene-Solr-trunk-Linux/build.xml:59: The following error occurred while executing this line:
/home/jenkins/workspace/Lucene-Solr-trunk-Linux/lucene/build.xml:50: The following error occurred while executing this line:
/home/jenkins/workspace/Lucene-Solr-trunk-Linux/lucene/common-build.xml:1457: The following error occurred while executing this line:
/home/jenkins/workspace/Lucene-Solr-trunk-Linux/lucene/common-build.xml:1014: There were test failures: 411 suites (1 ignored), 3395 tests, 3 errors, 3 failures, 61 ignored (57 assumptions) [seed: 64FE4B52F8B49E63]

Total time: 5 minutes 47 seconds
Build step 'Invoke Ant' marked build as failure
Archiving artifacts
[WARNINGS] Skipping publisher since build result is FAILURE
Recording test results
Email was triggered for: Failure - Any
Sending email for trigger: Failure - Any



Mime
View raw message