lucene-dev mailing list archives

Site index · List index
Message view « Date » · « Thread »
Top « Date » · « Thread »
From Policeman Jenkins Server <jenk...@thetaphi.de>
Subject [JENKINS] Lucene-Solr-5.5-Windows (32bit/jdk1.7.0_80) - Build # 19 - Failure!
Date Mon, 22 Feb 2016 04:54:48 GMT
Build: http://jenkins.thetaphi.de/job/Lucene-Solr-5.5-Windows/19/
Java: 32bit/jdk1.7.0_80 -server -XX:+UseParallelGC

1 tests failed.
FAILED:  org.apache.solr.security.PKIAuthenticationIntegrationTest.testPkiAuth

Error Message:
all nodes must get the user solr , no:of nodes got solr : 1

Stack Trace:
java.lang.AssertionError: all nodes must get the user solr , no:of nodes got solr : 1
	at __randomizedtesting.SeedInfo.seed([B1D13C22D40DA8F3:816FA57334BB2F52]:0)
	at org.junit.Assert.fail(Assert.java:93)
	at org.junit.Assert.assertTrue(Assert.java:43)
	at org.apache.solr.security.PKIAuthenticationIntegrationTest.testPkiAuth(PKIAuthenticationIntegrationTest.java:100)
	at sun.reflect.NativeMethodAccessorImpl.invoke0(Native Method)
	at sun.reflect.NativeMethodAccessorImpl.invoke(NativeMethodAccessorImpl.java:57)
	at sun.reflect.DelegatingMethodAccessorImpl.invoke(DelegatingMethodAccessorImpl.java:43)
	at java.lang.reflect.Method.invoke(Method.java:606)
	at com.carrotsearch.randomizedtesting.RandomizedRunner.invoke(RandomizedRunner.java:1764)
	at com.carrotsearch.randomizedtesting.RandomizedRunner$8.evaluate(RandomizedRunner.java:871)
	at com.carrotsearch.randomizedtesting.RandomizedRunner$9.evaluate(RandomizedRunner.java:907)
	at com.carrotsearch.randomizedtesting.RandomizedRunner$10.evaluate(RandomizedRunner.java:921)
	at org.apache.solr.BaseDistributedSearchTestCase$ShardsRepeatRule$ShardsFixedStatement.callStatement(BaseDistributedSearchTestCase.java:964)
	at org.apache.solr.BaseDistributedSearchTestCase$ShardsRepeatRule$ShardsStatement.evaluate(BaseDistributedSearchTestCase.java:939)
	at com.carrotsearch.randomizedtesting.rules.SystemPropertiesRestoreRule$1.evaluate(SystemPropertiesRestoreRule.java:57)
	at org.apache.lucene.util.TestRuleSetupTeardownChained$1.evaluate(TestRuleSetupTeardownChained.java:49)
	at org.apache.lucene.util.AbstractBeforeAfterRule$1.evaluate(AbstractBeforeAfterRule.java:45)
	at org.apache.lucene.util.TestRuleThreadAndTestName$1.evaluate(TestRuleThreadAndTestName.java:48)
	at org.apache.lucene.util.TestRuleIgnoreAfterMaxFailures$1.evaluate(TestRuleIgnoreAfterMaxFailures.java:64)
	at org.apache.lucene.util.TestRuleMarkFailure$1.evaluate(TestRuleMarkFailure.java:47)
	at com.carrotsearch.randomizedtesting.rules.StatementAdapter.evaluate(StatementAdapter.java:36)
	at com.carrotsearch.randomizedtesting.ThreadLeakControl$StatementRunner.run(ThreadLeakControl.java:367)
	at com.carrotsearch.randomizedtesting.ThreadLeakControl.forkTimeoutingTask(ThreadLeakControl.java:809)
	at com.carrotsearch.randomizedtesting.ThreadLeakControl$3.evaluate(ThreadLeakControl.java:460)
	at com.carrotsearch.randomizedtesting.RandomizedRunner.runSingleTest(RandomizedRunner.java:880)
	at com.carrotsearch.randomizedtesting.RandomizedRunner$5.evaluate(RandomizedRunner.java:781)
	at com.carrotsearch.randomizedtesting.RandomizedRunner$6.evaluate(RandomizedRunner.java:816)
	at com.carrotsearch.randomizedtesting.RandomizedRunner$7.evaluate(RandomizedRunner.java:827)
	at com.carrotsearch.randomizedtesting.rules.StatementAdapter.evaluate(StatementAdapter.java:36)
	at com.carrotsearch.randomizedtesting.rules.SystemPropertiesRestoreRule$1.evaluate(SystemPropertiesRestoreRule.java:57)
	at org.apache.lucene.util.AbstractBeforeAfterRule$1.evaluate(AbstractBeforeAfterRule.java:45)
	at com.carrotsearch.randomizedtesting.rules.StatementAdapter.evaluate(StatementAdapter.java:36)
	at org.apache.lucene.util.TestRuleStoreClassName$1.evaluate(TestRuleStoreClassName.java:41)
	at com.carrotsearch.randomizedtesting.rules.NoShadowingOrOverridesOnMethodsRule$1.evaluate(NoShadowingOrOverridesOnMethodsRule.java:40)
	at com.carrotsearch.randomizedtesting.rules.NoShadowingOrOverridesOnMethodsRule$1.evaluate(NoShadowingOrOverridesOnMethodsRule.java:40)
	at com.carrotsearch.randomizedtesting.rules.StatementAdapter.evaluate(StatementAdapter.java:36)
	at com.carrotsearch.randomizedtesting.rules.StatementAdapter.evaluate(StatementAdapter.java:36)
	at com.carrotsearch.randomizedtesting.rules.StatementAdapter.evaluate(StatementAdapter.java:36)
	at org.apache.lucene.util.TestRuleAssertionsRequired$1.evaluate(TestRuleAssertionsRequired.java:53)
	at org.apache.lucene.util.TestRuleMarkFailure$1.evaluate(TestRuleMarkFailure.java:47)
	at org.apache.lucene.util.TestRuleIgnoreAfterMaxFailures$1.evaluate(TestRuleIgnoreAfterMaxFailures.java:64)
	at org.apache.lucene.util.TestRuleIgnoreTestSuites$1.evaluate(TestRuleIgnoreTestSuites.java:54)
	at com.carrotsearch.randomizedtesting.rules.StatementAdapter.evaluate(StatementAdapter.java:36)
	at com.carrotsearch.randomizedtesting.ThreadLeakControl$StatementRunner.run(ThreadLeakControl.java:367)
	at java.lang.Thread.run(Thread.java:745)




Build Log:
[...truncated 10637 lines...]
   [junit4] Suite: org.apache.solr.security.PKIAuthenticationIntegrationTest
   [junit4]   2> Creating dataDir: C:\Users\JenkinsSlave\workspace\Lucene-Solr-5.5-Windows\solr\build\solr-core\test\J1\temp\solr.security.PKIAuthenticationIntegrationTest_B1D13C22D40DA8F3-001\init-core-data-001
   [junit4]   2> 25734 INFO  (SUITE-PKIAuthenticationIntegrationTest-seed#[B1D13C22D40DA8F3]-worker) [    ] o.a.s.BaseDistributedSearchTestCase Setting hostContext system property: /ww/z
   [junit4]   2> 25756 INFO  (TEST-PKIAuthenticationIntegrationTest.testPkiAuth-seed#[B1D13C22D40DA8F3]) [    ] o.a.s.c.ZkTestServer STARTING ZK TEST SERVER
   [junit4]   2> 25760 INFO  (Thread-60) [    ] o.a.s.c.ZkTestServer client port:0.0.0.0/0.0.0.0:0
   [junit4]   2> 25760 INFO  (Thread-60) [    ] o.a.s.c.ZkTestServer Starting server
   [junit4]   2> 25960 INFO  (TEST-PKIAuthenticationIntegrationTest.testPkiAuth-seed#[B1D13C22D40DA8F3]) [    ] o.a.s.c.ZkTestServer start zk server on port:54471
   [junit4]   2> 25997 INFO  (TEST-PKIAuthenticationIntegrationTest.testPkiAuth-seed#[B1D13C22D40DA8F3]) [    ] o.a.s.c.c.SolrZkClient Using default ZkCredentialsProvider
   [junit4]   2> 26083 INFO  (TEST-PKIAuthenticationIntegrationTest.testPkiAuth-seed#[B1D13C22D40DA8F3]) [    ] o.a.s.c.c.ConnectionManager Waiting for client to connect to ZooKeeper
   [junit4]   2> 26148 INFO  (zkCallback-19-thread-1) [    ] o.a.s.c.c.ConnectionManager Watcher org.apache.solr.common.cloud.ConnectionManager@1883f39 name:ZooKeeperConnection Watcher:127.0.0.1:54471 got event WatchedEvent state:SyncConnected type:None path:null path:null type:None
   [junit4]   2> 26149 INFO  (TEST-PKIAuthenticationIntegrationTest.testPkiAuth-seed#[B1D13C22D40DA8F3]) [    ] o.a.s.c.c.ConnectionManager Client is connected to ZooKeeper
   [junit4]   2> 26149 INFO  (TEST-PKIAuthenticationIntegrationTest.testPkiAuth-seed#[B1D13C22D40DA8F3]) [    ] o.a.s.c.c.SolrZkClient Using default ZkACLProvider
   [junit4]   2> 26153 INFO  (TEST-PKIAuthenticationIntegrationTest.testPkiAuth-seed#[B1D13C22D40DA8F3]) [    ] o.a.s.c.c.SolrZkClient makePath: /solr
   [junit4]   2> 26207 INFO  (TEST-PKIAuthenticationIntegrationTest.testPkiAuth-seed#[B1D13C22D40DA8F3]) [    ] o.a.s.c.c.SolrZkClient Using default ZkCredentialsProvider
   [junit4]   2> 26209 INFO  (TEST-PKIAuthenticationIntegrationTest.testPkiAuth-seed#[B1D13C22D40DA8F3]) [    ] o.a.s.c.c.ConnectionManager Waiting for client to connect to ZooKeeper
   [junit4]   2> 26210 INFO  (zkCallback-20-thread-1) [    ] o.a.s.c.c.ConnectionManager Watcher org.apache.solr.common.cloud.ConnectionManager@25d609 name:ZooKeeperConnection Watcher:127.0.0.1:54471/solr got event WatchedEvent state:SyncConnected type:None path:null path:null type:None
   [junit4]   2> 26210 INFO  (TEST-PKIAuthenticationIntegrationTest.testPkiAuth-seed#[B1D13C22D40DA8F3]) [    ] o.a.s.c.c.ConnectionManager Client is connected to ZooKeeper
   [junit4]   2> 26210 INFO  (TEST-PKIAuthenticationIntegrationTest.testPkiAuth-seed#[B1D13C22D40DA8F3]) [    ] o.a.s.c.c.SolrZkClient Using default ZkACLProvider
   [junit4]   2> 26210 INFO  (TEST-PKIAuthenticationIntegrationTest.testPkiAuth-seed#[B1D13C22D40DA8F3]) [    ] o.a.s.c.c.SolrZkClient makePath: /collections/collection1
   [junit4]   2> 26216 INFO  (TEST-PKIAuthenticationIntegrationTest.testPkiAuth-seed#[B1D13C22D40DA8F3]) [    ] o.a.s.c.c.SolrZkClient makePath: /collections/collection1/shards
   [junit4]   2> 26220 INFO  (TEST-PKIAuthenticationIntegrationTest.testPkiAuth-seed#[B1D13C22D40DA8F3]) [    ] o.a.s.c.c.SolrZkClient makePath: /collections/control_collection
   [junit4]   2> 26222 INFO  (TEST-PKIAuthenticationIntegrationTest.testPkiAuth-seed#[B1D13C22D40DA8F3]) [    ] o.a.s.c.c.SolrZkClient makePath: /collections/control_collection/shards
   [junit4]   2> 26224 INFO  (TEST-PKIAuthenticationIntegrationTest.testPkiAuth-seed#[B1D13C22D40DA8F3]) [    ] o.a.s.c.AbstractZkTestCase put C:\Users\JenkinsSlave\workspace\Lucene-Solr-5.5-Windows\solr\core\src\test-files\solr\collection1\conf\solrconfig-tlog.xml to /configs/conf1/solrconfig.xml
   [junit4]   2> 26225 INFO  (TEST-PKIAuthenticationIntegrationTest.testPkiAuth-seed#[B1D13C22D40DA8F3]) [    ] o.a.s.c.c.SolrZkClient makePath: /configs/conf1/solrconfig.xml
   [junit4]   2> 26231 INFO  (TEST-PKIAuthenticationIntegrationTest.testPkiAuth-seed#[B1D13C22D40DA8F3]) [    ] o.a.s.c.AbstractZkTestCase put C:\Users\JenkinsSlave\workspace\Lucene-Solr-5.5-Windows\solr\core\src\test-files\solr\collection1\conf\schema.xml to /configs/conf1/schema.xml
   [junit4]   2> 26231 INFO  (TEST-PKIAuthenticationIntegrationTest.testPkiAuth-seed#[B1D13C22D40DA8F3]) [    ] o.a.s.c.c.SolrZkClient makePath: /configs/conf1/schema.xml
   [junit4]   2> 26234 INFO  (TEST-PKIAuthenticationIntegrationTest.testPkiAuth-seed#[B1D13C22D40DA8F3]) [    ] o.a.s.c.AbstractZkTestCase put C:\Users\JenkinsSlave\workspace\Lucene-Solr-5.5-Windows\solr\core\src\test-files\solr\collection1\conf\solrconfig.snippet.randomindexconfig.xml to /configs/conf1/solrconfig.snippet.randomindexconfig.xml
   [junit4]   2> 26235 INFO  (TEST-PKIAuthenticationIntegrationTest.testPkiAuth-seed#[B1D13C22D40DA8F3]) [    ] o.a.s.c.c.SolrZkClient makePath: /configs/conf1/solrconfig.snippet.randomindexconfig.xml
   [junit4]   2> 26238 INFO  (TEST-PKIAuthenticationIntegrationTest.testPkiAuth-seed#[B1D13C22D40DA8F3]) [    ] o.a.s.c.AbstractZkTestCase put C:\Users\JenkinsSlave\workspace\Lucene-Solr-5.5-Windows\solr\core\src\test-files\solr\collection1\conf\stopwords.txt to /configs/conf1/stopwords.txt
   [junit4]   2> 26239 INFO  (TEST-PKIAuthenticationIntegrationTest.testPkiAuth-seed#[B1D13C22D40DA8F3]) [    ] o.a.s.c.c.SolrZkClient makePath: /configs/conf1/stopwords.txt
   [junit4]   2> 26242 INFO  (TEST-PKIAuthenticationIntegrationTest.testPkiAuth-seed#[B1D13C22D40DA8F3]) [    ] o.a.s.c.AbstractZkTestCase put C:\Users\JenkinsSlave\workspace\Lucene-Solr-5.5-Windows\solr\core\src\test-files\solr\collection1\conf\protwords.txt to /configs/conf1/protwords.txt
   [junit4]   2> 26242 INFO  (TEST-PKIAuthenticationIntegrationTest.testPkiAuth-seed#[B1D13C22D40DA8F3]) [    ] o.a.s.c.c.SolrZkClient makePath: /configs/conf1/protwords.txt
   [junit4]   2> 26246 INFO  (TEST-PKIAuthenticationIntegrationTest.testPkiAuth-seed#[B1D13C22D40DA8F3]) [    ] o.a.s.c.AbstractZkTestCase put C:\Users\JenkinsSlave\workspace\Lucene-Solr-5.5-Windows\solr\core\src\test-files\solr\collection1\conf\currency.xml to /configs/conf1/currency.xml
   [junit4]   2> 26246 INFO  (TEST-PKIAuthenticationIntegrationTest.testPkiAuth-seed#[B1D13C22D40DA8F3]) [    ] o.a.s.c.c.SolrZkClient makePath: /configs/conf1/currency.xml
   [junit4]   2> 26249 INFO  (TEST-PKIAuthenticationIntegrationTest.testPkiAuth-seed#[B1D13C22D40DA8F3]) [    ] o.a.s.c.AbstractZkTestCase put C:\Users\JenkinsSlave\workspace\Lucene-Solr-5.5-Windows\solr\core\src\test-files\solr\collection1\conf\enumsConfig.xml to /configs/conf1/enumsConfig.xml
   [junit4]   2> 26249 INFO  (TEST-PKIAuthenticationIntegrationTest.testPkiAuth-seed#[B1D13C22D40DA8F3]) [    ] o.a.s.c.c.SolrZkClient makePath: /configs/conf1/enumsConfig.xml
   [junit4]   2> 26253 INFO  (TEST-PKIAuthenticationIntegrationTest.testPkiAuth-seed#[B1D13C22D40DA8F3]) [    ] o.a.s.c.AbstractZkTestCase put C:\Users\JenkinsSlave\workspace\Lucene-Solr-5.5-Windows\solr\core\src\test-files\solr\collection1\conf\open-exchange-rates.json to /configs/conf1/open-exchange-rates.json
   [junit4]   2> 26253 INFO  (TEST-PKIAuthenticationIntegrationTest.testPkiAuth-seed#[B1D13C22D40DA8F3]) [    ] o.a.s.c.c.SolrZkClient makePath: /configs/conf1/open-exchange-rates.json
   [junit4]   2> 26257 INFO  (TEST-PKIAuthenticationIntegrationTest.testPkiAuth-seed#[B1D13C22D40DA8F3]) [    ] o.a.s.c.AbstractZkTestCase put C:\Users\JenkinsSlave\workspace\Lucene-Solr-5.5-Windows\solr\core\src\test-files\solr\collection1\conf\mapping-ISOLatin1Accent.txt to /configs/conf1/mapping-ISOLatin1Accent.txt
   [junit4]   2> 26257 INFO  (TEST-PKIAuthenticationIntegrationTest.testPkiAuth-seed#[B1D13C22D40DA8F3]) [    ] o.a.s.c.c.SolrZkClient makePath: /configs/conf1/mapping-ISOLatin1Accent.txt
   [junit4]   2> 26261 INFO  (TEST-PKIAuthenticationIntegrationTest.testPkiAuth-seed#[B1D13C22D40DA8F3]) [    ] o.a.s.c.AbstractZkTestCase put C:\Users\JenkinsSlave\workspace\Lucene-Solr-5.5-Windows\solr\core\src\test-files\solr\collection1\conf\old_synonyms.txt to /configs/conf1/old_synonyms.txt
   [junit4]   2> 26261 INFO  (TEST-PKIAuthenticationIntegrationTest.testPkiAuth-seed#[B1D13C22D40DA8F3]) [    ] o.a.s.c.c.SolrZkClient makePath: /configs/conf1/old_synonyms.txt
   [junit4]   2> 26264 INFO  (TEST-PKIAuthenticationIntegrationTest.testPkiAuth-seed#[B1D13C22D40DA8F3]) [    ] o.a.s.c.AbstractZkTestCase put C:\Users\JenkinsSlave\workspace\Lucene-Solr-5.5-Windows\solr\core\src\test-files\solr\collection1\conf\synonyms.txt to /configs/conf1/synonyms.txt
   [junit4]   2> 26264 INFO  (TEST-PKIAuthenticationIntegrationTest.testPkiAuth-seed#[B1D13C22D40DA8F3]) [    ] o.a.s.c.c.SolrZkClient makePath: /configs/conf1/synonyms.txt
   [junit4]   2> 26865 INFO  (TEST-PKIAuthenticationIntegrationTest.testPkiAuth-seed#[B1D13C22D40DA8F3]) [    ] o.a.s.SolrTestCaseJ4 Writing core.properties file to C:\Users\JenkinsSlave\workspace\Lucene-Solr-5.5-Windows\solr\build\solr-core\test\J1\temp\solr.security.PKIAuthenticationIntegrationTest_B1D13C22D40DA8F3-001\control-001\cores\collection1
   [junit4]   2> 26869 INFO  (TEST-PKIAuthenticationIntegrationTest.testPkiAuth-seed#[B1D13C22D40DA8F3]) [    ] o.e.j.s.Server jetty-9.2.13.v20150730
   [junit4]   2> 26872 INFO  (TEST-PKIAuthenticationIntegrationTest.testPkiAuth-seed#[B1D13C22D40DA8F3]) [    ] o.e.j.s.h.ContextHandler Started o.e.j.s.ServletContextHandler@afb337{/ww/z,null,AVAILABLE}
   [junit4]   2> 26874 INFO  (TEST-PKIAuthenticationIntegrationTest.testPkiAuth-seed#[B1D13C22D40DA8F3]) [    ] o.e.j.s.ServerConnector Started ServerConnector@11f0422{HTTP/1.1}{127.0.0.1:54478}
   [junit4]   2> 26874 INFO  (TEST-PKIAuthenticationIntegrationTest.testPkiAuth-seed#[B1D13C22D40DA8F3]) [    ] o.e.j.s.Server Started @30784ms
   [junit4]   2> 26874 INFO  (TEST-PKIAuthenticationIntegrationTest.testPkiAuth-seed#[B1D13C22D40DA8F3]) [    ] o.a.s.c.s.e.JettySolrRunner Jetty properties: {solr.data.dir=C:\Users\JenkinsSlave\workspace\Lucene-Solr-5.5-Windows\solr\build\solr-core\test\J1\temp\solr.security.PKIAuthenticationIntegrationTest_B1D13C22D40DA8F3-001\tempDir-001/control/data, hostContext=/ww/z, hostPort=54478, coreRootDirectory=C:\Users\JenkinsSlave\workspace\Lucene-Solr-5.5-Windows\solr\build\solr-core\test\J1\..\..\..\..\..\..\..\..\..\Users\JenkinsSlave\workspace\Lucene-Solr-5.5-Windows\solr\build\solr-core\test\J1\temp\solr.security.PKIAuthenticationIntegrationTest_B1D13C22D40DA8F3-001\control-001\cores}
   [junit4]   2> 26875 INFO  (TEST-PKIAuthenticationIntegrationTest.testPkiAuth-seed#[B1D13C22D40DA8F3]) [    ] o.a.s.s.SolrDispatchFilter SolrDispatchFilter.init(): sun.misc.Launcher$AppClassLoader@752144
   [junit4]   2> 26875 INFO  (TEST-PKIAuthenticationIntegrationTest.testPkiAuth-seed#[B1D13C22D40DA8F3]) [    ] o.a.s.c.SolrResourceLoader new SolrResourceLoader for directory: 'C:\Users\JenkinsSlave\workspace\Lucene-Solr-5.5-Windows\solr\build\solr-core\test\J1\temp\solr.security.PKIAuthenticationIntegrationTest_B1D13C22D40DA8F3-001\control-001'
   [junit4]   2> 26876 INFO  (TEST-PKIAuthenticationIntegrationTest.testPkiAuth-seed#[B1D13C22D40DA8F3]) [    ] o.a.s.c.SolrResourceLoader JNDI not configured for solr (NoInitialContextEx)
   [junit4]   2> 26876 INFO  (TEST-PKIAuthenticationIntegrationTest.testPkiAuth-seed#[B1D13C22D40DA8F3]) [    ] o.a.s.c.SolrResourceLoader solr home defaulted to 'solr/' (could not find system property or JNDI)
   [junit4]   2> 26876 INFO  (TEST-PKIAuthenticationIntegrationTest.testPkiAuth-seed#[B1D13C22D40DA8F3]) [    ] o.a.s.c.c.SolrZkClient Using default ZkCredentialsProvider
   [junit4]   2> 26877 INFO  (TEST-PKIAuthenticationIntegrationTest.testPkiAuth-seed#[B1D13C22D40DA8F3]) [    ] o.a.s.c.c.ConnectionManager Waiting for client to connect to ZooKeeper
   [junit4]   2> 26880 INFO  (zkCallback-21-thread-1) [    ] o.a.s.c.c.ConnectionManager Watcher org.apache.solr.common.cloud.ConnectionManager@cbac80 name:ZooKeeperConnection Watcher:127.0.0.1:54471/solr got event WatchedEvent state:SyncConnected type:None path:null path:null type:None
   [junit4]   2> 26880 INFO  (TEST-PKIAuthenticationIntegrationTest.testPkiAuth-seed#[B1D13C22D40DA8F3]) [    ] o.a.s.c.c.ConnectionManager Client is connected to ZooKeeper
   [junit4]   2> 26880 INFO  (TEST-PKIAuthenticationIntegrationTest.testPkiAuth-seed#[B1D13C22D40DA8F3]) [    ] o.a.s.c.c.SolrZkClient Using default ZkACLProvider
   [junit4]   2> 26882 INFO  (TEST-PKIAuthenticationIntegrationTest.testPkiAuth-seed#[B1D13C22D40DA8F3]) [    ] o.a.s.s.SolrDispatchFilter Loading solr.xml from SolrHome (not found in ZooKeeper)
   [junit4]   2> 26883 INFO  (TEST-PKIAuthenticationIntegrationTest.testPkiAuth-seed#[B1D13C22D40DA8F3]) [    ] o.a.s.c.SolrXmlConfig Loading container configuration from C:\Users\JenkinsSlave\workspace\Lucene-Solr-5.5-Windows\solr\build\solr-core\test\J1\temp\solr.security.PKIAuthenticationIntegrationTest_B1D13C22D40DA8F3-001\control-001\solr.xml
   [junit4]   2> 26908 INFO  (TEST-PKIAuthenticationIntegrationTest.testPkiAuth-seed#[B1D13C22D40DA8F3]) [    ] o.a.s.c.CorePropertiesLocator Config-defined core root directory: C:\Users\JenkinsSlave\workspace\Lucene-Solr-5.5-Windows\solr\build\solr-core\test\J1\..\..\..\..\..\..\..\..\..\Users\JenkinsSlave\workspace\Lucene-Solr-5.5-Windows\solr\build\solr-core\test\J1\temp\solr.security.PKIAuthenticationIntegrationTest_B1D13C22D40DA8F3-001\control-001\cores
   [junit4]   2> 26908 INFO  (TEST-PKIAuthenticationIntegrationTest.testPkiAuth-seed#[B1D13C22D40DA8F3]) [    ] o.a.s.c.CoreContainer New CoreContainer 1582413
   [junit4]   2> 26909 INFO  (TEST-PKIAuthenticationIntegrationTest.testPkiAuth-seed#[B1D13C22D40DA8F3]) [    ] o.a.s.c.CoreContainer Loading cores into CoreContainer [instanceDir=C:\Users\JenkinsSlave\workspace\Lucene-Solr-5.5-Windows\solr\build\solr-core\test\J1\temp\solr.security.PKIAuthenticationIntegrationTest_B1D13C22D40DA8F3-001\control-001]
   [junit4]   2> 26909 WARN  (TEST-PKIAuthenticationIntegrationTest.testPkiAuth-seed#[B1D13C22D40DA8F3]) [    ] o.a.s.c.CoreContainer Couldn't add files from C:\Users\JenkinsSlave\workspace\Lucene-Solr-5.5-Windows\solr\build\solr-core\test\J1\temp\solr.security.PKIAuthenticationIntegrationTest_B1D13C22D40DA8F3-001\control-001\lib to classpath: C:\Users\JenkinsSlave\workspace\Lucene-Solr-5.5-Windows\solr\build\solr-core\test\J1\temp\solr.security.PKIAuthenticationIntegrationTest_B1D13C22D40DA8F3-001\control-001\lib
   [junit4]   2> 26910 INFO  (TEST-PKIAuthenticationIntegrationTest.testPkiAuth-seed#[B1D13C22D40DA8F3]) [    ] o.a.s.h.c.HttpShardHandlerFactory created with socketTimeout : 90000,urlScheme : ,connTimeout : 15000,maxConnectionsPerHost : 20,maxConnections : 10000,corePoolSize : 0,maximumPoolSize : 2147483647,maxThreadIdleTime : 5,sizeOfQueue : -1,fairnessPolicy : false,useRetries : false,
   [junit4]   2> 26914 INFO  (TEST-PKIAuthenticationIntegrationTest.testPkiAuth-seed#[B1D13C22D40DA8F3]) [    ] o.a.s.u.UpdateShardHandler Creating UpdateShardHandler HTTP client with params: socketTimeout=340000&connTimeout=45000&retry=true
   [junit4]   2> 26914 INFO  (TEST-PKIAuthenticationIntegrationTest.testPkiAuth-seed#[B1D13C22D40DA8F3]) [    ] o.a.s.l.LogWatcher SLF4J impl is org.slf4j.impl.Log4jLoggerFactory
   [junit4]   2> 26914 INFO  (TEST-PKIAuthenticationIntegrationTest.testPkiAuth-seed#[B1D13C22D40DA8F3]) [    ] o.a.s.l.LogWatcher Registering Log Listener [Log4j (org.slf4j.impl.Log4jLoggerFactory)]
   [junit4]   2> 26915 INFO  (TEST-PKIAuthenticationIntegrationTest.testPkiAuth-seed#[B1D13C22D40DA8F3]) [    ] o.a.s.c.ZkContainer Zookeeper client=127.0.0.1:54471/solr
   [junit4]   2> 26941 INFO  (TEST-PKIAuthenticationIntegrationTest.testPkiAuth-seed#[B1D13C22D40DA8F3]) [    ] o.a.s.c.ZkController zkHost includes chroot
   [junit4]   2> 26941 INFO  (TEST-PKIAuthenticationIntegrationTest.testPkiAuth-seed#[B1D13C22D40DA8F3]) [    ] o.a.s.c.c.SolrZkClient Using default ZkCredentialsProvider
   [junit4]   2> 26943 INFO  (TEST-PKIAuthenticationIntegrationTest.testPkiAuth-seed#[B1D13C22D40DA8F3]) [    ] o.a.s.c.c.ConnectionManager Waiting for client to connect to ZooKeeper
   [junit4]   2> 26945 INFO  (zkCallback-24-thread-1) [    ] o.a.s.c.c.ConnectionManager Watcher org.apache.solr.common.cloud.ConnectionManager@127ea39 name:ZooKeeperConnection Watcher:127.0.0.1:54471 got event WatchedEvent state:SyncConnected type:None path:null path:null type:None
   [junit4]   2> 26945 INFO  (TEST-PKIAuthenticationIntegrationTest.testPkiAuth-seed#[B1D13C22D40DA8F3]) [    ] o.a.s.c.c.ConnectionManager Client is connected to ZooKeeper
   [junit4]   2> 26946 INFO  (TEST-PKIAuthenticationIntegrationTest.testPkiAuth-seed#[B1D13C22D40DA8F3]) [    ] o.a.s.c.c.SolrZkClient Using default ZkACLProvider
   [junit4]   2> 26947 WARN  (NIOServerCxn.Factory:0.0.0.0/0.0.0.0:0) [    ] o.a.z.s.NIOServerCnxn caught end of stream exception
   [junit4]   2> EndOfStreamException: Unable to read additional data from client sessionid 0x153071ee4580003, likely client has closed socket
   [junit4]   2> 	at org.apache.zookeeper.server.NIOServerCnxn.doIO(NIOServerCnxn.java:228)
   [junit4]   2> 	at org.apache.zookeeper.server.NIOServerCnxnFactory.run(NIOServerCnxnFactory.java:208)
   [junit4]   2> 	at java.lang.Thread.run(Thread.java:745)
   [junit4]   2> 26959 INFO  (TEST-PKIAuthenticationIntegrationTest.testPkiAuth-seed#[B1D13C22D40DA8F3]) [n:127.0.0.1:54478_ww%2Fz    ] o.a.s.c.c.ConnectionManager Waiting for client to connect to ZooKeeper
   [junit4]   2> 26960 INFO  (zkCallback-25-thread-1-processing-n:127.0.0.1:54478_ww%2Fz) [n:127.0.0.1:54478_ww%2Fz    ] o.a.s.c.c.ConnectionManager Watcher org.apache.solr.common.cloud.ConnectionManager@1e4e898 name:ZooKeeperConnection Watcher:127.0.0.1:54471/solr got event WatchedEvent state:SyncConnected type:None path:null path:null type:None
   [junit4]   2> 26961 INFO  (TEST-PKIAuthenticationIntegrationTest.testPkiAuth-seed#[B1D13C22D40DA8F3]) [n:127.0.0.1:54478_ww%2Fz    ] o.a.s.c.c.ConnectionManager Client is connected to ZooKeeper
   [junit4]   2> 26974 INFO  (TEST-PKIAuthenticationIntegrationTest.testPkiAuth-seed#[B1D13C22D40DA8F3]) [n:127.0.0.1:54478_ww%2Fz    ] o.a.s.c.c.SolrZkClient makePath: /overseer/queue
   [junit4]   2> 26991 INFO  (TEST-PKIAuthenticationIntegrationTest.testPkiAuth-seed#[B1D13C22D40DA8F3]) [n:127.0.0.1:54478_ww%2Fz    ] o.a.s.c.c.SolrZkClient makePath: /overseer/collection-queue-work
   [junit4]   2> 27001 INFO  (TEST-PKIAuthenticationIntegrationTest.testPkiAuth-seed#[B1D13C22D40DA8F3]) [n:127.0.0.1:54478_ww%2Fz    ] o.a.s.c.c.SolrZkClient makePath: /overseer/collection-map-running
   [junit4]   2> 27008 INFO  (TEST-PKIAuthenticationIntegrationTest.testPkiAuth-seed#[B1D13C22D40DA8F3]) [n:127.0.0.1:54478_ww%2Fz    ] o.a.s.c.c.SolrZkClient makePath: /overseer/collection-map-completed
   [junit4]   2> 27011 INFO  (TEST-PKIAuthenticationIntegrationTest.testPkiAuth-seed#[B1D13C22D40DA8F3]) [n:127.0.0.1:54478_ww%2Fz    ] o.a.s.c.c.SolrZkClient makePath: /overseer/collection-map-failure
   [junit4]   2> 27028 INFO  (TEST-PKIAuthenticationIntegrationTest.testPkiAuth-seed#[B1D13C22D40DA8F3]) [n:127.0.0.1:54478_ww%2Fz    ] o.a.s.c.c.SolrZkClient makePath: /live_nodes
   [junit4]   2> 27031 INFO  (TEST-PKIAuthenticationIntegrationTest.testPkiAuth-seed#[B1D13C22D40DA8F3]) [n:127.0.0.1:54478_ww%2Fz    ] o.a.s.c.c.SolrZkClient makePath: /aliases.json
   [junit4]   2> 27034 INFO  (TEST-PKIAuthenticationIntegrationTest.testPkiAuth-seed#[B1D13C22D40DA8F3]) [n:127.0.0.1:54478_ww%2Fz    ] o.a.s.c.c.SolrZkClient makePath: /clusterstate.json
   [junit4]   2> 27037 INFO  (TEST-PKIAuthenticationIntegrationTest.testPkiAuth-seed#[B1D13C22D40DA8F3]) [n:127.0.0.1:54478_ww%2Fz    ] o.a.s.c.c.SolrZkClient makePath: /security.json
   [junit4]   2> 27039 INFO  (TEST-PKIAuthenticationIntegrationTest.testPkiAuth-seed#[B1D13C22D40DA8F3]) [n:127.0.0.1:54478_ww%2Fz    ] o.a.s.c.ZkController Register node as live in ZooKeeper:/live_nodes/127.0.0.1:54478_ww%2Fz
   [junit4]   2> 27043 INFO  (TEST-PKIAuthenticationIntegrationTest.testPkiAuth-seed#[B1D13C22D40DA8F3]) [n:127.0.0.1:54478_ww%2Fz    ] o.a.s.c.c.SolrZkClient makePath: /live_nodes/127.0.0.1:54478_ww%2Fz
   [junit4]   2> 27050 INFO  (TEST-PKIAuthenticationIntegrationTest.testPkiAuth-seed#[B1D13C22D40DA8F3]) [n:127.0.0.1:54478_ww%2Fz    ] o.a.s.c.c.SolrZkClient makePath: /overseer_elect
   [junit4]   2> 27054 INFO  (TEST-PKIAuthenticationIntegrationTest.testPkiAuth-seed#[B1D13C22D40DA8F3]) [n:127.0.0.1:54478_ww%2Fz    ] o.a.s.c.c.SolrZkClient makePath: /overseer_elect/election
   [junit4]   2> 27056 INFO  (TEST-PKIAuthenticationIntegrationTest.testPkiAuth-seed#[B1D13C22D40DA8F3]) [n:127.0.0.1:54478_ww%2Fz    ] o.a.s.c.Overseer Overseer (id=null) closing
   [junit4]   2> 27057 INFO  (TEST-PKIAuthenticationIntegrationTest.testPkiAuth-seed#[B1D13C22D40DA8F3]) [n:127.0.0.1:54478_ww%2Fz    ] o.a.s.c.LeaderElector Joined leadership election with path: /overseer_elect/election/95427846366298116-127.0.0.1:54478_ww%2Fz-n_0000000000
   [junit4]   2> 27067 INFO  (TEST-PKIAuthenticationIntegrationTest.testPkiAuth-seed#[B1D13C22D40DA8F3]) [n:127.0.0.1:54478_ww%2Fz    ] o.a.s.c.OverseerElectionContext I am going to be the leader 127.0.0.1:54478_ww%2Fz
   [junit4]   2> 27067 INFO  (TEST-PKIAuthenticationIntegrationTest.testPkiAuth-seed#[B1D13C22D40DA8F3]) [n:127.0.0.1:54478_ww%2Fz    ] o.a.s.c.c.SolrZkClient makePath: /overseer_elect/leader
   [junit4]   2> 27069 INFO  (TEST-PKIAuthenticationIntegrationTest.testPkiAuth-seed#[B1D13C22D40DA8F3]) [n:127.0.0.1:54478_ww%2Fz    ] o.a.s.c.Overseer Overseer (id=95427846366298116-127.0.0.1:54478_ww%2Fz-n_0000000000) starting
   [junit4]   2> 27082 INFO  (TEST-PKIAuthenticationIntegrationTest.testPkiAuth-seed#[B1D13C22D40DA8F3]) [n:127.0.0.1:54478_ww%2Fz    ] o.a.s.c.c.SolrZkClient makePath: /overseer/queue-work
   [junit4]   2> 27124 INFO  (TEST-PKIAuthenticationIntegrationTest.testPkiAuth-seed#[B1D13C22D40DA8F3]) [n:127.0.0.1:54478_ww%2Fz    ] o.a.s.c.OverseerAutoReplicaFailoverThread Starting OverseerAutoReplicaFailoverThread autoReplicaFailoverWorkLoopDelay=10000 autoReplicaFailoverWaitAfterExpiration=30000 autoReplicaFailoverBadNodeExpiration=60000
   [junit4]   2> 27132 INFO  (TEST-PKIAuthenticationIntegrationTest.testPkiAuth-seed#[B1D13C22D40DA8F3]) [n:127.0.0.1:54478_ww%2Fz    ] o.a.s.c.c.ZkStateReader Updating cluster state from ZooKeeper... 
   [junit4]   2> 27133 INFO  (OverseerCollectionConfigSetProcessor-95427846366298116-127.0.0.1:54478_ww%2Fz-n_0000000000) [n:127.0.0.1:54478_ww%2Fz    ] o.a.s.c.OverseerTaskProcessor Process current queue of overseer operations
   [junit4]   2> 27143 INFO  (OverseerStateUpdate-95427846366298116-127.0.0.1:54478_ww%2Fz-n_0000000000) [n:127.0.0.1:54478_ww%2Fz    ] o.a.s.c.Overseer Starting to work on the main queue
   [junit4]   2> 27299 INFO  (TEST-PKIAuthenticationIntegrationTest.testPkiAuth-seed#[B1D13C22D40DA8F3]) [n:127.0.0.1:54478_ww%2Fz    ] o.a.s.c.CoreContainer Security conf doesn't exist. Skipping setup for authorization module.
   [junit4]   2> 27299 INFO  (TEST-PKIAuthenticationIntegrationTest.testPkiAuth-seed#[B1D13C22D40DA8F3]) [n:127.0.0.1:54478_ww%2Fz    ] o.a.s.c.CoreContainer No authentication plugin used.
   [junit4]   2> 27302 INFO  (TEST-PKIAuthenticationIntegrationTest.testPkiAuth-seed#[B1D13C22D40DA8F3]) [n:127.0.0.1:54478_ww%2Fz    ] o.a.s.c.CorePropertiesLocator Looking for core definitions underneath C:\Users\JenkinsSlave\workspace\Lucene-Solr-5.5-Windows\solr\build\solr-core\test\J1\..\..\..\..\..\..\..\..\..\Users\JenkinsSlave\workspace\Lucene-Solr-5.5-Windows\solr\build\solr-core\test\J1\temp\solr.security.PKIAuthenticationIntegrationTest_B1D13C22D40DA8F3-001\control-001\cores
   [junit4]   2> 27308 INFO  (TEST-PKIAuthenticationIntegrationTest.testPkiAuth-seed#[B1D13C22D40DA8F3]) [n:127.0.0.1:54478_ww%2Fz    ] o.a.s.c.CoreDescriptor Created CoreDescriptor: {loadOnStartup=true, coreNodeName=, name=collection1, shard=, schema=schema.xml, dataDir=data\, configSetProperties=configsetprops.json, collection=control_collection, config=solrconfig.xml, transient=false}
   [junit4]   2> 27308 INFO  (TEST-PKIAuthenticationIntegrationTest.testPkiAuth-seed#[B1D13C22D40DA8F3]) [n:127.0.0.1:54478_ww%2Fz    ] o.a.s.c.CorePropertiesLocator Found core collection1 in C:\Users\JenkinsSlave\workspace\Lucene-Solr-5.5-Windows\solr\build\solr-core\test\J1\..\..\..\..\..\..\..\..\..\Users\JenkinsSlave\workspace\Lucene-Solr-5.5-Windows\solr\build\solr-core\test\J1\temp\solr.security.PKIAuthenticationIntegrationTest_B1D13C22D40DA8F3-001\control-001\cores\collection1
   [junit4]   2> 27308 INFO  (TEST-PKIAuthenticationIntegrationTest.testPkiAuth-seed#[B1D13C22D40DA8F3]) [n:127.0.0.1:54478_ww%2Fz    ] o.a.s.c.CorePropertiesLocator Found 1 core definitions
   [junit4]   2> 27311 INFO  (TEST-PKIAuthenticationIntegrationTest.testPkiAuth-seed#[B1D13C22D40DA8F3]) [n:127.0.0.1:54478_ww%2Fz    ] o.a.s.s.SolrDispatchFilter user.dir=C:\Users\JenkinsSlave\workspace\Lucene-Solr-5.5-Windows\solr\build\solr-core\test\J1
   [junit4]   2> 27311 INFO  (TEST-PKIAuthenticationIntegrationTest.testPkiAuth-seed#[B1D13C22D40DA8F3]) [n:127.0.0.1:54478_ww%2Fz    ] o.a.s.s.SolrDispatchFilter SolrDispatchFilter.init() done
   [junit4]   2> 27313 INFO  (coreLoadExecutor-107-thread-1-processing-n:127.0.0.1:54478_ww%2Fz) [n:127.0.0.1:54478_ww%2Fz c:control_collection   x:collection1] o.a.s.c.ZkController publishing state=down
   [junit4]   2> 27313 INFO  (coreLoadExecutor-107-thread-1-processing-n:127.0.0.1:54478_ww%2Fz) [n:127.0.0.1:54478_ww%2Fz c:control_collection   x:collection1] o.a.s.c.ZkController numShards not found on descriptor - reading it from system property
   [junit4]   2> 27330 INFO  (coreLoadExecutor-107-thread-1-processing-n:127.0.0.1:54478_ww%2Fz) [n:127.0.0.1:54478_ww%2Fz c:control_collection   x:collection1] o.a.s.c.ZkController look for our core node name
   [junit4]   2> 27330 INFO  (OverseerStateUpdate-95427846366298116-127.0.0.1:54478_ww%2Fz-n_0000000000) [n:127.0.0.1:54478_ww%2Fz    ] o.a.s.c.Overseer processMessage: queueSize: 1, message = {
   [junit4]   2>   "collection":"control_collection",
   [junit4]   2>   "base_url":"http://127.0.0.1:54478/ww/z",
   [junit4]   2>   "core":"collection1",
   [junit4]   2>   "operation":"state",
   [junit4]   2>   "node_name":"127.0.0.1:54478_ww%2Fz",
   [junit4]   2>   "numShards":"1",
   [junit4]   2>   "shard":null,
   [junit4]   2>   "roles":null,
   [junit4]   2>   "state":"down"} current state version: 0
   [junit4]   2> 27351 INFO  (OverseerStateUpdate-95427846366298116-127.0.0.1:54478_ww%2Fz-n_0000000000) [n:127.0.0.1:54478_ww%2Fz    ] o.a.s.c.o.ReplicaMutator Update state numShards=1 message={
   [junit4]   2>   "collection":"control_collection",
   [junit4]   2>   "base_url":"http://127.0.0.1:54478/ww/z",
   [junit4]   2>   "core":"collection1",
   [junit4]   2>   "operation":"state",
   [junit4]   2>   "node_name":"127.0.0.1:54478_ww%2Fz",
   [junit4]   2>   "numShards":"1",
   [junit4]   2>   "shard":null,
   [junit4]   2>   "roles":null,
   [junit4]   2>   "state":"down"}
   [junit4]   2> 27358 INFO  (OverseerStateUpdate-95427846366298116-127.0.0.1:54478_ww%2Fz-n_0000000000) [n:127.0.0.1:54478_ww%2Fz    ] o.a.s.c.o.ClusterStateMutator building a new cName: control_collection
   [junit4]   2> 27379 INFO  (OverseerStateUpdate-95427846366298116-127.0.0.1:54478_ww%2Fz-n_0000000000) [n:127.0.0.1:54478_ww%2Fz    ] o.a.s.c.o.ReplicaMutator Assigning new node to shard shard=shard1
   [junit4]   2> 27388 INFO  (zkCallback-25-thread-1-processing-n:127.0.0.1:54478_ww%2Fz) [n:127.0.0.1:54478_ww%2Fz    ] o.a.s.c.c.ZkStateReader A cluster state change: [WatchedEvent state:SyncConnected type:NodeDataChanged path:/clusterstate.json], has occurred - updating... (live nodes size: [1])
   [junit4]   2> 28330 INFO  (coreLoadExecutor-107-thread-1-processing-n:127.0.0.1:54478_ww%2Fz) [n:127.0.0.1:54478_ww%2Fz c:control_collection   x:collection1] o.a.s.c.ZkController waiting to find shard id in clusterstate for collection1
   [junit4]   2> 28330 INFO  (coreLoadExecutor-107-thread-1-processing-n:127.0.0.1:54478_ww%2Fz) [n:127.0.0.1:54478_ww%2Fz c:control_collection   x:collection1] o.a.s.c.ZkController Check for collection zkNode:control_collection
   [junit4]   2> 28331 INFO  (coreLoadExecutor-107-thread-1-processing-n:127.0.0.1:54478_ww%2Fz) [n:127.0.0.1:54478_ww%2Fz c:control_collection   x:collection1] o.a.s.c.ZkController Collection zkNode exists
   [junit4]   2> 28331 INFO  (coreLoadExecutor-107-thread-1-processing-n:127.0.0.1:54478_ww%2Fz) [n:127.0.0.1:54478_ww%2Fz c:control_collection   x:collection1] o.a.s.c.c.ZkStateReader Load collection config from: [/collections/control_collection]
   [junit4]   2> 28332 INFO  (coreLoadExecutor-107-thread-1-processing-n:127.0.0.1:54478_ww%2Fz) [n:127.0.0.1:54478_ww%2Fz c:control_collection   x:collection1] o.a.s.c.c.ZkStateReader path=[/collections/control_collection] [configName]=[conf1] specified config exists in ZooKeeper
   [junit4]   2> 28332 INFO  (coreLoadExecutor-107-thread-1-processing-n:127.0.0.1:54478_ww%2Fz) [n:127.0.0.1:54478_ww%2Fz c:control_collection   x:collection1] o.a.s.c.SolrResourceLoader new SolrResourceLoader for directory: 'C:\Users\JenkinsSlave\workspace\Lucene-Solr-5.5-Windows\solr\build\solr-core\test\J1\temp\solr.security.PKIAuthenticationIntegrationTest_B1D13C22D40DA8F3-001\control-001\cores\collection1'
   [junit4]   2> 28332 INFO  (coreLoadExecutor-107-thread-1-processing-n:127.0.0.1:54478_ww%2Fz) [n:127.0.0.1:54478_ww%2Fz c:control_collection   x:collection1] o.a.s.c.SolrResourceLoader JNDI not configured for solr (NoInitialContextEx)
   [junit4]   2> 28333 INFO  (coreLoadExecutor-107-thread-1-processing-n:127.0.0.1:54478_ww%2Fz) [n:127.0.0.1:54478_ww%2Fz c:control_collection   x:collection1] o.a.s.c.SolrResourceLoader solr home defaulted to 'solr/' (could not find system property or JNDI)
   [junit4]   2> 28347 INFO  (coreLoadExecutor-107-thread-1-processing-n:127.0.0.1:54478_ww%2Fz) [n:127.0.0.1:54478_ww%2Fz c:control_collection   x:collection1] o.a.s.c.Config loaded config solrconfig.xml with version 0 
   [junit4]   2> 28365 INFO  (coreLoadExecutor-107-thread-1-processing-n:127.0.0.1:54478_ww%2Fz) [n:127.0.0.1:54478_ww%2Fz c:control_collection   x:collection1] o.a.s.c.SolrConfig current version of requestparams : -1
   [junit4]   2> 28385 INFO  (coreLoadExecutor-107-thread-1-processing-n:127.0.0.1:54478_ww%2Fz) [n:127.0.0.1:54478_ww%2Fz c:control_collection   x:collection1] o.a.s.c.SolrConfig Using Lucene MatchVersion: 5.5.0
   [junit4]   2> 28472 INFO  (coreLoadExecutor-107-thread-1-processing-n:127.0.0.1:54478_ww%2Fz) [n:127.0.0.1:54478_ww%2Fz c:control_collection   x:collection1] o.a.s.c.SolrConfig Loaded SolrConfig: solrconfig.xml
   [junit4]   2> 28497 INFO  (coreLoadExecutor-107-thread-1-processing-n:127.0.0.1:54478_ww%2Fz) [n:127.0.0.1:54478_ww%2Fz c:control_collection   x:collection1] o.a.s.s.IndexSchema [collection1] Schema name=test
   [junit4]   2> 28891 INFO  (coreLoadExecutor-107-thread-1-processing-n:127.0.0.1:54478_ww%2Fz) [n:127.0.0.1:54478_ww%2Fz c:control_collection   x:collection1] o.a.s.s.OpenExchangeRatesOrgProvider Initialized with rates=open-exchange-rates.json, refreshInterval=1440.
   [junit4]   2> 28906 INFO  (coreLoadExecutor-107-thread-1-processing-n:127.0.0.1:54478_ww%2Fz) [n:127.0.0.1:54478_ww%2Fz c:control_collection   x:collection1] o.a.s.s.IndexSchema default search field in schema is text
   [junit4]   2> 28909 INFO  (coreLoadExecutor-107-thread-1-processing-n:127.0.0.1:54478_ww%2Fz) [n:127.0.0.1:54478_ww%2Fz c:control_collection   x:collection1] o.a.s.s.IndexSchema unique key field: id
   [junit4]   2> 28927 INFO  (coreLoadExecutor-107-thread-1-processing-n:127.0.0.1:54478_ww%2Fz) [n:127.0.0.1:54478_ww%2Fz c:control_collection   x:collection1] o.a.s.s.FileExchangeRateProvider Reloading exchange rates from file currency.xml
   [junit4]   2> 28931 INFO  (coreLoadExecutor-107-thread-1-processing-n:127.0.0.1:54478_ww%2Fz) [n:127.0.0.1:54478_ww%2Fz c:control_collection   x:collection1] o.a.s.s.FileExchangeRateProvider Reloading exchange rates from file currency.xml
   [junit4]   2> 28935 INFO  (coreLoadExecutor-107-thread-1-processing-n:127.0.0.1:54478_ww%2Fz) [n:127.0.0.1:54478_ww%2Fz c:control_collection   x:collection1] o.a.s.s.OpenExchangeRatesOrgProvider Reloading exchange rates from open-exchange-rates.json
   [junit4]   2> 28937 INFO  (coreLoadExecutor-107-thread-1-processing-n:127.0.0.1:54478_ww%2Fz) [n:127.0.0.1:54478_ww%2Fz c:control_collection   x:collection1] o.a.s.s.OpenExchangeRatesOrgProvider Reloading exchange rates from open-exchange-rates.json
   [junit4]   2> 28941 INFO  (coreLoadExecutor-107-thread-1-processing-n:127.0.0.1:54478_ww%2Fz) [n:127.0.0.1:54478_ww%2Fz c:control_collection   x:collection1] o.a.s.c.ConfigSetProperties Did not find ConfigSet properties, assuming default properties: Can't find resource 'configsetprops.json' in classpath or '/configs/conf1', cwd=C:\Users\JenkinsSlave\workspace\Lucene-Solr-5.5-Windows\solr\build\solr-core\test\J1
   [junit4]   2> 28941 INFO  (coreLoadExecutor-107-thread-1-processing-n:127.0.0.1:54478_ww%2Fz) [n:127.0.0.1:54478_ww%2Fz c:control_collection   x:collection1] o.a.s.c.CoreContainer Creating SolrCore 'collection1' using configuration from collection control_collection
   [junit4]   2> 28942 INFO  (coreLoadExecutor-107-thread-1-processing-n:127.0.0.1:54478_ww%2Fz) [n:127.0.0.1:54478_ww%2Fz c:control_collection s:shard1 r:core_node1 x:collection1] o.a.s.c.SolrCore org.apache.solr.core.MockDirectoryFactory
   [junit4]   2> 28942 INFO  (coreLoadExecutor-107-thread-1-processing-n:127.0.0.1:54478_ww%2Fz) [n:127.0.0.1:54478_ww%2Fz c:control_collection s:shard1 r:core_node1 x:collection1] o.a.s.c.SolrCore [[collection1] ] Opening new SolrCore at [C:\Users\JenkinsSlave\workspace\Lucene-Solr-5.5-Windows\solr\build\solr-core\test\J1\temp\solr.security.PKIAuthenticationIntegrationTest_B1D13C22D40DA8F3-001\control-001\cores\collection1], dataDir=[C:\Users\JenkinsSlave\workspace\Lucene-Solr-5.5-Windows\solr\build\solr-core\test\J1\..\..\..\..\..\..\..\..\..\Users\JenkinsSlave\workspace\Lucene-Solr-5.5-Windows\solr\build\solr-core\test\J1\temp\solr.security.PKIAuthenticationIntegrationTest_B1D13C22D40DA8F3-001\control-001\cores\collection1\data\]
   [junit4]   2> 28948 INFO  (coreLoadExecutor-107-thread-1-processing-n:127.0.0.1:54478_ww%2Fz) [n:127.0.0.1:54478_ww%2Fz c:control_collection s:shard1 r:core_node1 x:collection1] o.a.s.c.JmxMonitoredMap JMX monitoring is enabled. Adding Solr mbeans to JMX Server: com.sun.jmx.mbeanserver.JmxMBeanServer@310d79
   [junit4]   2> 28960 INFO  (coreLoadExecutor-107-thread-1-processing-n:127.0.0.1:54478_ww%2Fz) [n:127.0.0.1:54478_ww%2Fz c:control_collection s:shard1 r:core_node1 x:collection1] o.a.s.c.CachingDirectoryFactory return new directory for C:\Users\JenkinsSlave\workspace\Lucene-Solr-5.5-Windows\solr\build\solr-core\test\J1\..\..\..\..\..\..\..\..\..\Users\JenkinsSlave\workspace\Lucene-Solr-5.5-Windows\solr\build\solr-core\test\J1\temp\solr.security.PKIAuthenticationIntegrationTest_B1D13C22D40DA8F3-001\control-001\cores\collection1\data\
   [junit4]   2> 28960 INFO  (coreLoadExecutor-107-thread-1-processing-n:127.0.0.1:54478_ww%2Fz) [n:127.0.0.1:54478_ww%2Fz c:control_collection s:shard1 r:core_node1 x:collection1] o.a.s.c.SolrCore New index directory detected: old=null new=C:\Users\JenkinsSlave\workspace\Lucene-Solr-5.5-Windows\solr\build\solr-core\test\J1\..\..\..\..\..\..\..\..\..\Users\JenkinsSlave\workspace\Lucene-Solr-5.5-Windows\solr\build\solr-core\test\J1\temp\solr.security.PKIAuthenticationIntegrationTest_B1D13C22D40DA8F3-001\control-001\cores\collection1\data\index/
   [junit4]   2> 28960 WARN  (coreLoadExecutor-107-thread-1-processing-n:127.0.0.1:54478_ww%2Fz) [n:127.0.0.1:54478_ww%2Fz c:control_collection s:shard1 r:core_node1 x:collection1] o.a.s.c.SolrCore [collection1] Solr index directory 'C:\Users\JenkinsSlave\workspace\Lucene-Solr-5.5-Windows\solr\build\solr-core\test\J1\..\..\..\..\..\..\..\..\..\Users\JenkinsSlave\workspace\Lucene-Solr-5.5-Windows\solr\build\solr-core\test\J1\temp\solr.security.PKIAuthenticationIntegrationTest_B1D13C22D40DA8F3-001\control-001\cores\collection1\data\index' doesn't exist. Creating new index...
   [junit4]   2> 28961 INFO  (coreLoadExecutor-107-thread-1-processing-n:127.0.0.1:54478_ww%2Fz) [n:127.0.0.1:54478_ww%2Fz c:control_collection s:shard1 r:core_node1 x:collection1] o.a.s.c.CachingDirectoryFactory return new directory for C:\Users\JenkinsSlave\workspace\Lucene-Solr-5.5-Windows\solr\build\solr-core\test\J1\..\..\..\..\..\..\..\..\..\Users\JenkinsSlave\workspace\Lucene-Solr-5.5-Windows\solr\build\solr-core\test\J1\temp\solr.security.PKIAuthenticationIntegrationTest_B1D13C22D40DA8F3-001\control-001\cores\collection1\data\index
   [junit4]   2> 28961 INFO  (coreLoadExecutor-107-thread-1-processing-n:127.0.0.1:54478_ww%2Fz) [n:127.0.0.1:54478_ww%2Fz c:control_collection s:shard1 r:core_node1 x:collection1] o.a.s.u.RandomMergePolicy RandomMergePolicy wrapping class org.apache.lucene.index.LogByteSizeMergePolicy: [LogByteSizeMergePolicy: minMergeSize=1677721, mergeFactor=18, maxMergeSize=2147483648, maxMergeSizeForForcedMerge=9223372036854775807, calibrateSizeByDeletes=false, maxMergeDocs=2147483647, maxCFSSegmentSizeMB=8.796093022207999E12, noCFSRatio=0.0]
   [junit4]   2> 28961 INFO  (coreLoadExecutor-107-thread-1-processing-n:127.0.0.1:54478_ww%2Fz) [n:127.0.0.1:54478_ww%2Fz c:control_collection s:shard1 r:core_node1 x:collection1] o.a.s.c.SolrDeletionPolicy SolrDeletionPolicy.onCommit: commits: num=1
   [junit4]   2> 	commit{dir=MockDirectoryWrapper(RAMDirectory@17b5381 lockFactory=org.apache.lucene.store.SingleInstanceLockFactory@1a74f6d),segFN=segments_1,generation=1}
   [junit4]   2> 28962 INFO  (coreLoadExecutor-107-thread-1-processing-n:127.0.0.1:54478_ww%2Fz) [n:127.0.0.1:54478_ww%2Fz c:control_collection s:shard1 r:core_node1 x:collection1] o.a.s.c.SolrDeletionPolicy newest commit generation = 1
   [junit4]   2> 28962 INFO  (OldIndexDirectoryCleanupThreadForCore-collection1) [n:127.0.0.1:54478_ww%2Fz c:control_collection s:shard1 r:core_node1 x:collection1] o.a.s.c.SolrCore Looking for old index directories to cleanup for core collection1 in C:\Users\JenkinsSlave\workspace\Lucene-Solr-5.5-Windows\solr\build\solr-core\test\J1\..\..\..\..\..\..\..\..\..\Users\JenkinsSlave\workspace\Lucene-Solr-5.5-Windows\solr\build\solr-core\test\J1\temp\solr.security.PKIAuthenticationIntegrationTest_B1D13C22D40DA8F3-001\control-001\cores\collection1\data\
   [junit4]   2> 28962 WARN  (OldIndexDirectoryCleanupThreadForCore-collection1) [n:127.0.0.1:54478_ww%2Fz c:control_collection s:shard1 r:core_node1 x:collection1] o.a.s.c.DirectoryFactory C:\Users\JenkinsSlave\workspace\Lucene-Solr-5.5-Windows\solr\build\solr-core\test\J1\..\..\..\..\..\..\..\..\..\Users\JenkinsSlave\workspace\Lucene-Solr-5.5-Windows\solr\build\solr-core\test\J1\temp\solr.security.PKIAuthenticationIntegrationTest_B1D13C22D40DA8F3-001\control-001\cores\collection1\data\ does not point to a valid data directory; skipping clean-up of old index directories.
   [junit4]   2> 28969 INFO  (coreLoadExecutor-107-thread-1-processing-n:127.0.0.1:54478_ww%2Fz) [n:127.0.0.1:54478_ww%2Fz c:control_collection s:shard1 r:core_node1 x:collection1] o.a.s.u.p.UpdateRequestProcessorChain creating updateRequestProcessorChain "nodistrib"
   [junit4]   2> 28999 INFO  (coreLoadExecutor-107-thread-1-processing-n:127.0.0.1:54478_ww%2Fz) [n:127.0.0.1:54478_ww%2Fz c:control_collection s:shard1 r:core_node1 x:collection1] o.a.s.u.p.UpdateRequestProcessorChain creating updateRequestProcessorChain "dedupe"
   [junit4]   2> 28999 INFO  (coreLoadExecutor-107-thread-1-processing-n:127.0.0.1:54478_ww%2Fz) [n:127.0.0.1:54478_ww%2Fz c:control_collection s:shard1 r:core_node1 x:collection1] o.a.s.u.p.UpdateRequestProcessorChain inserting DistributedUpdateProcessorFactory into updateRequestProcessorChain "dedupe"
   [junit4]   2> 28999 INFO  (coreLoadExecutor-107-thread-1-processing-n:127.0.0.1:54478_ww%2Fz) [n:127.0.0.1:54478_ww%2Fz c:control_collection s:shard1 r:core_node1 x:collection1] o.a.s.u.p.UpdateRequestProcessorChain creating updateRequestProcessorChain "stored_sig"
   [junit4]   2> 28999 INFO  (coreLoadExecutor-107-thread-1-processing-n:127.0.0.1:54478_ww%2Fz) [n:127.0.0.1:54478_ww%2Fz c:control_collection s:shard1 r:core_node1 x:collection1] o.a.s.u.p.UpdateRequestProcessorChain inserting DistributedUpdateProcessorFactory into updateRequestProcessorChain "stored_sig"
   [junit4]   2> 29000 INFO  (coreLoadExecutor-107-thread-1-processing-n:127.0.0.1:54478_ww%2Fz) [n:127.0.0.1:54478_ww%2Fz c:control_collection s:shard1 r:core_node1 x:collection1] o.a.s.u.p.UpdateRequestProcessorChain creating updateRequestProcessorChain "distrib-dup-test-chain-explicit"
   [junit4]   2> 29000 INFO  (coreLoadExecutor-107-thread-1-processing-n:127.0.0.1:54478_ww%2Fz) [n:127.0.0.1:54478_ww%2Fz c:control_collection s:shard1 r:core_node1 x:collection1] o.a.s.u.p.UpdateRequestProcessorChain creating updateRequestProcessorChain "distrib-dup-test-chain-implicit"
   [junit4]   2> 29000 INFO  (coreLoadExecutor-107-thread-1-processing-n:127.0.0.1:54478_ww%2Fz) [n:127.0.0.1:54478_ww%2Fz c:control_collection s:shard1 r:core_node1 x:collection1] o.a.s.u.p.UpdateRequestProcessorChain inserting DistributedUpdateProcessorFactory into updateRequestProcessorChain "distrib-dup-test-chain-implicit"
   [junit4]   2> 29000 INFO  (coreLoadExecutor-107-thread-1-processing-n:127.0.0.1:54478_ww%2Fz) [n:127.0.0.1:54478_ww%2Fz c:control_collection s:shard1 r:core_node1 x:collection1] o.a.s.c.SolrCore no updateRequestProcessorChain defined as default, creating implicit default
   [junit4]   2> 29000 WARN  (coreLoadExecutor-107-thread-1-processing-n:127.0.0.1:54478_ww%2Fz) [n:127.0.0.1:54478_ww%2Fz c:control_collection s:shard1 r:core_node1 x:collection1] o.a.s.c.RequestHandlers INVALID paramSet a in requestHandler {type = requestHandler,name = /dump,class = DumpRequestHandler,args = {defaults={a=A,b=B}}}
   [junit4]   2> 29007 INFO  (coreLoadExecutor-107-thread-1-processing-n:127.0.0.1:54478_ww%2Fz) [n:127.0.0.1:54478_ww%2Fz c:control_collection s:shard1 r:core_node1 x:collection1] o.a.s.h.l.XMLLoader xsltCacheLifetimeSeconds=60
   [junit4]   2> 29011 INFO  (coreLoadExecutor-107-thread-1-processing-n:127.0.0.1:54478_ww%2Fz) [n:127.0.0.1:54478_ww%2Fz c:control_collection s:shard1 r:core_node1 x:collection1] o.a.s.h.l.XMLLoader xsltCacheLifetimeSeconds=60
   [junit4]   2> 29013 INFO  (coreLoadExecutor-107-thread-1-processing-n:127.0.0.1:54478_ww%2Fz) [n:127.0.0.1:54478_ww%2Fz c:control_collection s:shard1 r:core_node1 x:collection1] o.a.s.h.l.XMLLoader xsltCacheLifetimeSeconds=60
   [junit4]   2> 29015 INFO  (coreLoadExecutor-107-thread-1-processing-n:127.0.0.1:54478_ww%2Fz) [n:127.0.0.1:54478_ww%2Fz c:control_collection s:shard1 r:core_node1 x:collection1] o.a.s.h.l.XMLLoader xsltCacheLifetimeSeconds=60
   [junit4]   2> 29021 INFO  (coreLoadExecutor-107-thread-1-processing-n:127.0.0.1:54478_ww%2Fz) [n:127.0.0.1:54478_ww%2Fz c:control_collection s:shard1 r:core_node1 x:collection1] o.a.s.c.RequestHandlers Registered paths: /get,/admin/mbeans,/admin/file,/update,/admin/properties,/admin/logging,/replication,/admin/threads,/admin/ping,/admin/segments,/dump,/admin/luke,standard,/config,/update/json,/update/csv,/schema,/update/json/docs,/admin/system,/admin/plugins
   [junit4]   2> 29024 INFO  (coreLoadExecutor-107-thread-1-processing-n:127.0.0.1:54478_ww%2Fz) [n:127.0.0.1:54478_ww%2Fz c:control_collection s:shard1 r:core_node1 x:collection1] o.a.s.c.SolrCore Using default statsCache cache: org.apache.solr.search.stats.LocalStatsCache
   [junit4]   2> 29035 INFO  (coreLoadExecutor-107-thread-1-processing-n:127.0.0.1:54478_ww%2Fz) [n:127.0.0.1:54478_ww%2Fz c:control_collection s:shard1 r:core_node1 x:collection1] o.a.s.u.UpdateHandler Using UpdateLog implementation: org.apache.solr.update.UpdateLog
   [junit4]   2> 29035 INFO  (coreLoadExecutor-107-thread-1-processing-n:127.0.0.1:54478_ww%2Fz) [n:127.0.0.1:54478_ww%2Fz c:control_collection s:shard1 r:core_node1 x:collection1] o.a.s.u.UpdateLog Initializing UpdateLog: dataDir= defaultSyncLevel=FLUSH numRecordsToKeep=100 maxNumLogsToKeep=10 numVersionBuckets=65536
   [junit4]   2> 29045 INFO  (coreLoadExecutor-107-thread-1-processing-n:127.0.0.1:54478_ww%2Fz) [n:127.0.0.1:54478_ww%2Fz c:control_collection s:shard1 r:core_node1 x:collection1] o.a.s.u.CommitTracker Hard AutoCommit: disabled
   [junit4]   2> 29045 INFO  (coreLoadExecutor-107-thread-1-processing-n:127.0.0.1:54478_ww%2Fz) [n:127.0.0.1:54478_ww%2Fz c:control_collection s:shard1 r:core_node1 x:collection1] o.a.s.u.CommitTracker Soft AutoCommit: disabled
   [junit4]   2> 29045 INFO  (coreLoadExecutor-107-thread-1-processing-n:127.0.0.1:54478_ww%2Fz) [n:127.0.0.1:54478_ww%2Fz c:control_collection s:shard1 r:core_node1 x:collection1] o.a.s.u.RandomMergePolicy RandomMergePolicy wrapping class org.apache.lucene.index.LogByteSizeMergePolicy: [LogByteSizeMergePolicy: minMergeSize=1677721, mergeFactor=40, maxMergeSize=2147483648, maxMergeSizeForForcedMerge=9223372036854775807, calibrateSizeByDeletes=true, maxMergeDocs=2147483647, maxCFSSegmentSizeMB=8.796093022207999E12, noCFSRatio=0.17976365257643298]
   [junit4]   2> 29046 INFO  (coreLoadExecutor-107-thread-1-processing-n:127.0.0.1:54478_ww%2Fz) [n:127.0.0.1:54478_ww%2Fz c:control_collection s:shard1 r:core_node1 x:collection1] o.a.s.c.SolrDeletionPolicy SolrDeletionPolicy.onInit: commits: num=1
   [junit4]   2> 	commit{dir=MockDirectoryWrapper(RAMDirectory@17b5381 lockFactory=org.apache.lucene.store.SingleInstanceLockFactory@1a74f6d),segFN=segments_1,generation=1}
   [junit4]   2> 29046 INFO  (coreLoadExecutor-107-thread-1-processing-n:127.0.0.1:54478_ww%2Fz) [n:127.0.0.1:54478_ww%2Fz c:control_collection s:shard1 r:core_node1 x:collection1] o.a.s.c.SolrDeletionPolicy newest commit generation = 1
   [junit4]   2> 29046 INFO  (coreLoadExecutor-107-thread-1-processing-n:127.0.0.1:54478_ww%2Fz) [n:127.0.0.1:54478_ww%2Fz c:control_collection s:shard1 r:core_node1 x:collection1] o.a.s.s.SolrIndexSearcher Opening Searcher@1c76567[collection1] main
   [junit4]   2> 29046 INFO  (coreLoadExecutor-107-thread-1-processing-n:127.0.0.1:54478_ww%2Fz) [n:127.0.0.1:54478_ww%2Fz c:control_collection s:shard1 r:core_node1 x:collection1] o.a.s.c.c.ZkStateReader Load collection config from: [/collections/control_collection]
   [junit4]   2> 29048 INFO  (coreLoadExecutor-107-thread-1-processing-n:127.0.0.1:54478_ww%2Fz) [n:127.0.0.1:54478_ww%2Fz c:control_collection s:shard1 r:core_node1 x:collection1] o.a.s.c.c.ZkStateReader path=[/collections/control_collection] [configName]=[conf1] specified config exists in ZooKeeper
   [junit4]   2> 29048 INFO  (coreLoadExecutor-107-thread-1-processing-n:127.0.0.1:54478_ww%2Fz) [n:127.0.0.1:54478_ww%2Fz c:control_collection s:shard1 r:core_node1 x:collection1] o.a.s.r.ManagedResourceStorage Setting up ZooKeeper-based storage for the RestManager with znodeBase: /configs/conf1
   [junit4]   2> 29053 INFO  (coreLoadExecutor-107-thread-1-processing-n:127.0.0.1:54478_ww%2Fz) [n:127.0.0.1:54478_ww%2Fz c:control_collection s:shard1 r:core_node1 x:collection1] o.a.s.r.ManagedResourceStorage Configured ZooKeeperStorageIO with znodeBase: /configs/conf1
   [junit4]   2> 29053 INFO  (coreLoadExecutor-107-thread-1-processing-n:127.0.0.1:54478_ww%2Fz) [n:127.0.0.1:54478_ww%2Fz c:control_collection s:shard1 r:core_node1 x:collection1] o.a.s.r.RestManager Initializing RestManager with initArgs: {}
   [junit4]   2> 29053 INFO  (coreLoadExecutor-107-thread-1-processing-n:127.0.0.1:54478_ww%2Fz) [n:127.0.0.1:54478_ww%2Fz c:control_collection s:shard1 r:core_node1 x:collection1] o.a.s.r.ManagedResourceStorage Reading _rest_managed.json using ZooKeeperStorageIO:path=/configs/conf1
   [junit4]   2> 29054 INFO  (coreLoadExecutor-107-thread-1-processing-n:127.0.0.1:54478_ww%2Fz) [n:127.0.0.1:54478_ww%2Fz c:control_collection s:shard1 r:core_node1 x:collection1] o.a.s.r.ManagedResourceStorage No data found for znode /configs/conf1/_rest_managed.json
   [junit4]   2> 29054 INFO  (coreLoadExecutor-107-thread-1-processing-n:127.0.0.1:54478_ww%2Fz) [n:127.0.0.1:54478_ww%2Fz c:control_collection s:shard1 r:core_node1 x:collection1] o.a.s.r.ManagedResourceStorage Loaded null at path _rest_managed.json using ZooKeeperStorageIO:path=/configs/conf1
   [junit4]   2> 29054 INFO  (coreLoadExecutor-107-thread-1-processing-n:127.0.0.1:54478_ww%2Fz) [n:127.0.0.1:54478_ww%2Fz c:control_collection s:shard1 r:core_node1 x:collection1] o.a.s.r.RestManager Initializing 0 registered ManagedResources
   [junit4]   2> 29054 INFO  (coreLoadExecutor-107-thread-1-processing-n:127.0.0.1:54478_ww%2Fz) [n:127.0.0.1:54478_ww%2Fz c:control_collection s:shard1 r:core_node1 x:collection1] o.a.s.h.ReplicationHandler Commits will be reserved for  10000
   [junit4]   2> 29056 INFO  (searcherExecutor-108-thread-1-processing-c:control_collection x:collection1 r:core_node1 n:127.0.0.1:54478_ww%2Fz s:shard1) [n:127.0.0.1:54478_ww%2Fz c:control_collection s:shard1 r:core_node1 x:collection1] o.a.s.c.SolrCore [collection1] Registered new searcher Searcher@1c76567[collection1] main{ExitableDirectoryReader(UninvertingDirectoryReader())}
   [junit4]   2> 29056 INFO  (coreLoadExecutor-107-thread-1-processing-n:127.0.0.1:54478_ww%2Fz) [n:127.0.0.1:54478_ww%2Fz c:control_collection s:shard1 r:core_node1 x:collection1] o.a.s.u.UpdateLog Looking up max value of version field to seed version buckets
   [junit4]   2> 29056 INFO  (coreLoadExecutor-107-thread-1-processing-n:127.0.0.1:54478_ww%2Fz) [n:127.0.0.1:54478_ww%2Fz c:control_collection s:shard1 r:core_node1 x:collection1] o.a.s.u.VersionInfo Refreshing highest value of _version_ for 65536 version buckets from index
   [junit4]   2> 29056 INFO  (coreLoadExecutor-107-thread-1-processing-n:127.0.0.1:54478_ww%2Fz) [n:127.0.0.1:54478_ww%2Fz c:control_collection s:shard1 r:core_node1 x:collection1] o.a.s.u.VersionInfo No terms found for _version_, cannot seed version bucket highest value from index
   [junit4]   2> 29057 INFO  (coreLoadExecutor-107-thread-1-processing-n:127.0.0.1:54478_ww%2Fz) [n:127.0.0.1:54478_ww%2Fz c:control_collection s:shard1 r:core_node1 x:collection1] o.a.s.u.UpdateLog Could not find max version in index or recent updates, using new clock 1526845545165881344
   [junit4]   2> 29060 INFO  (coreLoadExecutor-107-thread-1-processing-n:127.0.0.1:54478_ww%2Fz) [n:127.0.0.1:54478_ww%2Fz c:control_collection s:shard1 r:core_node1 x:collection1] o.a.s.u.UpdateLog Took 4.0ms to seed version buckets with highest version 1526845545165881344
   [junit4]   2> 29063 INFO  (coreLoadExecutor-107-thread-1-processing-n:127.0.0.1:54478_ww%2Fz) [n:127.0.0.1:54478_ww%2Fz c:control_collection s:shard1 r:core_node1 x:collection1] o.a.s.c.ZkController watch zkdir /configs/conf1
   [junit4]   2> 29066 INFO  (coreLoadExecutor-107-thread-1-processing-n:127.0.0.1:54478_ww%2Fz) [n:127.0.0.1:54478_ww%2Fz c:control_collection s:shard1 r:core_node1 x:collection1] o.a.s.c.CoreContainer registering core: collection1
   [junit4]   2> 29067 INFO  (coreZkRegister-101-thread-1-processing-c:control_collection x:collection1 r:core_node1 n:127.0.0.1:54478_ww%2Fz s:shard1) [n:127.0.0.1:54478_ww%2Fz c:control_collection s:shard1 r:core_node1 x:collection1] o.a.s.c.ZkController Register replica - core:collection1 address:http://127.0.0.1:54478/ww/z collection:control_collection shard:shard1
   [junit4]   2> 29080 INFO  (coreZkRegister-101-thread-1-processing-c:control_collection x:collection1 r:core_node1 n:127.0.0.1:54478_ww%2Fz s:shard1) [n:127.0.0.1:54478_ww%2Fz c:control_collection s:shard1 r:core_node1 x:collection1] o.a.s.c.c.SolrZkClient makePath: /collections/control_collection/leader_elect/shard1/election
   [junit4]   2> 29087 INFO  (coreZkRegister-101-thread-1-processing-c:control_collection x:collection1 r:core_node1 n:127.0.0.1:54478_ww%2Fz s:shard1) [n:127.0.0.1:54478_ww%2Fz c:control_collection s:shard1 r:core_node1 x:collection1] o.a.s.c.LeaderElector Joined leadership election with path: /collections/control_collection/leader_elect/shard1/election/95427846366298116-core_node1-n_0000000000
   [junit4]   2> 29088 INFO  (coreZkRegister-101-thread-1-processing-c:control_collection x:collection1 r:core_node1 n:127.0.0.1:54478_ww%2Fz s:shard1) [n:127.0.0.1:54478_ww%2Fz c:control_collection s:shard1 r:core_node1 x:collection1] o.a.s.c.ShardLeaderElectionContext Running the leader process for shard=shard1 and weAreReplacement=false and leaderVoteWait=10000
   [junit4]   2> 29092 INFO  (coreZkRegister-101-thread-1-processing-c:control_collection x:collection1 r:core_node1 n:127.0.0.1:54478_ww%2Fz s:shard1) [n:127.0.0.1:54478_ww%2Fz c:control_collection s:shard1 r:core_node1 x:collection1] o.a.s.c.ShardLeaderElectionContext Enough replicas found to continue.
   [junit4]   2> 29092 INFO  (coreZkRegister-101-thread-1-processing-c:control_collection x:collection1 r:core_node1 n:127.0.0.1:54478_ww%2Fz s:shard1) [n:127.0.0.1:54478_ww%2Fz c:control_collection s:shard1 r:core_node1 x:collection1] o.a.s.c.ShardLeaderElectionContext I may be the new leader - try and sync
   [junit4]   2> 29092 INFO  (OverseerStateUpdate-95427846366298116-127.0.0.1:54478_ww%2Fz-n_0000000000) [n:127.0.0.1:54478_ww%2Fz    ] o.a.s.c.Overseer processMessage: queueSize: 1, message = {
   [junit4]   2>   "operation":"leader",
   [junit4]   2>   "shard":"shard1",
   [junit4]   2>   "collection":"control_collection"} current state version: 1
   [junit4]   2> 29094 INFO  (coreZkRegister-101-thread-1-processing-c:control_collection x:collection1 r:core_node1 n:127.0.0.1:54478_ww%2Fz s:shard1) [n:127.0.0.1:54478_ww%2Fz c:control_collection s:shard1 r:core_node1 x:collection1] o.a.s.c.SyncStrategy Sync replicas to http://127.0.0.1:54478/ww/z/collection1/
   [junit4]   2> 29094 INFO  (coreZkRegister-101-thread-1-processing-c:control_collection x:collection1 r:core_node1 n:127.0.0.1:54478_ww%2Fz s:shard1) [n:127.0.0.1:54478_ww%2Fz c:control_collection s:shard1 r:core_node1 x:collection1] o.a.s.c.SyncStrategy Sync Success - now sync replicas to me
   [junit4]   2> 29094 INFO  (coreZkRegister-101-thread-1-processing-c:control_collection x:collection1 r:core_node1 n:127.0.0.1:54478_ww%2Fz s:shard1) [n:127.0.0.1:54478_ww%2Fz c:control_collection s:shard1 r:core_node1 x:collection1] o.a.s.c.SyncStrategy http://127.0.0.1:54478/ww/z/collection1/ has no replicas
   [junit4]   2> 29097 INFO  (zkCallback-25-thread-1-processing-n:127.0.0.1:54478_ww%2Fz) [n:127.0.0.1:54478_ww%2Fz    ] o.a.s.c.c.ZkStateReader A cluster state change: [WatchedEvent state:SyncConnected type:NodeDataChanged path:/clusterstate.json], has occurred - updating... (live nodes size: [1])
   [junit4]   2> 29101 INFO  (coreZkRegister-101-thread-1-processing-c:control_collection x:collection1 r:core_node1 n:127.0.0.1:54478_ww%2Fz s:shard1) [n:127.0.0.1:54478_ww%2Fz c:control_collection s:shard1 r:core_node1 x:collection1] o.a.s.c.c.SolrZkClient makePath: /collections/control_collection/leaders/shard1
   [junit4]   2> 29110 INFO  (coreZkRegister-101-thread-1-processing-c:control_collection x:collection1 r:core_node1 n:127.0.0.1:54478_ww%2Fz s:shard1) [n:127.0.0.1:54478_ww%2Fz c:control_collection s:shard1 r:core_node1 x:collection1] o.a.s.c.ShardLeaderElectionContextBase Creating leader registration node
   [junit4]   2> 29140 INFO  (coreZkRegister-101-thread-1-processing-c:control_collection x:collection1 r:core_node1 n:127.0.0.1:54478_ww%2Fz s:shard1) [n:127.0.0.1:54478_ww%2Fz c:control_collection s:shard1 r:core_node1 x:collection1] o.a.s.c.ShardLeaderElectionContext I am the new leader: http://127.0.0.1:54478/ww/z/collection1/ shard1
   [junit4]   2> 29140 INFO  (OverseerStateUpdate-95427846366298116-127.0.0.1:54478_ww%2Fz-n_0000000000) [n:127.0.0.1:54478_ww%2Fz    ] o.a.s.c.Overseer processMessage: queueSize: 1, message = {
   [junit4]   2>   "operation":"leader",
   [junit4]   2>   "shard":"shard1",
   [junit4]   2>   "collection":"control_collection",
   [junit4]   2>   "base_url":"http://127.0.0.1:54478/ww/z",
   [junit4]   2>   "core":"collection1",
   [junit4]   2>   "state":"active"} current state version: 2
   [junit4]   2> 29246 INFO  (zkCallback-25-thread-1-processing-n:127.0.0.1:54478_ww%2Fz) [n:127.0.0.1:54478_ww%2Fz    ] o.a.s.c.c.ZkStateReader A cluster state change: [WatchedEvent state:SyncConnected type:NodeDataChanged path:/clusterstate.json], has occurred - updating... (live nodes size: [1])
   [junit4]   2> 29293 INFO  (coreZkRegister-101-thread-1-processing-c:control_collection x:collection1 r:core_node1 n:127.0.0.1:54478_ww%2Fz s:shard1) [n:127.0.0.1:54478_ww%2Fz c:control_collection s:shard1 r:core_node1 x:collection1] o.a.s.c.ZkController We are http://127.0.0.1:54478/ww/z/collection1/ and leader is http://127.0.0.1:54478/ww/z/collection1/
   [junit4]   2> 29296 INFO  (coreZkRegister-101-thread-1-processing-c:control_collection x:collection1 r:core_node1 n:127.0.0.1:54478_ww%2Fz s:shard1) [n:127.0.0.1:54478_ww%2Fz c:control_collection s:shard1 r:core_node1 x:collection1] o.a.s.c.ZkController No LogReplay needed for core=collection1 baseURL=http://127.0.0.1:54478/ww/z
   [junit4]   2> 29296 INFO  (coreZkRegister-101-thread-1-processing-c:control_collection x:collection1 r:core_node1 n:127.0.0.1:54478_ww%2Fz s:shard1) [n:127.0.0.1:54478_ww%2Fz c:control_collection s:shard1 r:core_node1 x:collection1] o.a.s.c.ZkController I am the leader, no recovery necessary
   [junit4]   2> 29296 INFO  (coreZkRegister-101-thread-1-processing-c:control_collection x:collection1 r:core_node1 n:127.0.0.1:54478_ww%2Fz s:shard1) [n:127.0.0.1:54478_ww%2Fz c:control_collection s:shard1 r:core_node1 x:collection1] o.a.s.c.ZkController publishing state=active
   [junit4]   2> 29296 INFO  (coreZkRegister-101-thread-1-processing-c:control_collection x:collection1 r:core_node1 n:127.0.0.1:54478_ww%2Fz s:shard1) [n:127.0.0.1:54478_ww%2Fz c:control_collection s:shard1 r:core_node1 x:collection1] o.a.s.c.ZkController numShards not found on descriptor - reading it from system property
   [junit4]   2> 29299 INFO  (OverseerStateUpdate-95427846366298116-127.0.0.1:54478_ww%2Fz-n_0000000000) [n:127.0.0.1:54478_ww%2Fz    ] o.a.s.c.Overseer processMessage: queueSize: 1, message = {
   [junit4]   2>   "collection":"control_collection",
   [junit4]   2>   "base_url":"http://127.0.0.1:54478/ww/z",
   [junit4]   2>   "core":"collection1",
   [junit4]   2>   "operation":"state",
   [junit4]   2>   "node_name":"127.0.0.1:54478_ww%2Fz",
   [junit4]   2>   "numShards":"1",
   [junit4]   2>   "shard":"shard1",
   [junit4]   2>   "roles":null,
   [junit4]   2>   "core_node_name":"core_node1",
   [junit4]   2>   "state":"active"} current state version: 3
   [junit4]   2> 29300 INFO  (OverseerStateUpdate-95427846366298116-127.0.0.1:54478_ww%2Fz-n_0000000000) [n:127.0.0.1:54478_ww%2Fz    ] o.a.s.c.o.ReplicaMutator Update state numShards=1 message={
   [junit4]   2>   "collection":"control_collection",
   [junit4]   2>   "base_url":"http://127.0.0.1:54478/ww/z",
   [junit4]   2>   "core":"collection1",
   [junit4]   2>   "operation":"state",
   [junit4]   2>   "node_name":"127.0.0.1:54478_ww%2Fz",
   [junit4]   2>   "numShards":"1",
   [junit4]   2>   "shard":"shard1",
   [junit4]   2>   "roles":null,
   [junit4]   2>   "core_node_name":"core_node1",
   [junit4]   2>   "state":"active"}
   [junit4]   2> 29322 INFO  (TEST-PKIAuthenticationIntegrationTest.testPkiAuth-seed#[B1D13C22D40DA8F3]) [    ] o.a.s.c.c.SolrZkClient Using default ZkCredentialsProvider
   [junit4]   2> 29324 INFO  (TEST-PKIAuthenticationIntegrationTest.testPkiAuth-seed#[B1D13C22D40DA8F3]) [    ] o.a.s.c.c.ConnectionManager Waiting for client to connect to ZooKeeper
   [junit4]   2> 29326 INFO  (zkCallback-27-thread-1) [    ] o.a.s.c.c.ConnectionManager Watcher org.apache.solr.common.cloud.ConnectionManager@1583737 name:ZooKeeperConnection Watcher:127.0.0.1:54471/solr got event WatchedEvent state:SyncConnected type:None path:null path:null type:None
   [junit4]   2> 29326 INFO  (TEST-PKIAuthenticationIntegrationTest.testPkiAuth-seed#[B1D13C22D40DA8F3]) [    ] o.a.s.c.c.ConnectionManager Client is connected to ZooKeeper
   [junit4]   2> 29326 INFO  (TEST-PKIAuthenticationIntegrationTest.testPkiAuth-seed#[B1D13C22D40DA8F3]) [    ] o.a.s.c.c.SolrZkClient Using default ZkACLProvider
   [junit4]   2> 29326 INFO  (TEST-PKIAuthenticationIntegrationTest.testPkiAuth-seed#[B1D13C22D40DA8F3]) [    ] o.a.s.c.c.ZkStateReader Updating cluster state from ZooKeeper... 
   [junit4]   2> 29333 INFO  (TEST-PKIAuthenticationIntegrationTest.testPkiAuth-seed#[B1D13C22D40DA8F3]) [    ] o.a.s.c.ChaosMonkey monkey: init - expire sessions:false cause connection loss:false
   [junit4]   2> 29405 INFO  (zkCallback-27-thread-1) [    ] o.a.s.c.c.ZkStateReader A cluster state change: [WatchedEvent state:SyncConnected type:NodeDataChanged path:/clusterstate.json], has occurred - updating... (live nodes size: [1])
   [junit4]   2> 29406 INFO  (zkCallback-25-thread-1-processing-n:127.0.0.1:54478_ww%2Fz) [n:127.0.0.1:54478_ww%2Fz    ] o.a.s.c.c.ZkStateReader A cluster state change: [WatchedEvent state:SyncConnected type:NodeDataChanged path:/clusterstate.json], has occurred - updating... (live nodes size: [1])
   [junit4]   2> 29821 INFO  (TEST-PKIAuthenticationIntegrationTest.testPkiAuth-seed#[B1D13C22D40DA8F3]) [    ] o.a.s.SolrTestCaseJ4 Writing core.properties file to C:\Users\JenkinsSlave\workspace\Lucene-Solr-5.5-Windows\solr\build\solr-core\test\J1\temp\solr.security.PKIAuthenticationIntegrationTest_B1D13C22D40DA8F3-001\shard-1-001\cores\collection1
   [junit4]   2> 29824 INFO  (TEST-PKIAuthenticationIntegrationTest.testPkiAuth-seed#[B1D13C22D40DA8F3]) [    ] o.a.s.c.AbstractFullDistribZkTestBase create jetty 1 in directory C:\Users\JenkinsSlave\workspace\Lucene-Solr-5.5-Windows\solr\build\solr-core\test\J1\temp\solr.security.PKIAuthenticationIntegrationTest_B1D13C22D40DA8F3-001\shard-1-001
   [junit4]   2> 29824 INFO  (TEST-PKIAuthenticationIntegrationTest.testPkiAuth-seed#[B1D13C22D40DA8F3]) [    ] o.e.j.s.Server jetty-9.2.13.v20150730
   [junit4]   2> 29828 INFO  (TEST-PKIAuthenticationIntegrationTest.testPkiAuth-seed#[B1D13C22D40DA8F3]) [    ] o.e.j.s.h.ContextHandler Started o.e.j.s.ServletContextHandler@1e2d422{/ww/z,null,AVAILABLE}
   [junit4]   2> 29829 INFO  (TEST-PKIAuthenticationIntegrationTest.testPkiAuth-seed#[B1D13C22D40DA8F3]) [    ] o.e.j.s.ServerConnector Started ServerConnector@d544bf{HTTP/1.1}{127.0.0.1:54506}
   [junit4]   2> 29829 INFO  (TEST-PKIAuthenticationIntegrationTest.testPkiAuth-seed#[B1D13C22D40DA8F3]) [    ] o.e.j.s.Server Started @33739ms
   [junit4]   2> 29829 INFO  (TEST-PKIAuthenticationIntegrationTest.testPkiAuth-seed#[B1D13C22D40DA8F3]) [    ] o.a.s.c.s.e.JettySolrRunner Jetty properties: {coreRootDirectory=C:\Users\JenkinsSlave\workspace\Lucene-Solr-5.5-Windows\solr\build\solr-core\test\J1\temp\solr.security.PKIAuthenticationIntegrationTest_B1D13C22D40DA8F3-001\shard-1-001\cores, hostPort=54506, hostContext=/ww/z, solr.data.dir=C:\Users\JenkinsSlave\workspace\Lucene-Solr-5.5-Windows\solr\build\solr-core\test\J1\temp\solr.security.PKIAuthenticationIntegrationTest_B1D13C22D40DA8F3-001\tempDir-001/jetty1, solrconfig=solrconfig.xml}
   [junit4]   2> 29830 INFO  (TEST-PKIAuthenticationIntegrationTest.testPkiAuth-seed#[B1D13C22D40DA8F3]) [    ] o.a.s.s.SolrDispatchFilter SolrDispatchFilter.init(): sun.misc.Launcher$AppClassLoader@752144
   [junit4]   2> 29830 INFO  (TEST-PKIAuthenticationIntegrationTest.testPkiAuth-seed#[B1D13C22D40DA8F3]) [    ] o.a.s.c.SolrResourceLoader new SolrResourceLoader for directory: 'C:\Users\JenkinsSlave\workspace\Lucene-Solr-5.5-Windows\solr\build\solr-core\test\J1\temp\solr.security.PKIAuthenticationIntegrationTest_B1D13C22D40DA8F3-001\shard-1-001'
   [junit4]   2> 29830 INFO  (TEST-PKIAuthenticationIntegrationTest.testPkiAuth-seed#[B1D13C22D40DA8F3]) [    ] o.a.s.c.SolrResourceLoader JNDI not configured for solr (NoInitialContextEx)
   [junit4]   2> 29830 INFO  (TEST-PKIAuthenticationIntegrationTest.testPkiAuth-seed#[B1D13C22D40DA8F3]) [    ] o.a.s.c.SolrResourceLoader solr home defaulted to 'solr/' (could not find system property or JNDI)
   [junit4]   2> 29831 INFO  (TEST-PKIAuthenticationIntegrationTest.testPkiAuth-seed#[B1D13C22D40DA8F3]) [    ] o.a.s.c.c.SolrZkClient Using default ZkCredentialsProvider
   [junit4]   2> 29831 INFO  (TEST-PKIAuthenticationIntegrationTest.testPkiAuth-seed#[B1D13C22D40DA8F3]) [    ] o.a.s.c.c.ConnectionManager Waiting for client to connect to ZooKeeper
   [junit4]   2> 29833 INFO  (zkCallback-28-thread-1) [    ] o.a.s.c.c.ConnectionManager Watcher org.apache.solr.common.cloud.ConnectionManager@164b21d name:ZooKeeperConnection Watcher:127.0.0.1:54471/solr got event WatchedEvent state:SyncConnected type:None path:null path:null type:None
   [junit4]   2> 29834 INFO  (TEST-PKIAuthenticationIntegrationTest.testPkiAuth-seed#[B1D13C22D40DA8F3]) [    ] o.a.s.c.c.ConnectionManager Client is connected to ZooKeeper
   [junit4]   2> 29834 INFO  (TEST-PKIAuthenticationIntegrationTest.testPkiAuth-seed#[B1D13C22D40DA8F3]) [    ] o.a.s.c.c.SolrZkClient Using default ZkACLProvider
   [junit4]   2> 29836 INFO  (TEST-PKIAuthenticationIntegrationTest.testPkiAuth-seed#[B1D13C22D40DA8F3]) [    ] o.a.s.s.SolrDispatchFilter Loading solr.xml from SolrHome (not found in ZooKeeper)
   [junit4]   2> 29836 INFO  (TEST-PKIAuthenticationIntegrationTest.testPkiAuth-seed#[B1D13C22D40DA8F3]) [    ] o.a.s.c.SolrXmlConfig Loading container configuration from C:\Users\JenkinsSlave\workspace\Lucene-Solr-5.5-Windows\solr\build\solr-core\test\J1\temp\solr.security.PKIAuthenticationIntegrationTest_B1D13C22D40DA8F3-001\shard-1-001\solr.xml
   [junit4]   2> 29861 INFO  (TEST-PKIAuthenticationIntegrationTest.testPkiAuth-seed#[B1D13C22D40DA8F3]) [    ] o.a.s.c.CorePropertiesLocator Config-defined core root directory: C:\Users\JenkinsSlave\workspace\Lucene-Solr-5.5-Windows\solr\build\solr-core\test\J1\temp\solr.security.PKIAuthenticationIntegrationTest_B1D13C22D40DA8F3-001\shard-1-001\cores
   [junit4]   2> 29861 INFO  (TEST-PKIAuthenticationIntegrationTest.testPkiAuth-seed#[B1D13C22D40DA8F3]) [    ] o.a.s.c.CoreContainer New CoreContainer 28365105
   [junit4]   2> 29861 INFO  (TEST-PKIAuthenticationIntegrationTest.testPkiAuth-seed#[B1D13C22D40DA8F3]) [    ] o.a.s.c.CoreContainer Loading cores into CoreContainer [instanceDir=C:\Users\JenkinsSlave\workspace\Lucene-Solr-5.5-Windows\solr\build\solr-core\test\J1\temp\solr.security.PKIAuthenticationIntegrationTest_B1D13C22D40DA8F3-001\shard-1-001]
   [junit4]   2> 29861 WARN  (TEST-PKIAuthenticationIntegrationTest.testPkiAuth-seed#[B1D13C22D40DA8F3]) [    ] o.a.s.c.CoreContainer Couldn't add files from C:\Users\JenkinsSlave\workspace\Lucene-Solr-5.5-Windows\solr\build\solr-core\test\J1\temp\solr.security.PKIAuthenticationIntegrationTest_B1D13C22D40DA8F3-001\shard-1-001\lib to classpath: C:\Users\JenkinsSlave\workspace\Lucene-Solr-5.5-Windows\solr\build\solr-core\test\J1\temp\solr.security.PKIAuthenticationIntegrationTest_B1D13C22D40DA8F3-001\shard-1-001\lib
   [junit4]   2> 29862 INFO  (TEST-PKIAuthenticationIntegrationTest.testPkiAuth-seed#[B1D13C22D40DA8F3]) [    ] o.a.s.h.c.HttpShardHandlerFactory created with socketTimeout : 90000,urlScheme : ,connTimeout : 15000,maxConnectionsPerHost : 20,maxConnections : 10000,corePoolSize : 0,maximumPoolSize : 2147483647,maxThreadIdleTime : 5,sizeOfQueue : -1,fairnessPolicy : false,useRetries : false,
   [junit4]   2> 29864 INFO  (TEST-PKIAuthenticationIntegrationTest.testPkiAuth-seed#[B1D13C22D40DA8F3]) [    ] o.a.s.u.UpdateShardHandler Creating UpdateShardHandler HTTP client with params: socketTimeout=340000&connTimeout=45000&retry=true
   [junit4]   2> 29865 INFO  (TEST-PKIAuthenticationIntegrationTest.testPkiAuth-seed#[B1D13C22D40DA8F3]) [    ] o.a.s.l.LogWatcher SLF4J impl is org.slf4j.impl.Log4jLoggerFactory
   [junit4]   2> 29866 INFO  (TEST-PKIAuthenticationIntegrationTest.testPkiAuth-seed#[B1D13C22D40DA8F3]) [    ] o.a.s.l.LogWatcher Registering Log Listener [Log4j (org.slf4j.impl.Log4jLoggerFactory)]
   [junit4]   2> 29866 INFO  (TEST-PKIAuthenticationIntegrationTest.testPkiAuth-seed#[B1D13C22D40DA8F3]) [    ] o.a.s.c.ZkContainer Zookeeper client=127.0.0.1:54471/solr
   [junit4]   2> 29866 INFO  (TEST-PKIAuthenticationIntegrationTest.testPkiAuth-seed#[B1D13C22D40DA8F3]) [    ] o.a.s.c.ZkController zkHost includes chroot
   [junit4]   2> 29866 INFO  (TEST-PKIAuthenticationIntegrationTest.testPkiAuth-seed#[B1D13C22D40DA8F3]) [    ] o.a.s.c.c.SolrZkClient Using default ZkCredentialsProvider
   [junit4]   2> 29867 INFO  (TEST-PKIAuthenticationIntegrationTest.testPkiAuth-seed#[B1D13C22D40DA8F3]) [    ] o.a.s.c.c.ConnectionManager Waiting for client to connect to ZooKeeper
   [junit4]   2> 29870 INFO  (zkCallback-31-thread-1) [    ] o.a.s.c.c.ConnectionManager Watcher org.apache.solr.common.cloud.ConnectionManager@125570d name:ZooKeeperConnection Watcher:127.0.0.1:54471 got event WatchedEvent state:SyncConnected type:None path:null path:null type:None
   [junit4]   2> 29870 INFO  (TEST-PKIAuthenticationIntegrationTest.testPkiAuth-seed#[B1D13C22D40DA8F3]) [    ] o.a.s.c.c.ConnectionManager Client is connected to ZooKeeper
   [junit4]   2> 29870 INFO  (TEST-PKIAuthenticationIntegrationTest.testPkiAuth-seed#[B1D13C22D40DA8F3]) [    ] o.a.s.c.c.SolrZkClient Using default ZkACLProvider
   [junit4]   2> 29877 INFO  (TEST-PKIAuthenticationIntegrationTest.testPkiAuth-seed#[B1D13C22D40DA8F3]) [n:127.0.0.1:54506_ww%2Fz    ] o.a.s.c.c.ConnectionManager Waiting for client to connect to ZooKeeper
   [junit4]   2> 29880 INFO  (zkCallback-32-thread-1-processing-n:127.0.0.1:54506_ww%2Fz) [n:127.0.0.1:54506_ww%2Fz    ] o.a.s.c.c.ConnectionManager Watcher org.apache.solr.common.cloud.ConnectionManager@14b7910 name:ZooKeeperConnection Watcher:127.0.0.1:54471/solr got event WatchedEvent state:SyncConnected type:None path:null path:null type:None
   [junit4]   2> 29880 INFO  (TEST-PKIAuthenticationIntegrationTest.testPkiAuth-seed#[B1D13C22D40DA8F3]) [n:127.0.0.1:54506_ww%2Fz    ] o.a.s.c.c.ConnectionManager Client is connected to ZooKeeper
   [junit4]   2> 29891 INFO  (TEST-PKIAuthenticationIntegrationTest.testPkiAuth-seed#[B1D13C22D40DA8F3]) [n:127.0.0.1:54506_ww%2Fz    ] o.a.s.c.c.ZkStateReader Updating cluster state from ZooKeeper... 
   [junit4]   2> 30904 INFO  (TEST-PKIAuthenticationIntegrationTest.testPkiAuth-seed#[B1D13C22D40DA8F3]) [n:127.0.0.1:54506_ww%2Fz    ] o.a.s.c.ZkController Register node as live in ZooKeeper:/live_nodes/127.0.0.1:54506_ww%2Fz
   [junit4]   2> 30906 INFO  (TEST-PKIAuthenticationIntegrationTest.testPkiAuth-seed#[B1D13C22D40DA8F3]) [n:127.0.0.1:54506_ww%2Fz    ] o.a.s.c.c.SolrZkClient makePath: /live_nodes/127.0.0.1:54506_ww%2Fz
   [junit4]   2> 30909 INFO  (zkCallback-27-thread-1) [    ] o.a.s.c.c.ZkStateReader A live node change: [WatchedEvent state:SyncConnected type:NodeChildrenChanged path:/live_nodes], has occurred - updating... (live nodes size: [1])
   [junit4]   2> 30909 INFO  (zkCallback-25-thread-1-processing-n:127.0.0.1:54478_ww%2Fz) [n:127.0.0.1:54478_ww%2Fz    ] o.a.s.c.c.ZkStateReader A live node change: [WatchedEvent state:SyncConnected type:NodeChildrenChanged path:/live_nodes], has occurred - updating... (live nodes size: [1])
   [junit4]   2> 30909 INFO  (zkCallback-32-thread-1-processing-n:127.0.0.1:54506_ww%2Fz) [n:127.0.0.1:54506_ww%2Fz    ] o.a.s.c.c.ZkStateReader A live node change: [WatchedEvent state:SyncConnected type:NodeChildrenChanged path:/live_nodes], has occurred - updating... (live nodes size: [1])
   [junit4]   2> 30913 INFO  (TEST-PKIAuthenticationIntegrationTest.testPkiAuth-seed#[B1D13C22D40DA8F3]) [n:127.0.0.1:54506_ww%2Fz    ] o.a.s.c.Overseer Overseer (id=null) closing
   [junit4]   2> 30914 INFO  (TEST-PKIAuthenticationIntegrationTest.testPkiAuth-seed#[B1D13C22D40DA8F3]) [n:127.0.0.1:54506_ww%2Fz    ] o.a.s.c.LeaderElector Joined leadership election with path: /overseer_elect/election/95427846366298120-127.0.0.1:54506_ww%2Fz-n_0000000001
   [junit4]   2> 30919 INFO  (TEST-PKIAuthenticationIntegrationTest.testPkiAuth-seed#[B1D13C22D40DA8F3]) [n:127.0.0.1:54506_ww%2Fz    ] o.a.s.c.LeaderElector Watching path /overseer_elect/election/95427846366298116-127.0.0.1:54478_ww%2Fz-n_0000000000 to know if I could be the leader
   [junit4]   2> 31020 INFO  (TEST-PKIAuthenticationIntegrationTest.testPkiAuth-seed#[B1D13C22D40DA8F3]) [n:127.0.0.1:54506_ww%2Fz    ] o.a.s.c.CoreContainer Security conf doesn't exist. Skipping setup for authorization module.
   [junit4]   2> 31020 INFO  (TEST-PKIAuthenticationIntegrationTest.testPkiAuth-seed#[B1D13C22D40DA8F3]) [n:127.0.0.1:54506_ww%2Fz    ] o.a.s.c.CoreContainer No authentication plugin used.
   [junit4]   2> 31022 INFO  (TEST-PKIAuthenticationIntegrationTest.testPkiAuth-seed#[B1D13C22D40DA8F3]) [n:127.0.0.1:54506_ww%2Fz    ] o.a.s.c.CorePropertiesLocator Looking for core definitions underneath C:\Users\JenkinsSlave\workspace\Lucene-Solr-5.5-Windows\solr\build\solr-core\test\J1\temp\solr.security.PKIAuthenticationIntegrationTest_B1D13C22D40DA8F3-001\shard-1-001\cores
   [junit4]   2> 31025 INFO  (TEST-PKIAuthenticationIntegrationTest.testPkiAuth-seed#[B1D13C22D40DA8F3]) [n:127.0.0.1:54506_ww%2Fz    ] o.a.s.c.CoreDescriptor Created CoreDescriptor: {configSetProperties=configsetprops.json, collection=collection1, transient=false, loadOnStartup=true, config=solrconfig.xml, shard=, coreNodeName=, schema=schema.xml, name=collection1, dataDir=data\}
   [junit4]   2> 31025 INFO  (TEST-PKIAuthenticationIntegrationTest.testPkiAuth-seed#[B1D13C22D40DA8F3]) [n:127.0.0.1:54506_ww%2Fz    ] o.a.s.c.CorePropertiesLocator Found core collection1 in C:\Users\JenkinsSlave\workspace\Lucene-Solr-5.5-Windows\solr\build\solr-core\test\J1\temp\solr.security.PKIAuthenticationIntegrationTest_B1D13C22D40DA8F3-001\shard-1-001\cores\collection1
   [junit4]   2> 31025 INFO  (TEST-PKIAuthenticationIntegrationTest.testPkiAuth-seed#[B1D13C22D40DA8F3]) [n:127.0.0.1:54506_ww%2Fz    ] o.a.s.c.CorePropertiesLocator Found 1 core definitions
   [junit4]   2> 31027 INFO  (TEST-PKIAuthenticationIntegrationTest.testPkiAuth-seed#[B1D13C22D40DA8F3]) [n:127.0.0.1:54506_ww%2Fz    ] o.a.s.s.SolrDispatchFilter user.dir=C:\Users\JenkinsSlave\workspace\Lucene-Solr-5.5-Windows\solr\build\solr-core\test\J1
   [junit4]   2> 31027 INFO  (TEST-PKIAuthenticationIntegrationTest.testPkiAuth-seed#[B1D13C22D40DA8F3]) [n:127.0.0.1:54506_ww%2Fz    ] o.a.s.s.SolrDispatchFilter SolrDispatchFilter.init() done
   [junit4]   2> 31035 INFO  (coreLoadExecutor-118-thread-1-processing-n:127.0.0.1:54506_ww%2Fz) [n:127.0.0.1:54506_ww%2Fz c:collection1   x:collection1] o.a.s.c.ZkController publishing state=down
   [junit4]   2> 31035 INFO  (coreLoadExecutor-118-thread-1-processing-n:127.0.0.1:54506_ww%2Fz) [n:127.0.0.1:54506_ww%2Fz c:collection1   x:collection1] o.a.s.c.ZkController numShards not found on descriptor - reading it from system property
   [junit4]   2> 31040 INFO  (coreLoadExecutor-118-thread-1-processing-n:127.0.0.1:54506_ww%2Fz) [n:127.0.0.1:54506_ww%2Fz c:collection1   x:collection1] o.a.s.c.ZkController look for our core node name
   [junit4]   2> 31042 INFO  (OverseerStateUpdate-95427846366298116-127.0.0.1:54478_ww%2Fz-n_0000000000) [n:127.0.0.1:54478_ww%2Fz    ] o.a.s.c.Overseer processMessage: queueSize: 1, message = {
   [junit4]   2>   "collection":"collection1",
   [junit4]   2>   "base_url":"http://127.0.0.1:54506/ww/z",
   [junit4]   2>   "core":"collection1",
   [junit4]   2>   "operation":"state",
   [junit4]   2>   "node_name":"127.0.0.1:54506_ww%2Fz",
   [junit4]   2>   "numShards":"2",
   [junit4]   2>   "shard":null,
   [junit4]   2>   "roles":null,
   [junit4]   2>   "state":"down"} current state version: 4
   [junit4]   2> 31043 INFO  (OverseerStateUpdate-95427846366298116-127.0.0.1:54478_ww%2Fz-n_0000000000) [n:127.0.0.1:54478_ww%2Fz    ] o.a.s.c.o.ReplicaMutator Update state numShards=2 message={
   [junit4]   2>   "collection":"collection1",
   [junit4]   2>   "base_url":"http://127.0.0.1:54506/ww/z",
   [junit4]   2>   "core":"collection1",
   [junit4]   2>   "operation":"state",
   [junit4]   2>   "node_name":"127.0.0.1:54506_ww%2Fz",
   [junit4]   2>   "numShards":"2",
   [junit4]   2>   "shard":null,
   [junit4]   2>   "roles":null,
   [junit4]   2>   "state":"down"}
   [junit4]   2> 31043 INFO  (OverseerStateUpdate-95427846366298116-127.0.0.1:54478_ww%2Fz-n_0000000000) [n:127.0.0.1:54478_ww%2Fz    ] o.a.s.c.o.ClusterStateMutator building a new cName: collection1
   [junit4]   2> 31043 INFO  (OverseerStateUpdate-95427846366298116-127.0.0.1:54478_ww%2Fz-n_0000000000) [n:127.0.0.1:54478_ww%2Fz    ] o.a.s.c.o.ReplicaMutator Assigning new node to shard shard=shard2
   [junit4]   2> 31046 INFO  (zkCallback-25-thread-1-processing-n:127.0.0.1:54478_ww%2Fz) [n:127.0.0.1:54478_ww%2Fz    ] o.a.s.c.c.ZkStateReader A cluster state change: [WatchedEvent state:SyncConnected type:NodeDataChanged path:/clusterstate.json], has occurred - updating... (live nodes size: [2])
   [junit4]   2> 31046 INFO  (zkCallback-27-thread-1) [    ] o.a.s.c.c.ZkStateReader A cluster state change: [WatchedEvent state:SyncConnected type:NodeDataChanged path:/clusterstate.json], has occurred - updating... (live nodes size: [2])
   [junit4]   2> 31046 INFO  (zkCallback-32-thread-1-processing-n:127.0.0.1:54506_ww%2Fz) [n:127.0.0.1:54506_ww%2Fz    ] o.a.s.c.c.ZkStateReader A cluster state change: [WatchedEvent state:SyncConnected type:NodeDataChanged path:/clusterstate.json], has occurred - updating... (live nodes size: [2])
   [junit4]   2> 32042 INFO  (coreLoadExecutor-118-thread-1-processing-n:127.0.0.1:54506_ww%2Fz) [n:127.0.0.1:54506_ww%2Fz c:collection1   x:collection1] o.a.s.c.ZkController waiting to find shard id in clusterstate for collection1
   [junit4]   2> 32042 INFO  (coreLoadExecutor-118-thread-1-processing-n:127.0.0.1:54506_ww%2Fz) [n:127.0.0.1:54506_ww%2Fz c:collection1   x:collection1] o.a.s.c.ZkController Check for collection zkNode:collection1
   [junit4]   2> 32043 INFO  (coreLoadExecutor-118-thread-1-processing-n:127.0.0.1:54506_ww%2Fz) [n:127.0.0.1:54506_ww%2Fz c:collection1   x:collection1] o.a.s.c.ZkController Collection zkNode exists
   [junit4]   2> 32043 INFO  (coreLoadExecutor-118-thread-1-processing-n:127.0.0.1:54506_ww%2Fz) [n:127.0.0.1:54506_ww%2Fz c:collection1   x:collection1] o.a.s.c.c.ZkStateReader Load collection config from: [/collections/collection1]
   [junit4]   2> 32044 INFO  (coreLoadExecutor-118-thread-1-processing-n:127.0.0.1:54506_ww%2Fz) [n:127.0.0.1:54506_ww%2Fz c:collection1   x:collection1] o.a.s.c.c.ZkStateReader path=[/collections/collection1] [configName]=[conf1] specified config exists in ZooKeeper
   [junit4]   2> 32044 INFO  (coreLoadExecutor-118-thread-1-processing-n:127.0.0.1:54506_ww%2Fz) [n:127.0.0.1:54506_ww%2Fz c:collection1   x:collection1] o.a.s.c.SolrResourceLoader new SolrResourceLoader for directory: 'C:\Users\JenkinsSlave\workspace\Lucene-Solr-5.5-Windows\solr\build\solr-core\test\J1\temp\solr.security.PKIAuthenticationIntegrationTest_B1D13C22D40DA8F3-001\shard-1-001\cores\collection1'
   [junit4]   2> 32044 INFO  (coreLoadExecutor-118-thread-1-processing-n:127.0.0.1:54506_ww%2Fz) [n:127.0.0.1:54506_ww%2Fz c:collection1   x:collection1] o.a.s.c.SolrResourceLoader JNDI not configured for solr (NoInitialContextEx)
   [junit4]   2> 32044 INFO  (coreLoadExecutor-118-thread-1-processing-n:127.0.0.1:54506_ww%2Fz) [n:127.0.0.1:54506_ww%2Fz c:collection1   x:collection1] o.a.s.c.SolrResourceLoader solr home defaulted to 'solr/' (could not find system property or JNDI)
   [junit4]   2> 32047 INFO  (coreLoadExecutor-118-thread-1-processing-n:127.0.0.1:54506_ww%2Fz) [n:127.0.0.1:54506_ww%2Fz c:collection1   x:collection1] o.a.s.c.Config loaded config solrconfig.xml with version 0 
   [junit4]   2> 32062 INFO  (coreLoadExecutor-118-thread-1-processing-n:127.0.0.1:54506_ww%2Fz) [n:127.0.0.1:54506_ww%2Fz c:collection1   x:collection1] o.a.s.c.SolrConfig current version of requestparams : -1
   [junit4]   2> 32088 INFO  (coreLoadExecutor-118-thread-1-processing-n:127.0.0.1:54506_ww%2Fz) [n:127.0.0.1:54506_ww%2Fz c:collection1   x:collection1] o.a.s.c.SolrConfig Using Lucene MatchVersion: 5.5.0
   [junit4]   2> 32132 INFO  (coreLoadExecutor-118-thread-1-processing-n:127.0.0.1:54506_ww%2Fz) [n:127.0.0.1:54506_ww%2Fz c:collection1   x:collection1] o.a.s.c.SolrConfig Loaded SolrConfig: solrconfig.xml
   [junit4]   2> 32142 INFO  (coreLoadExecutor-118-thread-1-processing-n:127.0.0.1:54506_ww%2Fz) [n:127.0.0.1:54506_ww%2Fz c:collection1   x:collection1] o.a.s.s.IndexSchema [collection1] Schema name=test
   [junit4]   2> 32463 INFO  (coreLoadExecutor-118-thread-1-processing-n:127.0.0.1:54506_ww%2Fz) [n:127.0.0.1:54506_ww%2Fz c:collection1   x:collection1] o.a.s.s.OpenExchangeRatesOrgProvider Initialized with rates=open-exchange-rates.json, refreshInterval=1440.
   [junit4]   2> 32475 INFO  (coreLoadExecutor-118-thread-1-processing-n:127.0.0.1:54506_ww%2Fz) [n:127.0.0.1:54506_ww%2Fz c:collection1   x:collection1] o.a.s.s.IndexSchema default search field in schema is text
   [junit4]   2> 32477 INFO  (coreLoadExecutor-118-thread-1-processing-n:127.0.0.1:54506_ww%2Fz) [n:127.0.0.1:54506_ww%2Fz c:collection1   x:collection1] o.a.s.s.IndexSchema unique key field: id
   [junit4]   2> 32500 INFO  (coreLoadExecutor-118-thread-1-processing-n:127.0.0.1:54506_ww%2Fz) [n:127.0.0.1:54506_ww%2Fz c:collection1   x:collection1] o.a.s.s.FileExchangeRateProvider Reloading exchange rates from file currency.xml
   [junit4]   2> 32504 INFO  (coreLoadExecutor-118-thread-1-processing-n:127.0.0.1:54506_ww%2Fz) [n:127.0.0.1:54506_ww%2Fz c:collection1   x:collection1] o.a.s.s.FileExchangeRateProvider Reloading exchange rates from file currency.xml
   [junit4]   2> 32509 INFO  (coreLoadExecutor-118-thread-1-processing-n:127.0.0.1:54506_ww%2Fz) [n:127.0.0.1:54506_ww%2Fz c:collection1   x:collection1] o.a.s.s.OpenExchangeRatesOrgProvider Reloading exchange rates from open-exchange-rates.json
   [junit4]   2> 32510 INFO  (coreLoadExecutor-118-thread-1-processing-n:127.0.0.1:54506_ww%2Fz) [n:127.0.0.1:54506_ww%2Fz c:collection1   x:collection1] o.a.s.s.OpenExchangeRatesOrgProvider Reloading exchange rates from open-exchange-rates.json
   [junit4]   2> 32515 INFO  (coreLoadExecutor-118-thread-1-processing-n:127.0.0.1:54506_ww%2Fz) [n:127.0.0.1:54506_ww%2Fz c:collection1   x:collection1] o.a.s.c.ConfigSetProperties Did not find ConfigSet properties, assuming default properties: Can't find resource 'configsetprops.json' in classpath or '/configs/conf1', cwd=C:\Users\JenkinsSlave\workspace\Lucene-Solr-5.5-Windows\solr\build\solr-core\test\J1
   [junit4]   2> 32515 INFO  (coreLoadExecutor-118-thread-1-processing-n:127.0.0.1:54506_ww%2Fz) [n:127.0.0.1:54506_ww%2Fz c:collection1   x:collection1] o.a.s.c.CoreContainer Creating SolrCore 'collection1' using configuration from collection collection1
   [junit4]   2> 32515 INFO  (coreLoadExecutor-118-thread-1-processing-n:127.0.0.1:54506_ww%2Fz) [n:127.0.0.1:54506_ww%2Fz c:collection1 s:shard2 r:core_node1 x:collection1] o.a.s.c.SolrCore org.apache.solr.core.MockDirectoryFactory
   [junit4]   2> 32515 INFO  (coreLoadExecutor-118-thread-1-processing-n:127.0.0.1:54506_ww%2Fz) [n:127.0.0.1:54506_ww%2Fz c:collection1 s:shard2 r:core_node1 x:collection1] o.a.s.c.SolrCore [[collection1] ] Opening new SolrCore at [C:\Users\JenkinsSlave\workspace\Lucene-Solr-5.5-Windows\solr\build\solr-core\test\J1\temp\solr.security.PKIAuthenticationIntegrationTest_B1D13C22D40DA8F3-001\shard-1-001\cores\collection1], dataDir=[C:\Users\JenkinsSlave\workspace\Lucene-Solr-5.5-Windows\solr\build\solr-core\test\J1\temp\solr.security.PKIAuthenticationIntegrationTest_B1D13C22D40DA8F3-001\shard-1-001\cores\collection1\data\]
   [junit4]   2> 32515 INFO  (coreLoadExecutor-118-thread-1-processing-n:127.0.0.1:54506_ww%2Fz) [n:127.0.0.1:54506_ww%2Fz c:collection1 s:shard2 r:core_node1 x:collection1] o.a.s.c.JmxMonitoredMap JMX monitoring is enabled. Adding Solr mbeans to JMX Server: com.sun.jmx.mbeanserver.JmxMBeanServer@310d79
   [junit4]   2> 32515 INFO  (coreLoadExecutor

[...truncated too long message...]

\Lucene-Solr-5.5-Windows\solr\build\solr-core\test\J1\temp\solr.security.PKIAuthenticationIntegrationTest_B1D13C22D40DA8F3-001\shard-4-001\cores\collection1\data\;done=false>>]
   [junit4]   2> 60751 INFO  (zkCallback-48-thread-1-processing-n:127.0.0.1:54553_ww%2Fz) [n:127.0.0.1:54553_ww%2Fz c:collection1 s:shard1 r:core_node4 x:collection1] o.a.s.c.CachingDirectoryFactory Closing directory: C:\Users\JenkinsSlave\workspace\Lucene-Solr-5.5-Windows\solr\build\solr-core\test\J1\temp\solr.security.PKIAuthenticationIntegrationTest_B1D13C22D40DA8F3-001\shard-4-001\cores\collection1\data\
   [junit4]   2> 60751 INFO  (zkCallback-48-thread-1-processing-n:127.0.0.1:54553_ww%2Fz) [n:127.0.0.1:54553_ww%2Fz c:collection1 s:shard1 r:core_node4 x:collection1] o.a.s.c.CachingDirectoryFactory looking to close C:\Users\JenkinsSlave\workspace\Lucene-Solr-5.5-Windows\solr\build\solr-core\test\J1\temp\solr.security.PKIAuthenticationIntegrationTest_B1D13C22D40DA8F3-001\shard-4-001\cores\collection1\data\index [CachedDir<<refCount=0;path=C:\Users\JenkinsSlave\workspace\Lucene-Solr-5.5-Windows\solr\build\solr-core\test\J1\temp\solr.security.PKIAuthenticationIntegrationTest_B1D13C22D40DA8F3-001\shard-4-001\cores\collection1\data\index;done=false>>]
   [junit4]   2> 60751 INFO  (zkCallback-48-thread-1-processing-n:127.0.0.1:54553_ww%2Fz) [n:127.0.0.1:54553_ww%2Fz c:collection1 s:shard1 r:core_node4 x:collection1] o.a.s.c.CachingDirectoryFactory Closing directory: C:\Users\JenkinsSlave\workspace\Lucene-Solr-5.5-Windows\solr\build\solr-core\test\J1\temp\solr.security.PKIAuthenticationIntegrationTest_B1D13C22D40DA8F3-001\shard-4-001\cores\collection1\data\index
   [junit4]   2> 60751 INFO  (zkCallback-48-thread-1-processing-n:127.0.0.1:54553_ww%2Fz) [n:127.0.0.1:54553_ww%2Fz c:collection1 s:shard1 r:core_node4 x:collection1] o.a.s.c.ShardLeaderElectionContextBase No version found for ephemeral leader parent node, won't remove previous leader registration.
   [junit4]   2> 60751 INFO  (zkCallback-48-thread-1-processing-n:127.0.0.1:54553_ww%2Fz) [n:127.0.0.1:54553_ww%2Fz c:collection1 s:shard1 r:core_node4 x:collection1] o.a.s.c.ElectionContext Canceling election /collections/collection1/leader_elect/shard1/election/95427846366298129-core_node4-n_0000000001
   [junit4]   2> 60751 WARN  (zkCallback-48-thread-1-processing-n:127.0.0.1:54553_ww%2Fz) [n:127.0.0.1:54553_ww%2Fz c:collection1 s:shard1 r:core_node4 x:collection1] o.a.s.c.LeaderElector 
   [junit4]   2> org.apache.zookeeper.KeeperException$SessionExpiredException: KeeperErrorCode = Session expired for /collections/collection1/leader_elect/shard1/election/95427846366298129-core_node4-n_0000000001
   [junit4]   2> 	at org.apache.zookeeper.KeeperException.create(KeeperException.java:127)
   [junit4]   2> 	at org.apache.zookeeper.KeeperException.create(KeeperException.java:51)
   [junit4]   2> 	at org.apache.zookeeper.ZooKeeper.delete(ZooKeeper.java:873)
   [junit4]   2> 	at org.apache.solr.common.cloud.SolrZkClient$2.execute(SolrZkClient.java:244)
   [junit4]   2> 	at org.apache.solr.common.cloud.SolrZkClient$2.execute(SolrZkClient.java:241)
   [junit4]   2> 	at org.apache.solr.common.cloud.ZkCmdExecutor.retryOperation(ZkCmdExecutor.java:60)
   [junit4]   2> 	at org.apache.solr.common.cloud.SolrZkClient.delete(SolrZkClient.java:241)
   [junit4]   2> 	at org.apache.solr.cloud.ElectionContext.cancelElection(ElectionContext.java:86)
   [junit4]   2> 	at org.apache.solr.cloud.ShardLeaderElectionContextBase.cancelElection(ElectionContext.java:166)
   [junit4]   2> 	at org.apache.solr.cloud.ShardLeaderElectionContext.cancelElection(ElectionContext.java:268)
   [junit4]   2> 	at org.apache.solr.cloud.ShardLeaderElectionContext.runLeaderProcess(ElectionContext.java:444)
   [junit4]   2> 	at org.apache.solr.cloud.LeaderElector.runIamLeaderProcess(LeaderElector.java:197)
   [junit4]   2> 	at org.apache.solr.cloud.LeaderElector.checkIfIamLeader(LeaderElector.java:157)
   [junit4]   2> 	at org.apache.solr.cloud.LeaderElector.access$200(LeaderElector.java:58)
   [junit4]   2> 	at org.apache.solr.cloud.LeaderElector$ElectionWatcher.process(LeaderElector.java:388)
   [junit4]   2> 	at org.apache.solr.common.cloud.SolrZkClient$3$1.run(SolrZkClient.java:264)
   [junit4]   2> 	at java.util.concurrent.Executors$RunnableAdapter.call(Executors.java:471)
   [junit4]   2> 	at java.util.concurrent.FutureTask.run(FutureTask.java:262)
   [junit4]   2> 	at org.apache.solr.common.util.ExecutorUtil$MDCAwareThreadPoolExecutor$1.run(ExecutorUtil.java:231)
   [junit4]   2> 	at java.util.concurrent.ThreadPoolExecutor.runWorker(ThreadPoolExecutor.java:1145)
   [junit4]   2> 	at java.util.concurrent.ThreadPoolExecutor$Worker.run(ThreadPoolExecutor.java:615)
   [junit4]   2> 	at java.lang.Thread.run(Thread.java:745)
   [junit4]   2> 62204 WARN  (zkCallback-48-thread-3-processing-n:127.0.0.1:54553_ww%2Fz) [n:127.0.0.1:54553_ww%2Fz    ] o.a.s.c.c.ZkStateReader ZooKeeper watch triggered, but Solr cannot talk to ZK: [KeeperErrorCode = Session expired for /clusterstate.json]
   [junit4]   2> 62210 INFO  (TEST-PKIAuthenticationIntegrationTest.testPkiAuth-seed#[B1D13C22D40DA8F3]) [    ] o.e.j.s.ServerConnector Stopped ServerConnector@8f8429{HTTP/1.1}{127.0.0.1:0}
   [junit4]   2> 62210 INFO  (TEST-PKIAuthenticationIntegrationTest.testPkiAuth-seed#[B1D13C22D40DA8F3]) [    ] o.e.j.s.h.ContextHandler Stopped o.e.j.s.ServletContextHandler@e8fe4d{/ww/z,null,UNAVAILABLE}
   [junit4]   2> 62217 INFO  (TEST-PKIAuthenticationIntegrationTest.testPkiAuth-seed#[B1D13C22D40DA8F3]) [    ] o.a.s.c.ZkTestServer connecting to 127.0.0.1:54471 54471
   [junit4]   2> 64469 INFO  (Thread-60) [    ] o.a.s.c.ZkTestServer connecting to 127.0.0.1:54471 54471
   [junit4]   2> 64471 WARN  (Thread-60) [    ] o.a.s.c.ZkTestServer Watch limit violations: 
   [junit4]   2> Maximum concurrent create/delete watches above limit:
   [junit4]   2> 
   [junit4]   2> 	6	/solr/aliases.json
   [junit4]   2> 	5	/solr/security.json
   [junit4]   2> 	5	/solr/configs/conf1
   [junit4]   2> 
   [junit4]   2> Maximum concurrent data watches above limit:
   [junit4]   2> 
   [junit4]   2> 	6	/solr/clusterstate.json
   [junit4]   2> 
   [junit4]   2> Maximum concurrent children watches above limit:
   [junit4]   2> 
   [junit4]   2> 	6	/solr/collections
   [junit4]   2> 	6	/solr/live_nodes
   [junit4]   2> 	2	/solr/overseer/queue
   [junit4]   2> 	2	/solr/overseer/collection-queue-work
   [junit4]   2> 
   [junit4]   2> NOTE: reproduce with: ant test  -Dtestcase=PKIAuthenticationIntegrationTest -Dtests.method=testPkiAuth -Dtests.seed=B1D13C22D40DA8F3 -Dtests.slow=true -Dtests.locale=es-EC -Dtests.timezone=Europe/Brussels -Dtests.asserts=true -Dtests.file.encoding=UTF-8
   [junit4] FAILURE 38.7s J1 | PKIAuthenticationIntegrationTest.testPkiAuth <<<
   [junit4]    > Throwable #1: java.lang.AssertionError: all nodes must get the user solr , no:of nodes got solr : 1
   [junit4]    > 	at __randomizedtesting.SeedInfo.seed([B1D13C22D40DA8F3:816FA57334BB2F52]:0)
   [junit4]    > 	at org.apache.solr.security.PKIAuthenticationIntegrationTest.testPkiAuth(PKIAuthenticationIntegrationTest.java:100)
   [junit4]    > 	at org.apache.solr.BaseDistributedSearchTestCase$ShardsRepeatRule$ShardsFixedStatement.callStatement(BaseDistributedSearchTestCase.java:964)
   [junit4]    > 	at org.apache.solr.BaseDistributedSearchTestCase$ShardsRepeatRule$ShardsStatement.evaluate(BaseDistributedSearchTestCase.java:939)
   [junit4]    > 	at java.lang.Thread.run(Thread.java:745)
   [junit4]   2> 64478 INFO  (SUITE-PKIAuthenticationIntegrationTest-seed#[B1D13C22D40DA8F3]-worker) [    ] o.a.s.SolrTestCaseJ4 ###deleteCore
   [junit4]   2> NOTE: leaving temporary files on disk at: C:\Users\JenkinsSlave\workspace\Lucene-Solr-5.5-Windows\solr\build\solr-core\test\J1\temp\solr.security.PKIAuthenticationIntegrationTest_B1D13C22D40DA8F3-001
   [junit4]   2> NOTE: test params are: codec=Asserting(Lucene54): {}, docValues:{}, sim=DefaultSimilarity, locale=es-EC, timezone=Europe/Brussels
   [junit4]   2> NOTE: Windows 7 6.1 x86/Oracle Corporation 1.7.0_80 (32-bit)/cpus=3,threads=1,free=31560256,total=223346688
   [junit4]   2> NOTE: All tests run in this JVM: [TestWriterPerf, TestSolrCoreProperties, PreAnalyzedUpdateProcessorTest, UniqFieldsUpdateProcessorFactoryTest, SignatureUpdateProcessorFactoryTest, TestInitQParser, IgnoreCommitOptimizeUpdateProcessorFactoryTest, TestUseDocValuesAsStored2, TestOverriddenPrefixQueryForCustomFieldType, PKIAuthenticationIntegrationTest]
   [junit4] Completed [17/566 (1!)] on J1 in 38.77s, 1 test, 1 failure <<< FAILURES!

[...truncated 1759 lines...]
BUILD FAILED
C:\Users\JenkinsSlave\workspace\Lucene-Solr-5.5-Windows\build.xml:750: The following error occurred while executing this line:
C:\Users\JenkinsSlave\workspace\Lucene-Solr-5.5-Windows\build.xml:694: The following error occurred while executing this line:
C:\Users\JenkinsSlave\workspace\Lucene-Solr-5.5-Windows\build.xml:59: The following error occurred while executing this line:
C:\Users\JenkinsSlave\workspace\Lucene-Solr-5.5-Windows\solr\build.xml:233: The following error occurred while executing this line:
C:\Users\JenkinsSlave\workspace\Lucene-Solr-5.5-Windows\solr\common-build.xml:534: The following error occurred while executing this line:
C:\Users\JenkinsSlave\workspace\Lucene-Solr-5.5-Windows\lucene\common-build.xml:1477: The following error occurred while executing this line:
C:\Users\JenkinsSlave\workspace\Lucene-Solr-5.5-Windows\lucene\common-build.xml:1033: There were test failures: 566 suites (7 ignored), 2275 tests, 1 failure, 94 ignored (49 assumptions) [seed: B1D13C22D40DA8F3]

Total time: 81 minutes 1 second
Build step 'Invoke Ant' marked build as failure
Archiving artifacts
[WARNINGS] Skipping publisher since build result is FAILURE
Recording test results
Email was triggered for: Failure - Any
Sending email for trigger: Failure - Any



Mime
View raw message