lucene-dev mailing list archives

Site index · List index
Message view « Date » · « Thread »
Top « Date » · « Thread »
From Policeman Jenkins Server <jenk...@thetaphi.de>
Subject [JENKINS-EA] Lucene-Solr-trunk-Linux (64bit/jdk-9-ea+105) - Build # 15937 - Still Failing!
Date Sat, 20 Feb 2016 20:37:57 GMT
Build: http://jenkins.thetaphi.de/job/Lucene-Solr-trunk-Linux/15937/
Java: 64bit/jdk-9-ea+105 -XX:-UseCompressedOops -XX:+UseConcMarkSweepGC -XX:-UseSuperWord

1 tests failed.
FAILED:  org.apache.solr.morphlines.solr.SolrMorphlineZkAliasTest.test

Error Message:
No live SolrServers available to handle this request:[https://127.0.0.1:50094/f_lqr/pv, https://127.0.0.1:36753/f_lqr/pv, https://127.0.0.1:38585/f_lqr/pv, https://127.0.0.1:56113/f_lqr/pv]

Stack Trace:
org.apache.solr.client.solrj.SolrServerException: No live SolrServers available to handle this request:[https://127.0.0.1:50094/f_lqr/pv, https://127.0.0.1:36753/f_lqr/pv, https://127.0.0.1:38585/f_lqr/pv, https://127.0.0.1:56113/f_lqr/pv]
	at __randomizedtesting.SeedInfo.seed([BDF1A9126ED8D58:838B254B8811E0A0]:0)
	at org.apache.solr.client.solrj.impl.LBHttpSolrClient.request(LBHttpSolrClient.java:352)
	at org.apache.solr.client.solrj.impl.CloudSolrClient.sendRequest(CloudSolrClient.java:1100)
	at org.apache.solr.client.solrj.impl.CloudSolrClient.requestWithRetryOnStaleState(CloudSolrClient.java:870)
	at org.apache.solr.client.solrj.impl.CloudSolrClient.request(CloudSolrClient.java:806)
	at org.apache.solr.client.solrj.SolrClient.request(SolrClient.java:1219)
	at org.apache.solr.morphlines.solr.SolrMorphlineZkAliasTest.createAlias(SolrMorphlineZkAliasTest.java:117)
	at org.apache.solr.morphlines.solr.SolrMorphlineZkAliasTest.test(SolrMorphlineZkAliasTest.java:52)
	at sun.reflect.NativeMethodAccessorImpl.invoke0(Native Method)
	at sun.reflect.NativeMethodAccessorImpl.invoke(NativeMethodAccessorImpl.java:62)
	at sun.reflect.DelegatingMethodAccessorImpl.invoke(DelegatingMethodAccessorImpl.java:43)
	at java.lang.reflect.Method.invoke(Method.java:520)
	at com.carrotsearch.randomizedtesting.RandomizedRunner.invoke(RandomizedRunner.java:1764)
	at com.carrotsearch.randomizedtesting.RandomizedRunner$8.evaluate(RandomizedRunner.java:871)
	at com.carrotsearch.randomizedtesting.RandomizedRunner$9.evaluate(RandomizedRunner.java:907)
	at com.carrotsearch.randomizedtesting.RandomizedRunner$10.evaluate(RandomizedRunner.java:921)
	at org.apache.solr.BaseDistributedSearchTestCase$ShardsRepeatRule$ShardsFixedStatement.callStatement(BaseDistributedSearchTestCase.java:964)
	at org.apache.solr.BaseDistributedSearchTestCase$ShardsRepeatRule$ShardsStatement.evaluate(BaseDistributedSearchTestCase.java:939)
	at com.carrotsearch.randomizedtesting.rules.SystemPropertiesRestoreRule$1.evaluate(SystemPropertiesRestoreRule.java:57)
	at org.apache.lucene.util.TestRuleSetupTeardownChained$1.evaluate(TestRuleSetupTeardownChained.java:49)
	at org.apache.lucene.util.AbstractBeforeAfterRule$1.evaluate(AbstractBeforeAfterRule.java:45)
	at org.apache.lucene.util.TestRuleThreadAndTestName$1.evaluate(TestRuleThreadAndTestName.java:48)
	at org.apache.lucene.util.TestRuleIgnoreAfterMaxFailures$1.evaluate(TestRuleIgnoreAfterMaxFailures.java:64)
	at org.apache.lucene.util.TestRuleMarkFailure$1.evaluate(TestRuleMarkFailure.java:47)
	at com.carrotsearch.randomizedtesting.rules.StatementAdapter.evaluate(StatementAdapter.java:36)
	at com.carrotsearch.randomizedtesting.ThreadLeakControl$StatementRunner.run(ThreadLeakControl.java:367)
	at com.carrotsearch.randomizedtesting.ThreadLeakControl.forkTimeoutingTask(ThreadLeakControl.java:809)
	at com.carrotsearch.randomizedtesting.ThreadLeakControl$3.evaluate(ThreadLeakControl.java:460)
	at com.carrotsearch.randomizedtesting.RandomizedRunner.runSingleTest(RandomizedRunner.java:880)
	at com.carrotsearch.randomizedtesting.RandomizedRunner$5.evaluate(RandomizedRunner.java:781)
	at com.carrotsearch.randomizedtesting.RandomizedRunner$6.evaluate(RandomizedRunner.java:816)
	at com.carrotsearch.randomizedtesting.RandomizedRunner$7.evaluate(RandomizedRunner.java:827)
	at com.carrotsearch.randomizedtesting.rules.StatementAdapter.evaluate(StatementAdapter.java:36)
	at com.carrotsearch.randomizedtesting.rules.SystemPropertiesRestoreRule$1.evaluate(SystemPropertiesRestoreRule.java:57)
	at org.apache.lucene.util.AbstractBeforeAfterRule$1.evaluate(AbstractBeforeAfterRule.java:45)
	at com.carrotsearch.randomizedtesting.rules.StatementAdapter.evaluate(StatementAdapter.java:36)
	at org.apache.lucene.util.TestRuleStoreClassName$1.evaluate(TestRuleStoreClassName.java:41)
	at com.carrotsearch.randomizedtesting.rules.NoShadowingOrOverridesOnMethodsRule$1.evaluate(NoShadowingOrOverridesOnMethodsRule.java:40)
	at com.carrotsearch.randomizedtesting.rules.NoShadowingOrOverridesOnMethodsRule$1.evaluate(NoShadowingOrOverridesOnMethodsRule.java:40)
	at com.carrotsearch.randomizedtesting.rules.StatementAdapter.evaluate(StatementAdapter.java:36)
	at com.carrotsearch.randomizedtesting.rules.StatementAdapter.evaluate(StatementAdapter.java:36)
	at com.carrotsearch.randomizedtesting.rules.StatementAdapter.evaluate(StatementAdapter.java:36)
	at org.apache.lucene.util.TestRuleAssertionsRequired$1.evaluate(TestRuleAssertionsRequired.java:53)
	at org.apache.lucene.util.TestRuleMarkFailure$1.evaluate(TestRuleMarkFailure.java:47)
	at org.apache.lucene.util.TestRuleIgnoreAfterMaxFailures$1.evaluate(TestRuleIgnoreAfterMaxFailures.java:64)
	at org.apache.lucene.util.TestRuleIgnoreTestSuites$1.evaluate(TestRuleIgnoreTestSuites.java:54)
	at com.carrotsearch.randomizedtesting.rules.StatementAdapter.evaluate(StatementAdapter.java:36)
	at com.carrotsearch.randomizedtesting.ThreadLeakControl$StatementRunner.run(ThreadLeakControl.java:367)
	at java.lang.Thread.run(Thread.java:804)
Caused by: org.apache.solr.client.solrj.SolrServerException: IOException occured when talking to server at: https://127.0.0.1:38585/f_lqr/pv
	at org.apache.solr.client.solrj.impl.HttpSolrClient.executeMethod(HttpSolrClient.java:591)
	at org.apache.solr.client.solrj.impl.HttpSolrClient.request(HttpSolrClient.java:241)
	at org.apache.solr.client.solrj.impl.HttpSolrClient.request(HttpSolrClient.java:230)
	at org.apache.solr.client.solrj.impl.LBHttpSolrClient.doRequest(LBHttpSolrClient.java:372)
	at org.apache.solr.client.solrj.impl.LBHttpSolrClient.request(LBHttpSolrClient.java:325)
	... 47 more
Caused by: java.net.SocketException: Connection reset
	at java.net.SocketOutputStream.socketWrite(SocketOutputStream.java:113)
	at java.net.SocketOutputStream.write(SocketOutputStream.java:153)
	at sun.security.ssl.SSLSocketOutputRecord.flush(SSLSocketOutputRecord.java:236)
	at sun.security.ssl.HandshakeOutStream.flush(HandshakeOutStream.java:79)
	at sun.security.ssl.Handshaker.kickstart(Handshaker.java:1052)
	at sun.security.ssl.SSLSocketImpl.kickstartHandshake(SSLSocketImpl.java:1492)
	at sun.security.ssl.SSLSocketImpl.performInitialHandshake(SSLSocketImpl.java:1373)
	at sun.security.ssl.SSLSocketImpl.startHandshake(SSLSocketImpl.java:1408)
	at sun.security.ssl.SSLSocketImpl.startHandshake(SSLSocketImpl.java:1392)
	at org.apache.http.conn.ssl.SSLSocketFactory.connectSocket(SSLSocketFactory.java:543)
	at org.apache.http.conn.ssl.SSLSocketFactory.connectSocket(SSLSocketFactory.java:409)
	at org.apache.http.impl.conn.DefaultClientConnectionOperator.openConnection(DefaultClientConnectionOperator.java:177)
	at org.apache.http.impl.conn.ManagedClientConnectionImpl.open(ManagedClientConnectionImpl.java:304)
	at org.apache.http.impl.client.DefaultRequestDirector.tryConnect(DefaultRequestDirector.java:611)
	at org.apache.http.impl.client.DefaultRequestDirector.execute(DefaultRequestDirector.java:446)
	at org.apache.http.impl.client.AbstractHttpClient.doExecute(AbstractHttpClient.java:882)
	at org.apache.http.impl.client.CloseableHttpClient.execute(CloseableHttpClient.java:82)
	at org.apache.http.impl.client.CloseableHttpClient.execute(CloseableHttpClient.java:107)
	at org.apache.http.impl.client.CloseableHttpClient.execute(CloseableHttpClient.java:55)
	at org.apache.solr.client.solrj.impl.HttpSolrClient.executeMethod(HttpSolrClient.java:482)
	... 51 more




Build Log:
[...truncated 21342 lines...]
   [junit4] Suite: org.apache.solr.morphlines.solr.SolrMorphlineZkAliasTest
   [junit4]   2> Creating dataDir: /home/jenkins/workspace/Lucene-Solr-trunk-Linux/solr/build/contrib/solr-morphlines-core/test/J1/temp/solr.morphlines.solr.SolrMorphlineZkAliasTest_BDF1A9126ED8D58-001/init-core-data-001
   [junit4]   2> 0    INFO  (SUITE-SolrMorphlineZkAliasTest-seed#[BDF1A9126ED8D58]-worker) [    ] o.a.s.SolrTestCaseJ4 Randomized ssl (true) and clientAuth (false)
   [junit4]   2> 13   INFO  (SUITE-SolrMorphlineZkAliasTest-seed#[BDF1A9126ED8D58]-worker) [    ] o.a.s.BaseDistributedSearchTestCase Setting hostContext system property: /f_lqr/pv
   [junit4]   2> 114  INFO  (TEST-SolrMorphlineZkAliasTest.test-seed#[BDF1A9126ED8D58]) [    ] o.a.s.c.ZkTestServer STARTING ZK TEST SERVER
   [junit4]   2> 115  INFO  (Thread-1) [    ] o.a.s.c.ZkTestServer client port:0.0.0.0/0.0.0.0:0
   [junit4]   2> 116  INFO  (Thread-1) [    ] o.a.s.c.ZkTestServer Starting server
   [junit4]   2> 146  INFO  (Thread-1) [    ] o.a.z.s.ZooKeeperServer Server environment:zookeeper.version=3.4.6-1569965, built on 02/20/2014 09:09 GMT
   [junit4]   2> 147  INFO  (Thread-1) [    ] o.a.z.s.ZooKeeperServer Server environment:host.name=serv1
   [junit4]   2> 147  INFO  (Thread-1) [    ] o.a.z.s.ZooKeeperServer Server environment:java.version=9-ea
   [junit4]   2> 147  INFO  (Thread-1) [    ] o.a.z.s.ZooKeeperServer Server environment:java.vendor=Oracle Corporation
   [junit4]   2> 147  INFO  (Thread-1) [    ] o.a.z.s.ZooKeeperServer Server environment:java.home=/home/jenkins/tools/java/64bit/jdk-9-ea+105
   [junit4]   2> 147  INFO  (Thread-1) [    ] o.a.z.s.ZooKeeperServer Server environment:java.class.path=/home/jenkins/workspace/Lucene-Solr-trunk-Linux/solr/build/contrib/solr-morphlines-core/classes/test:/home/jenkins/workspace/Lucene-Solr-trunk-Linux/solr/build/solr-test-framework/classes/java:/home/jenkins/workspace/Lucene-Solr-trunk-Linux/solr/test-framework/lib/junit4-ant-2.3.2.jar:/home/jenkins/workspace/Lucene-Solr-trunk-Linux/solr/contrib/morphlines-core/src/test-files:/home/jenkins/workspace/Lucene-Solr-trunk-Linux/lucene/build/test-framework/classes/java:/home/jenkins/workspace/Lucene-Solr-trunk-Linux/lucene/build/codecs/classes/java:/home/jenkins/workspace/Lucene-Solr-trunk-Linux/solr/build/solr-solrj/classes/java:/home/jenkins/workspace/Lucene-Solr-trunk-Linux/solr/build/solr-core/classes/java:/home/jenkins/workspace/Lucene-Solr-trunk-Linux/lucene/build/analysis/common/lucene-analyzers-common-6.0.0-SNAPSHOT.jar:/home/jenkins/workspace/Lucene-Solr-trunk-Linux/lucene/build/analysis/kuromoji/lucene-analyzers-kuromoji-6.0.0-SNAPSHOT.jar:/home/jenkins/workspace/Lucene-Solr-trunk-Linux/lucene/build/analysis/phonetic/lucene-analyzers-phonetic-6.0.0-SNAPSHOT.jar:/home/jenkins/workspace/Lucene-Solr-trunk-Linux/lucene/build/codecs/lucene-codecs-6.0.0-SNAPSHOT.jar:/home/jenkins/workspace/Lucene-Solr-trunk-Linux/lucene/build/backward-codecs/lucene-backward-codecs-6.0.0-SNAPSHOT.jar:/home/jenkins/workspace/Lucene-Solr-trunk-Linux/lucene/build/highlighter/lucene-highlighter-6.0.0-SNAPSHOT.jar:/home/jenkins/workspace/Lucene-Solr-trunk-Linux/lucene/build/memory/lucene-memory-6.0.0-SNAPSHOT.jar:/home/jenkins/workspace/Lucene-Solr-trunk-Linux/lucene/build/misc/lucene-misc-6.0.0-SNAPSHOT.jar:/home/jenkins/workspace/Lucene-Solr-trunk-Linux/lucene/build/spatial/lucene-spatial-6.0.0-SNAPSHOT.jar:/home/jenkins/workspace/Lucene-Solr-trunk-Linux/lucene/build/expressions/lucene-expressions-6.0.0-SNAPSHOT.jar:/home/jenkins/workspace/Lucene-Solr-trunk-Linux/lucene/build/suggest/lucene-suggest-6.0.0-SNAPSHOT.jar:/home/jenkins/workspace/Lucene-Solr-trunk-Linux/lucene/build/grouping/lucene-grouping-6.0.0-SNAPSHOT.jar:/home/jenkins/workspace/Lucene-Solr-trunk-Linux/lucene/build/queries/lucene-queries-6.0.0-SNAPSHOT.jar:/home/jenkins/workspace/Lucene-Solr-trunk-Linux/lucene/build/queryparser/lucene-queryparser-6.0.0-SNAPSHOT.jar:/home/jenkins/workspace/Lucene-Solr-trunk-Linux/lucene/build/join/lucene-join-6.0.0-SNAPSHOT.jar:/home/jenkins/workspace/Lucene-Solr-trunk-Linux/lucene/build/sandbox/lucene-sandbox-6.0.0-SNAPSHOT.jar:/home/jenkins/workspace/Lucene-Solr-trunk-Linux/solr/core/lib/antlr4-runtime-4.5.1-1.jar:/home/jenkins/workspace/Lucene-Solr-trunk-Linux/solr/core/lib/asm-5.0.4.jar:/home/jenkins/workspace/Lucene-Solr-trunk-Linux/solr/core/lib/asm-commons-5.0.4.jar:/home/jenkins/workspace/Lucene-Solr-trunk-Linux/solr/core/lib/caffeine-1.0.1.jar:/home/jenkins/workspace/Lucene-Solr-trunk-Linux/solr/core/lib/commons-cli-1.2.jar:/home/jenkins/workspace/Lucene-Solr-trunk-Linux/solr/core/lib/commons-codec-1.10.jar:/home/jenkins/workspace/Lucene-Solr-trunk-Linux/solr/core/lib/commons-collections-3.2.2.jar:/home/jenkins/workspace/Lucene-Solr-trunk-Linux/solr/core/lib/commons-configuration-1.6.jar:/home/jenkins/workspace/Lucene-Solr-trunk-Linux/solr/core/lib/commons-exec-1.3.jar:/home/jenkins/workspace/Lucene-Solr-trunk-Linux/solr/core/lib/commons-fileupload-1.2.1.jar:/home/jenkins/workspace/Lucene-Solr-trunk-Linux/solr/core/lib/commons-lang-2.6.jar:/home/jenkins/workspace/Lucene-Solr-trunk-Linux/solr/core/lib/dom4j-1.6.1.jar:/home/jenkins/workspace/Lucene-Solr-trunk-Linux/solr/core/lib/guava-14.0.1.jar:/home/jenkins/workspace/Lucene-Solr-trunk-Linux/solr/core/lib/hadoop-annotations-2.6.0.jar:/home/jenkins/workspace/Lucene-Solr-trunk-Linux/solr/core/lib/hadoop-auth-2.6.0.jar:/home/jenkins/workspace/Lucene-Solr-trunk-Linux/solr/core/lib/hadoop-common-2.6.0.jar:/home/jenkins/workspace/Lucene-Solr-trunk-Linux/solr/core/lib/hadoop-hdfs-2.6.0.jar:/home/jenkins/workspace/Lucene-Solr-trunk-Linux/solr/core/lib/hppc-0.7.1.jar:/home/jenkins/workspace/Lucene-Solr-trunk-Linux/solr/core/lib/htrace-core-3.0.4.jar:/home/jenkins/workspace/Lucene-Solr-trunk-Linux/solr/core/lib/jackson-core-2.5.4.jar:/home/jenkins/workspace/Lucene-Solr-trunk-Linux/solr/core/lib/jackson-dataformat-smile-2.5.4.jar:/home/jenkins/workspace/Lucene-Solr-trunk-Linux/solr/core/lib/jcl-over-slf4j-1.7.7.jar:/home/jenkins/workspace/Lucene-Solr-trunk-Linux/solr/core/lib/joda-time-2.2.jar:/home/jenkins/workspace/Lucene-Solr-trunk-Linux/solr/core/lib/log4j-1.2.17.jar:/home/jenkins/workspace/Lucene-Solr-trunk-Linux/solr/core/lib/org.restlet-2.3.0.jar:/home/jenkins/workspace/Lucene-Solr-trunk-Linux/solr/core/lib/org.restlet.ext.servlet-2.3.0.jar:/home/jenkins/workspace/Lucene-Solr-trunk-Linux/solr/core/lib/presto-parser-0.122.jar:/home/jenkins/workspace/Lucene-Solr-trunk-Linux/solr/core/lib/protobuf-java-2.5.0.jar:/home/jenkins/workspace/Lucene-Solr-trunk-Linux/solr/core/lib/slf4j-log4j12-1.7.7.jar:/home/jenkins/workspace/Lucene-Solr-trunk-Linux/solr/core/lib/slice-0.10.jar:/home/jenkins/workspace/Lucene-Solr-trunk-Linux/solr/core/lib/spatial4j-0.5.jar:/home/jenkins/workspace/Lucene-Solr-trunk-Linux/solr/core/lib/t-digest-3.1.jar:/home/jenkins/workspace/Lucene-Solr-trunk-Linux/solr/solrj/lib/commons-io-2.4.jar:/home/jenkins/workspace/Lucene-Solr-trunk-Linux/solr/solrj/lib/httpclient-4.4.1.jar:/home/jenkins/workspace/Lucene-Solr-trunk-Linux/solr/solrj/lib/httpcore-4.4.1.jar:/home/jenkins/workspace/Lucene-Solr-trunk-Linux/solr/solrj/lib/httpmime-4.4.1.jar:/home/jenkins/workspace/Lucene-Solr-trunk-Linux/solr/solrj/lib/jcl-over-slf4j-1.7.7.jar:/home/jenkins/workspace/Lucene-Solr-trunk-Linux/solr/solrj/lib/noggit-0.6.jar:/home/jenkins/workspace/Lucene-Solr-trunk-Linux/solr/solrj/lib/slf4j-api-1.7.7.jar:/home/jenkins/workspace/Lucene-Solr-trunk-Linux/solr/solrj/lib/stax2-api-3.1.4.jar:/home/jenkins/workspace/Lucene-Solr-trunk-Linux/solr/solrj/lib/woodstox-core-asl-4.4.1.jar:/home/jenkins/workspace/Lucene-Solr-trunk-Linux/solr/solrj/lib/zookeeper-3.4.6.jar:/home/jenkins/workspace/Lucene-Solr-trunk-Linux/solr/server/lib/javax.servlet-api-3.1.0.jar:/home/jenkins/workspace/Lucene-Solr-trunk-Linux/solr/server/lib/jetty-continuation-9.3.6.v20151106.jar:/home/jenkins/workspace/Lucene-Solr-trunk-Linux/solr/server/lib/jetty-deploy-9.3.6.v20151106.jar:/home/jenkins/workspace/Lucene-Solr-trunk-Linux/solr/server/lib/jetty-http-9.3.6.v20151106.jar:/home/jenkins/workspace/Lucene-Solr-trunk-Linux/solr/server/lib/jetty-io-9.3.6.v20151106.jar:/home/jenkins/workspace/Lucene-Solr-trunk-Linux/solr/server/lib/jetty-jmx-9.3.6.v20151106.jar:/home/jenkins/workspace/Lucene-Solr-trunk-Linux/solr/server/lib/jetty-rewrite-9.3.6.v20151106.jar:/home/jenkins/workspace/Lucene-Solr-trunk-Linux/solr/server/lib/jetty-security-9.3.6.v20151106.jar:/home/jenkins/workspace/Lucene-Solr-trunk-Linux/solr/server/lib/jetty-server-9.3.6.v20151106.jar:/home/jenkins/workspace/Lucene-Solr-trunk-Linux/solr/server/lib/jetty-servlet-9.3.6.v20151106.jar:/home/jenkins/workspace/Lucene-Solr-trunk-Linux/solr/server/lib/jetty-servlets-9.3.6.v20151106.jar:/home/jenkins/workspace/Lucene-Solr-trunk-Linux/solr/server/lib/jetty-util-9.3.6.v20151106.jar:/home/jenkins/workspace/Lucene-Solr-trunk-Linux/solr/server/lib/jetty-webapp-9.3.6.v20151106.jar:/home/jenkins/workspace/Lucene-Solr-trunk-Linux/solr/server/lib/jetty-xml-9.3.6.v20151106.jar:/home/jenkins/workspace/Lucene-Solr-trunk-Linux/solr/example/example-DIH/solr/db/lib/derby-10.9.1.0.jar:/home/jenkins/workspace/Lucene-Solr-trunk-Linux/solr/example/example-DIH/solr/db/lib/hsqldb-1.8.0.10.jar:/home/jenkins/workspace/Lucene-Solr-trunk-Linux/solr/contrib/morphlines-core/lib/config-1.0.2.jar:/home/jenkins/workspace/Lucene-Solr-trunk-Linux/solr/contrib/morphlines-core/lib/kite-morphlines-avro-1.1.0.jar:/home/jenkins/workspace/Lucene-Solr-trunk-Linux/solr/contrib/morphlines-core/lib/kite-morphlines-core-1.1.0.jar:/home/jenkins/workspace/Lucene-Solr-trunk-Linux/solr/contrib/morphlines-core/lib/metrics-core-3.0.1.jar:/home/jenkins/workspace/Lucene-Solr-trunk-Linux/solr/contrib/morphlines-core/lib/metrics-healthchecks-3.0.1.jar:/home/jenkins/workspace/Lucene-Solr-trunk-Linux/lucene/build/core/classes/java:/home/jenkins/workspace/Lucene-Solr-trunk-Linux/solr/build/contrib/solr-cell/classes/java:/home/jenkins/workspace/Lucene-Solr-trunk-Linux/solr/contrib/extraction/lib/apache-mime4j-core-0.7.2.jar:/home/jenkins/workspace/Lucene-Solr-trunk-Linux/solr/contrib/extraction/lib/apache-mime4j-dom-0.7.2.jar:/home/jenkins/workspace/Lucene-Solr-trunk-Linux/solr/contrib/extraction/lib/aspectjrt-1.8.0.jar:/home/jenkins/workspace/Lucene-Solr-trunk-Linux/solr/contrib/extraction/lib/bcmail-jdk15-1.45.jar:/home/jenkins/workspace/Lucene-Solr-trunk-Linux/solr/contrib/extraction/lib/bcprov-jdk15-1.45.jar:/home/jenkins/workspace/Lucene-Solr-trunk-Linux/solr/contrib/extraction/lib/boilerpipe-1.1.0.jar:/home/jenkins/workspace/Lucene-Solr-trunk-Linux/solr/contrib/extraction/lib/commons-compress-1.8.1.jar:/home/jenkins/workspace/Lucene-Solr-trunk-Linux/solr/contrib/extraction/lib/fontbox-1.8.8.jar:/home/jenkins/workspace/Lucene-Solr-trunk-Linux/solr/contrib/extraction/lib/icu4j-56.1.jar:/home/jenkins/workspace/Lucene-Solr-trunk-Linux/solr/contrib/extraction/lib/isoparser-1.0.2.jar:/home/jenkins/workspace/Lucene-Solr-trunk-Linux/solr/contrib/extraction/lib/java-libpst-0.8.1.jar:/home/jenkins/workspace/Lucene-Solr-trunk-Linux/solr/contrib/extraction/lib/jdom-1.0.jar:/home/jenkins/workspace/Lucene-Solr-trunk-Linux/solr/contrib/extraction/lib/jempbox-1.8.8.jar:/home/jenkins/workspace/Lucene-Solr-trunk-Linux/solr/contrib/extraction/lib/jmatio-1.0.jar:/home/jenkins/workspace/Lucene-Solr-trunk-Linux/solr/contrib/extraction/lib/juniversalchardet-1.0.3.jar:/home/jenkins/workspace/Lucene-Solr-trunk-Linux/solr/contrib/extraction/lib/metadata-extractor-2.6.2.jar:/home/jenkins/workspace/Lucene-Solr-trunk-Linux/solr/contrib/extraction/lib/pdfbox-1.8.8.jar:/home/jenkins/workspace/Lucene-Solr-trunk-Linux/solr/contrib/extraction/lib/poi-3.11.jar:/home/jenkins/workspace/Lucene-Solr-trunk-Linux/solr/contrib/extraction/lib/poi-ooxml-3.11.jar:/home/jenkins/workspace/Lucene-Solr-trunk-Linux/solr/contrib/extraction/lib/poi-ooxml-schemas-3.11.jar:/home/jenkins/workspace/Lucene-Solr-trunk-Linux/solr/contrib/extraction/lib/poi-scratchpad-3.11.jar:/home/jenkins/workspace/Lucene-Solr-trunk-Linux/solr/contrib/extraction/lib/rome-1.0.jar:/home/jenkins/workspace/Lucene-Solr-trunk-Linux/solr/contrib/extraction/lib/tagsoup-1.2.1.jar:/home/jenkins/workspace/Lucene-Solr-trunk-Linux/solr/contrib/extraction/lib/tika-core-1.7.jar:/home/jenkins/workspace/Lucene-Solr-trunk-Linux/solr/contrib/extraction/lib/tika-java7-1.7.jar:/home/jenkins/workspace/Lucene-Solr-trunk-Linux/solr/contrib/extraction/lib/tika-parsers-1.7.jar:/home/jenkins/workspace/Lucene-Solr-trunk-Linux/solr/contrib/extraction/lib/tika-xmp-1.7.jar:/home/jenkins/workspace/Lucene-Solr-trunk-Linux/solr/contrib/extraction/lib/vorbis-java-core-0.6.jar:/home/jenkins/workspace/Lucene-Solr-trunk-Linux/solr/contrib/extraction/lib/vorbis-java-tika-0.6.jar:/home/jenkins/workspace/Lucene-Solr-trunk-Linux/solr/contrib/extraction/lib/xercesImpl-2.9.1.jar:/home/jenkins/workspace/Lucene-Solr-trunk-Linux/solr/contrib/extraction/lib/xmlbeans-2.6.0.jar:/home/jenkins/workspace/Lucene-Solr-trunk-Linux/solr/contrib/extraction/lib/xmpcore-5.1.2.jar:/home/jenkins/workspace/Lucene-Solr-trunk-Linux/solr/contrib/extraction/lib/xz-1.5.jar:/home/jenkins/workspace/Lucene-Solr-trunk-Linux/lucene/test-framework/lib/junit-4.10.jar:/home/jenkins/workspace/Lucene-Solr-trunk-Linux/lucene/test-framework/lib/randomizedtesting-runner-2.3.2.jar:/home/jenkins/workspace/Lucene-Solr-trunk-Linux/solr/build/contrib/solr-morphlines-core/classes/java:/home/jenkins/workspace/Lucene-Solr-trunk-Linux/solr/contrib/morphlines-core/test-lib/aopalliance-1.0.jar:/home/jenkins/workspace/Lucene-Solr-trunk-Linux/solr/contrib/morphlines-core/test-lib/avro-1.7.5.jar:/home/jenkins/workspace/Lucene-Solr-trunk-Linux/solr/contrib/morphlines-core/test-lib/commons-collections-3.2.2.jar:/home/jenkins/workspace/Lucene-Solr-trunk-Linux/solr/contrib/morphlines-core/test-lib/curator-client-2.8.0.jar:/home/jenkins/workspace/Lucene-Solr-trunk-Linux/solr/contrib/morphlines-core/test-lib/curator-framework-2.8.0.jar:/home/jenkins/workspace/Lucene-Solr-trunk-Linux/solr/contrib/morphlines-core/test-lib/guice-3.0.jar:/home/jenkins/workspace/Lucene-Solr-trunk-Linux/solr/contrib/morphlines-core/test-lib/guice-servlet-3.0.jar:/home/jenkins/workspace/Lucene-Solr-trunk-Linux/solr/contrib/morphlines-core/test-lib/hadoop-common-2.6.0-tests.jar:/home/jenkins/workspace/Lucene-Solr-trunk-Linux/solr/contrib/morphlines-core/test-lib/hadoop-common-2.6.0.jar:/home/jenkins/workspace/Lucene-Solr-trunk-Linux/solr/contrib/morphlines-core/test-lib/hadoop-hdfs-2.6.0-tests.jar:/home/jenkins/workspace/Lucene-Solr-trunk-Linux/solr/contrib/morphlines-core/test-lib/hadoop-mapreduce-client-app-2.6.0.jar:/home/jenkins/workspace/Lucene-Solr-trunk-Linux/solr/contrib/morphlines-core/test-lib/hadoop-mapreduce-client-common-2.6.0.jar:/home/jenkins/workspace/Lucene-Solr-trunk-Linux/solr/contrib/morphlines-core/test-lib/hadoop-mapreduce-client-core-2.6.0.jar:/home/jenkins/workspace/Lucene-Solr-trunk-Linux/solr/contrib/morphlines-core/test-lib/hadoop-mapreduce-client-hs-2.6.0.jar:/home/jenkins/workspace/Lucene-Solr-trunk-Linux/solr/contrib/morphlines-core/test-lib/hadoop-mapreduce-client-jobclient-2.6.0-tests.jar:/home/jenkins/workspace/Lucene-Solr-trunk-Linux/solr/contrib/morphlines-core/test-lib/hadoop-mapreduce-client-jobclient-2.6.0.jar:/home/jenkins/workspace/Lucene-Solr-trunk-Linux/solr/contrib/morphlines-core/test-lib/hadoop-mapreduce-client-shuffle-2.6.0.jar:/home/jenkins/workspace/Lucene-Solr-trunk-Linux/solr/contrib/morphlines-core/test-lib/hadoop-yarn-api-2.6.0.jar:/home/jenkins/workspace/Lucene-Solr-trunk-Linux/solr/contrib/morphlines-core/test-lib/hadoop-yarn-client-2.6.0.jar:/home/jenkins/workspace/Lucene-Solr-trunk-Linux/solr/contrib/morphlines-core/test-lib/hadoop-yarn-common-2.6.0.jar:/home/jenkins/workspace/Lucene-Solr-trunk-Linux/solr/contrib/morphlines-core/test-lib/hadoop-yarn-server-applicationhistoryservice-2.6.0.jar:/home/jenkins/workspace/Lucene-Solr-trunk-Linux/solr/contrib/morphlines-core/test-lib/hadoop-yarn-server-common-2.6.0.jar:/home/jenkins/workspace/Lucene-Solr-trunk-Linux/solr/contrib/morphlines-core/test-lib/hadoop-yarn-server-nodemanager-2.6.0.jar:/home/jenkins/workspace/Lucene-Solr-trunk-Linux/solr/contrib/morphlines-core/test-lib/hadoop-yarn-server-resourcemanager-2.6.0.jar:/home/jenkins/workspace/Lucene-Solr-trunk-Linux/solr/contrib/morphlines-core/test-lib/hadoop-yarn-server-tests-2.6.0-tests.jar:/home/jenkins/workspace/Lucene-Solr-trunk-Linux/solr/contrib/morphlines-core/test-lib/hadoop-yarn-server-web-proxy-2.6.0.jar:/home/jenkins/workspace/Lucene-Solr-trunk-Linux/solr/contrib/morphlines-core/test-lib/jackson-annotations-2.5.4.jar:/home/jenkins/workspace/Lucene-Solr-trunk-Linux/solr/contrib/morphlines-core/test-lib/jackson-core-2.5.4.jar:/home/jenkins/workspace/Lucene-Solr-trunk-Linux/solr/contrib/morphlines-core/test-lib/jackson-core-asl-1.9.13.jar:/home/jenkins/workspace/Lucene-Solr-trunk-Linux/solr/contrib/morphlines-core/test-lib/jackson-databind-2.5.4.jar:/home/jenkins/workspace/Lucene-Solr-trunk-Linux/solr/contrib/morphlines-core/test-lib/jackson-jaxrs-1.9.13.jar:/home/jenkins/workspace/Lucene-Solr-trunk-Linux/solr/contrib/morphlines-core/test-lib/jackson-mapper-asl-1.9.13.jar:/home/jenkins/workspace/Lucene-Solr-trunk-Linux/solr/contrib/morphlines-core/test-lib/javax.inject-1.jar:/home/jenkins/workspace/Lucene-Solr-trunk-Linux/solr/contrib/morphlines-core/test-lib/jaxb-impl-2.2.3-1.jar:/home/jenkins/workspace/Lucene-Solr-trunk-Linux/solr/contrib/morphlines-core/test-lib/jersey-bundle-1.9.jar:/home/jenkins/workspace/Lucene-Solr-trunk-Linux/solr/contrib/morphlines-core/test-lib/jersey-core-1.9.jar:/home/jenkins/workspace/Lucene-Solr-trunk-Linux/solr/contrib/morphlines-core/test-lib/jersey-guice-1.9.jar:/home/jenkins/workspace/Lucene-Solr-trunk-Linux/solr/contrib/morphlines-core/test-lib/jersey-json-1.9.jar:/home/jenkins/workspace/Lucene-Solr-trunk-Linux/solr/contrib/morphlines-core/test-lib/jersey-server-1.9.jar:/home/jenkins/workspace/Lucene-Sol
   [junit4]   2> r-trunk-Linux/solr/contrib/morphlines-core/test-lib/jetty-6.1.26.jar:/home/jenkins/workspace/Lucene-Solr-trunk-Linux/solr/contrib/morphlines-core/test-lib/jetty-util-6.1.26.jar:/home/jenkins/workspace/Lucene-Solr-trunk-Linux/solr/contrib/morphlines-core/test-lib/kite-morphlines-core-1.1.0-tests.jar:/home/jenkins/workspace/Lucene-Solr-trunk-Linux/solr/contrib/morphlines-core/test-lib/kite-morphlines-core-1.1.0.jar:/home/jenkins/workspace/Lucene-Solr-trunk-Linux/solr/contrib/morphlines-core/test-lib/leveldb-0.7.jar:/home/jenkins/workspace/Lucene-Solr-trunk-Linux/solr/contrib/morphlines-core/test-lib/leveldb-api-0.7.jar:/home/jenkins/workspace/Lucene-Solr-trunk-Linux/solr/contrib/morphlines-core/test-lib/leveldbjni-1.8.jar:/home/jenkins/workspace/Lucene-Solr-trunk-Linux/solr/contrib/morphlines-core/test-lib/mockito-core-1.9.5.jar:/home/jenkins/workspace/Lucene-Solr-trunk-Linux/solr/contrib/morphlines-core/test-lib/mrunit-1.0.0-hadoop2.jar:/home/jenkins/workspace/Lucene-Solr-trunk-Linux/solr/contrib/morphlines-core/test-lib/netty-3.7.0.Final.jar:/home/jenkins/workspace/Lucene-Solr-trunk-Linux/solr/contrib/morphlines-core/test-lib/objenesis-1.2.jar:/home/jenkins/workspace/Lucene-Solr-trunk-Linux/solr/contrib/morphlines-core/test-lib/paranamer-2.3.jar:/home/jenkins/workspace/Lucene-Solr-trunk-Linux/solr/contrib/morphlines-core/test-lib/snappy-java-1.0.5.jar:/var/lib/jenkins/tools/hudson.tasks.Ant_AntInstallation/ANT_1.8.2/lib/ant-launcher.jar:/var/lib/jenkins/.ant/lib/ivy-2.3.0.jar:/var/lib/jenkins/tools/hudson.tasks.Ant_AntInstallation/ANT_1.8.2/lib/ant-jdepend.jar:/var/lib/jenkins/tools/hudson.tasks.Ant_AntInstallation/ANT_1.8.2/lib/ant.jar:/var/lib/jenkins/tools/hudson.tasks.Ant_AntInstallation/ANT_1.8.2/lib/ant-apache-bcel.jar:/var/lib/jenkins/tools/hudson.tasks.Ant_AntInstallation/ANT_1.8.2/lib/ant-jmf.jar:/var/lib/jenkins/tools/hudson.tasks.Ant_AntInstallation/ANT_1.8.2/lib/ant-junit4.jar:/var/lib/jenkins/tools/hudson.tasks.Ant_AntInstallation/ANT_1.8.2/lib/ant-apache-xalan2.jar:/var/lib/jenkins/tools/hudson.tasks.Ant_AntInstallation/ANT_1.8.2/lib/ant-javamail.jar:/var/lib/jenkins/tools/hudson.tasks.Ant_AntInstallation/ANT_1.8.2/lib/ant-jai.jar:/var/lib/jenkins/tools/hudson.tasks.Ant_AntInstallation/ANT_1.8.2/lib/ant-apache-bsf.jar:/var/lib/jenkins/tools/hudson.tasks.Ant_AntInstallation/ANT_1.8.2/lib/ant-commons-logging.jar:/var/lib/jenkins/tools/hudson.tasks.Ant_AntInstallation/ANT_1.8.2/lib/ant-commons-net.jar:/var/lib/jenkins/tools/hudson.tasks.Ant_AntInstallation/ANT_1.8.2/lib/ant-apache-resolver.jar:/var/lib/jenkins/tools/hudson.tasks.Ant_AntInstallation/ANT_1.8.2/lib/ant-apache-log4j.jar:/var/lib/jenkins/tools/hudson.tasks.Ant_AntInstallation/ANT_1.8.2/lib/ant-junit.jar:/var/lib/jenkins/tools/hudson.tasks.Ant_AntInstallation/ANT_1.8.2/lib/ant-apache-oro.jar:/var/lib/jenkins/tools/hudson.tasks.Ant_AntInstallation/ANT_1.8.2/lib/ant-antlr.jar:/var/lib/jenkins/tools/hudson.tasks.Ant_AntInstallation/ANT_1.8.2/lib/ant-jsch.jar:/var/lib/jenkins/tools/hudson.tasks.Ant_AntInstallation/ANT_1.8.2/lib/ant-apache-regexp.jar:/var/lib/jenkins/tools/hudson.tasks.Ant_AntInstallation/ANT_1.8.2/lib/ant-swing.jar:/var/lib/jenkins/tools/hudson.tasks.Ant_AntInstallation/ANT_1.8.2/lib/ant-testutil.jar:/var/lib/jenkins/tools/hudson.tasks.Ant_AntInstallation/ANT_1.8.2/lib/ant-netrexx.jar:/var/lib/jenkins/.ivy2/cache/com.carrotsearch.randomizedtesting/junit4-ant/jars/junit4-ant-2.3.2.jar
   [junit4]   2> 154  INFO  (Thread-1) [    ] o.a.z.s.ZooKeeperServer Server environment:java.library.path=/usr/java/packages/lib/amd64:/usr/lib64:/lib64:/lib:/usr/lib
   [junit4]   2> 154  INFO  (Thread-1) [    ] o.a.z.s.ZooKeeperServer Server environment:java.io.tmpdir=./temp
   [junit4]   2> 154  INFO  (Thread-1) [    ] o.a.z.s.ZooKeeperServer Server environment:java.compiler=<NA>
   [junit4]   2> 155  INFO  (Thread-1) [    ] o.a.z.s.ZooKeeperServer Server environment:os.name=Linux
   [junit4]   2> 155  INFO  (Thread-1) [    ] o.a.z.s.ZooKeeperServer Server environment:os.arch=amd64
   [junit4]   2> 155  INFO  (Thread-1) [    ] o.a.z.s.ZooKeeperServer Server environment:os.version=3.19.0-47-generic
   [junit4]   2> 155  INFO  (Thread-1) [    ] o.a.z.s.ZooKeeperServer Server environment:user.name=jenkins
   [junit4]   2> 155  INFO  (Thread-1) [    ] o.a.z.s.ZooKeeperServer Server environment:user.home=/var/lib/jenkins
   [junit4]   2> 155  INFO  (Thread-1) [    ] o.a.z.s.ZooKeeperServer Server environment:user.dir=/home/jenkins/workspace/Lucene-Solr-trunk-Linux/solr/build/contrib/solr-morphlines-core/test/J1
   [junit4]   2> 167  INFO  (Thread-1) [    ] o.a.z.s.ZooKeeperServer Created server with tickTime 1000 minSessionTimeout 2000 maxSessionTimeout 20000 datadir /home/jenkins/workspace/Lucene-Solr-trunk-Linux/solr/build/contrib/solr-morphlines-core/test/J1/temp/solr.morphlines.solr.SolrMorphlineZkAliasTest_BDF1A9126ED8D58-001/tempDir-002/zookeeper/server1/data/version-2 snapdir /home/jenkins/workspace/Lucene-Solr-trunk-Linux/solr/build/contrib/solr-morphlines-core/test/J1/temp/solr.morphlines.solr.SolrMorphlineZkAliasTest_BDF1A9126ED8D58-001/tempDir-002/zookeeper/server1/data/version-2
   [junit4]   2> 173  INFO  (Thread-1) [    ] o.a.z.s.NIOServerCnxnFactory binding to port 0.0.0.0/0.0.0.0:0
   [junit4]   2> 215  INFO  (TEST-SolrMorphlineZkAliasTest.test-seed#[BDF1A9126ED8D58]) [    ] o.a.s.c.ZkTestServer start zk server on port:53284
   [junit4]   2> 235  INFO  (TEST-SolrMorphlineZkAliasTest.test-seed#[BDF1A9126ED8D58]) [    ] o.a.s.c.c.SolrZkClient Using default ZkCredentialsProvider
   [junit4]   2> 253  INFO  (TEST-SolrMorphlineZkAliasTest.test-seed#[BDF1A9126ED8D58]) [    ] o.a.z.ZooKeeper Client environment:zookeeper.version=3.4.6-1569965, built on 02/20/2014 09:09 GMT
   [junit4]   2> 254  INFO  (TEST-SolrMorphlineZkAliasTest.test-seed#[BDF1A9126ED8D58]) [    ] o.a.z.ZooKeeper Client environment:host.name=serv1
   [junit4]   2> 254  INFO  (TEST-SolrMorphlineZkAliasTest.test-seed#[BDF1A9126ED8D58]) [    ] o.a.z.ZooKeeper Client environment:java.version=9-ea
   [junit4]   2> 254  INFO  (TEST-SolrMorphlineZkAliasTest.test-seed#[BDF1A9126ED8D58]) [    ] o.a.z.ZooKeeper Client environment:java.vendor=Oracle Corporation
   [junit4]   2> 254  INFO  (TEST-SolrMorphlineZkAliasTest.test-seed#[BDF1A9126ED8D58]) [    ] o.a.z.ZooKeeper Client environment:java.home=/home/jenkins/tools/java/64bit/jdk-9-ea+105
   [junit4]   2> 254  INFO  (TEST-SolrMorphlineZkAliasTest.test-seed#[BDF1A9126ED8D58]) [    ] o.a.z.ZooKeeper Client environment:java.class.path=/home/jenkins/workspace/Lucene-Solr-trunk-Linux/solr/build/contrib/solr-morphlines-core/classes/test:/home/jenkins/workspace/Lucene-Solr-trunk-Linux/solr/build/solr-test-framework/classes/java:/home/jenkins/workspace/Lucene-Solr-trunk-Linux/solr/test-framework/lib/junit4-ant-2.3.2.jar:/home/jenkins/workspace/Lucene-Solr-trunk-Linux/solr/contrib/morphlines-core/src/test-files:/home/jenkins/workspace/Lucene-Solr-trunk-Linux/lucene/build/test-framework/classes/java:/home/jenkins/workspace/Lucene-Solr-trunk-Linux/lucene/build/codecs/classes/java:/home/jenkins/workspace/Lucene-Solr-trunk-Linux/solr/build/solr-solrj/classes/java:/home/jenkins/workspace/Lucene-Solr-trunk-Linux/solr/build/solr-core/classes/java:/home/jenkins/workspace/Lucene-Solr-trunk-Linux/lucene/build/analysis/common/lucene-analyzers-common-6.0.0-SNAPSHOT.jar:/home/jenkins/workspace/Lucene-Solr-trunk-Linux/lucene/build/analysis/kuromoji/lucene-analyzers-kuromoji-6.0.0-SNAPSHOT.jar:/home/jenkins/workspace/Lucene-Solr-trunk-Linux/lucene/build/analysis/phonetic/lucene-analyzers-phonetic-6.0.0-SNAPSHOT.jar:/home/jenkins/workspace/Lucene-Solr-trunk-Linux/lucene/build/codecs/lucene-codecs-6.0.0-SNAPSHOT.jar:/home/jenkins/workspace/Lucene-Solr-trunk-Linux/lucene/build/backward-codecs/lucene-backward-codecs-6.0.0-SNAPSHOT.jar:/home/jenkins/workspace/Lucene-Solr-trunk-Linux/lucene/build/highlighter/lucene-highlighter-6.0.0-SNAPSHOT.jar:/home/jenkins/workspace/Lucene-Solr-trunk-Linux/lucene/build/memory/lucene-memory-6.0.0-SNAPSHOT.jar:/home/jenkins/workspace/Lucene-Solr-trunk-Linux/lucene/build/misc/lucene-misc-6.0.0-SNAPSHOT.jar:/home/jenkins/workspace/Lucene-Solr-trunk-Linux/lucene/build/spatial/lucene-spatial-6.0.0-SNAPSHOT.jar:/home/jenkins/workspace/Lucene-Solr-trunk-Linux/lucene/build/expressions/lucene-expressions-6.0.0-SNAPSHOT.jar:/home/jenkins/workspace/Lucene-Solr-trunk-Linux/lucene/build/suggest/lucene-suggest-6.0.0-SNAPSHOT.jar:/home/jenkins/workspace/Lucene-Solr-trunk-Linux/lucene/build/grouping/lucene-grouping-6.0.0-SNAPSHOT.jar:/home/jenkins/workspace/Lucene-Solr-trunk-Linux/lucene/build/queries/lucene-queries-6.0.0-SNAPSHOT.jar:/home/jenkins/workspace/Lucene-Solr-trunk-Linux/lucene/build/queryparser/lucene-queryparser-6.0.0-SNAPSHOT.jar:/home/jenkins/workspace/Lucene-Solr-trunk-Linux/lucene/build/join/lucene-join-6.0.0-SNAPSHOT.jar:/home/jenkins/workspace/Lucene-Solr-trunk-Linux/lucene/build/sandbox/lucene-sandbox-6.0.0-SNAPSHOT.jar:/home/jenkins/workspace/Lucene-Solr-trunk-Linux/solr/core/lib/antlr4-runtime-4.5.1-1.jar:/home/jenkins/workspace/Lucene-Solr-trunk-Linux/solr/core/lib/asm-5.0.4.jar:/home/jenkins/workspace/Lucene-Solr-trunk-Linux/solr/core/lib/asm-commons-5.0.4.jar:/home/jenkins/workspace/Lucene-Solr-trunk-Linux/solr/core/lib/caffeine-1.0.1.jar:/home/jenkins/workspace/Lucene-Solr-trunk-Linux/solr/core/lib/commons-cli-1.2.jar:/home/jenkins/workspace/Lucene-Solr-trunk-Linux/solr/core/lib/commons-codec-1.10.jar:/home/jenkins/workspace/Lucene-Solr-trunk-Linux/solr/core/lib/commons-collections-3.2.2.jar:/home/jenkins/workspace/Lucene-Solr-trunk-Linux/solr/core/lib/commons-configuration-1.6.jar:/home/jenkins/workspace/Lucene-Solr-trunk-Linux/solr/core/lib/commons-exec-1.3.jar:/home/jenkins/workspace/Lucene-Solr-trunk-Linux/solr/core/lib/commons-fileupload-1.2.1.jar:/home/jenkins/workspace/Lucene-Solr-trunk-Linux/solr/core/lib/commons-lang-2.6.jar:/home/jenkins/workspace/Lucene-Solr-trunk-Linux/solr/core/lib/dom4j-1.6.1.jar:/home/jenkins/workspace/Lucene-Solr-trunk-Linux/solr/core/lib/guava-14.0.1.jar:/home/jenkins/workspace/Lucene-Solr-trunk-Linux/solr/core/lib/hadoop-annotations-2.6.0.jar:/home/jenkins/workspace/Lucene-Solr-trunk-Linux/solr/core/lib/hadoop-auth-2.6.0.jar:/home/jenkins/workspace/Lucene-Solr-trunk-Linux/solr/core/lib/hadoop-common-2.6.0.jar:/home/jenkins/workspace/Lucene-Solr-trunk-Linux/solr/core/lib/hadoop-hdfs-2.6.0.jar:/home/jenkins/workspace/Lucene-Solr-trunk-Linux/solr/core/lib/hppc-0.7.1.jar:/home/jenkins/workspace/Lucene-Solr-trunk-Linux/solr/core/lib/htrace-core-3.0.4.jar:/home/jenkins/workspace/Lucene-Solr-trunk-Linux/solr/core/lib/jackson-core-2.5.4.jar:/home/jenkins/workspace/Lucene-Solr-trunk-Linux/solr/core/lib/jackson-dataformat-smile-2.5.4.jar:/home/jenkins/workspace/Lucene-Solr-trunk-Linux/solr/core/lib/jcl-over-slf4j-1.7.7.jar:/home/jenkins/workspace/Lucene-Solr-trunk-Linux/solr/core/lib/joda-time-2.2.jar:/home/jenkins/workspace/Lucene-Solr-trunk-Linux/solr/core/lib/log4j-1.2.17.jar:/home/jenkins/workspace/Lucene-Solr-trunk-Linux/solr/core/lib/org.restlet-2.3.0.jar:/home/jenkins/workspace/Lucene-Solr-trunk-Linux/solr/core/lib/org.restlet.ext.servlet-2.3.0.jar:/home/jenkins/workspace/Lucene-Solr-trunk-Linux/solr/core/lib/presto-parser-0.122.jar:/home/jenkins/workspace/Lucene-Solr-trunk-Linux/solr/core/lib/protobuf-java-2.5.0.jar:/home/jenkins/workspace/Lucene-Solr-trunk-Linux/solr/core/lib/slf4j-log4j12-1.7.7.jar:/home/jenkins/workspace/Lucene-Solr-trunk-Linux/solr/core/lib/slice-0.10.jar:/home/jenkins/workspace/Lucene-Solr-trunk-Linux/solr/core/lib/spatial4j-0.5.jar:/home/jenkins/workspace/Lucene-Solr-trunk-Linux/solr/core/lib/t-digest-3.1.jar:/home/jenkins/workspace/Lucene-Solr-trunk-Linux/solr/solrj/lib/commons-io-2.4.jar:/home/jenkins/workspace/Lucene-Solr-trunk-Linux/solr/solrj/lib/httpclient-4.4.1.jar:/home/jenkins/workspace/Lucene-Solr-trunk-Linux/solr/solrj/lib/httpcore-4.4.1.jar:/home/jenkins/workspace/Lucene-Solr-trunk-Linux/solr/solrj/lib/httpmime-4.4.1.jar:/home/jenkins/workspace/Lucene-Solr-trunk-Linux/solr/solrj/lib/jcl-over-slf4j-1.7.7.jar:/home/jenkins/workspace/Lucene-Solr-trunk-Linux/solr/solrj/lib/noggit-0.6.jar:/home/jenkins/workspace/Lucene-Solr-trunk-Linux/solr/solrj/lib/slf4j-api-1.7.7.jar:/home/jenkins/workspace/Lucene-Solr-trunk-Linux/solr/solrj/lib/stax2-api-3.1.4.jar:/home/jenkins/workspace/Lucene-Solr-trunk-Linux/solr/solrj/lib/woodstox-core-asl-4.4.1.jar:/home/jenkins/workspace/Lucene-Solr-trunk-Linux/solr/solrj/lib/zookeeper-3.4.6.jar:/home/jenkins/workspace/Lucene-Solr-trunk-Linux/solr/server/lib/javax.servlet-api-3.1.0.jar:/home/jenkins/workspace/Lucene-Solr-trunk-Linux/solr/server/lib/jetty-continuation-9.3.6.v20151106.jar:/home/jenkins/workspace/Lucene-Solr-trunk-Linux/solr/server/lib/jetty-deploy-9.3.6.v20151106.jar:/home/jenkins/workspace/Lucene-Solr-trunk-Linux/solr/server/lib/jetty-http-9.3.6.v20151106.jar:/home/jenkins/workspace/Lucene-Solr-trunk-Linux/solr/server/lib/jetty-io-9.3.6.v20151106.jar:/home/jenkins/workspace/Lucene-Solr-trunk-Linux/solr/server/lib/jetty-jmx-9.3.6.v20151106.jar:/home/jenkins/workspace/Lucene-Solr-trunk-Linux/solr/server/lib/jetty-rewrite-9.3.6.v20151106.jar:/home/jenkins/workspace/Lucene-Solr-trunk-Linux/solr/server/lib/jetty-security-9.3.6.v20151106.jar:/home/jenkins/workspace/Lucene-Solr-trunk-Linux/solr/server/lib/jetty-server-9.3.6.v20151106.jar:/home/jenkins/workspace/Lucene-Solr-trunk-Linux/solr/server/lib/jetty-servlet-9.3.6.v20151106.jar:/home/jenkins/workspace/Lucene-Solr-trunk-Linux/solr/server/lib/jetty-servlets-9.3.6.v20151106.jar:/home/jenkins/workspace/Lucene-Solr-trunk-Linux/solr/server/lib/jetty-util-9.3.6.v20151106.jar:/home/jenkins/workspace/Lucene-Solr-trunk-Linux/solr/server/lib/jetty-webapp-9.3.6.v20151106.jar:/home/jenkins/workspace/Lucene-Solr-trunk-Linux/solr/server/lib/jetty-xml-9.3.6.v20151106.jar:/home/jenkins/workspace/Lucene-Solr-trunk-Linux/solr/example/example-DIH/solr/db/lib/derby-10.9.1.0.jar:/home/jenkins/workspace/Lucene-Solr-trunk-Linux/solr/example/example-DIH/solr/db/lib/hsqldb-1.8.0.10.jar:/home/jenkins/workspace/Lucene-Solr-trunk-Linux/solr/contrib/morphlines-core/lib/config-1.0.2.jar:/home/jenkins/workspace/Lucene-Solr-trunk-Linux/solr/contrib/morphlines-core/lib/kite-morphlines-avro-1.1.0.jar:/home/jenkins/workspace/Lucene-Solr-trunk-Linux/solr/contrib/morphlines-core/lib/kite-morphlines-core-1.1.0.jar:/home/jenkins/workspace/Lucene-Solr-trunk-Linux/solr/contrib/morphlines-core/lib/metrics-core-3.0.1.jar:/home/jenkins/workspace/Lucene-Solr-trunk-Linux/solr/contrib/morphlines-core/lib/metrics-healthchecks-3.0.1.jar:/home/jenkins/workspace/Lucene-Solr-trunk-Linux/lucene/build/core/classes/java:/home/jenkins/workspace/Lucene-Solr-trunk-Linux/solr/build/contrib/solr-cell/classes/java:/home/jenkins/workspace/Lucene-Solr-trunk-Linux/solr/contrib/extraction/lib/apache-mime4j-core-0.7.2.jar:/home/jenkins/workspace/Lucene-Solr-trunk-Linux/solr/contrib/extraction/lib/apache-mime4j-dom-0.7.2.jar:/home/jenkins/workspace/Lucene-Solr-trunk-Linux/solr/contrib/extraction/lib/aspectjrt-1.8.0.jar:/home/jenkins/workspace/Lucene-Solr-trunk-Linux/solr/contrib/extraction/lib/bcmail-jdk15-1.45.jar:/home/jenkins/workspace/Lucene-Solr-trunk-Linux/solr/contrib/extraction/lib/bcprov-jdk15-1.45.jar:/home/jenkins/workspace/Lucene-Solr-trunk-Linux/solr/contrib/extraction/lib/boilerpipe-1.1.0.jar:/home/jenkins/workspace/Lucene-Solr-trunk-Linux/solr/contrib/extraction/lib/commons-compress-1.8.1.jar:/home/jenkins/workspace/Lucene-Solr-trunk-Linux/solr/contrib/extraction/lib/fontbox-1.8.8.jar:/home/jenkins/workspace/Lucene-Solr-trunk-Linux/solr/contrib/extraction/lib/icu4j-56.1.jar:/home/jenkins/workspace/Lucene-Solr-trunk-Linux/solr/contrib/extraction/lib/isoparser-1.0.2.jar:/home/jenkins/workspace/Lucene-Solr-trunk-Linux/solr/contrib/extraction/lib/java-libpst-0.8.1.jar:/home/jenkins/workspace/Lucene-Solr-trunk-Linux/solr/contrib/extraction/lib/jdom-1.0.jar:/home/jenkins/workspace/Lucene-Solr-trunk-Linux/solr/contrib/extraction/lib/jempbox-1.8.8.jar:/home/jenkins/workspace/Lucene-Solr-trunk-Linux/solr/contrib/extraction/lib/jmatio-1.0.jar:/home/jenkins/workspace/Lucene-Solr-trunk-Linux/solr/contrib/extraction/lib/juniversalchardet-1.0.3.jar:/home/jenkins/workspace/Lucene-Solr-trunk-Linux/solr/contrib/extraction/lib/metadata-extractor-2.6.2.jar:/home/jenkins/workspace/Lucene-Solr-trunk-Linux/solr/contrib/extraction/lib/pdfbox-1.8.8.jar:/home/jenkins/workspace/Lucene-Solr-trunk-Linux/solr/contrib/extraction/lib/poi-3.11.jar:/home/jenkins/workspace/Lucene-Solr-trunk-Linux/solr/contrib/extraction/lib/poi-ooxml-3.11.jar:/home/jenkins/workspace/Lucene-Solr-trunk-Linux/solr/contrib/extraction/lib/poi-ooxml-schemas-3.11.jar:/home/jenkins/workspace/Lucene-Solr-trunk-Linux/solr/contrib/extraction/lib/poi-scratchpad-3.11.jar:/home/jenkins/workspace/Lucene-Solr-trunk-Linux/solr/contrib/extraction/lib/rome-1.0.jar:/home/jenkins/workspace/Lucene-Solr-trunk-Linux/solr/contrib/extraction/lib/tagsoup-1.2.1.jar:/home/jenkins/workspace/Lucene-Solr-trunk-Linux/solr/contrib/extraction/lib/tika-core-1.7.jar:/home/jenkins/workspace/Lucene-Solr-trunk-Linux/solr/contrib/extraction/lib/tika-java7-1.7.jar:/home/jenkins/workspace/Lucene-Solr-trunk-Linux/solr/contrib/extraction/lib/tika-parsers-1.7.jar:/home/jenkins/workspace/Lucene-Solr-trunk-Linux/solr/contrib/extraction/lib/tika-xmp-1.7.jar:/home/jenkins/workspace/Lucene-Solr-trunk-Linux/solr/contrib/extraction/lib/vorbis-java-core-0.6.jar:/home/jenkins/workspace/Lucene-Solr-trunk-Linux/solr/contrib/extraction/lib/vorbis-java-tika-0.6.jar:/home/jenkins/workspace/Lucene-Solr-trunk-Linux/solr/contrib/extraction/lib/xercesImpl-2.9.1.jar:/home/jenkins/workspace/Lucene-Solr-trunk-Linux/solr/contrib/extraction/lib/xmlbeans-2.6.0.jar:/home/jenkins/workspace/Lucene-Solr-trunk-Linux/solr/contrib/extraction/lib/xmpcore-5.1.2.jar:/home/jenkins/workspace/Lucene-Solr-trunk-Linux/solr/contrib/extraction/lib/xz-1.5.jar:/home/jenkins/workspace/Lucene-Solr-trunk-Linux/lucene/test-framework/lib/junit-4.10.jar:/home/jenkins/workspace/Lucene-Solr-trunk-Linux/lucene/test-framework/lib/randomizedtesting-runner-2.3.2.jar:/home/jenkins/workspace/Lucene-Solr-trunk-Linux/solr/build/contrib/solr-morphlines-core/classes/java:/home/jenkins/workspace/Lucene-Solr-trunk-Linux/solr/contrib/morphlines-core/test-lib/aopalliance-1.0.jar:/home/jenkins/workspace/Lucene-Solr-trunk-Linux/solr/contrib/morphlines-core/test-lib/avro-1.7.5.jar:/home/jenkins/workspace/Lucene-Solr-trunk-Linux/solr/contrib/morphlines-core/test-lib/commons-collections-3.2.2.jar:/home/jenkins/workspace/Lucene-Solr-trunk-Linux/solr/contrib/morphlines-core/test-lib/curator-client-2.8.0.jar:/home/jenkins/workspace/Lucene-Solr-trunk-Linux/solr/contrib/morphlines-core/test-lib/curator-framework-2.8.0.jar:/home/jenkins/workspace/Lucene-Solr-trunk-Linux/solr/contrib/morphlines-core/test-lib/guice-3.0.jar:/home/jenkins/workspace/Lucene-Solr-trunk-Linux/solr/contrib/morphlines-core/test-lib/guice-servlet-3.0.jar:/home/jenkins/workspace/Lucene-Solr-trunk-Linux/solr/contrib/morphlines-core/test-lib/hadoop-common-2.6.0-tests.jar:/home/jenkins/workspace/Lucene-Solr-trunk-Linux/solr/contrib/morphlines-core/test-lib/hadoop-common-2.6.0.jar:/home/jenkins/workspace/Lucene-Solr-trunk-Linux/solr/contrib/morphlines-core/test-lib/hadoop-hdfs-2.6.0-tests.jar:/home/jenkins/workspace/Lucene-Solr-trunk-Linux/solr/contrib/morphlines-core/test-lib/hadoop-mapreduce-client-app-2.6.0.jar:/home/jenkins/workspace/Lucene-Solr-trunk-Linux/solr/contrib/morphlines-core/test-lib/hadoop-mapreduce-client-common-2.6.0.jar:/home/jenkins/workspace/Lucene-Solr-trunk-Linux/solr/contrib/morphlines-core/test-lib/hadoop-mapreduce-client-core-2.6.0.jar:/home/jenkins/workspace/Lucene-Solr-trunk-Linux/solr/contrib/morphlines-core/test-lib/hadoop-mapreduce-client-hs-2.6.0.jar:/home/jenkins/workspace/Lucene-Solr-trunk-Linux/solr/contrib/morphlines-core/test-lib/hadoop-mapreduce-client-jobclient-2.6.0-tests.jar:/home/jenkins/workspace/Lucene-Solr-trunk-Linux/solr/contrib/morphlines-core/test-lib/hadoop-mapreduce-client-jobclient-2.6.0.jar:/home/jenkins/workspace/Lucene-Solr-trunk-Linux/solr/contrib/morphlines-core/test-lib/hadoop-mapreduce-client-shuffle-2.6.0.jar:/home/jenkins/workspace/Lucene-Solr-trunk-Linux/solr/contrib/morphlines-core/test-lib/hadoop-yarn-api-2.6.0.jar:/home/jenkins/workspace/Lucene-Solr-trunk-Linux/solr/contrib/morphlines-core/test-lib/hadoop-yarn-client-2.6.0.jar:/home/jenkins/workspace/Lucene-Solr-trunk-Linux/solr/contrib/morphlines-core/test-lib/hadoop-yarn-common-2.6.0.jar:/home/jenkins/workspace/Lucene-Solr-trunk-Linux/solr/contrib/morphlines-core/test-lib/hadoop-yarn-server-applicationhistoryservice-2.6.0.jar:/home/jenkins/workspace/Lucene-Solr-trunk-Linux/solr/contrib/morphlines-core/test-lib/hadoop-yarn-server-common-2.6.0.jar:/home/jenkins/workspace/Lucene-Solr-trunk-Linux/solr/contrib/morphlines-core/test-lib/hadoop-yarn-server-nodemanager-2.6.0.jar:/home/jenkins/workspace/Lucene-Solr-trunk-Linux/solr/contrib/morphlines-core/test-lib/hadoop-yarn-server-resourcemanager-2.6.0.jar:/home/jenkins/workspace/Lucene-Solr-trunk-Linux/solr/contrib/morphlines-core/test-lib/hadoop-yarn-server-tests-2.6.0-tests.jar:/home/jenkins/workspace/Lucene-Solr-trunk-Linux/solr/contrib/morphlines-core/test-lib/hadoop-yarn-server-web-proxy-2.6.0.jar:/home/jenkins/workspace/Lucene-Solr-trunk-Linux/solr/contrib/morphlines-core/test-lib/jackson-annotations-2.5.4.jar:/home/jenkins/workspace/Lucene-Solr-trunk-Linux/solr/contrib/morphlines-core/test-lib/jackson-core-2.5.4.jar:/home/jenkins/workspace/Lucene-Solr-trunk-Linux/solr/contrib/morphlines-core/test-lib/jackson-core-asl-1.9.13.jar:/home/jenkins/workspace/Lucene-Solr-trunk-Linux/solr/contrib/morphlines-core/test-lib/jackson-databind-2.5.4.jar:/home/jenkins/workspace/Lucene-Solr-trunk-Linux/solr/contrib/morphlines-core/test-lib/jackson-jaxrs-1.9.13.jar:/home/jenkins/workspace/Lucene-Solr-trunk-Linux/solr/contrib/morphlines-core/test-lib/jackson-mapper-asl-1.9.13.jar:/home/jenkins/workspace/Lucene-Solr-trunk-Linux/solr/contrib/morphlines-core/test-lib/javax.inject-1.jar:/home/jenkins/workspace/Lucene-Solr-trunk-Linux/solr/contrib/morphlines-core/test-lib/jaxb-impl-2.2.3-1.jar:/home/jenkins/workspace/Lucene-Solr-trunk-Linux/solr/contrib/morphlines-core/test-lib/jersey-bundle-1.9.jar:/home/jenkins/workspace/Lucene-Solr-trunk-Linux/solr/contrib/morphlines-core/test-lib/jersey-core-1.9.jar:/home/jenkins/workspace/Lucene-Solr-trunk-Linux/solr/contrib/morphlines-core/test-lib/jersey-guice-1.9.jar:/home/jenkins/workspace/Lucene-Solr-trunk-Linux/solr/contrib/morphlines-core/test-lib/jersey-json-1.9.jar:/home/jenkins/workspace/Lucene-Solr-trunk-Linux/solr/contrib/morphlines-core/test-lib/jersey-server-1
   [junit4]   2> .9.jar:/home/jenkins/workspace/Lucene-Solr-trunk-Linux/solr/contrib/morphlines-core/test-lib/jetty-6.1.26.jar:/home/jenkins/workspace/Lucene-Solr-trunk-Linux/solr/contrib/morphlines-core/test-lib/jetty-util-6.1.26.jar:/home/jenkins/workspace/Lucene-Solr-trunk-Linux/solr/contrib/morphlines-core/test-lib/kite-morphlines-core-1.1.0-tests.jar:/home/jenkins/workspace/Lucene-Solr-trunk-Linux/solr/contrib/morphlines-core/test-lib/kite-morphlines-core-1.1.0.jar:/home/jenkins/workspace/Lucene-Solr-trunk-Linux/solr/contrib/morphlines-core/test-lib/leveldb-0.7.jar:/home/jenkins/workspace/Lucene-Solr-trunk-Linux/solr/contrib/morphlines-core/test-lib/leveldb-api-0.7.jar:/home/jenkins/workspace/Lucene-Solr-trunk-Linux/solr/contrib/morphlines-core/test-lib/leveldbjni-1.8.jar:/home/jenkins/workspace/Lucene-Solr-trunk-Linux/solr/contrib/morphlines-core/test-lib/mockito-core-1.9.5.jar:/home/jenkins/workspace/Lucene-Solr-trunk-Linux/solr/contrib/morphlines-core/test-lib/mrunit-1.0.0-hadoop2.jar:/home/jenkins/workspace/Lucene-Solr-trunk-Linux/solr/contrib/morphlines-core/test-lib/netty-3.7.0.Final.jar:/home/jenkins/workspace/Lucene-Solr-trunk-Linux/solr/contrib/morphlines-core/test-lib/objenesis-1.2.jar:/home/jenkins/workspace/Lucene-Solr-trunk-Linux/solr/contrib/morphlines-core/test-lib/paranamer-2.3.jar:/home/jenkins/workspace/Lucene-Solr-trunk-Linux/solr/contrib/morphlines-core/test-lib/snappy-java-1.0.5.jar:/var/lib/jenkins/tools/hudson.tasks.Ant_AntInstallation/ANT_1.8.2/lib/ant-launcher.jar:/var/lib/jenkins/.ant/lib/ivy-2.3.0.jar:/var/lib/jenkins/tools/hudson.tasks.Ant_AntInstallation/ANT_1.8.2/lib/ant-jdepend.jar:/var/lib/jenkins/tools/hudson.tasks.Ant_AntInstallation/ANT_1.8.2/lib/ant.jar:/var/lib/jenkins/tools/hudson.tasks.Ant_AntInstallation/ANT_1.8.2/lib/ant-apache-bcel.jar:/var/lib/jenkins/tools/hudson.tasks.Ant_AntInstallation/ANT_1.8.2/lib/ant-jmf.jar:/var/lib/jenkins/tools/hudson.tasks.Ant_AntInstallation/ANT_1.8.2/lib/ant-junit4.jar:/var/lib/jenkins/tools/hudson.tasks.Ant_AntInstallation/ANT_1.8.2/lib/ant-apache-xalan2.jar:/var/lib/jenkins/tools/hudson.tasks.Ant_AntInstallation/ANT_1.8.2/lib/ant-javamail.jar:/var/lib/jenkins/tools/hudson.tasks.Ant_AntInstallation/ANT_1.8.2/lib/ant-jai.jar:/var/lib/jenkins/tools/hudson.tasks.Ant_AntInstallation/ANT_1.8.2/lib/ant-apache-bsf.jar:/var/lib/jenkins/tools/hudson.tasks.Ant_AntInstallation/ANT_1.8.2/lib/ant-commons-logging.jar:/var/lib/jenkins/tools/hudson.tasks.Ant_AntInstallation/ANT_1.8.2/lib/ant-commons-net.jar:/var/lib/jenkins/tools/hudson.tasks.Ant_AntInstallation/ANT_1.8.2/lib/ant-apache-resolver.jar:/var/lib/jenkins/tools/hudson.tasks.Ant_AntInstallation/ANT_1.8.2/lib/ant-apache-log4j.jar:/var/lib/jenkins/tools/hudson.tasks.Ant_AntInstallation/ANT_1.8.2/lib/ant-junit.jar:/var/lib/jenkins/tools/hudson.tasks.Ant_AntInstallation/ANT_1.8.2/lib/ant-apache-oro.jar:/var/lib/jenkins/tools/hudson.tasks.Ant_AntInstallation/ANT_1.8.2/lib/ant-antlr.jar:/var/lib/jenkins/tools/hudson.tasks.Ant_AntInstallation/ANT_1.8.2/lib/ant-jsch.jar:/var/lib/jenkins/tools/hudson.tasks.Ant_AntInstallation/ANT_1.8.2/lib/ant-apache-regexp.jar:/var/lib/jenkins/tools/hudson.tasks.Ant_AntInstallation/ANT_1.8.2/lib/ant-swing.jar:/var/lib/jenkins/tools/hudson.tasks.Ant_AntInstallation/ANT_1.8.2/lib/ant-testutil.jar:/var/lib/jenkins/tools/hudson.tasks.Ant_AntInstallation/ANT_1.8.2/lib/ant-netrexx.jar:/var/lib/jenkins/.ivy2/cache/com.carrotsearch.randomizedtesting/junit4-ant/jars/junit4-ant-2.3.2.jar
   [junit4]   2> 260  INFO  (TEST-SolrMorphlineZkAliasTest.test-seed#[BDF1A9126ED8D58]) [    ] o.a.z.ZooKeeper Client environment:java.library.path=/usr/java/packages/lib/amd64:/usr/lib64:/lib64:/lib:/usr/lib
   [junit4]   2> 260  INFO  (TEST-SolrMorphlineZkAliasTest.test-seed#[BDF1A9126ED8D58]) [    ] o.a.z.ZooKeeper Client environment:java.io.tmpdir=./temp
   [junit4]   2> 260  INFO  (TEST-SolrMorphlineZkAliasTest.test-seed#[BDF1A9126ED8D58]) [    ] o.a.z.ZooKeeper Client environment:java.compiler=<NA>
   [junit4]   2> 260  INFO  (TEST-SolrMorphlineZkAliasTest.test-seed#[BDF1A9126ED8D58]) [    ] o.a.z.ZooKeeper Client environment:os.name=Linux
   [junit4]   2> 261  INFO  (TEST-SolrMorphlineZkAliasTest.test-seed#[BDF1A9126ED8D58]) [    ] o.a.z.ZooKeeper Client environment:os.arch=amd64
   [junit4]   2> 261  INFO  (TEST-SolrMorphlineZkAliasTest.test-seed#[BDF1A9126ED8D58]) [    ] o.a.z.ZooKeeper Client environment:os.version=3.19.0-47-generic
   [junit4]   2> 261  INFO  (TEST-SolrMorphlineZkAliasTest.test-seed#[BDF1A9126ED8D58]) [    ] o.a.z.ZooKeeper Client environment:user.name=jenkins
   [junit4]   2> 261  INFO  (TEST-SolrMorphlineZkAliasTest.test-seed#[BDF1A9126ED8D58]) [    ] o.a.z.ZooKeeper Client environment:user.home=/var/lib/jenkins
   [junit4]   2> 261  INFO  (TEST-SolrMorphlineZkAliasTest.test-seed#[BDF1A9126ED8D58]) [    ] o.a.z.ZooKeeper Client environment:user.dir=/home/jenkins/workspace/Lucene-Solr-trunk-Linux/solr/build/contrib/solr-morphlines-core/test/J1
   [junit4]   2> 263  INFO  (TEST-SolrMorphlineZkAliasTest.test-seed#[BDF1A9126ED8D58]) [    ] o.a.z.ZooKeeper Initiating client connection, connectString=127.0.0.1:53284 sessionTimeout=45000 watcher=org.apache.solr.common.cloud.SolrZkClient$3@5c7d52af
   [junit4]   2> 286  INFO  (TEST-SolrMorphlineZkAliasTest.test-seed#[BDF1A9126ED8D58]) [    ] o.a.s.c.c.ConnectionManager Waiting for client to connect to ZooKeeper
   [junit4]   2> 288  INFO  (TEST-SolrMorphlineZkAliasTest.test-seed#[BDF1A9126ED8D58]-SendThread(127.0.0.1:53284)) [    ] o.a.z.ClientCnxn Opening socket connection to server 127.0.0.1/127.0.0.1:53284. Will not attempt to authenticate using SASL (unknown error)
   [junit4]   2> 291  INFO  (TEST-SolrMorphlineZkAliasTest.test-seed#[BDF1A9126ED8D58]-SendThread(127.0.0.1:53284)) [    ] o.a.z.ClientCnxn Socket connection established to 127.0.0.1/127.0.0.1:53284, initiating session
   [junit4]   2> 291  INFO  (NIOServerCxn.Factory:0.0.0.0/0.0.0.0:0) [    ] o.a.z.s.NIOServerCnxnFactory Accepted socket connection from /127.0.0.1:41038
   [junit4]   2> 298  WARN  (NIOServerCxn.Factory:0.0.0.0/0.0.0.0:0) [    ] o.a.z.s.NIOServerCnxn Exception causing close of session 0x0 due to java.io.IOException: ZooKeeperServer not running
   [junit4]   2> 298  INFO  (NIOServerCxn.Factory:0.0.0.0/0.0.0.0:0) [    ] o.a.z.s.NIOServerCnxn Closed socket connection for client /127.0.0.1:41038 (no session established for client)
   [junit4]   2> 299  INFO  (TEST-SolrMorphlineZkAliasTest.test-seed#[BDF1A9126ED8D58]-SendThread(127.0.0.1:53284)) [    ] o.a.z.ClientCnxn Unable to read additional data from server sessionid 0x0, likely server has closed socket, closing socket connection and attempting reconnect
   [junit4]   2> 2022 INFO  (TEST-SolrMorphlineZkAliasTest.test-seed#[BDF1A9126ED8D58]-SendThread(127.0.0.1:53284)) [    ] o.a.z.ClientCnxn Opening socket connection to server 127.0.0.1/127.0.0.1:53284. Will not attempt to authenticate using SASL (unknown error)
   [junit4]   2> 2022 INFO  (TEST-SolrMorphlineZkAliasTest.test-seed#[BDF1A9126ED8D58]-SendThread(127.0.0.1:53284)) [    ] o.a.z.ClientCnxn Socket connection established to 127.0.0.1/127.0.0.1:53284, initiating session
   [junit4]   2> 2022 INFO  (NIOServerCxn.Factory:0.0.0.0/0.0.0.0:0) [    ] o.a.z.s.NIOServerCnxnFactory Accepted socket connection from /127.0.0.1:41041
   [junit4]   2> 2024 INFO  (NIOServerCxn.Factory:0.0.0.0/0.0.0.0:0) [    ] o.a.z.s.ZooKeeperServer Client attempting to establish new session at /127.0.0.1:41041
   [junit4]   2> 2027 INFO  (SyncThread:0) [    ] o.a.z.s.p.FileTxnLog Creating new log file: log.1
   [junit4]   2> 2035 INFO  (SyncThread:0) [    ] o.a.z.s.ZooKeeperServer Established session 0x1530066ced80000 with negotiated timeout 20000 for client /127.0.0.1:41041
   [junit4]   2> 2035 INFO  (TEST-SolrMorphlineZkAliasTest.test-seed#[BDF1A9126ED8D58]-SendThread(127.0.0.1:53284)) [    ] o.a.z.ClientCnxn Session establishment complete on server 127.0.0.1/127.0.0.1:53284, sessionid = 0x1530066ced80000, negotiated timeout = 20000
   [junit4]   2> 2040 INFO  (zkCallback-1-thread-1) [    ] o.a.s.c.c.ConnectionManager Watcher org.apache.solr.common.cloud.ConnectionManager@4e30e345 name:ZooKeeperConnection Watcher:127.0.0.1:53284 got event WatchedEvent state:SyncConnected type:None path:null path:null type:None
   [junit4]   2> 2040 INFO  (TEST-SolrMorphlineZkAliasTest.test-seed#[BDF1A9126ED8D58]) [    ] o.a.s.c.c.ConnectionManager Client is connected to ZooKeeper
   [junit4]   2> 2042 INFO  (TEST-SolrMorphlineZkAliasTest.test-seed#[BDF1A9126ED8D58]) [    ] o.a.s.c.c.SolrZkClient Using default ZkACLProvider
   [junit4]   2> 2043 INFO  (TEST-SolrMorphlineZkAliasTest.test-seed#[BDF1A9126ED8D58]) [    ] o.a.s.c.c.SolrZkClient makePath: /solr
   [junit4]   2> 2059 INFO  (ProcessThread(sid:0 cport:-1):) [    ] o.a.z.s.PrepRequestProcessor Processed session termination for sessionid: 0x1530066ced80000
   [junit4]   2> 2060 INFO  (TEST-SolrMorphlineZkAliasTest.test-seed#[BDF1A9126ED8D58]) [    ] o.a.z.ZooKeeper Session: 0x1530066ced80000 closed
   [junit4]   2> 2060 INFO  (TEST-SolrMorphlineZkAliasTest.test-seed#[BDF1A9126ED8D58]-EventThread) [    ] o.a.z.ClientCnxn EventThread shut down
   [junit4]   2> 2060 INFO  (TEST-SolrMorphlineZkAliasTest.test-seed#[BDF1A9126ED8D58]) [    ] o.a.s.c.c.SolrZkClient Using default ZkCredentialsProvider
   [junit4]   2> 2061 INFO  (NIOServerCxn.Factory:0.0.0.0/0.0.0.0:0) [    ] o.a.z.s.NIOServerCnxn Closed socket connection for client /127.0.0.1:41041 which had sessionid 0x1530066ced80000
   [junit4]   2> 2061 INFO  (TEST-SolrMorphlineZkAliasTest.test-seed#[BDF1A9126ED8D58]) [    ] o.a.z.ZooKeeper Initiating client connection, connectString=127.0.0.1:53284/solr sessionTimeout=45000 watcher=org.apache.solr.common.cloud.SolrZkClient$3@6b3a8f1b
   [junit4]   2> 2061 INFO  (TEST-SolrMorphlineZkAliasTest.test-seed#[BDF1A9126ED8D58]) [    ] o.a.s.c.c.ConnectionManager Waiting for client to connect to ZooKeeper
   [junit4]   2> 2061 INFO  (TEST-SolrMorphlineZkAliasTest.test-seed#[BDF1A9126ED8D58]-SendThread(127.0.0.1:53284)) [    ] o.a.z.ClientCnxn Opening socket connection to server 127.0.0.1/127.0.0.1:53284. Will not attempt to authenticate using SASL (unknown error)
   [junit4]   2> 2062 INFO  (TEST-SolrMorphlineZkAliasTest.test-seed#[BDF1A9126ED8D58]-SendThread(127.0.0.1:53284)) [    ] o.a.z.ClientCnxn Socket connection established to 127.0.0.1/127.0.0.1:53284, initiating session
   [junit4]   2> 2062 INFO  (NIOServerCxn.Factory:0.0.0.0/0.0.0.0:0) [    ] o.a.z.s.NIOServerCnxnFactory Accepted socket connection from /127.0.0.1:41042
   [junit4]   2> 2062 INFO  (NIOServerCxn.Factory:0.0.0.0/0.0.0.0:0) [    ] o.a.z.s.ZooKeeperServer Client attempting to establish new session at /127.0.0.1:41042
   [junit4]   2> 2063 INFO  (SyncThread:0) [    ] o.a.z.s.ZooKeeperServer Established session 0x1530066ced80001 with negotiated timeout 20000 for client /127.0.0.1:41042
   [junit4]   2> 2063 INFO  (TEST-SolrMorphlineZkAliasTest.test-seed#[BDF1A9126ED8D58]-SendThread(127.0.0.1:53284)) [    ] o.a.z.ClientCnxn Session establishment complete on server 127.0.0.1/127.0.0.1:53284, sessionid = 0x1530066ced80001, negotiated timeout = 20000
   [junit4]   2> 2063 INFO  (zkCallback-2-thread-1) [    ] o.a.s.c.c.ConnectionManager Watcher org.apache.solr.common.cloud.ConnectionManager@59522433 name:ZooKeeperConnection Watcher:127.0.0.1:53284/solr got event WatchedEvent state:SyncConnected type:None path:null path:null type:None
   [junit4]   2> 2063 INFO  (TEST-SolrMorphlineZkAliasTest.test-seed#[BDF1A9126ED8D58]) [    ] o.a.s.c.c.ConnectionManager Client is connected to ZooKeeper
   [junit4]   2> 2064 INFO  (TEST-SolrMorphlineZkAliasTest.test-seed#[BDF1A9126ED8D58]) [    ] o.a.s.c.c.SolrZkClient Using default ZkACLProvider
   [junit4]   2> 2068 INFO  (TEST-SolrMorphlineZkAliasTest.test-seed#[BDF1A9126ED8D58]) [    ] o.a.s.c.c.SolrZkClient makePath: /collections/collection1
   [junit4]   2> 2072 INFO  (TEST-SolrMorphlineZkAliasTest.test-seed#[BDF1A9126ED8D58]) [    ] o.a.s.c.c.SolrZkClient makePath: /collections/collection1/shards
   [junit4]   2> 2074 INFO  (TEST-SolrMorphlineZkAliasTest.test-seed#[BDF1A9126ED8D58]) [    ] o.a.s.c.c.SolrZkClient makePath: /collections/control_collection
   [junit4]   2> 2076 INFO  (TEST-SolrMorphlineZkAliasTest.test-seed#[BDF1A9126ED8D58]) [    ] o.a.s.c.c.SolrZkClient makePath: /collections/control_collection/shards
   [junit4]   2> 2078 INFO  (TEST-SolrMorphlineZkAliasTest.test-seed#[BDF1A9126ED8D58]) [    ] o.a.s.c.AbstractZkTestCase skipping /home/jenkins/workspace/Lucene-Solr-trunk-Linux/solr/build/contrib/solr-morphlines-core/test/J1/temp/solr.morphlines.solr.SolrMorphlineZkAliasTest_BDF1A9126ED8D58-001/tempDir-001/collection1/conf/solrconfig-tlog.xml because it doesn't exist
   [junit4]   2> 2079 INFO  (TEST-SolrMorphlineZkAliasTest.test-seed#[BDF1A9126ED8D58]) [    ] o.a.s.c.AbstractZkTestCase put /home/jenkins/workspace/Lucene-Solr-trunk-Linux/solr/build/contrib/solr-morphlines-core/test/J1/temp/solr.morphlines.solr.SolrMorphlineZkAliasTest_BDF1A9126ED8D58-001/tempDir-001/collection1/conf/schema.xml to /configs/conf1/schema.xml
   [junit4]   2> 2079 INFO  (TEST-SolrMorphlineZkAliasTest.test-seed#[BDF1A9126ED8D58]) [    ] o.a.s.c.c.SolrZkClient makePath: /configs/conf1/schema.xml
   [junit4]   2> 2082 INFO  (TEST-SolrMorphlineZkAliasTest.test-seed#[BDF1A9126ED8D58]) [    ] o.a.s.c.AbstractZkTestCase skipping /home/jenkins/workspace/Lucene-Solr-trunk-Linux/solr/build/contrib/solr-morphlines-core/test/J1/temp/solr.morphlines.solr.SolrMorphlineZkAliasTest_BDF1A9126ED8D58-001/tempDir-001/collection1/conf/solrconfig.snippet.randomindexconfig.xml because it doesn't exist
   [junit4]   2> 2083 INFO  (TEST-SolrMorphlineZkAliasTest.test-seed#[BDF1A9126ED8D58]) [    ] o.a.s.c.AbstractZkTestCase put /home/jenkins/workspace/Lucene-Solr-trunk-Linux/solr/build/contrib/solr-morphlines-core/test/J1/temp/solr.morphlines.solr.SolrMorphlineZkAliasTest_BDF1A9126ED8D58-001/tempDir-001/collection1/conf/stopwords.txt to /configs/conf1/stopwords.txt
   [junit4]   2> 2083 INFO  (TEST-SolrMorphlineZkAliasTest.test-seed#[BDF1A9126ED8D58]) [    ] o.a.s.c.c.SolrZkClient makePath: /configs/conf1/stopwords.txt
   [junit4]   2> 2085 INFO  (TEST-SolrMorphlineZkAliasTest.test-seed#[BDF1A9126ED8D58]) [    ] o.a.s.c.AbstractZkTestCase put /home/jenkins/workspace/Lucene-Solr-trunk-Linux/solr/build/contrib/solr-morphlines-core/test/J1/temp/solr.morphlines.solr.SolrMorphlineZkAliasTest_BDF1A9126ED8D58-001/tempDir-001/collection1/conf/protwords.txt to /configs/conf1/protwords.txt
   [junit4]   2> 2085 INFO  (TEST-SolrMorphlineZkAliasTest.test-seed#[BDF1A9126ED8D58]) [    ] o.a.s.c.c.SolrZkClient makePath: /configs/conf1/protwords.txt
   [junit4]   2> 2088 INFO  (TEST-SolrMorphlineZkAliasTest.test-seed#[BDF1A9126ED8D58]) [    ] o.a.s.c.AbstractZkTestCase put /home/jenkins/workspace/Lucene-Solr-trunk-Linux/solr/build/contrib/solr-morphlines-core/test/J1/temp/solr.morphlines.solr.SolrMorphlineZkAliasTest_BDF1A9126ED8D58-001/tempDir-001/collection1/conf/currency.xml to /configs/conf1/currency.xml
   [junit4]   2> 2088 INFO  (TEST-SolrMorphlineZkAliasTest.test-seed#[BDF1A9126ED8D58]) [    ] o.a.s.c.c.SolrZkClient makePath: /configs/conf1/currency.xml
   [junit4]   2> 2091 INFO  (TEST-SolrMorphlineZkAliasTest.test-seed#[BDF1A9126ED8D58]) [    ] o.a.s.c.AbstractZkTestCase skipping /home/jenkins/workspace/Lucene-Solr-trunk-Linux/solr/build/contrib/solr-morphlines-core/test/J1/temp/solr.morphlines.solr.SolrMorphlineZkAliasTest_BDF1A9126ED8D58-001/tempDir-001/collection1/conf/enumsConfig.xml because it doesn't exist
   [junit4]   2> 2091 INFO  (TEST-SolrMorphlineZkAliasTest.test-seed#[BDF1A9126ED8D58]) [    ] o.a.s.c.AbstractZkTestCase skipping /home/jenkins/workspace/Lucene-Solr-trunk-Linux/solr/build/contrib/solr-morphlines-core/test/J1/temp/solr.morphlines.solr.SolrMorphlineZkAliasTest_BDF1A9126ED8D58-001/tempDir-001/collection1/conf/open-exchange-rates.json because it doesn't exist
   [junit4]   2> 2091 INFO  (TEST-SolrMorphlineZkAliasTest.test-seed#[BDF1A9126ED8D58]) [    ] o.a.s.c.AbstractZkTestCase skipping /home/jenkins/workspace/Lucene-Solr-trunk-Linux/solr/build/contrib/solr-morphlines-core/test/J1/temp/solr.morphlines.solr.SolrMorphlineZkAliasTest_BDF1A9126ED8D58-001/tempDir-001/collection1/conf/mapping-ISOLatin1Accent.txt because it doesn't exist
   [junit4]   2> 2091 INFO  (TEST-SolrMorphlineZkAliasTest.test-seed#[BDF1A9126ED8D58]) [    ] o.a.s.c.AbstractZkTestCase skipping /home/jenkins/workspace/Lucene-Solr-trunk-Linux/solr/build/contrib/solr-morphlines-core/test/J1/temp/solr.morphlines.solr.SolrMorphlineZkAliasTest_BDF1A9126ED8D58-001/tempDir-001/collection1/conf/old_synonyms.txt because it doesn't exist
   [junit4]   2> 2091 INFO  (TEST-SolrMorphlineZkAliasTest.test-seed#[BDF1A9126ED8D58]) [    ] o.a.s.c.AbstractZkTestCase put /home/jenkins/workspace/Lucene-Solr-trunk-Linux/solr/build/contrib/solr-morphlines-core/test/J1/temp/solr.morphlines.solr.SolrMorphlineZkAliasTest_BDF1A9126ED8D58-001/tempDir-001/collection1/conf/synonyms.txt to /configs/conf1/synonyms.txt
   [junit4]   2> 2092 INFO  (TEST-SolrMorphlineZkAliasTest.test-seed#[BDF1A9126ED8D58]) [    ] o.a.s.c.c.SolrZkClient makePath: /configs/conf1/synonyms.txt
   [junit4]   2> 2094 INFO  (ProcessThread(sid:0 cport:-1):) [    ] o.a.z.s.PrepRequestProcessor Processed session termination for sessionid: 0x1530066ced80001
   [junit4]   2> 2094 INFO  (TEST-SolrMorphlineZkAliasTest.test-seed#[BDF1A9126ED8D58]) [    ] o.a.z.ZooKeeper Session: 0x1530066ced80001 closed
   [junit4]   2> 2094 INFO  (TEST-SolrMorphlineZkAliasTest.test-seed#[BDF1A9126ED8D58]-EventThread) [    ] o.a.z.ClientCnxn EventThread shut down
   [junit4]   2> 2094 INFO  (NIOServerCxn.Factory:0.0.0.0/0.0.0.0:0) [    ] o.a.z.s.NIOServerCnxn Closed socket connection for client /127.0.0.1:41042 which had sessionid 0x1530066ced80001
   [junit4]   2> 2097 INFO  (TEST-SolrMorphlineZkAliasTest.test-seed#[BDF1A9126ED8D58]) [    ] o.a.s.c.c.SolrZkClient Using default ZkCredentialsProvider
   [junit4]   2> 2097 INFO  (TEST-SolrMorphlineZkAliasTest.test-seed#[BDF1A9126ED8D58]) [    ] o.a.z.ZooKeeper Initiating client connection, connectString=127.0.0.1:53284/solr sessionTimeout=45000 watcher=org.apache.solr.common.cloud.SolrZkClient$3@437f9c19
   [junit4]   2> 2098 INFO  (TEST-SolrMorphlineZkAliasTest.test-seed#[BDF1A9126ED8D58]) [    ] o.a.s.c.c.ConnectionManager Waiting for client to connect to ZooKeeper
   [junit4]   2> 2098 INFO  (TEST-SolrMorphlineZkAliasTest.test-seed#[BDF1A9126ED8D58]-SendThread(127.0.0.1:53284)) [    ] o.a.z.ClientCnxn Opening socket connection to server 127.0.0.1/127.0.0.1:53284. Will not attempt to authenticate using SASL (unknown error)
   [junit4]   2> 2098 INFO  (TEST-SolrMorphlineZkAliasTest.test-seed#[BDF1A9126ED8D58]-SendThread(127.0.0.1:53284)) [    ] o.a.z.ClientCnxn Socket connection established to 127.0.0.1/127.0.0.1:53284, initiating session
   [junit4]   2> 2098 INFO  (NIOServerCxn.Factory:0.0.0.0/0.0.0.0:0) [    ] o.a.z.s.NIOServerCnxnFactory Accepted socket connection from /127.0.0.1:41043
   [junit4]   2> 2098 INFO  (NIOServerCxn.Factory:0.0.0.0/0.0.0.0:0) [    ] o.a.z.s.ZooKeeperServer Client attempting to establish new session at /127.0.0.1:41043
   [junit4]   2> 2099 INFO  (SyncThread:0) [    ] o.a.z.s.ZooKeeperServer Established session 0x1530066ced80002 with negotiated timeout 20000 for client /127.0.0.1:41043
   [junit4]   2> 2099 INFO  (TEST-SolrMorphlineZkAliasTest.test-seed#[BDF1A9126ED8D58]-SendThread(127.0.0.1:53284)) [    ] o.a.z.ClientCnxn Session establishment complete on server 127.0.0.1/127.0.0.1:53284, sessionid = 0x1530066ced80002, negotiated timeout = 20000
   [junit4]   2> 2099 INFO  (zkCallback-3-thread-1) [    ] o.a.s.c.c.ConnectionManager Watcher org.apache.solr.common.cloud.ConnectionManager@313aa3d1 name:ZooKeeperConnection Watcher:127.0.0.1:53284/solr got event WatchedEvent state:SyncConnected type:None path:null path:null type:None
   [junit4]   2> 2100 INFO  (TEST-SolrMorphlineZkAliasTest.test-seed#[BDF1A9126ED8D58]) [    ] o.a.s.c.c.ConnectionManager Client is connected to ZooKeeper
   [junit4]   2> 2100 INFO  (TEST-SolrMorphlineZkAliasTest.test-seed#[BDF1A9126ED8D58]) [    ] o.a.s.c.c.SolrZkClient Using default ZkACLProvider
   [junit4]   2> 2102 INFO  (ProcessThread(sid:0 cport:-1):) [    ] o.a.z.s.PrepRequestProcessor Processed session termination for sessionid: 0x1530066ced80002
   [junit4]   2> 2102 INFO  (TEST-SolrMorphlineZkAliasTest.test-seed#[BDF1A9126ED8D58]) [    ] o.a.z.ZooKeeper Session: 0x1530066ced80002 closed
   [junit4]   2> 2102 INFO  (TEST-SolrMorphlineZkAliasTest.test-seed#[BDF1A9126ED8D58]-EventThread) [    ] o.a.z.ClientCnxn EventThread shut down
   [junit4]   2> 2103 INFO  (NIOServerCxn.Factory:0.0.0.0/0.0.0.0:0) [    ] o.a.z.s.NIOServerCnxn Closed socket connection for client /127.0.0.1:41043 which had sessionid 0x1530066ced80002
   [junit4]   2> 2103 INFO  (TEST-SolrMorphlineZkAliasTest.test-seed#[BDF1A9126ED8D58]) [    ] o.a.s.c.c.SolrZkClient Using default ZkCredentialsProvider
   [junit4]   2> 2103 INFO  (TEST-SolrMorphlineZkAliasTest.test-seed#[BDF1A9126ED8D58]) [    ] o.a.z.ZooKeeper Initiating client connection, connectString=127.0.0.1:53284/solr sessionTimeout=10000 watcher=org.apache.solr.common.cloud.SolrZkClient$3@14605436
   [junit4]   2> 2103 INFO  (TEST-SolrMorphlineZkAliasTest.test-seed#[BDF1A9126ED8D58]) [    ] o.a.s.c.c.ConnectionManager Waiting for client to connect to ZooKeeper
   [junit4]   2> 2103 INFO  (TEST-SolrMorphlineZkAliasTest.test-seed#[BDF1A9126ED8D58]-SendThread(127.0.0.1:53284)) [    ] o.a.z.ClientCnxn Opening socket connection to server 127.0.0.1/127.0.0.1:53284. Will not attempt to authenticate using SASL (unknown error)
   [junit4]   2> 2103 INFO  (TEST-SolrMorphlineZkAliasTest.test-seed#[BDF1A9126ED8D58]-SendThread(127.0.0.1:53284)) [    ] o.a.z.ClientCnxn Socket connection established to 127.0.0.1/127.0.0.1:53284, initiating session
   [junit4]   2> 2104 INFO  (NIOServerCxn.Factory:0.0.0.0/0.0.0.0:0) [    ] o.a.z.s.NIOServerCnxnFactory Accepted socket connection from /127.0.0.1:41045
   [junit4]   2> 2104 INFO  (NIOServerCxn.Factory:0.0.0.0/0.0.0.0:0) [    ] o.a.z.s.ZooKeeperServer Client attempting to establish new session at /127.0.0.1:41045
   [junit4]   2> 2105 INFO  (SyncThread:0) [    ] o.a.z.s.ZooKeeperServer Established session 0x1530066ced80003 with negotiated timeout 10000 for client /127.0.0.1:41045
   [junit4]   2> 2105 INFO  (TEST-SolrMorphlineZkAliasTest.test-seed#[BDF1A9126ED8D58]-SendThread(127.0.0.1:53284)) [    ] o.a.z.ClientCnxn Session establishment complete on server 127.0.0.1/127.0.0.1:53284, sessionid = 0x1530066ced80003, negotiated timeout = 10000
   [junit4]   2> 2105 INFO  (zkCallback-4-thread-1) [    ] o.a.s.c.c.ConnectionManager Watcher org.apache.solr.common.cloud.ConnectionManager@5cdbe902 name:ZooKeeperConnection Watcher:127.0.0.1:53284/solr got event WatchedEvent state:SyncConnected type:None path:null path:null type:None
   [junit4]   2> 2106 INFO  (TEST-SolrMorphlineZkAliasTest.test-seed#[BDF1A9126ED8D58]) [    ] o.a.s.c.c.ConnectionManager Client is connected to ZooKeeper
   [junit4]   2> 2106 INFO  (TEST-SolrMorphlineZkAliasTest.test-seed#[BDF1A9126ED8D58]) [    ] o.a.s.c.c.SolrZkClient Using default ZkACLProvider
   [junit4]   1> put /home/jenkins/workspace/Lucene-Solr-trunk-Linux/solr/contrib/morphlines-core/src/test-files/solr/collection1/conf/protwords.txt to /configs/conf1/protwords.txt
   [junit4]   2> 2106 INFO  (TEST-SolrMorphlineZkAliasTest.test-seed#[BDF1A9126ED8D58]) [    ] o.a.s.c.c.SolrZkClient makePath: /configs/conf1/protwords.txt
   [junit4]   1> put /home/jenkins/workspace/Lucene-Solr-trunk-Linux/solr/contrib/morphlines-core/src/test-files/solr/collection1/conf/solrconfig.xml to /configs/conf1/solrconfig.xml
   [junit4]   2> 2111 INFO  (TEST-SolrMorphlineZkAliasTest.test-seed#[BDF1A9126ED8D58]) [    ] o.a.s.c.c.SolrZkClient makePath: /configs/conf1/solrconfig.xml
   [junit4]   1> put /home/jenkins/workspace/Lucene-Solr-trunk-Linux/solr/contrib/morphlines-core/src/test-files/solr/collection1/conf/stopwords.txt to /configs/conf1/stopwords.txt
   [junit4]   2> 2114 INFO  (TEST-SolrMorphlineZkAliasTest.test-seed#[BDF1A9126ED8D58]) [    ] o.a.s.c.c.SolrZkClient makePath: /configs/conf1/stopwords.txt
   [junit4]   1> put /home/jenkins/workspace/Lucene-Solr-trunk-Linux/solr/contrib/morphlines-core/src/test-files/solr/collection1/conf/lang/stopwords_ar.txt to /configs/conf1/lang/stopwords_ar.txt
   [junit4]   2> 2116 INFO  (TEST-SolrMorphlineZkAliasTest.test-seed#[BDF1A9126ED8D58]) [    ] o.a.s.c.c.SolrZkClient makePath: /configs/conf1/lang/stopwords_ar.txt
   [junit4]   1> put /home/jenkins/workspace/Lucene-Solr-trunk-Linux/solr/contrib/morphlines-core/src/test-files/solr/collection1/conf/lang/stopwords_el.txt to /configs/conf1/lang/stopwords_el.txt
   [junit4]   2> 2120 INFO  (TEST-SolrMorphlineZkAliasTest.test-seed#[BDF1A9126ED8D58]) [    ] o.a.s.c.c.SolrZkClient makePath: /configs/conf1/lang/stopwords_el.txt
   [junit4]   1> put /home/jenkins/workspace/Lucene-Solr-trunk-Linux/solr/contrib/morphlines-core/src/test-files/solr/collection1/conf/lang/stopwords_ja.txt to /configs/conf1/lang/stopwords_ja.txt
   [junit4]   2> 2134 INFO  (TEST-SolrMorphlineZkAliasTest.test-seed#[BDF1A9126ED8D58]) [    ] o.a.s.c.c.SolrZkClient makePath: /configs/conf1/lang/stopwords_ja.txt
   [junit4]   1> put /home/jenkins/workspace/Lucene-Solr-trunk-Linux/solr/contrib/morphlines-core/src/test-files/solr/collection1/conf/lang/stopwords_gl.txt to /configs/conf1/lang/stopwords_gl.txt
   [junit4]   2> 2137 INFO  (TEST-SolrMorphlineZkAliasTest.test-seed#[BDF1A9126ED8D58]) [    ] o.a.s.c.c.SolrZkClient makePath: /configs/conf1/lang/stopwords_gl.txt
   [junit4]   1> put /home/jenkins/workspace/Lucene-Solr-trunk-Linux/solr/contrib/morphlines-core/src/test-files/solr/collection1/conf/lang/contractions_fr.txt to /configs/conf1/lang/contractions_fr.txt
   [junit4]   2> 2141 INFO  (TEST-SolrMorphlineZkAliasTest.test-seed#[BDF1A9126ED8D58]) [    ] o.a.s.c.c.SolrZkClient makePath: /configs/conf1/lang/contractions_fr.txt
   [junit4]   1> put /home/jenkins/workspace/Lucene-Solr-trunk-Linux/solr/contrib/morphlines-core/src/test-files/solr/collection1/conf/lang/stopwords_fr.txt to /configs/conf1/lang/stopwords_fr.txt
   [junit4]   2> 2146 INFO  (TEST-SolrMorphlineZkAliasTest.test-seed#[BDF1A9126ED8D58]) [    ] o.a.s.c.c.SolrZkClient makePath: /configs/conf1/lang/stopwords_fr.txt
   [junit4]   1> put /home/jenkins/workspace/Lucene-Solr-trunk-Linux/solr/contrib/morphlines-core/src/test-files/solr/collection1/conf/lang/stopwords_nl.txt to /configs/conf1/lang/stopwords_nl.txt
   [junit4]   2> 2149 INFO  (TEST-SolrMorphlineZkAliasTest.test-seed#[BDF1A9126ED8D58]) [    ] o.a.s.c.c.SolrZkClient makePath: /configs/conf1/lang/stopwords_nl.txt
   [junit4]   1> put /home/jenkins/workspace/Lucene-Solr-trunk-Linux/solr/contrib/morphlines-core/src/test-files/solr/collection1/conf/lang/stopwords_cz.txt to /configs/conf1/lang/stopwords_cz.txt
   [junit4]   2> 2152 INFO  (TEST-SolrMorphlineZkAliasTest.test-seed#[BDF1A9126ED8D58]) [    ] o.a.s.c.c.SolrZkClient makePath: /configs/conf1/lang/stopwords_cz.txt
   [junit4]   1> put /home/jenkins/workspace/Lucene-Solr-trunk-Linux/solr/contrib/morphlines-core/src/test-files/solr/collection1/conf/lang/stopwords_ca.txt to /configs/conf1/lang/stopwords_ca.txt
   [junit4]   2> 2156 INFO  (TEST-SolrMorphlineZkAliasTest.test-seed#[BDF1A9126ED8D58]) [    ] o.a.s.c.c.SolrZkClient makePath: /configs/conf1/lang/stopwords_ca.txt
   [junit4]   1> put /home/jenkins/workspace/Lucene-Solr-trunk-Linux/solr/contrib/morphlines-core/src/test-files/solr/collection1/conf/lang/stopwords_de.txt to /configs/conf1/lang/stopwords_de.txt
   [junit4]   2> 2159 INFO  (TEST-SolrMorphlineZkAliasTest.test-seed#[BDF1A9126ED8D58]) [    ] o.a.s.c.c.SolrZkClient makePath: /configs/conf1/lang/stopwords_de.txt
   [junit4]   1> put /home/jenkins/workspace/Lucene-Solr-trunk-Linux/solr/contrib/morphlines-core/src/test-files/solr/collection1/conf/lang/contractions_ga.txt to /configs/conf1/lang/contractions_ga.txt
   [junit4]   2> 2162 INFO  (TEST-SolrMorphlineZkAliasTest.test-seed#[BDF1A9126ED8D58]) [    ] o.a.s.c.c.SolrZkClient makePath: /configs/conf1/lang/contractions_ga.txt
   [junit4]   1> put /home/jenkins/workspace/Lucene-Solr-trunk-Linux/solr/contrib/morphlines-core/src/test-files/solr/collection1/conf/lang/stopwords_da.txt to /configs/conf1/lang/stopwords_da.txt
   [junit4]   2> 2165 INFO  (TEST-SolrMorphlineZkAliasTest.test-seed#[BDF1A9126ED8D58]) [    ] o.a.s.c.c.SolrZkClient makePath: /configs/conf1/lang/stopwords_da.txt
   [junit4]   1> put /home/jenkins/workspace/Lucene-Solr-trunk-Linux/solr/contrib/morphlines-core/src/test-files/solr/collection1/conf/lang/stopwords_no.txt to /configs/conf1/lang/stopwords_no.txt
   [junit4]   2> 2167 INFO  (TEST-SolrMorphlineZkAliasTest.test-seed#[BDF1A9126ED8D58]) [    ] o.a.s.c.c.SolrZkClient makePath: /configs/conf1/lang/stopwords_no.txt
   [junit4]   1> put /home/jenkins/workspace/Lucene-Solr-trunk-Linux/solr/contrib/morphlines-core/src/test-files/solr/collection1/conf/lang/stopwords_es.txt to /configs/conf1/lang/stopwords_es.txt
   [junit4]   2> 2170 INFO  (TEST-SolrMorphlineZkAliasTest.test-seed#[BDF1A9126ED8D58]) [    ] o.a.s.c.c.SolrZkClient makePath: /configs/conf1/lang/stopwords_es.txt
   [junit4]   1> put /home/jenkins/workspace/Lucene-Solr-trunk-Linux/solr/contrib/morphlines-core/src/test-files/solr/collection1/conf/lang/stopwords_sv.txt to /configs/conf1/lang/stopwords_sv.txt
   [junit4]   2> 2172 INFO  (TEST-SolrMorphlineZkAliasTest.test-seed#[BDF1A9126ED8D58]) [    ] o.a.s.c.c.SolrZkClient makePath: /configs/conf1/lang/stopwords_sv.txt
   [junit4]   1> put /home/jenkins/workspace/Lucene-Solr-trunk-Linux/solr/contrib/morphlines-core/src/test-files/solr/collection1/conf/lang/stopwords_fi.txt to /configs/conf1/lang/stopwords_fi.txt
   [junit4]   2> 2175 INFO  (TEST-SolrMorphlineZkAliasTest.test-seed#[BDF1A9126ED8D58]) [    ] o.a.s.c.c.SolrZkClient makePath: /configs/conf1/lang/stopwords_fi.txt
   [junit4]   1> put /home/jenkins/workspace/Lucene-Solr-trunk-Linux/solr/contrib/morphlines-core/src/test-files/solr/collection1/conf/lang/stopwords_hu.txt to /configs/conf1/lang/stopwords_hu.txt
   [junit4]   2> 2177 INFO  (TEST-SolrMorphlineZkAliasTest.test-seed#[BDF1A9126ED8D58]) [    ] o.a.s.c.c.SolrZkClient makePath: /configs/conf1/lang/stopwords_hu.txt
   [junit4]   1> put /home/jenkins/workspace/Lucene-Solr-trunk-Linux/solr/contrib/morphlines-core/src/test-files/solr/collection1/conf/lang/stopwords_bg.txt to /configs/conf1/lang/stopwords_bg.txt
   [junit4]   2> 2179 INFO  (TEST-SolrMorphlineZkAliasTest.test-seed#[BDF1A9126ED8D58]) [    ] o.a.s.c.c.SolrZkClient makePath: /configs/conf1/lang/stopwords_bg.txt
   [junit4]   1> put /home/jenkins/workspace/Lucene-Solr-trunk-Linux/solr/contrib/morphlines-core/src/test-files/solr/collection1/conf/lang/stopwords_fa.txt to /configs/conf1/lang/stopwords_fa.txt
   [junit4]   2> 2181 INFO  (TEST-SolrMorphlineZkAliasTest.test-seed#[BDF1A9126ED8D58]) [    ] o.a.s.c.c.SolrZkClient makePath: /configs/conf1/lang/stopwords_fa.txt
   [junit4]   1> put /home/jenkins/workspace/Lucene-Solr-trunk-Linux/solr/contrib/morphlines-core/src/test-files/solr/collection1/conf/lang/contractions_it.txt to /configs/conf1/lang/contractions_it.txt
   [junit4]   2> 2183 INFO  (TEST-SolrMorphlineZkAliasTest.test-seed#[BDF1A9126ED8D58]) [    ] o.a.s.c.c.SolrZkClient makePath: /configs/conf1/lang/contractions_it.txt
   [junit4]   1> put /home/jenkins/workspace/Lucene-Solr-trunk-Linux/solr/contrib/morphlines-core/src/test-files/solr/collection1/conf/lang/stopwords_eu.txt to /configs/conf1/lang/stopwords_eu.txt
   [junit4]   2> 2186 INFO  (TEST-SolrMorphlineZkAliasTest.test-seed#[BDF1A9126ED8D58]) [    ] o.a.s.c.c.SolrZkClient makePath: /configs/conf1/lang/stopwords_eu.txt
   [junit4]   1> put /home/jenkins/workspace/Lucene-Solr-trunk-Linux/solr/contrib/morphlines-core/src/test-files/solr/collection1/conf/lang/stopwords_ro.txt to /configs/conf1/lang/stopwords_ro.txt
   [junit4]   2> 2188 INFO  (TEST-SolrMorphlineZkAliasTest.test-seed#[BDF1A9126ED8D58]) [    ] o.a.s.c.c.SolrZkClient makePath: /configs/conf1/lang/stopwords_ro.txt
   [junit4]   1> put /home/jenkins/workspace/Lucene-Solr-trunk-Linux/solr/contrib/morphlines-core/src/test-files/solr/collection1/conf/lang/stopwords_ga.txt to /configs/conf1/lang/stopwords_ga.txt
   [junit4]   2> 2190 INFO  (TEST-SolrMorphlineZkAliasTest.test-seed#[BDF1A9126ED8D58]) [    ] o.a.s.c.c.SolrZkClient makePath: /configs/conf1/lang/stopwords_ga.txt
   [junit4]   1> put /home/jenkins/workspace/Lucene-Solr-trunk-Linux/solr/contrib/morphlines-core/src/test-files/solr/collection1/conf/lang/stemdict_nl.txt to /configs/conf1/lang/stemdict_nl.txt
   [junit4]   2> 2192 INFO  (TEST-SolrMorphlineZkAliasTest.test-seed#[BDF1A9126ED8D58]) [    ] o.a.s.c.c.SolrZkClient makePath: /configs/conf1/lang/stemdict_nl.txt
   [junit4]   1> put /home/jenkins/workspace/Lucene-Solr-trunk-Linux/solr/contrib/morphlines-core/src/test-files/solr/collection1/conf/lang/stopwords_hy.txt to /configs/conf1/lang/stopwords_hy.txt
   [junit4]   2> 2194 INFO  (TEST-SolrMorphlineZkAliasTest.test-seed#[BDF1A9126ED8D58]) [    ] o.a.s.c.c.SolrZkClient makePath: /configs/conf1/lang/stopwords_hy.txt
   [junit4]   1> put /home/jenkins/workspace/Lucene-Solr-trunk-Linux/solr/contrib/morphlines-core/src/test-files/solr/collection1/conf/lang/contractions_ca.txt to /configs/conf1/lang/contractions_ca.txt
   [junit4]   2> 2196 INFO  (TEST-SolrMorphlineZkAliasTest.test-seed#[BDF1A9126ED8D58]) [    ] o.a.s.c.c.SolrZkClient makePath: /configs/conf1/lang/contractions_ca.txt
   [junit4]   1> put /home/jenkins/workspace/Lucene-Solr-trunk-Linux/solr/contrib/morphlines-core/src/test-files/solr/collection1/conf/lang/stoptags_ja.txt to /configs/conf1/lang/stoptags_ja.txt
   [junit4]   2> 2198 INFO  (TEST-SolrMorphlineZkAliasTest.test-seed#[BDF1A9126ED8D58]) [    ] o.a.s.c.c.SolrZkClient makePath: /configs/conf1/lang/stoptags_ja.txt
   [junit4]   1> put /home/jenkins/workspace/Lucene-Solr-trunk-Linux/solr/contrib/morphlines-core/src/test-files/solr/collection1/conf/lang/stopwords_lv.txt to /configs/conf1/lang/stopwords_lv.txt
   [junit4]   2> 2200 INFO  (TEST-SolrMorphlineZkAliasTest.test-seed#[BDF1A9126ED8D58]) [    ] o.a.s.c.c.SolrZkClient makePath: /configs/conf1/lang/stopwords_lv.txt
   [junit4]   1> put /home/jenkins/workspace/Lucene-Solr-trunk-Linux/solr/contrib/morphlines-core/src/test-files/solr/collection1/conf/lang/userdict_ja.txt to /configs/conf1/lang/userdict_ja.txt
   [junit4]   2> 2203 INFO  (TEST-SolrMorphlineZkAliasTest.test-seed#[BDF1A9126ED8D58]) [    ] o.a.s.c.c.SolrZkClient makePath: /configs/conf1/lang/userdict_ja.txt
   [junit4]   1> put /home/jenkins/workspace/Lucene-Solr-trunk-Linux/solr/contrib/morphlines-core/src/test-files/solr/collection1/conf/lang/stopwords_tr.txt to /configs/conf1/lang/stopwords_tr.txt
   [junit4]   2> 2205 INFO  (TEST-SolrMorphlineZkAliasTest.test-seed#[BDF1A9126ED8D58]) [    ] o.a.s.c.c.SolrZkClient makePath: /configs/conf1/lang/stopwords_tr.txt
   [junit4]   1> put /home/jenkins/workspace/Lucene-Solr-trunk-Linux/solr/contrib/morphlines-core/src/test-files/solr/collection1/conf/lang/stopwords_it.txt to /configs/conf1/lang/stopwords_it.txt
   [junit4]   2> 2207 INFO  (TEST-SolrMorphlineZkAliasTest.test-seed#[BDF1A9126ED8D58]) [    ] o.a.s.c.c.SolrZkClient makePath: /configs/conf1/lang/stopwords_it.txt
   [junit4]   1> put /home/jenkins/workspace/Lucene-Solr-trunk-Linux/solr/contrib/morphlines-core/src/test-files/solr/collection1/conf/lang/stopwords_ru.txt to /configs/conf1/lang/stopwords_ru.txt
   [junit4]   2> 2209 INFO  (TEST-SolrMorphlineZkAliasTest.test-seed#[BDF1A9126ED8D58]) [    ] o.a.s.c.c.SolrZkClient makePath: /configs/conf1/lang/stopwords_ru.txt
   [junit4]   1> put /home/jenkins/workspace/Lucene-Solr-trunk-Linux/solr/contrib/morphlines-core/src/test-files/solr/collection1/conf/lang/stopwords_th.txt to /configs/conf1/lang/stopwords_th.txt
   [junit4]   2> 2212 INFO  (TEST-SolrMorphlineZkAliasTest.test-seed#[BDF1A9126ED8D58]) [    ] o.a.s.c.c.SolrZkClient makePath: /configs/conf1/lang/stopwords_th.txt
   [junit4]   1> put /home/jenkins/workspace/Lucene-Solr-trunk-Linux/solr/contrib/morphlines-core/src/test-files/solr/collection1/conf/lang/hyphenations_ga.txt to /configs/conf1/lang/hyphenations_ga.txt
   [junit4]   2> 2215 INFO  (TEST-SolrMorphlineZkAliasTest.test-seed#[BDF1A9126ED8D58]) [    ] o.a.s.c.c.SolrZkClient makePath: /configs/conf1/lang/hyphenations_ga.txt
   [junit4]   1> put /home/jenkins/workspace/Lucene-Solr-trunk-Linux/solr/contrib/morphlines-core/src/test-files/solr/collection1/conf/lang/stopwords_en.txt to /configs/conf1/lang/stopwords_en.txt
   [junit4]   2> 2217 INFO  (TEST-SolrMorphlineZkAliasTest.test-seed#[BDF1A9126ED8D58]) [    ] o.a.s.c.c.SolrZkClient makePath: /configs/conf1/lang/stopwords_en.txt
   [junit4]   1> put /home/jenkins/workspace/Lucene-Solr-trunk-Linux/solr/contrib/morphlines-core/src/test-files/solr/collection1/conf/lang/stopwords_hi.txt to /configs/conf1/lang/stopwords_hi.txt
   [junit4]   2> 2219 INFO  (TEST-SolrMorphlineZkAliasTest.test-seed#[BDF1A9126ED8D58]) [    ] o.a.s.c.c.SolrZkClient makePath: /configs/conf1/lang/stopwords_hi.txt
   [junit4]   1> put /home/jenkins/workspace/Lucene-Solr-trunk-Linux/solr/contrib/morphlines-core/src/test-files/solr/collection1/conf/lang/stopwords_pt.txt to /configs/conf1/lang/stopwords_pt.txt
   [junit4]   2> 2220 INFO  (TEST-SolrMorphlineZkAliasTest.test-seed#[BDF1A9126ED8D58]) [    ] o.a.s.c.c.SolrZkClient makePath: /configs/conf1/lang/stopwords_pt.txt
   [junit4]   1> put /home/jenkins/workspace/Lucene-Solr-trunk-Linux/solr/contrib/morphlines-core/src/test-files/solr/collection1/conf/lang/stopwords_id.txt to /configs/conf1/lang/stopwords_id.txt
   [junit4]   2> 2222 INFO  (TEST-SolrMorphlineZkAliasTest.test-seed#[BDF1A9126ED8D58]) [    ] o.a.s.c.c.SolrZkClient makePath: /configs/conf1/lang/stopwords_id.txt
   [junit4]   1> put /home/jenkins/workspace/Lucene-Solr-trunk-Linux/solr/contrib/morphlines-core/src/test-files/solr/collection1/conf/schema.xml to /configs/conf1/schema.xml
   [junit4]   2> 2224 INFO  (TEST-SolrMorphlineZkAliasTest.test-seed#[BDF1A9126ED8D58]) [    ] o.a.s.c.c.SolrZkClient makePath: /configs/conf1/schema.xml
   [junit4]   1> put /home/jenkins/workspace/Lucene-Solr-trunk-Linux/solr/contrib/morphlines-core/src/test-files/solr/collection1/conf/synonyms.txt to /configs/conf1/synonyms.txt
   [junit4]   2> 2226 INFO  (TEST-SolrMorphlineZkAliasTest.test-seed#[BDF1A9126ED8D58]) [    ] o.a.s.c.c.SolrZkClient makePath: /configs/conf1/synonyms.txt
   [junit4]   1> put /home/jenkins/workspace/Lucene-Solr-trunk-Linux/solr/contrib/morphlines-core/src/test-files/solr/collection1/conf/elevate.xml to /configs/conf1/elevate.xml
   [junit4]   2> 2228 INFO  (TEST-SolrMorphlineZkAliasTest.test-seed#[BDF1A9126ED8D58]) [    ] o.a.s.c.c.SolrZkClient makePath: /configs/conf1/elevate.xml
   [junit4]   1> put /home/jenkins/workspace/Lucene-Solr-trunk-Linux/solr/contrib/morphlines-core/src/test-files/solr/collection1/conf/currency.xml to /configs/conf1/currency.xml
   [junit4]   2> 2230 INFO  (TEST-SolrMorphlineZkAliasTest.test-seed#[BDF1A9126ED8D58]) [    ] o.a.s.c.c.SolrZkClient makePath: /configs/conf1/currency.xml
   [junit4]   2> 2232 INFO  (ProcessThread(sid:0 cport:-1):) [    ] o.a.z.s.PrepRequestProcessor Processed session termination for sessionid: 0x1530066ced80003
   [junit4]   2> 2232 INFO  (TEST-SolrMorphlineZkAliasTest.test-seed#[BDF1A9126ED8D58]-EventThread) [    ] o.a.z.ClientCnxn EventThread shut down
   [junit4]   2> 2232 INFO  (TEST-SolrMorphlineZkAliasTest.test-seed#[BDF1A9126ED8D58]) [    ] o.a.z.ZooKeeper Session: 0x1530066ced80003 closed
   [junit4]   2> 2233 INFO  (NIOServerCxn.Factory:0.0.0.0/0.0.0.0:0) [    ] o.a.z.s.NIOServerCnxn Closed socket connection for client /127.0.0.1:41045 which had sessionid 0x1530066ced80003
   [junit4]   2> 2291 INFO  (TEST-SolrMorphlineZkAliasTest.test-seed#[BDF1A9126ED8D58]) [    ] o.a.s.SolrTestCaseJ4 Writing core.properties file to /home/jenkins/workspace/Lucene-Solr-trunk-Linux/solr/build/contrib/solr-morphlines-core/test/J1/temp/solr.morphlines.solr.SolrMorphlineZkAliasTest_BDF1A9126ED8D58-001/control-001/cores/collection1
   [junit4]   2> 2317 INFO  (TEST-SolrMorphlineZkAliasTest.test-seed#[BDF1A9126ED8D58]) [    ] o.e.j.u.log Logging initialized @4057ms
   [junit4]   2> 2471 INFO  (TEST-SolrMorphlineZkAliasTest.test-seed#[BDF1A9126ED8D58]) [    ] o.e.j.s.Server jetty-9.3.6.v20151106
   [junit4]   2> 2503 INFO  (TEST-SolrMorphlineZkAliasTest.test-seed#[BDF1A9126ED8D58]) [    ] o.e.j.s.h.ContextHandler Started o.e.j.s.ServletContextHandler@3f091d91{/f_lqr/pv,null,AVAILABLE}
   [junit4]   2> 2529 INFO  (TEST-SolrMorphlineZkAliasTest.test-seed#[BDF1A9126ED8D58]) [    ] o.e.j.u.s.SslContextFactory x509=X509@7c9dd217(solrtest,h=[],w=[]) for SslContextFactory@e8d105f(file:///home/jenkins/workspace/Lucene-Solr-trunk-Linux/solr/server/etc/test/solrtest.keystore,file:///home/jenkin

[...truncated too long message...]

nalRequestProcessor shutdown of request processor complete
   [junit4]   2> 19278 INFO  (TEST-SolrMorphlineZkAliasTest.test-seed#[BDF1A9126ED8D58]) [    ] o.a.s.c.ZkTestServer connecting to 127.0.0.1:53284 53284
   [junit4]   2> 19384 INFO  (NIOServerCxn.Factory:0.0.0.0/0.0.0.0:0) [    ] o.a.z.s.NIOServerCnxnFactory NIOServerCnxn factory exited run method
   [junit4]   2> 19384 INFO  (Thread-1) [    ] o.a.z.s.ZooKeeperServer shutting down
   [junit4]   2> 19384 INFO  (Thread-1) [    ] o.a.z.s.SessionTrackerImpl Shutting down
   [junit4]   2> 19384 INFO  (TEST-SolrMorphlineZkAliasTest.test-seed#[BDF1A9126ED8D58]) [    ] o.a.z.s.ZooKeeperServer shutting down
   [junit4]   2> 19384 INFO  (Thread-1) [    ] o.a.z.s.PrepRequestProcessor Shutting down
   [junit4]   2> 19384 INFO  (TEST-SolrMorphlineZkAliasTest.test-seed#[BDF1A9126ED8D58]) [    ] o.a.z.s.SessionTrackerImpl Shutting down
   [junit4]   2> 19384 INFO  (TEST-SolrMorphlineZkAliasTest.test-seed#[BDF1A9126ED8D58]) [    ] o.a.z.s.PrepRequestProcessor Shutting down
   [junit4]   2> 19384 INFO  (Thread-1) [    ] o.a.z.s.SyncRequestProcessor Shutting down
   [junit4]   2> 19384 INFO  (TEST-SolrMorphlineZkAliasTest.test-seed#[BDF1A9126ED8D58]) [    ] o.a.z.s.SyncRequestProcessor Shutting down
   [junit4]   2> 19384 INFO  (Thread-1) [    ] o.a.z.s.FinalRequestProcessor shutdown of request processor complete
   [junit4]   2> 19384 INFO  (TEST-SolrMorphlineZkAliasTest.test-seed#[BDF1A9126ED8D58]) [    ] o.a.z.s.FinalRequestProcessor shutdown of request processor complete
   [junit4]   2> 19385 INFO  (Thread-1) [    ] o.a.s.c.ZkTestServer connecting to 127.0.0.1:53284 53284
   [junit4]   2> 19386 INFO  (Thread-1) [    ] o.a.z.s.ZooKeeperServer shutting down
   [junit4]   2> 19386 INFO  (Thread-1) [    ] o.a.z.s.SessionTrackerImpl Shutting down
   [junit4]   2> 19386 INFO  (Thread-1) [    ] o.a.z.s.PrepRequestProcessor Shutting down
   [junit4]   2> 19386 INFO  (Thread-1) [    ] o.a.z.s.SyncRequestProcessor Shutting down
   [junit4]   2> 19386 INFO  (Thread-1) [    ] o.a.z.s.FinalRequestProcessor shutdown of request processor complete
   [junit4]   2> 19400 WARN  (Thread-1) [    ] o.a.s.c.ZkTestServer Watch limit violations: 
   [junit4]   2> Maximum concurrent create/delete watches above limit:
   [junit4]   2> 
   [junit4]   2> 	5	/solr/aliases.json
   [junit4]   2> 	4	/solr/security.json
   [junit4]   2> 	4	/solr/configs/conf1
   [junit4]   2> 
   [junit4]   2> Maximum concurrent data watches above limit:
   [junit4]   2> 
   [junit4]   2> 	5	/solr/clusterstate.json
   [junit4]   2> 
   [junit4]   2> Maximum concurrent children watches above limit:
   [junit4]   2> 
   [junit4]   2> 	5	/solr/live_nodes
   [junit4]   2> 	5	/solr/collections
   [junit4]   2> 	4	/solr/overseer/queue
   [junit4]   2> 	4	/solr/overseer/collection-queue-work
   [junit4]   2> 
   [junit4]   2> NOTE: reproduce with: ant test  -Dtestcase=SolrMorphlineZkAliasTest -Dtests.method=test -Dtests.seed=BDF1A9126ED8D58 -Dtests.multiplier=3 -Dtests.slow=true -Dtests.locale=az-Cyrl -Dtests.timezone=HST -Dtests.asserts=true -Dtests.file.encoding=US-ASCII
   [junit4] ERROR   19.3s J1 | SolrMorphlineZkAliasTest.test <<<
   [junit4]    > Throwable #1: org.apache.solr.client.solrj.SolrServerException: No live SolrServers available to handle this request:[https://127.0.0.1:50094/f_lqr/pv, https://127.0.0.1:36753/f_lqr/pv, https://127.0.0.1:38585/f_lqr/pv, https://127.0.0.1:56113/f_lqr/pv]
   [junit4]    > 	at __randomizedtesting.SeedInfo.seed([BDF1A9126ED8D58:838B254B8811E0A0]:0)
   [junit4]    > 	at org.apache.solr.client.solrj.impl.LBHttpSolrClient.request(LBHttpSolrClient.java:352)
   [junit4]    > 	at org.apache.solr.client.solrj.impl.CloudSolrClient.sendRequest(CloudSolrClient.java:1100)
   [junit4]    > 	at org.apache.solr.client.solrj.impl.CloudSolrClient.requestWithRetryOnStaleState(CloudSolrClient.java:870)
   [junit4]    > 	at org.apache.solr.client.solrj.impl.CloudSolrClient.request(CloudSolrClient.java:806)
   [junit4]    > 	at org.apache.solr.client.solrj.SolrClient.request(SolrClient.java:1219)
   [junit4]    > 	at org.apache.solr.morphlines.solr.SolrMorphlineZkAliasTest.createAlias(SolrMorphlineZkAliasTest.java:117)
   [junit4]    > 	at org.apache.solr.morphlines.solr.SolrMorphlineZkAliasTest.test(SolrMorphlineZkAliasTest.java:52)
   [junit4]    > 	at org.apache.solr.BaseDistributedSearchTestCase$ShardsRepeatRule$ShardsFixedStatement.callStatement(BaseDistributedSearchTestCase.java:964)
   [junit4]    > 	at org.apache.solr.BaseDistributedSearchTestCase$ShardsRepeatRule$ShardsStatement.evaluate(BaseDistributedSearchTestCase.java:939)
   [junit4]    > 	at java.lang.Thread.run(Thread.java:804)
   [junit4]    > Caused by: org.apache.solr.client.solrj.SolrServerException: IOException occured when talking to server at: https://127.0.0.1:38585/f_lqr/pv
   [junit4]    > 	at org.apache.solr.client.solrj.impl.HttpSolrClient.executeMethod(HttpSolrClient.java:591)
   [junit4]    > 	at org.apache.solr.client.solrj.impl.HttpSolrClient.request(HttpSolrClient.java:241)
   [junit4]    > 	at org.apache.solr.client.solrj.impl.HttpSolrClient.request(HttpSolrClient.java:230)
   [junit4]    > 	at org.apache.solr.client.solrj.impl.LBHttpSolrClient.doRequest(LBHttpSolrClient.java:372)
   [junit4]    > 	at org.apache.solr.client.solrj.impl.LBHttpSolrClient.request(LBHttpSolrClient.java:325)
   [junit4]    > 	... 47 more
   [junit4]    > Caused by: java.net.SocketException: Connection reset
   [junit4]    > 	at java.net.SocketOutputStream.socketWrite(SocketOutputStream.java:113)
   [junit4]    > 	at java.net.SocketOutputStream.write(SocketOutputStream.java:153)
   [junit4]    > 	at sun.security.ssl.SSLSocketOutputRecord.flush(SSLSocketOutputRecord.java:236)
   [junit4]    > 	at sun.security.ssl.HandshakeOutStream.flush(HandshakeOutStream.java:79)
   [junit4]    > 	at sun.security.ssl.Handshaker.kickstart(Handshaker.java:1052)
   [junit4]    > 	at sun.security.ssl.SSLSocketImpl.kickstartHandshake(SSLSocketImpl.java:1492)
   [junit4]    > 	at sun.security.ssl.SSLSocketImpl.performInitialHandshake(SSLSocketImpl.java:1373)
   [junit4]    > 	at sun.security.ssl.SSLSocketImpl.startHandshake(SSLSocketImpl.java:1408)
   [junit4]    > 	at sun.security.ssl.SSLSocketImpl.startHandshake(SSLSocketImpl.java:1392)
   [junit4]    > 	at org.apache.http.conn.ssl.SSLSocketFactory.connectSocket(SSLSocketFactory.java:543)
   [junit4]    > 	at org.apache.http.conn.ssl.SSLSocketFactory.connectSocket(SSLSocketFactory.java:409)
   [junit4]    > 	at org.apache.http.impl.conn.DefaultClientConnectionOperator.openConnection(DefaultClientConnectionOperator.java:177)
   [junit4]    > 	at org.apache.http.impl.conn.ManagedClientConnectionImpl.open(ManagedClientConnectionImpl.java:304)
   [junit4]    > 	at org.apache.http.impl.client.DefaultRequestDirector.tryConnect(DefaultRequestDirector.java:611)
   [junit4]    > 	at org.apache.http.impl.client.DefaultRequestDirector.execute(DefaultRequestDirector.java:446)
   [junit4]    > 	at org.apache.http.impl.client.AbstractHttpClient.doExecute(AbstractHttpClient.java:882)
   [junit4]    > 	at org.apache.http.impl.client.CloseableHttpClient.execute(CloseableHttpClient.java:82)
   [junit4]    > 	at org.apache.http.impl.client.CloseableHttpClient.execute(CloseableHttpClient.java:107)
   [junit4]    > 	at org.apache.http.impl.client.CloseableHttpClient.execute(CloseableHttpClient.java:55)
   [junit4]    > 	at org.apache.solr.client.solrj.impl.HttpSolrClient.executeMethod(HttpSolrClient.java:482)
   [junit4]    > 	... 51 more
   [junit4]   2> 19411 INFO  (SUITE-SolrMorphlineZkAliasTest-seed#[BDF1A9126ED8D58]-worker) [    ] o.a.s.SolrTestCaseJ4 ###deleteCore
   [junit4]   2> NOTE: leaving temporary files on disk at: /home/jenkins/workspace/Lucene-Solr-trunk-Linux/solr/build/contrib/solr-morphlines-core/test/J1/temp/solr.morphlines.solr.SolrMorphlineZkAliasTest_BDF1A9126ED8D58-001
   [junit4]   2> Feb 20, 2016 8:37:50 PM com.carrotsearch.randomizedtesting.ThreadLeakControl checkThreadLeaks
   [junit4]   2> WARNING: Will linger awaiting termination of 1 leaked thread(s).
   [junit4]   2> 20217 INFO  (SessionTracker) [    ] o.a.z.s.SessionTrackerImpl SessionTrackerImpl exited loop!
   [junit4]   2> NOTE: test params are: codec=Lucene60, sim=RandomSimilarity(queryNorm=true,coord=yes): {}, locale=az-Cyrl, timezone=HST
   [junit4]   2> NOTE: Linux 3.19.0-47-generic amd64/Oracle Corporation 9-ea (64-bit)/cpus=12,threads=1,free=349583720,total=508887040
   [junit4]   2> NOTE: All tests run in this JVM: [SolrMorphlineZkAliasTest]
   [junit4] Completed [1/4 (1!)] on J1 in 21.08s, 1 test, 1 error <<< FAILURES!

[...truncated 20 lines...]
BUILD FAILED
/home/jenkins/workspace/Lucene-Solr-trunk-Linux/build.xml:740: The following error occurred while executing this line:
/home/jenkins/workspace/Lucene-Solr-trunk-Linux/build.xml:684: The following error occurred while executing this line:
/home/jenkins/workspace/Lucene-Solr-trunk-Linux/build.xml:59: The following error occurred while executing this line:
/home/jenkins/workspace/Lucene-Solr-trunk-Linux/solr/build.xml:253: The following error occurred while executing this line:
/home/jenkins/workspace/Lucene-Solr-trunk-Linux/solr/common-build.xml:459: The following error occurred while executing this line:
/home/jenkins/workspace/Lucene-Solr-trunk-Linux/solr/common-build.xml:524: The following error occurred while executing this line:
/home/jenkins/workspace/Lucene-Solr-trunk-Linux/lucene/common-build.xml:1457: The following error occurred while executing this line:
/home/jenkins/workspace/Lucene-Solr-trunk-Linux/lucene/common-build.xml:1014: There were test failures: 4 suites, 5 tests, 1 error [seed: BDF1A9126ED8D58]

Total time: 57 minutes 52 seconds
Build step 'Invoke Ant' marked build as failure
Archiving artifacts
[WARNINGS] Skipping publisher since build result is FAILURE
Recording test results
Email was triggered for: Failure - Any
Sending email for trigger: Failure - Any



Mime
View raw message