lucene-dev mailing list archives

Site index · List index
Message view « Date » · « Thread »
Top « Date » · « Thread »
From Policeman Jenkins Server <jenk...@thetaphi.de>
Subject [JENKINS] Lucene-Solr-trunk-Linux (64bit/jdk1.8.0_72) - Build # 15885 - Failure!
Date Sun, 14 Feb 2016 19:12:59 GMT
Build: http://jenkins.thetaphi.de/job/Lucene-Solr-trunk-Linux/15885/
Java: 64bit/jdk1.8.0_72 -XX:+UseCompressedOops -XX:+UseConcMarkSweepGC

1 tests failed.
FAILED:  org.apache.solr.handler.PingRequestHandlerTest.testPingInClusterWithNoHealthCheck

Error Message:
Could not find a healthy node to handle the request.

Stack Trace:
org.apache.solr.common.SolrException: Could not find a healthy node to handle the request.
	at __randomizedtesting.SeedInfo.seed([2AE4E4E82A810B53:C4375A38AF6D31B7]:0)
	at org.apache.solr.client.solrj.impl.CloudSolrClient.sendRequest(CloudSolrClient.java:1084)
	at org.apache.solr.client.solrj.impl.CloudSolrClient.requestWithRetryOnStaleState(CloudSolrClient.java:870)
	at org.apache.solr.client.solrj.impl.CloudSolrClient.requestWithRetryOnStaleState(CloudSolrClient.java:953)
	at org.apache.solr.client.solrj.impl.CloudSolrClient.requestWithRetryOnStaleState(CloudSolrClient.java:953)
	at org.apache.solr.client.solrj.impl.CloudSolrClient.requestWithRetryOnStaleState(CloudSolrClient.java:953)
	at org.apache.solr.client.solrj.impl.CloudSolrClient.requestWithRetryOnStaleState(CloudSolrClient.java:953)
	at org.apache.solr.client.solrj.impl.CloudSolrClient.requestWithRetryOnStaleState(CloudSolrClient.java:953)
	at org.apache.solr.client.solrj.impl.CloudSolrClient.request(CloudSolrClient.java:806)
	at org.apache.solr.client.solrj.SolrRequest.process(SolrRequest.java:149)
	at org.apache.solr.handler.PingRequestHandlerTest.testPingInClusterWithNoHealthCheck(PingRequestHandlerTest.java:199)
	at sun.reflect.NativeMethodAccessorImpl.invoke0(Native Method)
	at sun.reflect.NativeMethodAccessorImpl.invoke(NativeMethodAccessorImpl.java:62)
	at sun.reflect.DelegatingMethodAccessorImpl.invoke(DelegatingMethodAccessorImpl.java:43)
	at java.lang.reflect.Method.invoke(Method.java:498)
	at com.carrotsearch.randomizedtesting.RandomizedRunner.invoke(RandomizedRunner.java:1764)
	at com.carrotsearch.randomizedtesting.RandomizedRunner$8.evaluate(RandomizedRunner.java:871)
	at com.carrotsearch.randomizedtesting.RandomizedRunner$9.evaluate(RandomizedRunner.java:907)
	at com.carrotsearch.randomizedtesting.RandomizedRunner$10.evaluate(RandomizedRunner.java:921)
	at com.carrotsearch.randomizedtesting.rules.SystemPropertiesRestoreRule$1.evaluate(SystemPropertiesRestoreRule.java:57)
	at org.apache.lucene.util.TestRuleSetupTeardownChained$1.evaluate(TestRuleSetupTeardownChained.java:49)
	at org.apache.lucene.util.AbstractBeforeAfterRule$1.evaluate(AbstractBeforeAfterRule.java:45)
	at org.apache.lucene.util.TestRuleThreadAndTestName$1.evaluate(TestRuleThreadAndTestName.java:48)
	at org.apache.lucene.util.TestRuleIgnoreAfterMaxFailures$1.evaluate(TestRuleIgnoreAfterMaxFailures.java:64)
	at org.apache.lucene.util.TestRuleMarkFailure$1.evaluate(TestRuleMarkFailure.java:47)
	at com.carrotsearch.randomizedtesting.rules.StatementAdapter.evaluate(StatementAdapter.java:36)
	at com.carrotsearch.randomizedtesting.ThreadLeakControl$StatementRunner.run(ThreadLeakControl.java:367)
	at com.carrotsearch.randomizedtesting.ThreadLeakControl.forkTimeoutingTask(ThreadLeakControl.java:809)
	at com.carrotsearch.randomizedtesting.ThreadLeakControl$3.evaluate(ThreadLeakControl.java:460)
	at com.carrotsearch.randomizedtesting.RandomizedRunner.runSingleTest(RandomizedRunner.java:880)
	at com.carrotsearch.randomizedtesting.RandomizedRunner$5.evaluate(RandomizedRunner.java:781)
	at com.carrotsearch.randomizedtesting.RandomizedRunner$6.evaluate(RandomizedRunner.java:816)
	at com.carrotsearch.randomizedtesting.RandomizedRunner$7.evaluate(RandomizedRunner.java:827)
	at com.carrotsearch.randomizedtesting.rules.StatementAdapter.evaluate(StatementAdapter.java:36)
	at com.carrotsearch.randomizedtesting.rules.SystemPropertiesRestoreRule$1.evaluate(SystemPropertiesRestoreRule.java:57)
	at org.apache.lucene.util.AbstractBeforeAfterRule$1.evaluate(AbstractBeforeAfterRule.java:45)
	at com.carrotsearch.randomizedtesting.rules.StatementAdapter.evaluate(StatementAdapter.java:36)
	at org.apache.lucene.util.TestRuleStoreClassName$1.evaluate(TestRuleStoreClassName.java:41)
	at com.carrotsearch.randomizedtesting.rules.NoShadowingOrOverridesOnMethodsRule$1.evaluate(NoShadowingOrOverridesOnMethodsRule.java:40)
	at com.carrotsearch.randomizedtesting.rules.NoShadowingOrOverridesOnMethodsRule$1.evaluate(NoShadowingOrOverridesOnMethodsRule.java:40)
	at com.carrotsearch.randomizedtesting.rules.StatementAdapter.evaluate(StatementAdapter.java:36)
	at com.carrotsearch.randomizedtesting.rules.StatementAdapter.evaluate(StatementAdapter.java:36)
	at com.carrotsearch.randomizedtesting.rules.StatementAdapter.evaluate(StatementAdapter.java:36)
	at org.apache.lucene.util.TestRuleAssertionsRequired$1.evaluate(TestRuleAssertionsRequired.java:53)
	at org.apache.lucene.util.TestRuleMarkFailure$1.evaluate(TestRuleMarkFailure.java:47)
	at org.apache.lucene.util.TestRuleIgnoreAfterMaxFailures$1.evaluate(TestRuleIgnoreAfterMaxFailures.java:64)
	at org.apache.lucene.util.TestRuleIgnoreTestSuites$1.evaluate(TestRuleIgnoreTestSuites.java:54)
	at com.carrotsearch.randomizedtesting.rules.StatementAdapter.evaluate(StatementAdapter.java:36)
	at com.carrotsearch.randomizedtesting.ThreadLeakControl$StatementRunner.run(ThreadLeakControl.java:367)
	at java.lang.Thread.run(Thread.java:745)




Build Log:
[...truncated 11691 lines...]
   [junit4] Suite: org.apache.solr.handler.PingRequestHandlerTest
   [junit4]   2> Creating dataDir: /home/jenkins/workspace/Lucene-Solr-trunk-Linux/solr/build/solr-core/test/J2/temp/solr.handler.PingRequestHandlerTest_2AE4E4E82A810B53-001/init-core-data-001
   [junit4]   2> 1278158 INFO  (SUITE-PingRequestHandlerTest-seed#[2AE4E4E82A810B53]-worker) [    ] o.a.s.SolrTestCaseJ4 Randomized ssl (false) and clientAuth (false)
   [junit4]   2> 1278158 INFO  (SUITE-PingRequestHandlerTest-seed#[2AE4E4E82A810B53]-worker) [    ] o.a.s.SolrTestCaseJ4 ####initCore
   [junit4]   2> 1278158 INFO  (SUITE-PingRequestHandlerTest-seed#[2AE4E4E82A810B53]-worker) [    ] o.a.s.c.SolrResourceLoader new SolrResourceLoader for directory: '/home/jenkins/workspace/Lucene-Solr-trunk-Linux/solr/core/src/test-files/solr/collection1'
   [junit4]   2> 1278158 INFO  (SUITE-PingRequestHandlerTest-seed#[2AE4E4E82A810B53]-worker) [    ] o.a.s.c.SolrResourceLoader JNDI not configured for solr (NoInitialContextEx)
   [junit4]   2> 1278158 INFO  (SUITE-PingRequestHandlerTest-seed#[2AE4E4E82A810B53]-worker) [    ] o.a.s.c.SolrResourceLoader using system property solr.solr.home: /home/jenkins/workspace/Lucene-Solr-trunk-Linux/solr/core/src/test-files/solr
   [junit4]   2> 1278158 INFO  (SUITE-PingRequestHandlerTest-seed#[2AE4E4E82A810B53]-worker) [    ] o.a.s.c.SolrResourceLoader Adding 'file:/home/jenkins/workspace/Lucene-Solr-trunk-Linux/solr/core/src/test-files/solr/collection1/lib/classes/' to classloader
   [junit4]   2> 1278158 INFO  (SUITE-PingRequestHandlerTest-seed#[2AE4E4E82A810B53]-worker) [    ] o.a.s.c.SolrResourceLoader Adding 'file:/home/jenkins/workspace/Lucene-Solr-trunk-Linux/solr/core/src/test-files/solr/collection1/lib/README' to classloader
   [junit4]   2> 1278193 INFO  (SUITE-PingRequestHandlerTest-seed#[2AE4E4E82A810B53]-worker) [    ] o.a.s.c.SolrConfig current version of requestparams : -1
   [junit4]   2> 1278199 INFO  (SUITE-PingRequestHandlerTest-seed#[2AE4E4E82A810B53]-worker) [    ] o.a.s.c.SolrConfig Using Lucene MatchVersion: 6.0.0
   [junit4]   2> 1278221 INFO  (SUITE-PingRequestHandlerTest-seed#[2AE4E4E82A810B53]-worker) [    ] o.a.s.c.SolrConfig Loaded SolrConfig: solrconfig.xml
   [junit4]   2> 1278226 INFO  (SUITE-PingRequestHandlerTest-seed#[2AE4E4E82A810B53]-worker) [    ] o.a.s.s.IndexSchema [null] Schema name=test
   [junit4]   2> 1278963 INFO  (SUITE-PingRequestHandlerTest-seed#[2AE4E4E82A810B53]-worker) [    ] o.a.s.s.OpenExchangeRatesOrgProvider Initialized with rates=open-exchange-rates.json, refreshInterval=1440.
   [junit4]   2> 1278968 INFO  (SUITE-PingRequestHandlerTest-seed#[2AE4E4E82A810B53]-worker) [    ] o.a.s.s.IndexSchema default search field in schema is text
   [junit4]   2> 1278970 INFO  (SUITE-PingRequestHandlerTest-seed#[2AE4E4E82A810B53]-worker) [    ] o.a.s.s.IndexSchema unique key field: id
   [junit4]   2> 1278975 INFO  (SUITE-PingRequestHandlerTest-seed#[2AE4E4E82A810B53]-worker) [    ] o.a.s.s.FileExchangeRateProvider Reloading exchange rates from file currency.xml
   [junit4]   2> 1278976 INFO  (SUITE-PingRequestHandlerTest-seed#[2AE4E4E82A810B53]-worker) [    ] o.a.s.s.FileExchangeRateProvider Reloading exchange rates from file currency.xml
   [junit4]   2> 1278978 INFO  (SUITE-PingRequestHandlerTest-seed#[2AE4E4E82A810B53]-worker) [    ] o.a.s.s.OpenExchangeRatesOrgProvider Reloading exchange rates from open-exchange-rates.json
   [junit4]   2> 1278978 INFO  (SUITE-PingRequestHandlerTest-seed#[2AE4E4E82A810B53]-worker) [    ] o.a.s.s.OpenExchangeRatesOrgProvider Reloading exchange rates from open-exchange-rates.json
   [junit4]   2> 1278978 INFO  (SUITE-PingRequestHandlerTest-seed#[2AE4E4E82A810B53]-worker) [    ] o.a.s.c.SolrResourceLoader JNDI not configured for solr (NoInitialContextEx)
   [junit4]   2> 1278978 INFO  (SUITE-PingRequestHandlerTest-seed#[2AE4E4E82A810B53]-worker) [    ] o.a.s.c.SolrResourceLoader using system property solr.solr.home: /home/jenkins/workspace/Lucene-Solr-trunk-Linux/solr/core/src/test-files/solr
   [junit4]   2> 1278978 INFO  (SUITE-PingRequestHandlerTest-seed#[2AE4E4E82A810B53]-worker) [    ] o.a.s.c.SolrResourceLoader new SolrResourceLoader for directory: '/home/jenkins/workspace/Lucene-Solr-trunk-Linux/solr/core/src/test-files/solr'
   [junit4]   2> 1278978 INFO  (SUITE-PingRequestHandlerTest-seed#[2AE4E4E82A810B53]-worker) [    ] o.a.s.c.SolrResourceLoader JNDI not configured for solr (NoInitialContextEx)
   [junit4]   2> 1278978 INFO  (SUITE-PingRequestHandlerTest-seed#[2AE4E4E82A810B53]-worker) [    ] o.a.s.c.SolrResourceLoader using system property solr.solr.home: /home/jenkins/workspace/Lucene-Solr-trunk-Linux/solr/core/src/test-files/solr
   [junit4]   2> 1278978 INFO  (SUITE-PingRequestHandlerTest-seed#[2AE4E4E82A810B53]-worker) [    ] o.a.s.c.CoreContainer New CoreContainer 228851766
   [junit4]   2> 1278979 INFO  (SUITE-PingRequestHandlerTest-seed#[2AE4E4E82A810B53]-worker) [    ] o.a.s.c.CoreContainer Loading cores into CoreContainer [instanceDir=/home/jenkins/workspace/Lucene-Solr-trunk-Linux/solr/core/src/test-files/solr]
   [junit4]   2> 1278979 WARN  (SUITE-PingRequestHandlerTest-seed#[2AE4E4E82A810B53]-worker) [    ] o.a.s.c.CoreContainer Couldn't add files from /home/jenkins/workspace/Lucene-Solr-trunk-Linux/solr/core/src/test-files/solr/lib to classpath: /home/jenkins/workspace/Lucene-Solr-trunk-Linux/solr/core/src/test-files/solr/lib
   [junit4]   2> 1278979 INFO  (SUITE-PingRequestHandlerTest-seed#[2AE4E4E82A810B53]-worker) [    ] o.a.s.h.c.HttpShardHandlerFactory created with socketTimeout : 600000,connTimeout : 60000,maxConnectionsPerHost : 20,maxConnections : 10000,corePoolSize : 0,maximumPoolSize : 2147483647,maxThreadIdleTime : 5,sizeOfQueue : -1,fairnessPolicy : false,useRetries : false,
   [junit4]   2> 1278981 INFO  (SUITE-PingRequestHandlerTest-seed#[2AE4E4E82A810B53]-worker) [    ] o.a.s.u.UpdateShardHandler Creating UpdateShardHandler HTTP client with params: socketTimeout=30000&connTimeout=30000&retry=true
   [junit4]   2> 1278982 INFO  (SUITE-PingRequestHandlerTest-seed#[2AE4E4E82A810B53]-worker) [    ] o.a.s.l.LogWatcher SLF4J impl is org.slf4j.impl.Log4jLoggerFactory
   [junit4]   2> 1278982 INFO  (SUITE-PingRequestHandlerTest-seed#[2AE4E4E82A810B53]-worker) [    ] o.a.s.l.LogWatcher Registering Log Listener [Log4j (org.slf4j.impl.Log4jLoggerFactory)]
   [junit4]   2> 1278982 INFO  (SUITE-PingRequestHandlerTest-seed#[2AE4E4E82A810B53]-worker) [    ] o.a.s.c.CoreContainer Security conf doesn't exist. Skipping setup for authorization module.
   [junit4]   2> 1278982 INFO  (SUITE-PingRequestHandlerTest-seed#[2AE4E4E82A810B53]-worker) [    ] o.a.s.c.CoreContainer No authentication plugin used.
   [junit4]   2> 1278983 INFO  (SUITE-PingRequestHandlerTest-seed#[2AE4E4E82A810B53]-worker) [    ] o.a.s.c.CoreDescriptor Created CoreDescriptor: {name=collection1, config=solrconfig.xml, transient=false, schema=schema.xml, loadOnStartup=true, configSetProperties=configsetprops.json, collection=collection1, dataDir=/home/jenkins/workspace/Lucene-Solr-trunk-Linux/solr/build/solr-core/test/J2/temp/solr.handler.PingRequestHandlerTest_2AE4E4E82A810B53-001/init-core-data-001, shard=shard1}
   [junit4]   2> 1278984 INFO  (coreLoadExecutor-4180-thread-1) [    ] o.a.s.c.SolrResourceLoader new SolrResourceLoader for directory: '/home/jenkins/workspace/Lucene-Solr-trunk-Linux/solr/core/src/test-files/solr/collection1'
   [junit4]   2> 1278984 INFO  (coreLoadExecutor-4180-thread-1) [    ] o.a.s.c.SolrResourceLoader JNDI not configured for solr (NoInitialContextEx)
   [junit4]   2> 1278984 INFO  (coreLoadExecutor-4180-thread-1) [    ] o.a.s.c.SolrResourceLoader using system property solr.solr.home: /home/jenkins/workspace/Lucene-Solr-trunk-Linux/solr/core/src/test-files/solr
   [junit4]   2> 1278984 INFO  (coreLoadExecutor-4180-thread-1) [    ] o.a.s.c.SolrResourceLoader Adding 'file:/home/jenkins/workspace/Lucene-Solr-trunk-Linux/solr/core/src/test-files/solr/collection1/lib/classes/' to classloader
   [junit4]   2> 1278984 INFO  (coreLoadExecutor-4180-thread-1) [    ] o.a.s.c.SolrResourceLoader Adding 'file:/home/jenkins/workspace/Lucene-Solr-trunk-Linux/solr/core/src/test-files/solr/collection1/lib/README' to classloader
   [junit4]   2> 1279009 INFO  (coreLoadExecutor-4180-thread-1) [    ] o.a.s.c.SolrConfig current version of requestparams : -1
   [junit4]   2> 1279014 INFO  (coreLoadExecutor-4180-thread-1) [    ] o.a.s.c.SolrConfig Using Lucene MatchVersion: 6.0.0
   [junit4]   2> 1279026 INFO  (coreLoadExecutor-4180-thread-1) [    ] o.a.s.c.SolrConfig Loaded SolrConfig: solrconfig.xml
   [junit4]   2> 1279030 INFO  (coreLoadExecutor-4180-thread-1) [    ] o.a.s.s.IndexSchema [collection1] Schema name=test
   [junit4]   2> 1279085 INFO  (coreLoadExecutor-4180-thread-1) [    ] o.a.s.s.OpenExchangeRatesOrgProvider Initialized with rates=open-exchange-rates.json, refreshInterval=1440.
   [junit4]   2> 1279088 INFO  (coreLoadExecutor-4180-thread-1) [    ] o.a.s.s.IndexSchema default search field in schema is text
   [junit4]   2> 1279088 INFO  (coreLoadExecutor-4180-thread-1) [    ] o.a.s.s.IndexSchema unique key field: id
   [junit4]   2> 1279091 INFO  (coreLoadExecutor-4180-thread-1) [    ] o.a.s.s.FileExchangeRateProvider Reloading exchange rates from file currency.xml
   [junit4]   2> 1279092 INFO  (coreLoadExecutor-4180-thread-1) [    ] o.a.s.s.FileExchangeRateProvider Reloading exchange rates from file currency.xml
   [junit4]   2> 1279093 INFO  (coreLoadExecutor-4180-thread-1) [    ] o.a.s.s.OpenExchangeRatesOrgProvider Reloading exchange rates from open-exchange-rates.json
   [junit4]   2> 1279093 INFO  (coreLoadExecutor-4180-thread-1) [    ] o.a.s.s.OpenExchangeRatesOrgProvider Reloading exchange rates from open-exchange-rates.json
   [junit4]   2> 1279094 INFO  (coreLoadExecutor-4180-thread-1) [    ] o.a.s.c.ConfigSetProperties Did not find ConfigSet properties, assuming default properties: Can't find resource 'configsetprops.json' in classpath or '/home/jenkins/workspace/Lucene-Solr-trunk-Linux/solr/core/src/test-files/solr/collection1'
   [junit4]   2> 1279094 INFO  (coreLoadExecutor-4180-thread-1) [    ] o.a.s.c.CoreContainer Creating SolrCore 'collection1' using configuration from instancedir /home/jenkins/workspace/Lucene-Solr-trunk-Linux/solr/core/src/test-files/solr/collection1
   [junit4]   2> 1279094 INFO  (coreLoadExecutor-4180-thread-1) [    x:collection1] o.a.s.c.SolrCore org.apache.solr.core.MockDirectoryFactory
   [junit4]   2> 1279094 INFO  (coreLoadExecutor-4180-thread-1) [    x:collection1] o.a.s.c.SolrCore [[collection1] ] Opening new SolrCore at [/home/jenkins/workspace/Lucene-Solr-trunk-Linux/solr/core/src/test-files/solr/collection1], dataDir=[/home/jenkins/workspace/Lucene-Solr-trunk-Linux/solr/build/solr-core/test/J2/temp/solr.handler.PingRequestHandlerTest_2AE4E4E82A810B53-001/init-core-data-001/]
   [junit4]   2> 1279094 INFO  (coreLoadExecutor-4180-thread-1) [    x:collection1] o.a.s.c.JmxMonitoredMap JMX monitoring is enabled. Adding Solr mbeans to JMX Server: com.sun.jmx.mbeanserver.JmxMBeanServer@1e738045
   [junit4]   2> 1279095 INFO  (coreLoadExecutor-4180-thread-1) [    x:collection1] o.a.s.c.CachingDirectoryFactory return new directory for /home/jenkins/workspace/Lucene-Solr-trunk-Linux/solr/build/solr-core/test/J2/temp/solr.handler.PingRequestHandlerTest_2AE4E4E82A810B53-001/init-core-data-001
   [junit4]   2> 1279095 INFO  (coreLoadExecutor-4180-thread-1) [    x:collection1] o.a.s.c.SolrCore New index directory detected: old=null new=/home/jenkins/workspace/Lucene-Solr-trunk-Linux/solr/build/solr-core/test/J2/temp/solr.handler.PingRequestHandlerTest_2AE4E4E82A810B53-001/init-core-data-001/index/
   [junit4]   2> 1279095 WARN  (coreLoadExecutor-4180-thread-1) [    x:collection1] o.a.s.c.SolrCore [collection1] Solr index directory '/home/jenkins/workspace/Lucene-Solr-trunk-Linux/solr/build/solr-core/test/J2/temp/solr.handler.PingRequestHandlerTest_2AE4E4E82A810B53-001/init-core-data-001/index' doesn't exist. Creating new index...
   [junit4]   2> 1279095 INFO  (coreLoadExecutor-4180-thread-1) [    x:collection1] o.a.s.c.CachingDirectoryFactory return new directory for /home/jenkins/workspace/Lucene-Solr-trunk-Linux/solr/build/solr-core/test/J2/temp/solr.handler.PingRequestHandlerTest_2AE4E4E82A810B53-001/init-core-data-001/index
   [junit4]   2> 1279095 INFO  (coreLoadExecutor-4180-thread-1) [    x:collection1] o.a.s.u.RandomMergePolicy RandomMergePolicy wrapping class org.apache.lucene.index.TieredMergePolicy: [TieredMergePolicy: maxMergeAtOnce=29, maxMergeAtOnceExplicit=18, maxMergedSegmentMB=73.1630859375, floorSegmentMB=2.134765625, forceMergeDeletesPctAllowed=27.192401583957675, segmentsPerTier=19.0, maxCFSSegmentSizeMB=8.796093022207999E12, noCFSRatio=0.5390796848844734
   [junit4]   2> 1279096 INFO  (coreLoadExecutor-4180-thread-1) [    x:collection1] o.a.s.c.SolrDeletionPolicy SolrDeletionPolicy.onCommit: commits: num=1
   [junit4]   2> 	commit{dir=MockDirectoryWrapper(RAMDirectory@735afc9c lockFactory=org.apache.lucene.store.SingleInstanceLockFactory@12e79f4b),segFN=segments_1,generation=1}
   [junit4]   2> 1279096 INFO  (coreLoadExecutor-4180-thread-1) [    x:collection1] o.a.s.c.SolrDeletionPolicy newest commit generation = 1
   [junit4]   2> 1279096 INFO  (OldIndexDirectoryCleanupThreadForCore-collection1) [    x:collection1] o.a.s.c.SolrCore Looking for old index directories to cleanup for core collection1 in /home/jenkins/workspace/Lucene-Solr-trunk-Linux/solr/build/solr-core/test/J2/temp/solr.handler.PingRequestHandlerTest_2AE4E4E82A810B53-001/init-core-data-001/
   [junit4]   2> 1279098 INFO  (coreLoadExecutor-4180-thread-1) [    x:collection1] o.a.s.u.p.UpdateRequestProcessorChain creating updateRequestProcessorChain "dedupe"
   [junit4]   2> 1279098 INFO  (coreLoadExecutor-4180-thread-1) [    x:collection1] o.a.s.u.p.UpdateRequestProcessorChain inserting DistributedUpdateProcessorFactory into updateRequestProcessorChain "dedupe"
   [junit4]   2> 1279098 INFO  (coreLoadExecutor-4180-thread-1) [    x:collection1] o.a.s.u.p.UpdateRequestProcessorChain creating updateRequestProcessorChain "dedupe-allfields"
   [junit4]   2> 1279098 INFO  (coreLoadExecutor-4180-thread-1) [    x:collection1] o.a.s.u.p.UpdateRequestProcessorChain inserting DistributedUpdateProcessorFactory into updateRequestProcessorChain "dedupe-allfields"
   [junit4]   2> 1279098 INFO  (coreLoadExecutor-4180-thread-1) [    x:collection1] o.a.s.u.p.UpdateRequestProcessorChain creating updateRequestProcessorChain "stored_sig"
   [junit4]   2> 1279098 INFO  (coreLoadExecutor-4180-thread-1) [    x:collection1] o.a.s.u.p.UpdateRequestProcessorChain inserting DistributedUpdateProcessorFactory into updateRequestProcessorChain "stored_sig"
   [junit4]   2> 1279098 INFO  (coreLoadExecutor-4180-thread-1) [    x:collection1] o.a.s.u.p.UpdateRequestProcessorChain creating updateRequestProcessorChain "uniq-fields"
   [junit4]   2> 1279098 INFO  (coreLoadExecutor-4180-thread-1) [    x:collection1] o.a.s.u.p.UpdateRequestProcessorChain inserting DistributedUpdateProcessorFactory into updateRequestProcessorChain "uniq-fields"
   [junit4]   2> 1279098 INFO  (coreLoadExecutor-4180-thread-1) [    x:collection1] o.a.s.u.p.UpdateRequestProcessorChain creating updateRequestProcessorChain "distrib-dup-test-chain-explicit"
   [junit4]   2> 1279098 INFO  (coreLoadExecutor-4180-thread-1) [    x:collection1] o.a.s.u.p.UpdateRequestProcessorChain creating updateRequestProcessorChain "distrib-dup-test-chain-implicit"
   [junit4]   2> 1279098 INFO  (coreLoadExecutor-4180-thread-1) [    x:collection1] o.a.s.u.p.UpdateRequestProcessorChain inserting DistributedUpdateProcessorFactory into updateRequestProcessorChain "distrib-dup-test-chain-implicit"
   [junit4]   2> 1279098 INFO  (coreLoadExecutor-4180-thread-1) [    x:collection1] o.a.s.c.SolrCore no updateRequestProcessorChain defined as default, creating implicit default
   [junit4]   2> 1279100 INFO  (coreLoadExecutor-4180-thread-1) [    x:collection1] o.a.s.h.l.XMLLoader xsltCacheLifetimeSeconds=60
   [junit4]   2> 1279100 INFO  (coreLoadExecutor-4180-thread-1) [    x:collection1] o.a.s.h.l.XMLLoader xsltCacheLifetimeSeconds=60
   [junit4]   2> 1279101 INFO  (coreLoadExecutor-4180-thread-1) [    x:collection1] o.a.s.h.l.XMLLoader xsltCacheLifetimeSeconds=60
   [junit4]   2> 1279101 INFO  (coreLoadExecutor-4180-thread-1) [    x:collection1] o.a.s.h.l.XMLLoader xsltCacheLifetimeSeconds=60
   [junit4]   2> 1279103 INFO  (coreLoadExecutor-4180-thread-1) [    x:collection1] o.a.s.c.PluginBag requestHandler : 'lazy' created with startup=lazy 
   [junit4]   2> 1279104 INFO  (coreLoadExecutor-4180-thread-1) [    x:collection1] o.a.s.c.RequestHandlers Registered paths: /admin/mbeans,standard,spellCheckCompRH,lazy,/update/json/docs,/admin/luke,/export,spellCheckWithWordbreak_Direct,tvrh,/get,/admin/properties,/update/json,mltrh,/admin/threads,/search-facet-def,/update/csv,/sql,/search-facet-invariants,/admin/segments,spellCheckCompRH1,/mlt,/admin/system,/replication,dismax,defaults,/config,/stream,/schema,/admin/plugins,/admin/logging,spellCheckWithWordbreak,mock,/admin/ping,/update,/admin/file,/terms,spellCheckCompRH_Direct,/debug/dump
   [junit4]   2> 1279104 WARN  (coreLoadExecutor-4180-thread-1) [    x:collection1] o.a.s.c.SolrCore solrconfig.xml uses deprecated <admin/gettableFiles>, Please update your config to use the ShowFileRequestHandler.
   [junit4]   2> 1279104 INFO  (coreLoadExecutor-4180-thread-1) [    x:collection1] o.a.s.c.SolrCore Using default statsCache cache: org.apache.solr.search.stats.LocalStatsCache
   [junit4]   2> 1279105 INFO  (coreLoadExecutor-4180-thread-1) [    x:collection1] o.a.s.u.UpdateHandler Using UpdateLog implementation: org.apache.solr.update.UpdateLog
   [junit4]   2> 1279105 INFO  (coreLoadExecutor-4180-thread-1) [    x:collection1] o.a.s.u.UpdateLog Initializing UpdateLog: dataDir= defaultSyncLevel=FLUSH numRecordsToKeep=100 maxNumLogsToKeep=10 numVersionBuckets=65536
   [junit4]   2> 1279105 INFO  (coreLoadExecutor-4180-thread-1) [    x:collection1] o.a.s.u.CommitTracker Hard AutoCommit: disabled
   [junit4]   2> 1279105 INFO  (coreLoadExecutor-4180-thread-1) [    x:collection1] o.a.s.u.CommitTracker Soft AutoCommit: disabled
   [junit4]   2> 1279106 INFO  (coreLoadExecutor-4180-thread-1) [    x:collection1] o.a.s.u.RandomMergePolicy RandomMergePolicy wrapping class org.apache.lucene.index.LogByteSizeMergePolicy: [LogByteSizeMergePolicy: minMergeSize=1677721, mergeFactor=36, maxMergeSize=2147483648, maxMergeSizeForForcedMerge=9223372036854775807, calibrateSizeByDeletes=true, maxMergeDocs=2147483647, maxCFSSegmentSizeMB=8.796093022207999E12, noCFSRatio=0.2024974683275863]
   [junit4]   2> 1279106 INFO  (coreLoadExecutor-4180-thread-1) [    x:collection1] o.a.s.c.SolrDeletionPolicy SolrDeletionPolicy.onInit: commits: num=1
   [junit4]   2> 	commit{dir=MockDirectoryWrapper(RAMDirectory@735afc9c lockFactory=org.apache.lucene.store.SingleInstanceLockFactory@12e79f4b),segFN=segments_1,generation=1}
   [junit4]   2> 1279106 INFO  (coreLoadExecutor-4180-thread-1) [    x:collection1] o.a.s.c.SolrDeletionPolicy newest commit generation = 1
   [junit4]   2> 1279106 INFO  (coreLoadExecutor-4180-thread-1) [    x:collection1] o.a.s.s.SolrIndexSearcher Opening [Searcher@51a5462a[collection1] main]
   [junit4]   2> 1279106 INFO  (coreLoadExecutor-4180-thread-1) [    x:collection1] o.a.s.r.RestManager Initializing RestManager with initArgs: {storageIO=org.apache.solr.rest.ManagedResourceStorage$InMemoryStorageIO}
   [junit4]   2> 1279106 INFO  (coreLoadExecutor-4180-thread-1) [    x:collection1] o.a.s.r.ManagedResourceStorage Reading _rest_managed.json using InMemoryStorage
   [junit4]   2> 1279106 INFO  (coreLoadExecutor-4180-thread-1) [    x:collection1] o.a.s.r.RestManager Initializing 0 registered ManagedResources
   [junit4]   2> 1279106 INFO  (coreLoadExecutor-4180-thread-1) [    x:collection1] o.a.s.h.c.SpellCheckComponent Initializing spell checkers
   [junit4]   2> 1279127 INFO  (coreLoadExecutor-4180-thread-1) [    x:collection1] o.a.s.s.DirectSolrSpellChecker init: {name=direct,classname=DirectSolrSpellChecker,field=lowerfilt,minQueryLength=3}
   [junit4]   2> 1279240 INFO  (coreLoadExecutor-4180-thread-1) [    x:collection1] o.a.s.h.ReplicationHandler Commits will be reserved for  10000
   [junit4]   2> 1279240 INFO  (searcherExecutor-4181-thread-1-processing-x:collection1) [    x:collection1] o.a.s.h.c.SpellCheckComponent Loading spell index for spellchecker: default
   [junit4]   2> 1279240 INFO  (searcherExecutor-4181-thread-1-processing-x:collection1) [    x:collection1] o.a.s.h.c.SpellCheckComponent Loading spell index for spellchecker: direct
   [junit4]   2> 1279240 INFO  (searcherExecutor-4181-thread-1-processing-x:collection1) [    x:collection1] o.a.s.h.c.SpellCheckComponent Loading spell index for spellchecker: wordbreak
   [junit4]   2> 1279240 INFO  (coreLoadExecutor-4180-thread-1) [    x:collection1] o.a.s.u.UpdateLog Looking up max value of version field to seed version buckets
   [junit4]   2> 1279240 INFO  (searcherExecutor-4181-thread-1-processing-x:collection1) [    x:collection1] o.a.s.h.c.SpellCheckComponent Loading spell index for spellchecker: multipleFields
   [junit4]   2> 1279240 INFO  (coreLoadExecutor-4180-thread-1) [    x:collection1] o.a.s.u.VersionInfo Refreshing highest value of _version_ for 65536 version buckets from index
   [junit4]   2> 1279241 INFO  (coreLoadExecutor-4180-thread-1) [    x:collection1] o.a.s.u.VersionInfo No terms found for _version_, cannot seed version bucket highest value from index
   [junit4]   2> 1279241 INFO  (coreLoadExecutor-4180-thread-1) [    x:collection1] o.a.s.u.UpdateLog Could not find max version in index or recent updates, using new clock 1526177962962976768
   [junit4]   2> 1279241 INFO  (searcherExecutor-4181-thread-1-processing-x:collection1) [    x:collection1] o.a.s.h.c.SpellCheckComponent Loading spell index for spellchecker: jarowinkler
   [junit4]   2> 1279241 INFO  (searcherExecutor-4181-thread-1-processing-x:collection1) [    x:collection1] o.a.s.h.c.SpellCheckComponent Loading spell index for spellchecker: external
   [junit4]   2> 1279241 INFO  (searcherExecutor-4181-thread-1-processing-x:collection1) [    x:collection1] o.a.s.h.c.SpellCheckComponent Loading spell index for spellchecker: freq
   [junit4]   2> 1279241 INFO  (searcherExecutor-4181-thread-1-processing-x:collection1) [    x:collection1] o.a.s.h.c.SpellCheckComponent Loading spell index for spellchecker: fqcn
   [junit4]   2> 1279241 INFO  (searcherExecutor-4181-thread-1-processing-x:collection1) [    x:collection1] o.a.s.h.c.SpellCheckComponent Loading spell index for spellchecker: perDict
   [junit4]   2> 1279241 INFO  (searcherExecutor-4181-thread-1-processing-x:collection1) [    x:collection1] o.a.s.c.SolrCore [collection1] Registered new searcher Searcher@51a5462a[collection1] main{ExitableDirectoryReader(UninvertingDirectoryReader())}
   [junit4]   2> 1279242 INFO  (coreLoadExecutor-4180-thread-1) [    x:collection1] o.a.s.u.UpdateLog Took 1.0ms to seed version buckets with highest version 1526177962962976768
   [junit4]   2> 1279242 INFO  (coreLoadExecutor-4180-thread-1) [    x:collection1] o.a.s.c.CoreContainer registering core: collection1
   [junit4]   2> 1279243 INFO  (SUITE-PingRequestHandlerTest-seed#[2AE4E4E82A810B53]-worker) [    ] o.a.s.SolrTestCaseJ4 ####initCore end
   [junit4]   2> 1279246 INFO  (TEST-PingRequestHandlerTest.testBadActionRaisesException-seed#[2AE4E4E82A810B53]) [    ] o.a.s.SolrTestCaseJ4 ###Starting testBadActionRaisesException
   [junit4]   2> 1279247 INFO  (TEST-PingRequestHandlerTest.testBadActionRaisesException-seed#[2AE4E4E82A810B53]) [    ] o.a.s.SolrTestCaseJ4 ###Ending testBadActionRaisesException
   [junit4]   2> 1279248 INFO  (TEST-PingRequestHandlerTest.testPingWithNoHealthCheck-seed#[2AE4E4E82A810B53]) [    ] o.a.s.SolrTestCaseJ4 ###Starting testPingWithNoHealthCheck
   [junit4]   2> 1279249 INFO  (TEST-PingRequestHandlerTest.testPingWithNoHealthCheck-seed#[2AE4E4E82A810B53]) [    ] o.a.s.c.S.Request [collection1]  webapp=null path=null params={wt=xml} hits=0 status=0 QTime=1
   [junit4]   2> 1279250 INFO  (TEST-PingRequestHandlerTest.testPingWithNoHealthCheck-seed#[2AE4E4E82A810B53]) [    ] o.a.s.c.S.Request [collection1]  webapp=null path=null params={action=ping&wt=xml} hits=0 status=0 QTime=0
   [junit4]   2> 1279250 INFO  (TEST-PingRequestHandlerTest.testPingWithNoHealthCheck-seed#[2AE4E4E82A810B53]) [    ] o.a.s.SolrTestCaseJ4 ###Ending testPingWithNoHealthCheck
   [junit4]   2> 1279251 INFO  (TEST-PingRequestHandlerTest.testPingInClusterWithNoHealthCheck-seed#[2AE4E4E82A810B53]) [    ] o.a.s.SolrTestCaseJ4 ###Starting testPingInClusterWithNoHealthCheck
   [junit4]   2> 1279251 INFO  (TEST-PingRequestHandlerTest.testPingInClusterWithNoHealthCheck-seed#[2AE4E4E82A810B53]) [    ] o.a.s.c.ZkTestServer STARTING ZK TEST SERVER
   [junit4]   2> 1279252 INFO  (Thread-3705) [    ] o.a.s.c.ZkTestServer client port:0.0.0.0/0.0.0.0:0
   [junit4]   2> 1279252 INFO  (Thread-3705) [    ] o.a.s.c.ZkTestServer Starting server
   [junit4]   2> 1279352 INFO  (TEST-PingRequestHandlerTest.testPingInClusterWithNoHealthCheck-seed#[2AE4E4E82A810B53]) [    ] o.a.s.c.ZkTestServer start zk server on port:51610
   [junit4]   2> 1279352 INFO  (TEST-PingRequestHandlerTest.testPingInClusterWithNoHealthCheck-seed#[2AE4E4E82A810B53]) [    ] o.a.s.c.c.SolrZkClient Using default ZkCredentialsProvider
   [junit4]   2> 1279352 INFO  (TEST-PingRequestHandlerTest.testPingInClusterWithNoHealthCheck-seed#[2AE4E4E82A810B53]) [    ] o.a.s.c.c.ConnectionManager Waiting for client to connect to ZooKeeper
   [junit4]   2> 1279355 INFO  (zkCallback-1301-thread-1) [    ] o.a.s.c.c.ConnectionManager Watcher org.apache.solr.common.cloud.ConnectionManager@37d816e0 name:ZooKeeperConnection Watcher:127.0.0.1:51610 got event WatchedEvent state:SyncConnected type:None path:null path:null type:None
   [junit4]   2> 1279355 INFO  (TEST-PingRequestHandlerTest.testPingInClusterWithNoHealthCheck-seed#[2AE4E4E82A810B53]) [    ] o.a.s.c.c.ConnectionManager Client is connected to ZooKeeper
   [junit4]   2> 1279355 INFO  (TEST-PingRequestHandlerTest.testPingInClusterWithNoHealthCheck-seed#[2AE4E4E82A810B53]) [    ] o.a.s.c.c.SolrZkClient Using default ZkACLProvider
   [junit4]   2> 1279355 INFO  (TEST-PingRequestHandlerTest.testPingInClusterWithNoHealthCheck-seed#[2AE4E4E82A810B53]) [    ] o.a.s.c.c.SolrZkClient makePath: /solr/solr.xml
   [junit4]   2> 1279370 INFO  (jetty-launcher-1300-thread-5) [    ] o.e.j.s.Server jetty-9.2.13.v20150730
   [junit4]   2> 1279370 INFO  (jetty-launcher-1300-thread-1) [    ] o.e.j.s.Server jetty-9.2.13.v20150730
   [junit4]   2> 1279370 INFO  (jetty-launcher-1300-thread-2) [    ] o.e.j.s.Server jetty-9.2.13.v20150730
   [junit4]   2> 1279370 INFO  (jetty-launcher-1300-thread-3) [    ] o.e.j.s.Server jetty-9.2.13.v20150730
   [junit4]   2> 1279370 INFO  (jetty-launcher-1300-thread-4) [    ] o.e.j.s.Server jetty-9.2.13.v20150730
   [junit4]   2> 1279372 INFO  (jetty-launcher-1300-thread-3) [    ] o.e.j.s.h.ContextHandler Started o.e.j.s.ServletContextHandler@2a6ef43{/solr,null,AVAILABLE}
   [junit4]   2> 1279372 INFO  (jetty-launcher-1300-thread-5) [    ] o.e.j.s.h.ContextHandler Started o.e.j.s.ServletContextHandler@141d791e{/solr,null,AVAILABLE}
   [junit4]   2> 1279372 INFO  (jetty-launcher-1300-thread-1) [    ] o.e.j.s.h.ContextHandler Started o.e.j.s.ServletContextHandler@48057cbf{/solr,null,AVAILABLE}
   [junit4]   2> 1279372 INFO  (jetty-launcher-1300-thread-4) [    ] o.e.j.s.h.ContextHandler Started o.e.j.s.ServletContextHandler@2e85cfaa{/solr,null,AVAILABLE}
   [junit4]   2> 1279375 INFO  (jetty-launcher-1300-thread-5) [    ] o.e.j.s.ServerConnector Started ServerConnector@53fadd44{HTTP/1.1}{127.0.0.1:49110}
   [junit4]   2> 1279375 INFO  (jetty-launcher-1300-thread-3) [    ] o.e.j.s.ServerConnector Started ServerConnector@4826ff9d{HTTP/1.1}{127.0.0.1:51035}
   [junit4]   2> 1279375 INFO  (jetty-launcher-1300-thread-2) [    ] o.e.j.s.h.ContextHandler Started o.e.j.s.ServletContextHandler@2f8e4068{/solr,null,AVAILABLE}
   [junit4]   2> 1279375 INFO  (jetty-launcher-1300-thread-3) [    ] o.e.j.s.Server Started @1280801ms
   [junit4]   2> 1279375 INFO  (jetty-launcher-1300-thread-5) [    ] o.e.j.s.Server Started @1280801ms
   [junit4]   2> 1279375 INFO  (jetty-launcher-1300-thread-3) [    ] o.a.s.c.s.e.JettySolrRunner Jetty properties: {hostContext=/solr, hostPort=51035}
   [junit4]   2> 1279375 INFO  (jetty-launcher-1300-thread-5) [    ] o.a.s.c.s.e.JettySolrRunner Jetty properties: {hostContext=/solr, hostPort=49110}
   [junit4]   2> 1279375 INFO  (jetty-launcher-1300-thread-4) [    ] o.e.j.s.ServerConnector Started ServerConnector@5b6b565c{HTTP/1.1}{127.0.0.1:47332}
   [junit4]   2> 1279375 INFO  (jetty-launcher-1300-thread-4) [    ] o.e.j.s.Server Started @1280801ms
   [junit4]   2> 1279375 INFO  (jetty-launcher-1300-thread-3) [    ] o.a.s.s.SolrDispatchFilter SolrDispatchFilter.init(): sun.misc.Launcher$AppClassLoader@73d16e93
   [junit4]   2> 1279375 INFO  (jetty-launcher-1300-thread-5) [    ] o.a.s.s.SolrDispatchFilter SolrDispatchFilter.init(): sun.misc.Launcher$AppClassLoader@73d16e93
   [junit4]   2> 1279375 INFO  (jetty-launcher-1300-thread-3) [    ] o.a.s.c.SolrResourceLoader new SolrResourceLoader for directory: '/home/jenkins/workspace/Lucene-Solr-trunk-Linux/solr/build/solr-core/test/J2/temp/solr.handler.PingRequestHandlerTest_2AE4E4E82A810B53-001/tempDir-001/node3'
   [junit4]   2> 1279375 INFO  (jetty-launcher-1300-thread-5) [    ] o.a.s.c.SolrResourceLoader new SolrResourceLoader for directory: '/home/jenkins/workspace/Lucene-Solr-trunk-Linux/solr/build/solr-core/test/J2/temp/solr.handler.PingRequestHandlerTest_2AE4E4E82A810B53-001/tempDir-001/node4'
   [junit4]   2> 1279375 INFO  (jetty-launcher-1300-thread-1) [    ] o.e.j.s.ServerConnector Started ServerConnector@f3d9ac6{HTTP/1.1}{127.0.0.1:54957}
   [junit4]   2> 1279375 INFO  (jetty-launcher-1300-thread-3) [    ] o.a.s.c.SolrResourceLoader JNDI not configured for solr (NoInitialContextEx)
   [junit4]   2> 1279375 INFO  (jetty-launcher-1300-thread-4) [    ] o.a.s.c.s.e.JettySolrRunner Jetty properties: {hostContext=/solr, hostPort=47332}
   [junit4]   2> 1279375 INFO  (jetty-launcher-1300-thread-3) [    ] o.a.s.c.SolrResourceLoader using system property solr.solr.home: /home/jenkins/workspace/Lucene-Solr-trunk-Linux/solr/core/src/test-files/solr
   [junit4]   2> 1279375 INFO  (jetty-launcher-1300-thread-1) [    ] o.e.j.s.Server Started @1280801ms
   [junit4]   2> 1279375 INFO  (jetty-launcher-1300-thread-5) [    ] o.a.s.c.SolrResourceLoader JNDI not configured for solr (NoInitialContextEx)
   [junit4]   2> 1279375 INFO  (jetty-launcher-1300-thread-2) [    ] o.e.j.s.ServerConnector Started ServerConnector@23d93815{HTTP/1.1}{127.0.0.1:42083}
   [junit4]   2> 1279376 INFO  (jetty-launcher-1300-thread-4) [    ] o.a.s.s.SolrDispatchFilter SolrDispatchFilter.init(): sun.misc.Launcher$AppClassLoader@73d16e93
   [junit4]   2> 1279376 INFO  (jetty-launcher-1300-thread-2) [    ] o.e.j.s.Server Started @1280801ms
   [junit4]   2> 1279376 INFO  (jetty-launcher-1300-thread-3) [    ] o.a.s.c.c.SolrZkClient Using default ZkCredentialsProvider
   [junit4]   2> 1279376 INFO  (jetty-launcher-1300-thread-5) [    ] o.a.s.c.SolrResourceLoader using system property solr.solr.home: /home/jenkins/workspace/Lucene-Solr-trunk-Linux/solr/core/src/test-files/solr
   [junit4]   2> 1279376 INFO  (jetty-launcher-1300-thread-1) [    ] o.a.s.c.s.e.JettySolrRunner Jetty properties: {hostContext=/solr, hostPort=54957}
   [junit4]   2> 1279376 INFO  (jetty-launcher-1300-thread-2) [    ] o.a.s.c.s.e.JettySolrRunner Jetty properties: {hostContext=/solr, hostPort=42083}
   [junit4]   2> 1279376 INFO  (jetty-launcher-1300-thread-4) [    ] o.a.s.c.SolrResourceLoader new SolrResourceLoader for directory: '/home/jenkins/workspace/Lucene-Solr-trunk-Linux/solr/build/solr-core/test/J2/temp/solr.handler.PingRequestHandlerTest_2AE4E4E82A810B53-001/tempDir-001/node5'
   [junit4]   2> 1279376 INFO  (jetty-launcher-1300-thread-5) [    ] o.a.s.c.c.SolrZkClient Using default ZkCredentialsProvider
   [junit4]   2> 1279376 INFO  (jetty-launcher-1300-thread-1) [    ] o.a.s.s.SolrDispatchFilter SolrDispatchFilter.init(): sun.misc.Launcher$AppClassLoader@73d16e93
   [junit4]   2> 1279376 INFO  (jetty-launcher-1300-thread-4) [    ] o.a.s.c.SolrResourceLoader JNDI not configured for solr (NoInitialContextEx)
   [junit4]   2> 1279376 INFO  (jetty-launcher-1300-thread-1) [    ] o.a.s.c.SolrResourceLoader new SolrResourceLoader for directory: '/home/jenkins/workspace/Lucene-Solr-trunk-Linux/solr/build/solr-core/test/J2/temp/solr.handler.PingRequestHandlerTest_2AE4E4E82A810B53-001/tempDir-001/node1'
   [junit4]   2> 1279376 INFO  (jetty-launcher-1300-thread-4) [    ] o.a.s.c.SolrResourceLoader using system property solr.solr.home: /home/jenkins/workspace/Lucene-Solr-trunk-Linux/solr/core/src/test-files/solr
   [junit4]   2> 1279376 INFO  (jetty-launcher-1300-thread-1) [    ] o.a.s.c.SolrResourceLoader JNDI not configured for solr (NoInitialContextEx)
   [junit4]   2> 1279376 INFO  (jetty-launcher-1300-thread-2) [    ] o.a.s.s.SolrDispatchFilter SolrDispatchFilter.init(): sun.misc.Launcher$AppClassLoader@73d16e93
   [junit4]   2> 1279376 INFO  (jetty-launcher-1300-thread-1) [    ] o.a.s.c.SolrResourceLoader using system property solr.solr.home: /home/jenkins/workspace/Lucene-Solr-trunk-Linux/solr/core/src/test-files/solr
   [junit4]   2> 1279376 INFO  (jetty-launcher-1300-thread-2) [    ] o.a.s.c.SolrResourceLoader new SolrResourceLoader for directory: '/home/jenkins/workspace/Lucene-Solr-trunk-Linux/solr/build/solr-core/test/J2/temp/solr.handler.PingRequestHandlerTest_2AE4E4E82A810B53-001/tempDir-001/node2'
   [junit4]   2> 1279376 INFO  (jetty-launcher-1300-thread-4) [    ] o.a.s.c.c.SolrZkClient Using default ZkCredentialsProvider
   [junit4]   2> 1279376 INFO  (jetty-launcher-1300-thread-1) [    ] o.a.s.c.c.SolrZkClient Using default ZkCredentialsProvider
   [junit4]   2> 1279377 INFO  (jetty-launcher-1300-thread-2) [    ] o.a.s.c.SolrResourceLoader JNDI not configured for solr (NoInitialContextEx)
   [junit4]   2> 1279377 INFO  (jetty-launcher-1300-thread-2) [    ] o.a.s.c.SolrResourceLoader using system property solr.solr.home: /home/jenkins/workspace/Lucene-Solr-trunk-Linux/solr/core/src/test-files/solr
   [junit4]   2> 1279377 INFO  (jetty-launcher-1300-thread-2) [    ] o.a.s.c.c.SolrZkClient Using default ZkCredentialsProvider
   [junit4]   2> 1279389 INFO  (jetty-launcher-1300-thread-3) [    ] o.a.s.c.c.ConnectionManager Waiting for client to connect to ZooKeeper
   [junit4]   2> 1279389 INFO  (jetty-launcher-1300-thread-2) [    ] o.a.s.c.c.ConnectionManager Waiting for client to connect to ZooKeeper
   [junit4]   2> 1279389 INFO  (jetty-launcher-1300-thread-5) [    ] o.a.s.c.c.ConnectionManager Waiting for client to connect to ZooKeeper
   [junit4]   2> 1279390 INFO  (jetty-launcher-1300-thread-4) [    ] o.a.s.c.c.ConnectionManager Waiting for client to connect to ZooKeeper
   [junit4]   2> 1279390 INFO  (jetty-launcher-1300-thread-1) [    ] o.a.s.c.c.ConnectionManager Waiting for client to connect to ZooKeeper
   [junit4]   2> 1279391 INFO  (zkCallback-1306-thread-1) [    ] o.a.s.c.c.ConnectionManager Watcher org.apache.solr.common.cloud.ConnectionManager@22f2e003 name:ZooKeeperConnection Watcher:127.0.0.1:51610/solr got event WatchedEvent state:SyncConnected type:None path:null path:null type:None
   [junit4]   2> 1279391 INFO  (zkCallback-1303-thread-1) [    ] o.a.s.c.c.ConnectionManager Watcher org.apache.solr.common.cloud.ConnectionManager@4b4de20a name:ZooKeeperConnection Watcher:127.0.0.1:51610/solr got event WatchedEvent state:SyncConnected type:None path:null path:null type:None
   [junit4]   2> 1279391 INFO  (zkCallback-1305-thread-1) [    ] o.a.s.c.c.ConnectionManager Watcher org.apache.solr.common.cloud.ConnectionManager@fe87c78 name:ZooKeeperConnection Watcher:127.0.0.1:51610/solr got event WatchedEvent state:SyncConnected type:None path:null path:null type:None
   [junit4]   2> 1279391 INFO  (zkCallback-1304-thread-1) [    ] o.a.s.c.c.ConnectionManager Watcher org.apache.solr.common.cloud.ConnectionManager@55092a9 name:ZooKeeperConnection Watcher:127.0.0.1:51610/solr got event WatchedEvent state:SyncConnected type:None path:null path:null type:None
   [junit4]   2> 1279391 INFO  (jetty-launcher-1300-thread-1) [    ] o.a.s.c.c.ConnectionManager Client is connected to ZooKeeper
   [junit4]   2> 1279391 INFO  (jetty-launcher-1300-thread-5) [    ] o.a.s.c.c.ConnectionManager Client is connected to ZooKeeper
   [junit4]   2> 1279391 INFO  (jetty-launcher-1300-thread-5) [    ] o.a.s.c.c.SolrZkClient Using default ZkACLProvider
   [junit4]   2> 1279391 INFO  (jetty-launcher-1300-thread-1) [    ] o.a.s.c.c.SolrZkClient Using default ZkACLProvider
   [junit4]   2> 1279391 INFO  (jetty-launcher-1300-thread-2) [    ] o.a.s.c.c.ConnectionManager Client is connected to ZooKeeper
   [junit4]   2> 1279391 INFO  (jetty-launcher-1300-thread-4) [    ] o.a.s.c.c.ConnectionManager Client is connected to ZooKeeper
   [junit4]   2> 1279391 INFO  (jetty-launcher-1300-thread-2) [    ] o.a.s.c.c.SolrZkClient Using default ZkACLProvider
   [junit4]   2> 1279391 INFO  (jetty-launcher-1300-thread-4) [    ] o.a.s.c.c.SolrZkClient Using default ZkACLProvider
   [junit4]   2> 1279391 INFO  (jetty-launcher-1300-thread-2) [    ] o.a.s.s.SolrDispatchFilter solr.xml found in ZooKeeper. Loading...
   [junit4]   2> 1279392 INFO  (jetty-launcher-1300-thread-5) [    ] o.a.s.s.SolrDispatchFilter solr.xml found in ZooKeeper. Loading...
   [junit4]   2> 1279392 INFO  (jetty-launcher-1300-thread-4) [    ] o.a.s.s.SolrDispatchFilter solr.xml found in ZooKeeper. Loading...
   [junit4]   2> 1279392 INFO  (jetty-launcher-1300-thread-1) [    ] o.a.s.s.SolrDispatchFilter solr.xml found in ZooKeeper. Loading...
   [junit4]   2> 1279397 INFO  (jetty-launcher-1300-thread-4) [    ] o.a.s.c.CorePropertiesLocator Config-defined core root directory: /home/jenkins/workspace/Lucene-Solr-trunk-Linux/solr/build/solr-core/test/J2/temp/solr.handler.PingRequestHandlerTest_2AE4E4E82A810B53-001/tempDir-001/node5/.
   [junit4]   2> 1279398 INFO  (jetty-launcher-1300-thread-4) [    ] o.a.s.c.CoreContainer New CoreContainer 1495099081
   [junit4]   2> 1279398 INFO  (jetty-launcher-1300-thread-4) [    ] o.a.s.c.CoreContainer Loading cores into CoreContainer [instanceDir=/home/jenkins/workspace/Lucene-Solr-trunk-Linux/solr/build/solr-core/test/J2/temp/solr.handler.PingRequestHandlerTest_2AE4E4E82A810B53-001/tempDir-001/node5]
   [junit4]   2> 1279398 WARN  (jetty-launcher-1300-thread-4) [    ] o.a.s.c.CoreContainer Couldn't add files from /home/jenkins/workspace/Lucene-Solr-trunk-Linux/solr/build/solr-core/test/J2/temp/solr.handler.PingRequestHandlerTest_2AE4E4E82A810B53-001/tempDir-001/node5/lib to classpath: /home/jenkins/workspace/Lucene-Solr-trunk-Linux/solr/build/solr-core/test/J2/temp/solr.handler.PingRequestHandlerTest_2AE4E4E82A810B53-001/tempDir-001/node5/lib
   [junit4]   2> 1279399 INFO  (jetty-launcher-1300-thread-4) [    ] o.a.s.h.c.HttpShardHandlerFactory created with socketTimeout : 90000,urlScheme : ,connTimeout : 15000,maxConnectionsPerHost : 20,maxConnections : 10000,corePoolSize : 0,maximumPoolSize : 2147483647,maxThreadIdleTime : 5,sizeOfQueue : -1,fairnessPolicy : false,useRetries : false,
   [junit4]   2> 1279399 INFO  (jetty-launcher-1300-thread-2) [    ] o.a.s.c.CorePropertiesLocator Config-defined core root directory: /home/jenkins/workspace/Lucene-Solr-trunk-Linux/solr/build/solr-core/test/J2/temp/solr.handler.PingRequestHandlerTest_2AE4E4E82A810B53-001/tempDir-001/node2/.
   [junit4]   2> 1279399 INFO  (jetty-launcher-1300-thread-2) [    ] o.a.s.c.CoreContainer New CoreContainer 581964180
   [junit4]   2> 1279399 INFO  (jetty-launcher-1300-thread-2) [    ] o.a.s.c.CoreContainer Loading cores into CoreContainer [instanceDir=/home/jenkins/workspace/Lucene-Solr-trunk-Linux/solr/build/solr-core/test/J2/temp/solr.handler.PingRequestHandlerTest_2AE4E4E82A810B53-001/tempDir-001/node2]
   [junit4]   2> 1279399 WARN  (jetty-launcher-1300-thread-2) [    ] o.a.s.c.CoreContainer Couldn't add files from /home/jenkins/workspace/Lucene-Solr-trunk-Linux/solr/build/solr-core/test/J2/temp/solr.handler.PingRequestHandlerTest_2AE4E4E82A810B53-001/tempDir-001/node2/lib to classpath: /home/jenkins/workspace/Lucene-Solr-trunk-Linux/solr/build/solr-core/test/J2/temp/solr.handler.PingRequestHandlerTest_2AE4E4E82A810B53-001/tempDir-001/node2/lib
   [junit4]   2> 1279399 INFO  (jetty-launcher-1300-thread-4) [    ] o.a.s.u.UpdateShardHandler Creating UpdateShardHandler HTTP client with params: socketTimeout=340000&connTimeout=45000&retry=true
   [junit4]   2> 1279400 INFO  (jetty-launcher-1300-thread-2) [    ] o.a.s.h.c.HttpShardHandlerFactory created with socketTimeout : 90000,urlScheme : ,connTimeout : 15000,maxConnectionsPerHost : 20,maxConnections : 10000,corePoolSize : 0,maximumPoolSize : 2147483647,maxThreadIdleTime : 5,sizeOfQueue : -1,fairnessPolicy : false,useRetries : false,
   [junit4]   2> 1279400 INFO  (jetty-launcher-1300-thread-2) [    ] o.a.s.u.UpdateShardHandler Creating UpdateShardHandler HTTP client with params: socketTimeout=340000&connTimeout=45000&retry=true
   [junit4]   2> 1279400 INFO  (jetty-launcher-1300-thread-4) [    ] o.a.s.l.LogWatcher SLF4J impl is org.slf4j.impl.Log4jLoggerFactory
   [junit4]   2> 1279400 INFO  (jetty-launcher-1300-thread-2) [    ] o.a.s.l.LogWatcher SLF4J impl is org.slf4j.impl.Log4jLoggerFactory
   [junit4]   2> 1279400 INFO  (jetty-launcher-1300-thread-4) [    ] o.a.s.l.LogWatcher Registering Log Listener [Log4j (org.slf4j.impl.Log4jLoggerFactory)]
   [junit4]   2> 1279400 INFO  (jetty-launcher-1300-thread-2) [    ] o.a.s.l.LogWatcher Registering Log Listener [Log4j (org.slf4j.impl.Log4jLoggerFactory)]
   [junit4]   2> 1279400 INFO  (jetty-launcher-1300-thread-1) [    ] o.a.s.c.CorePropertiesLocator Config-defined core root directory: /home/jenkins/workspace/Lucene-Solr-trunk-Linux/solr/build/solr-core/test/J2/temp/solr.handler.PingRequestHandlerTest_2AE4E4E82A810B53-001/tempDir-001/node1/.
   [junit4]   2> 1279400 INFO  (jetty-launcher-1300-thread-2) [    ] o.a.s.c.ZkContainer Zookeeper client=127.0.0.1:51610/solr
   [junit4]   2> 1279400 INFO  (jetty-launcher-1300-thread-1) [    ] o.a.s.c.CoreContainer New CoreContainer 536206052
   [junit4]   2> 1279400 INFO  (jetty-launcher-1300-thread-2) [    ] o.a.s.c.ZkController zkHost includes chroot
   [junit4]   2> 1279400 INFO  (jetty-launcher-1300-thread-1) [    ] o.a.s.c.CoreContainer Loading cores into CoreContainer [instanceDir=/home/jenkins/workspace/Lucene-Solr-trunk-Linux/solr/build/solr-core/test/J2/temp/solr.handler.PingRequestHandlerTest_2AE4E4E82A810B53-001/tempDir-001/node1]
   [junit4]   2> 1279401 INFO  (jetty-launcher-1300-thread-2) [    ] o.a.s.c.c.SolrZkClient Using default ZkCredentialsProvider
   [junit4]   2> 1279400 INFO  (jetty-launcher-1300-thread-4) [    ] o.a.s.c.ZkContainer Zookeeper client=127.0.0.1:51610/solr
   [junit4]   2> 1279401 WARN  (jetty-launcher-1300-thread-1) [    ] o.a.s.c.CoreContainer Couldn't add files from /home/jenkins/workspace/Lucene-Solr-trunk-Linux/solr/build/solr-core/test/J2/temp/solr.handler.PingRequestHandlerTest_2AE4E4E82A810B53-001/tempDir-001/node1/lib to classpath: /home/jenkins/workspace/Lucene-Solr-trunk-Linux/solr/build/solr-core/test/J2/temp/solr.handler.PingRequestHandlerTest_2AE4E4E82A810B53-001/tempDir-001/node1/lib
   [junit4]   2> 1279401 INFO  (jetty-launcher-1300-thread-4) [    ] o.a.s.c.ZkController zkHost includes chroot
   [junit4]   2> 1279401 INFO  (jetty-launcher-1300-thread-5) [    ] o.a.s.c.CorePropertiesLocator Config-defined core root directory: /home/jenkins/workspace/Lucene-Solr-trunk-Linux/solr/build/solr-core/test/J2/temp/solr.handler.PingRequestHandlerTest_2AE4E4E82A810B53-001/tempDir-001/node4/.
   [junit4]   2> 1279401 INFO  (jetty-launcher-1300-thread-1) [    ] o.a.s.h.c.HttpShardHandlerFactory created with socketTimeout : 90000,urlScheme : ,connTimeout : 15000,maxConnectionsPerHost : 20,maxConnections : 10000,corePoolSize : 0,maximumPoolSize : 2147483647,maxThreadIdleTime : 5,sizeOfQueue : -1,fairnessPolicy : false,useRetries : false,
   [junit4]   2> 1279401 INFO  (jetty-launcher-1300-thread-5) [    ] o.a.s.c.CoreContainer New CoreContainer 2123664267
   [junit4]   2> 1279401 INFO  (jetty-launcher-1300-thread-4) [    ] o.a.s.c.c.SolrZkClient Using default ZkCredentialsProvider
   [junit4]   2> 1279401 INFO  (jetty-launcher-1300-thread-5) [    ] o.a.s.c.CoreContainer Loading cores into CoreContainer [instanceDir=/home/jenkins/workspace/Lucene-Solr-trunk-Linux/solr/build/solr-core/test/J2/temp/solr.handler.PingRequestHandlerTest_2AE4E4E82A810B53-001/tempDir-001/node4]
   [junit4]   2> 1279402 WARN  (jetty-launcher-1300-thread-5) [    ] o.a.s.c.CoreContainer Couldn't add files from /home/jenkins/workspace/Lucene-Solr-trunk-Linux/solr/build/solr-core/test/J2/temp/solr.handler.PingRequestHandlerTest_2AE4E4E82A810B53-001/tempDir-001/node4/lib to classpath: /home/jenkins/workspace/Lucene-Solr-trunk-Linux/solr/build/solr-core/test/J2/temp/solr.handler.PingRequestHandlerTest_2AE4E4E82A810B53-001/tempDir-001/node4/lib
   [junit4]   2> 1279402 INFO  (jetty-launcher-1300-thread-1) [    ] o.a.s.u.UpdateShardHandler Creating UpdateShardHandler HTTP client with params: socketTimeout=340000&connTimeout=45000&retry=true
   [junit4]   2> 1279402 INFO  (jetty-launcher-1300-thread-5) [    ] o.a.s.h.c.HttpShardHandlerFactory created with socketTimeout : 90000,urlScheme : ,connTimeout : 15000,maxConnectionsPerHost : 20,maxConnections : 10000,corePoolSize : 0,maximumPoolSize : 2147483647,maxThreadIdleTime : 5,sizeOfQueue : -1,fairnessPolicy : false,useRetries : false,
   [junit4]   2> 1279402 INFO  (jetty-launcher-1300-thread-1) [    ] o.a.s.l.LogWatcher SLF4J impl is org.slf4j.impl.Log4jLoggerFactory
   [junit4]   2> 1279402 INFO  (jetty-launcher-1300-thread-1) [    ] o.a.s.l.LogWatcher Registering Log Listener [Log4j (org.slf4j.impl.Log4jLoggerFactory)]
   [junit4]   2> 1279402 INFO  (jetty-launcher-1300-thread-1) [    ] o.a.s.c.ZkContainer Zookeeper client=127.0.0.1:51610/solr
   [junit4]   2> 1279402 INFO  (jetty-launcher-1300-thread-1) [    ] o.a.s.c.ZkController zkHost includes chroot
   [junit4]   2> 1279402 INFO  (jetty-launcher-1300-thread-1) [    ] o.a.s.c.c.SolrZkClient Using default ZkCredentialsProvider
   [junit4]   2> 1279402 INFO  (jetty-launcher-1300-thread-5) [    ] o.a.s.u.UpdateShardHandler Creating UpdateShardHandler HTTP client with params: socketTimeout=340000&connTimeout=45000&retry=true
   [junit4]   2> 1279403 INFO  (jetty-launcher-1300-thread-5) [    ] o.a.s.l.LogWatcher SLF4J impl is org.slf4j.impl.Log4jLoggerFactory
   [junit4]   2> 1279403 INFO  (jetty-launcher-1300-thread-5) [    ] o.a.s.l.LogWatcher Registering Log Listener [Log4j (org.slf4j.impl.Log4jLoggerFactory)]
   [junit4]   2> 1279403 INFO  (jetty-launcher-1300-thread-5) [    ] o.a.s.c.ZkContainer Zookeeper client=127.0.0.1:51610/solr
   [junit4]   2> 1279403 INFO  (jetty-launcher-1300-thread-5) [    ] o.a.s.c.ZkController zkHost includes chroot
   [junit4]   2> 1279403 INFO  (jetty-launcher-1300-thread-5) [    ] o.a.s.c.c.SolrZkClient Using default ZkCredentialsProvider
   [junit4]   2> 1279403 INFO  (zkCallback-1302-thread-1) [    ] o.a.s.c.c.ConnectionManager Watcher org.apache.solr.common.cloud.ConnectionManager@1fafb45c name:ZooKeeperConnection Watcher:127.0.0.1:51610/solr got event WatchedEvent state:SyncConnected type:None path:null path:null type:None
   [junit4]   2> 1279403 INFO  (jetty-launcher-1300-thread-3) [    ] o.a.s.c.c.ConnectionManager Client is connected to ZooKeeper
   [junit4]   2> 1279403 INFO  (jetty-launcher-1300-thread-2) [    ] o.a.s.c.c.ConnectionManager Waiting for client to connect to ZooKeeper
   [junit4]   2> 1279403 INFO  (jetty-launcher-1300-thread-3) [    ] o.a.s.c.c.SolrZkClient Using default ZkACLProvider
   [junit4]   2> 1279403 INFO  (jetty-launcher-1300-thread-5) [    ] o.a.s.c.c.ConnectionManager Waiting for client to connect to ZooKeeper
   [junit4]   2> 1279404 INFO  (jetty-launcher-1300-thread-4) [    ] o.a.s.c.c.ConnectionManager Waiting for client to connect to ZooKeeper
   [junit4]   2> 1279404 INFO  (jetty-launcher-1300-thread-3) [    ] o.a.s.s.SolrDispatchFilter solr.xml found in ZooKeeper. Loading...
   [junit4]   2> 1279404 INFO  (jetty-launcher-1300-thread-1) [    ] o.a.s.c.c.ConnectionManager Waiting for client to connect to ZooKeeper
   [junit4]   2> 1279413 INFO  (zkCallback-1311-thread-1) [    ] o.a.s.c.c.ConnectionManager Watcher org.apache.solr.common.cloud.ConnectionManager@48162786 name:ZooKeeperConnection Watcher:127.0.0.1:51610 got event WatchedEvent state:SyncConnected type:None path:null path:null type:None
   [junit4]   2> 1279414 INFO  (zkCallback-1312-thread-1) [    ] o.a.s.c.c.ConnectionManager Watcher org.apache.solr.common.cloud.ConnectionManager@1bb0c4fe name:ZooKeeperConnection Watcher:127.0.0.1:51610 got event WatchedEvent state:SyncConnected type:None path:null path:null type:None
   [junit4]   2> 1279414 INFO  (jetty-launcher-1300-thread-4) [    ] o.a.s.c.c.ConnectionManager Client is connected to ZooKeeper
   [junit4]   2> 1279414 INFO  (jetty-launcher-1300-thread-4) [    ] o.a.s.c.c.SolrZkClient Using default ZkACLProvider
   [junit4]   2> 1279414 INFO  (jetty-launcher-1300-thread-2) [    ] o.a.s.c.c.ConnectionManager Client is connected to ZooKeeper
   [junit4]   2> 1279415 INFO  (jetty-launcher-1300-thread-2) [    ] o.a.s.c.c.SolrZkClient Using default ZkACLProvider
   [junit4]   2> 1279415 INFO  (zkCallback-1315-thread-1) [    ] o.a.s.c.c.ConnectionManager Watcher org.apache.solr.common.cloud.ConnectionManager@2f41d285 name:ZooKeeperConnection Watcher:127.0.0.1:51610 got event WatchedEvent state:SyncConnected type:None path:null path:null type:None
   [junit4]   2> 1279415 INFO  (jetty-launcher-1300-thread-1) [    ] o.a.s.c.c.ConnectionManager Client is connected to ZooKeeper
   [junit4]   2> 1279415 INFO  (jetty-launcher-1300-thread-1) [    ] o.a.s.c.c.SolrZkClient Using default ZkACLProvider
   [junit4]   2> 1279419 INFO  (jetty-launcher-1300-thread-3) [    ] o.a.s.c.CorePropertiesLocator Config-defined core root directory: /home/jenkins/workspace/Lucene-Solr-trunk-Linux/solr/build/solr-core/test/J2/temp/solr.handler.PingRequestHandlerTest_2AE4E4E82A810B53-001/tempDir-001/node3/.
   [junit4]   2> 1279419 INFO  (jetty-launcher-1300-thread-3) [    ] o.a.s.c.CoreContainer New CoreContainer 1104937894
   [junit4]   2> 1279419 INFO  (jetty-launcher-1300-thread-3) [    ] o.a.s.c.CoreContainer Loading cores into CoreContainer [instanceDir=/home/jenkins/workspace/Lucene-Solr-trunk-Linux/solr/build/solr-core/test/J2/temp/solr.handler.PingRequestHandlerTest_2AE4E4E82A810B53-001/tempDir-001/node3]
   [junit4]   2> 1279419 WARN  (jetty-launcher-1300-thread-3) [    ] o.a.s.c.CoreContainer Couldn't add files from /home/jenkins/workspace/Lucene-Solr-trunk-Linux/solr/build/solr-core/test/J2/temp/solr.handler.PingRequestHandlerTest_2AE4E4E82A810B53-001/tempDir-001/node3/lib to classpath: /home/jenkins/workspace/Lucene-Solr-trunk-Linux/solr/build/solr-core/test/J2/temp/solr.handler.PingRequestHandlerTest_2AE4E4E82A810B53-001/tempDir-001/node3/lib
   [junit4]   2> 1279419 INFO  (jetty-launcher-1300-thread-3) [    ] o.a.s.h.c.HttpShardHandlerFactory created with socketTimeout : 90000,urlScheme : ,connTimeout : 15000,maxConnectionsPerHost : 20,maxConnections : 10000,corePoolSize : 0,maximumPoolSize : 2147483647,maxThreadIdleTime : 5,sizeOfQueue : -1,fairnessPolicy : false,useRetries : false,
   [junit4]   2> 1279420 INFO  (jetty-launcher-1300-thread-3) [    ] o.a.s.u.UpdateShardHandler Creating UpdateShardHandler HTTP client with params: socketTimeout=340000&connTimeout=45000&retry=true
   [junit4]   2> 1279420 INFO  (jetty-launcher-1300-thread-3) [    ] o.a.s.l.LogWatcher SLF4J impl is org.slf4j.impl.Log4jLoggerFactory
   [junit4]   2> 1279420 INFO  (jetty-launcher-1300-thread-3) [    ] o.a.s.l.LogWatcher Registering Log Listener [Log4j (org.slf4j.impl.Log4jLoggerFactory)]
   [junit4]   2> 1279420 INFO  (jetty-launcher-1300-thread-3) [    ] o.a.s.c.ZkContainer Zookeeper client=127.0.0.1:51610/solr
   [junit4]   2> 1279420 INFO  (jetty-launcher-1300-thread-3) [    ] o.a.s.c.ZkController zkHost includes chroot
   [junit4]   2> 1279420 INFO  (jetty-launcher-1300-thread-3) [    ] o.a.s.c.c.SolrZkClient Using default ZkCredentialsProvider
   [junit4]   2> 1279420 INFO  (zkCallback-1318-thread-1) [    ] o.a.s.c.c.ConnectionManager Watcher org.apache.solr.common.cloud.ConnectionManager@1bb99ea8 name:ZooKeeperConnection Watcher:127.0.0.1:51610 got event WatchedEvent state:SyncConnected type:None path:null path:null type:None
   [junit4]   2> 1279420 INFO  (jetty-launcher-1300-thread-5) [    ] o.a.s.c.c.ConnectionManager Client is connected to ZooKeeper
   [junit4]   2> 1279421 INFO  (jetty-launcher-1300-thread-5) [    ] o.a.s.c.c.SolrZkClient Using default ZkACLProvider
   [junit4]   2> 1279429 INFO  (jetty-launcher-1300-thread-2) [n:127.0.0.1:42083_solr    ] o.a.s.c.c.ConnectionManager Waiting for client to connect to ZooKeeper
   [junit4]   2> 1279429 INFO  (zkCallback-1320-thread-1-processing-n:127.0.0.1:42083_solr) [n:127.0.0.1:42083_solr    ] o.a.s.c.c.ConnectionManager Watcher org.apache.solr.common.cloud.ConnectionManager@7bf5ee88 name:ZooKeeperConnection Watcher:127.0.0.1:51610/solr got event WatchedEvent state:SyncConnected type:None path:null path:null type:None
   [junit4]   2> 1279429 INFO  (jetty-launcher-1300-thread-3) [    ] o.a.s.c.c.ConnectionManager Waiting for client to connect to ZooKeeper
   [junit4]   2> 1279429 INFO  (jetty-launcher-1300-thread-2) [n:127.0.0.1:42083_solr    ] o.a.s.c.c.ConnectionManager Client is connected to ZooKeeper
   [junit4]   2> 1279430 INFO  (jetty-launcher-1300-thread-1) [n:127.0.0.1:54957_solr    ] o.a.s.c.c.ConnectionManager Waiting for client to connect to ZooKeeper
   [junit4]   2> 1279430 INFO  (jetty-launcher-1300-thread-2) [n:127.0.0.1:42083_solr    ] o.a.s.c.c.SolrZkClient makePath: /overseer/queue
   [junit4]   2> 1279431 INFO  (jetty-launcher-1300-thread-2) [n:127.0.0.1:42083_solr    ] o.a.s.c.c.SolrZkClient makePath: /overseer/collection-queue-work
   [junit4]   2> 1279432 INFO  (jetty-launcher-1300-thread-2) [n:127.0.0.1:42083_solr    ] o.a.s.c.c.SolrZkClient makePath: /overseer/collection-map-running
   [junit4]   2> 1279433 INFO  (jetty-launcher-1300-thread-2) [n:127.0.0.1:42083_solr    ] o.a.s.c.c.SolrZkClient makePath: /overseer/collection-map-completed
   [junit4]   2> 1279433 INFO  (jetty-launcher-1300-thread-2) [n:127.0.0.1:42083_solr    ] o.a.s.c.c.SolrZkClient makePath: /overseer/collection-map-failure
   [junit4]   2> 1279434 INFO  (jetty-launcher-1300-thread-2) [n:127.0.0.1:42083_solr    ] o.a.s.c.c.SolrZkClient makePath: /live_nodes
   [junit4]   2> 1279435 INFO  (jetty-launcher-1300-thread-2) [n:127.0.0.1:42083_solr    ] o.a.s.c.c.SolrZkClient makePath: /collections
   [junit4]   2> 1279435 INFO  (jetty-launcher-1300-thread-2) [n:127.0.0.1:42083_solr    ] o.a.s.c.c.SolrZkClient makePath: /aliases.json
   [junit4]   2> 1279436 INFO  (jetty-launcher-1300-thread-2) [n:127.0.0.1:42083_solr    ] o.a.s.c.c.SolrZkClient makePath: /clusterstate.json
   [junit4]   2> 1279436 INFO  (jetty-launcher-1300-thread-2) [n:127.0.0.1:42083_solr    ] o.a.s.c.c.SolrZkClient makePath: /security.json
   [junit4]   2> 1279437 INFO  (jetty-launcher-1300-thread-4) [n:127.0.0.1:47332_solr    ] o.a.s.c.c.ConnectionManager Waiting for client to connect to ZooKeeper
   [junit4]   2> 1279437 INFO  (jetty-launcher-1300-thread-2) [n:127.0.0.1:42083_solr    ] o.a.s.c.ZkController Register node as live in ZooKeeper:/live_nodes/127.0.0.1:42083_solr
   [junit4]   2> 1279437 INFO  (jetty-launcher-1300-thread-2) [n:127.0.0.1:42083_solr    ] o.a.s.c.c.SolrZkClient makePath: /live_nodes/127.0.0.1:42083_solr
   [junit4]   2> 1279438 INFO  (jetty-launcher-1300-thread-2) [n:127.0.0.1:42083_solr    ] o.a.s.c.c.SolrZkClient makePath: /overseer_elect
   [junit4]   2> 1279439 INFO  (jetty-launcher-1300-thread-2) [n:127.0.0.1:42083_solr    ] o.a.s.c.c.SolrZkClient makePath: /overseer_elect/election
   [junit4]   2> 1279439 INFO  (jetty-launcher-1300-thread-2) [n:127.0.0.1:42083_solr    ] o.a.s.c.Overseer Overseer (id=null) closing
   [junit4]   2> 1279439 INFO  (jetty-launcher-1300-thread-2) [n:127.0.0.1:42083_solr    ] o.a.s.c.LeaderElector Joined leadership election with path: /overseer_elect/election/95386122685972490-127.0.0.1:42083_solr-n_0000000000
   [junit4]   2> 1279440 INFO  (jetty-launcher-1300-thread-2) [n:127.0.0.1:42083_solr    ] o.a.s.c.OverseerElectionContext I am going to be the leader 127.0.0.1:42083_solr
   [junit4]   2> 1279440 INFO  (jetty-launcher-1300-thread-2) [n:127.0.0.1:42083_solr    ] o.a.s.c.c.SolrZkClient makePath: /overseer_elect/leader
   [junit4]   2> 1279440 INFO  (jetty-launcher-1300-thread-2) [n:127.0.0.1:42083_solr    ] o.a.s.c.Overseer Overseer (id=95386122685972490-127.0.0.1:42083_solr-n_0000000000) starting
   [junit4]   2> 1279441 INFO  (zkCallback-1319-thread-1-processing-n:127.0.0.1:54957_solr) [n:127.0.0.1:54957_solr    ] o.a.s.c.c.ConnectionManager Watcher org.apache.solr.common.cloud.ConnectionManager@43f796a7 name:ZooKeeperConnection Watcher:127.0.0.1:51610/solr got event WatchedEvent state:SyncConnected type:None path:null path:null type:None
   [junit4]   2> 1279441 INFO  (zkCallback-1321-thread-1-processing-n:127.0.0.1:47332_solr) [n:127.0.0.1:47332_solr    ] o.a.s.c.c.ConnectionManager Watcher org.apache.solr.common.cloud.ConnectionManager@3601f9e5 name:ZooKeeperConnection Watcher:127.0.0.1:51610/solr got event WatchedEvent state:SyncConnected type:None path:null path:null type:None
   [junit4]   2> 1279441 INFO  (jetty-launcher-1300-thread-1) [n:127.0.0.1:54957_solr    ] o.a.s.c.c.ConnectionManager Client is connected to ZooKeeper
   [junit4]   2> 1279441 INFO  (jetty-launcher-1300-thread-4) [n:127.0.0.1:47332_solr    ] o.a.s.c.c.ConnectionManager Client is connected to ZooKeeper
   [junit4]   2> 1279441 INFO  (jetty-launcher-1300-thread-2) [n:127.0.0.1:42083_solr    ] o.a.s.c.c.SolrZkClient makePath: /overseer/queue-work
   [junit4]   2> 1279441 INFO  (zkCallback-1324-thread-1) [    ] o.a.s.c.c.ConnectionManager Watcher org.apache.solr.common.cloud.ConnectionManager@2f205c58 name:ZooKeeperConnection Watcher:127.0.0.1:51610 got event WatchedEvent state:SyncConnected type:None path:null path:null type:None
   [junit4]   2> 1279441 INFO  (jetty-launcher-1300-thread-3) [    ] o.a.s.c.c.ConnectionManager Client is connected to ZooKeeper
   [junit4]   2> 1279442 INFO  (jetty-launcher-1300-thread-3) [    ] o.a.s.c.c.SolrZkClient Using default ZkACLProvider
   [junit4]   2> 1279444 INFO  (jetty-launcher-1300-thread-1) [n:127.0.0.1:54957_solr    ] o.a.s.c.c.ZkStateReader Updating cluster state from ZooKeeper... 
   [junit4]   2> 1279444 INFO  (jetty-launcher-1300-thread-4) [n:127.0.0.1:47332_solr    ] o.a.s.c.c.ZkStateReader Updating cluster state from ZooKeeper... 
   [junit4]   2> 1279448 INFO  (jetty-launcher-1300-thread-5) [n:127.0.0.1:49110_solr    ] o.a.s.c.c.ConnectionManager Waiting for client to connect to ZooKeeper
   [junit4]   2> 1279449 INFO  (zkCallback-1325-thread-1-processing-n:127.0.0.1:49110_solr) [n:127.0.0.1:49110_solr    ] o.a.s.c.c.ConnectionManager Watcher org.apache.solr.common.cloud.ConnectionManager@7e32ea36 name:ZooKeeperConnection Watcher:127.0.0.1:51610/solr got event WatchedEvent state:SyncConnected type:None path:null path:null type:None
   [junit4]   2> 1279449 INFO  (jetty-launcher-1300-thread-5) [n:127.0.0.1:49110_solr    ] o.a.s.c.c.ConnectionManager Client is connected to ZooKeeper
   [junit4]   2> 1279449 INFO  (jetty-launcher-1300-thread-3) [n:127.0.0.1:51035_solr    ] o.a.s.c.c.ConnectionManager Waiting for client to connect to ZooKeeper
   [junit4]   2> 1279450 INFO  (zkCallback-1326-thread-1-processing-n:127.0.0.1:51035_solr) [n:127.0.0.1:51035_solr    ] o.a.s.c.c.ConnectionManager Watcher org.apache.solr.common.cloud.ConnectionManager@5605f780 name:ZooKeeperConnection Watcher:127.0.0.1:51610/solr got event WatchedEvent state:SyncConnected type:None path:null path:null type:None
   [junit4]   2> 1279450 INFO  (jetty-launcher-1300-thread-3) [n:127.0.0.1:51035_solr    ] o.a.s.c.c.ConnectionManager Client is connected to ZooKeeper
   [junit4]   2> 1279451 INFO  (jetty-launcher-1300-thread-2) [n:127.0.0.1:42083_solr    ] o.a.s.c.OverseerAutoReplicaFailoverThread Starting OverseerAutoReplicaFailoverThread autoReplicaFailoverWorkLoopDelay=10000 autoReplicaFailoverWaitAfterExpiration=30000 autoReplicaFailoverBadNodeExpiration=60000
   [junit4]   2> 1279451 INFO  (OverseerStateUpdate-95386122685972490-127.0.0.1:42083_solr-n_0000000000) [n:127.0.0.1:42083_solr    ] o.a.s.c.Overseer Starting to work on the main queue
   [junit4]   2> 1279452 INFO  (OverseerStateUpdate-95386122685972490-127.0.0.1:42083_solr-n_0000000000) [n:127.0.0.1:42083_solr    ] o.a.s.c.c.ZkStateReader Updating cluster state from ZooKeeper... 
   [junit4]   2> 1279452 INFO  (jetty-launcher-1300-thread-5) [n:127.0.0.1:49110_solr    ] o.a.s.c.c.ZkStateReader Updating cluster state from ZooKeeper... 
   [junit4]   2> 1279453 INFO  (jetty-launcher-1300-thread-3) [n:127.0.0.1:51035_solr    ] o.a.s.c.c.ZkStateReader Updating cluster state from ZooKeeper... 
   [junit4]   2> 1279458 INFO  (OverseerCollectionConfigSetProcessor-95386122685972490-127.0.0.1:42083_solr-n_0000000000) [n:127.0.0.1:42083_solr    ] o.a.s.c.OverseerTaskProcessor Process current queue of overseer operations
   [junit4]   2> 1279459 INFO  (jetty-launcher-1300-thread-2) [n:127.0.0.1:42083_solr    ] o.a.s.c.c.ZkStateReader Updating cluster state from ZooKeeper... 
   [junit4]   2> 1279470 INFO  (jetty-launcher-1300-thread-2) [n:127.0.0.1:42083_solr    ] o.a.s.c.CoreContainer Security conf doesn't exist. Skipping setup for authorization module.
   [junit4]   2> 1279470 INFO  (jetty-launcher-1300-thread-2) [n:127.0.0.1:42083_solr    ] o.a.s.c.CoreContainer No authentication plugin used.
   [junit4]   2> 1279470 INFO  (jetty-launcher-1300-thread-2) [n:127.0.0.1:42083_solr    ] o.a.s.c.CorePropertiesLocator Looking for core definitions underneath /home/jenkins/workspace/Lucene-Solr-trunk-Linux/solr/build/solr-core/test/J2/temp/solr.handler.PingRequestHandlerTest_2AE4E4E82A810B53-001/tempDir-001/node2/.
   [junit4]   2> 1279470 INFO  (jetty-launcher-1300-thread-2) [n:127.0.0.1:42083_solr    ] o.a.s.c.CorePropertiesLocator Found 0 core definitions
   [junit4]   2> 1279471 INFO  (jetty-launcher-1300-thread-2) [n:127.0.0.1:42083_solr    ] o.a.s.s.SolrDispatchFilter user.dir=/home/jenkins/workspace/Lucene-Solr-trunk-Linux/solr/build/solr-core/test/J2
   [junit4]   2> 1279471 INFO  (jetty-launcher-1300-thread-2) [n:127.0.0.1:42083_solr    ] o.a.s.s.SolrDispatchFilter SolrDispatchFilter.init() done
   [junit4]   2> 1280446 INFO  (jetty-launcher-1300-thread-1) [n:127.0.0.1:54957_solr    ] o.a.s.c.ZkController Register node as live in ZooKeeper:/live_nodes/127.0.0.1:54957_solr
   [junit4]   2> 1280446 INFO  (jetty-launcher-1300-thread-4) [n:127.0.0.1:47332_solr    ] o.a.s.c.ZkController Register node as live in ZooKeeper:/live_nodes/127.0.0.1:47332_solr
   [junit4]   2> 1280446 INFO  (jetty-launcher-1300-thread-1) [n:127.0.0.1:54957_solr    ] o.a.s.c.c.SolrZkClient makePath: /live_nodes/127.0.0.1:54957_solr
   [junit4]   2> 1280446 INFO  (jetty-launcher-1300-thread-4) [n:127.0.0.1:47332_solr    ] o.a.s.c.c.SolrZkClient makePath: /live_nodes/127.0.0.1:47332_solr
   [junit4]   2> 1280446 INFO  (zkCallback-1321-thread-1-processing-n:127.0.0.1:47332_solr) [n:127.0.0.1:47332_solr    ] o.a.s.c.c.ZkStateReader A live node change: [WatchedEvent state:SyncConnected type:NodeChildrenChanged path:/live_nodes], has occurred - updating... (live nodes size: [1])
   [junit4]   2> 1280446 INFO  (zkCallback-1320-thread-1-processing-n:127.0.0.1:42083_solr) [n:127.0.0.1:42083_solr    ] o.a.s.c.c.ZkStateReader A live node change: [WatchedEvent state:SyncConnected type:NodeChildrenChanged path:/live_nodes], has occurred - updating... (live nodes size: [1])
   [junit4]   2> 1280446 INFO  (zkCallback-1326-thread-1-processing-n:127.0.0.1:51035_solr) [n:127.0.0.1:51035_solr    ] o.a.s.c.c.ZkStateReader A live node change: [WatchedEvent state:SyncConnected type:NodeChildrenChanged path:/live_nodes], has occurred - updating... (live nodes size: [1])
   [junit4]   2> 1280446 INFO  (zkCallback-1320-thread-2-processing-n:127.0.0.1:42083_solr) [n:127.0.0.1:42083_solr    ] o.a.s.c.c.ZkStateReader A live node change: [WatchedEvent state:SyncConnected type:NodeChildrenChanged path:/live_nodes], has occurred - updating... (live nodes size: [1])
   [junit4]   2> 1280446 INFO  (zkCallback-1325-thread-1-processing-n:127.0.0.1:49110_solr) [n:127.0.0.1:49110_solr    ] o.a.s.c.c.ZkStateReader A live node change: [WatchedEvent state:SyncConnected type:NodeChildrenChanged path:/live_nodes], has occurred - updating... (live nodes size: [1])
   [junit4]   2> 1280446 INFO  (zkCallback-1319-thread-1-processing-n:127.0.0.1:54957_solr) [n:127.0.0.1:54957_solr    ] o.a.s.c.c.ZkStateReader A live node change: [WatchedEvent state:SyncConnected type:NodeChildrenChanged path:/live_nodes], has occurred - updating... (live nodes size: [1])
   [junit4]   2> 1280448 INFO  (jetty-launcher-1300-thread-4) [n:127.0.0.1:47332_solr    ] o.a.s.c.Overseer Overseer (id=null) closing
   [junit4]   2> 1280448 INFO  (jetty-launcher-1300-thread-1) [n:127.0.0.1:54957_solr    ] o.a.s.c.Overseer Overseer (id=null) closing
   [junit4]   2> 1280449 INFO  (jetty-launcher-1300-thread-4) [n:127.0.0.1:47332_solr    ] o.a.s.c.LeaderElector Joined leadership election with path: /overseer_elect/election/95386122685972493-127.0.0.1:47332_solr-n_0000000001
   [junit4]   2> 1280449 INFO  (jetty-launcher-1300-thread-1) [n:127.0.0.1:54957_solr    ] o.a.s.c.LeaderElector Joined leadership election with path: /overseer_elect/election/95386122685972492-127.0.0.1:54957_solr-n_0000000002
   [junit4]   2> 1280449 INFO  (jetty-launcher-1300-thread-4) [n:127.0.0.1:47332_solr    ] o.a.s.c.LeaderElector Watching path /overseer_elect/election/95386122685972490-127.0.0.1:42083_solr-n_0000000000 to know if I could be the leader
   [junit4]   2> 1280449 INFO  (jetty-launcher-1300-thread-1) [n:127.0.0.1:54957_solr    ] o.a.s.c.LeaderElector Watching path /overseer_elect/election/95386122685972493-127.0.0.1:47332_solr-n_0000000001 to know if I could be the leader
   [junit4]   2> 1280455 INFO  (jetty-launcher-1300-thread-5) [n:127.0.0.1:49110_solr    ] o.a.s.c.ZkController Register node as live in ZooKeeper:/live_nodes/127.0.0.1:49110_solr
   [junit4]   2> 1280455 INFO  (jetty-launcher-1300-thread-3) [n:127.0.0.1:51035_solr    ] o.a.s.c.ZkController Register node as live in ZooKeeper:/live_nodes/127.0.0.1:51035_solr
   [junit4]   2> 1280455 INFO  (jetty-launcher-1300-thread-5) [n:127.0.0.1:49110_solr    ] o.a.s.c.c.SolrZkClient makePath: /live_nodes/127.0.0.1:49110_solr
   [junit4]   2> 1280455 INFO  (jetty-launcher-1300-thread-3) [n:127.0.0.1:51035_solr    ] o.a.s.c.c.SolrZkClient makePath: /live_nodes/127.0.0.1:51035_solr
   [junit4]   2> 1280456 INFO  (zkCallback-1321-thread-1-processing-n:127.0.0.1:47332_solr) [n:127.0.0.1:47332_solr    ] o.a.s.c.c.ZkStateReader A live node change: [WatchedEvent state:SyncConnected type:NodeChildrenChanged path:/live_nodes], has occurred - updating... (live nodes size: [3])
   [junit4]   2> 1280456 INFO  (zkCallback-1319-thread-1-processing-n:127.0.0.1:54957_solr) [n:127.0.0.1:54957_solr    ] o.a.s.c.c.ZkStateReader A live node change: [WatchedEvent state:SyncConnected type:NodeChildrenChanged path:/live_nodes], has occurred - updating... (live nodes size: [3])
   [junit4]   2> 1280456 INFO  (zkCallback-1320-thread-1-processing-n:127.0.0.1:42083_solr) [n:127.0.0.1:42083_solr    ] o.a.s.c.c.ZkStateReader A live node change: [WatchedEvent state:SyncConnected type:NodeChildrenChanged path:/live_nodes], has occurred - updating... (live nodes size: [3])
   [junit4]   2> 1280456 INFO  (zkCallback-1326-thread-1-processing-n:127.0.0.1:51035_solr) [n:127.0.0.1:51035_solr    ] o.a.s.c.c.ZkStateReader A live node change: [WatchedEvent state:SyncConnected type:NodeChildrenChanged path:/live_nodes], has occurred - updating... (live nodes size: [3])
   [junit4]   2> 1280456 INFO  (zkCallback-1325-thread-1-processing-n:127.0.0.1:49110_solr) [n:127.0.0.1:49110_solr    ] o.a.s.c.c.ZkStateReader A live node change: [WatchedEvent state:SyncConnected type:NodeChildrenChanged path:/live_nodes], has occurred - updating... (live nodes size: [3])
   [junit4]   2> 1280456 INFO  (zkCallback-1320-thread-2-processing-n:127.0.0.1:42083_solr) [n:127.0.0.1:42083_solr    ] o.a.s.c.c.ZkStateReader A live node change: [WatchedEvent state:SyncConnected type:NodeChildrenChanged path:/live_nodes], has occurred - updating... (live nodes size: [3])
   [junit4]   2> 1280456 INFO  (jetty-launcher-1300-thread-3) [n:127.0.0.1:51035_solr    ] o.a.s.c.Overseer Overseer (id=null) closing
   [junit4]   2> 1280456 INFO  (jetty-launcher-1300-thread-5) [n:127.0.0.1:49110_solr    ] o.a.s.c.Overseer Overseer (id=null) closing
   [junit4]   2> 1280456 INFO  (jetty-launcher-1300-thread-3) [n:127.0.0.1:51035_solr    ] o.a.s.c.LeaderElector Joined leadership election with path: /overseer_elect/election/95386122685972495-127.0.0.1:51035_solr-n_0000000003
   [junit4]   2> 1280457 INFO  (jetty-launcher-1300-thread-5) [n:127.0.0.1:49110_solr    ] o.a.s.c.LeaderElector Joined leadership election with path: /overseer_elect/election/95386122685972494-127.0.0.1:49110_solr-n_0000000004
   [junit4]   2> 1280457 INFO  (jetty-launcher-1300-thread-5) [n:127.0.0.1:49110_solr    ] o.a.s.c.LeaderElector Watching path /overseer_elect/election/95386122685972495-127.0.0.1:51035_solr-n_0000000003 to know if I could be the leader
   [junit4]   2> 1280458 INFO  (jetty-launcher-1300-thread-4) [n:127.0.0.1:47332_solr    ] o.a.s.c.CoreContainer Security conf doesn't exist. Skipping setup for authorization module.
   [junit4]   2> 1280459 INFO  (jetty-launcher-1300-thread-4) [n:127.0.0.1:47332_solr    ] o.a.s.c.CoreContainer No authentication plugin used.
   [junit4]   2> 1280459 INFO  (jetty-launcher-1300-thread-4) [n:127.0.0.1:47332_solr    ] o.a.s.c.CorePropertiesLocator Looking for core definitions underneath /home/jenkins/workspace/Lucene-Solr-trunk-Linux/solr/build/solr-core/test/J2/temp/solr.handler.PingRequestHandlerTest_2AE4E4E82A810B53-001/tempDir-001/node5/.
   [junit4]   2> 1280459 INFO  (jetty-launcher-1300-thread-4) [n:127.0.0.1:47332_solr    ] o.a.s.c.CorePropertiesLocator Found 0 core definitions
   [junit4]   2> 1280460 INFO  (jetty-launcher-1300-thread-3) [n:127.0.0.1:51035_solr    ] o.a.s.c.LeaderElector Watching path /overseer_elect/election/95386122685972492-127.0.0.1:54957_solr-n_0000000002 to know if I could be the leader
   [junit4]   2> 1280461 INFO  (jetty-launcher-1300-thread-4) [n:127.0.0.1:47332_solr    ] o.a.s.s.SolrDispatchFilter user.dir=/home/jenkins/workspace/Lucene-Solr-trunk-Linux/solr/build/solr-core/test/J2
   [junit4]   2> 1280461 INFO  (jetty-launcher-1300-thread-4) [n:127.0.0.1:47332_solr    ] o.a.s.s.SolrDispatchFilter SolrDispatchFilter.init() done
   [junit4]   2> 1280470 INFO  (jetty-launcher-1300-thread-1) [n:127.0.0.1:54957_solr    ] o.a.s.c.CoreContainer Security conf doesn't exist. Skipping setup for authorization module.
   [junit4]   2> 1280471 INFO  (jetty-launcher-1300-thread-1) [n:127.0.0.1:54957_solr    ] o.a.s.c.CoreContainer No authentication plugin used.
   [junit4]   2> 1280471 INFO  (jetty-launcher-1300-thread-1) [n:127.0.0.1:54957_solr    ] o.a.s.c.CorePropertiesLocator Looking for core definitions underneath /home/jenkins/workspace/Lucene-Solr-trunk-Linux/solr/build/solr-core/test/J2/temp/solr.handler.PingRequestHandlerTest_2AE4E4E82A810B53-001/tempDir-001/node1/.
   [junit4]   2> 1280471 INFO  (jetty-launcher-1300-thread-1) [n:127.0.0.1:54957_solr    ] o.a.s.c.CorePropertiesLocator Found 0 core definitions
   [junit4]   2> 1280472 INFO  (jetty-launcher-1300-thread-1) [n:127.0.0.1:54957_solr    ] o.a.s.s.SolrDispatchFilter user.dir=/home/jenkins/workspace/Lucene-Solr-trunk-Linux/solr/build/solr-core/test/J2
   [junit4]   2> 1280472 INFO  (jetty-launcher-1300-thread-1) [n:127.0.0.1:54957_solr    ] o.a.s.s.SolrDispatchFilter SolrDispatchFilter.init() done
   [junit4]   2> 1280472 INFO  (jetty-launcher-1300-thread-3) [n:127.0.0.1:51035_solr    ] o.a.s.c.CoreContainer Security conf doesn't exist. Skipping setup for authorization module.
   [junit4]   2> 1280473 INFO  (jetty-launcher-1300-thread-3) [n:127.0.0.1:51035_solr    ] o.a.s.c.CoreContainer No authentication plugin used.
   [junit4]   2> 1280473 INFO  (jetty-launcher-1300-thread-3) [n:127.0.0.1:51035_solr    ] o.a.s.c.CorePropertiesLocator Looking for core definitions underneath /home/jenkins/workspace/Lucene-Solr-trunk-Linux/solr/build/solr-core/test/J2/temp/solr.handler.PingRequestHandlerTest_2AE4E4E82A810B53-001/tempDir-001/node3/.
   [junit4]   2> 1280473 INFO  (jetty-launcher-1300-thread-3) [n:127.0.0.1:51035_solr    ] o.a.s.c.CorePropertiesLocator Found 0 core definitions
   [junit4]   2> 1280474 INFO  (jetty-launcher-1300-thread-3) [n:127.0.0.1:51035_solr    ] o.a.s.s.SolrDispatchFilter user.dir=/home/jenkins/workspace/Lucene-Solr-trunk-Linux/solr/build/solr-core/test/J2
   [junit4]   2> 1280474 INFO  (jetty-launcher-1300-thread-3) [n:127.0.0.1:51035_solr    ] o.a.s.s.SolrDispatchFilter SolrDispatchFilter.init() done
   [junit4]   2> 1280478 INFO  (jetty-launcher-1300-thread-5) [n:127.0.0.1:49110_solr    ] o.a.s.c.CoreContainer Security conf doesn't exist. Skipping setup for authorization module.
   [junit4]   2> 1280478 INFO  (jetty-launcher-1300-thread-5) [n:127.0.0.1:49110_solr    ] o.a.s.c.CoreContainer No authentication plugin used.
   [junit4]   2> 1280478 INFO  (jetty-launcher-1300-thread-5) [n:127.0.0.1:49110_solr    ] o.a.s.c.CorePropertiesLocator Looking for core definitions underneath /home/jenkins/workspace/Lucene-Solr-trunk-Linux/solr/build/solr-core/test/J2/temp/solr.handler.PingRequestHandlerTest_2AE4E4E82A810B53-001/tempDir-001/node4/.
   [junit4]   2> 1280478 INFO  (jetty-launcher-1300-thread-5) [n:127.0.0.1:49110_solr    ] o.a.s.c.CorePropertiesLocator Found 0 core definitions
   [junit4]   2> 1280479 INFO  (jetty-launcher-1300-thread-5) [n:127.0.0.1:49110_solr    ] o.a.s.s.SolrDispatchFilter user.dir=/home/jenkins/workspace/Lucene-Solr-trunk-Linux/solr/build/solr-core/test/J2
   [junit4]   2> 1280479 INFO  (jetty-launcher-1300-thread-5) [n:127.0.0.1:49110_solr    ] o.a.s.s.SolrDispatchFilter SolrDispatchFilter.init() done
   [junit4]   2> 1280479 INFO  (TEST-PingRequestHandlerTest.testPingInClusterWithNoHealthCheck-seed#[2AE4E4E82A810B53]) [    ] o.a.s.c.c.SolrZkClient Using default ZkCredentialsProvider
   [junit4]   2> 1280479 INFO  (TEST-PingRequestHandlerTest.testPingInClusterWithNoHealthCheck-seed#[2AE4E4E82A810B53]) [    ] o.a.s.c.c.ConnectionManager Waiting for client to connect to ZooKeeper
   [junit4]   2> 1280480 INFO  (zkCallback-1327-thread-1) [    ] o.a.s.c.c.ConnectionManager Watcher org.apache.solr.common.cloud.ConnectionManager@6da422ea name:ZooKeeperConnection Watcher:127.0.0.1:51610 got event WatchedEvent state:SyncConnected type:None path:null path:null type:None
   [junit4]   2> 1280480 INFO  (TEST-PingRequestHandlerTest.testPingInClusterWithNoHealthCheck-seed#[2AE4E4E82A810B53]) [    ] o.a.s.c.c.ConnectionManager Client is connected to ZooKeeper
   [junit4]   2> 1280480 INFO  (TEST-PingRequestHandlerTest.testPingInClusterWithNoHealthCheck-seed#[2AE4E4E82A810B53]) [    ] o.a.s.c.c.SolrZkClient Using default ZkACLProvider
   [junit4]   2> 1280482 INFO  (TEST-PingRequestHandlerTest.testPingInClusterWithNoHealthCheck-seed#[2AE4E4E82A810B53]) [    ] o.a.s.c.c.SolrZkClient Using default ZkCredentialsProvider
   [junit4]   2> 1280482 INFO  (TEST-PingRequestHandlerTest.testPingInClusterWithNoHealthCheck-seed#[2AE4E4E82A810B53]) [    ] o.a.s.c.c.ConnectionManager Waiting for client to connect to ZooKeeper
   [junit4]   2> 1280483 INFO  (zkCallback-1329-thread-1) [    ] o.a.s.c.c.ConnectionManager Watcher org.apache.solr.common.cloud.ConnectionManager@327e0b64 name:ZooKeeperConnection Watcher:127.0.0.1:51610/solr got event WatchedEvent state:SyncConnected type:None path:null path:null type:None
   [junit4]   2> 1280483 INFO  (TEST-PingRequestHandlerTest.testPingInClusterWithNoHealthCheck-seed#[2AE4E4E82A810B53]) [    ] o.a.s.c.c.ConnectionManager Client is connected to ZooKeeper
   [junit4]   2> 1280483 INFO  (TEST-PingRequestHandlerTest.testPingInClusterWithNoHealthCheck-seed#[2AE4E4E82A810B53]) [    ] o.a.s.c.c.SolrZkClient Using default ZkACLProvider
   [junit4]   2> 1280483 INFO  (TEST-PingRequestHandlerTest.testPingInClusterWithNoHealthCheck-seed#[2AE4E4E82A810B53]) [    ] o.a.s.c.c.SolrZkClient makePath: /configs/solrCloudCollectionConfig/protwords.txt
   [junit4]   2> 1280484 INFO  (TEST-PingRequestHandlerTest.testPingInClusterWithNoHealthCheck-seed#[2AE4E4E82A810B53]) [    ] o.a.s.c.c.SolrZkClient makePath: /configs/solrCloudCollectionConfig/solrconfig-delaying-component.xml
   [junit4]   2> 1280484 INFO  (TEST-PingRequestHandlerTest.testPingInClusterWithNoHealthCheck-seed#[2AE4E4E82A810B53]) [    ] o.a.s.c.c.SolrZkClient makePath: /configs/solrCloudCollectionConfig/bad_solrconfig.xml
   [junit4]   2> 1280485 INFO  (TEST-PingRequestHandlerTest.testPingInClusterWithNoHealthCheck-seed#[2AE4E4E82A810B53]) [    ] o.a.s.c.c.SolrZkClient makePath: /configs/solrCloudCollectionConfig/solrconfig-sortingmergepolicyfactory.xml
   [junit4]   2> 1280486 INFO  (TEST-PingRequestHandlerTest.testPingInClusterWithNoHealthCheck-seed#[2AE4E4E82A810B53]) [    ] o.a.s.c.c.SolrZkClient makePath: /configs/solrCloudCollectionConfig/solrconfig-nocache.xml
   [junit4]   2> 1280486 INFO  (TEST-PingRequestHandlerTest.testPingInClusterWithNoHealthCheck-seed#[2AE4E4E82A810B53]) [    ] o.a.s.c.c.SolrZkClient makePath: /configs/solrCloudCollectionConfig/solrconfig-implicitproperties.xml
   [junit4]   2> 1280487 INFO  (TEST-PingRequestHandlerTest.testPingInClusterWithNoHealthCheck-seed#[2AE4E4E82A810B53]) [    ] o.a.s.c.c.SolrZkClient makePath: /configs/solrCloudCollectionConfig/solrconfig-mergepolicy-legacy.xml
   [junit4]   2> 1280487 INFO  (TEST-PingRequestHandlerTest.testPingInClusterWithNoHealthCheck-seed#[2AE4E4E82A810B53]) [    ] o.a.s.c.c.SolrZkClient makePath: /configs/solrCloudCollectionConfig/bad-schema-uniquekey-uses-default.xml
   [junit4]   2> 1280488 INFO  (TEST-PingRequestHandlerTest.testPingInClusterWithNoHealthCheck-seed#[2AE4E4E82A810B53]) [    ] o.a.s.c.c.SolrZkClient makePath: /configs/solrCloudCollectionConfig/bad-schema-sim-default-has-no-explicit-sim.xml
   [junit4]   2> 1280488 INFO  (TEST-PingRequestHandlerTest.testPingInClusterWithNoHealthCheck-seed#[2AE4E4E82A810B53]) [    ] o.a.s.c.c.SolrZkClient makePath: /configs/solrCloudCollectionConfig/bad-schema-uniquekey-multivalued.xml
   [junit4]   2> 1280489 INFO  (TEST-PingRequestHandlerTest.testPingInClusterWithNoHealthCheck-seed#[2AE4E4E82A810B53]) [    ] o.a.s.c.c.SolrZkClient makePath: /configs/solrCloudCollectionConfig/analyzingInfixSuggest.txt
   [junit4]   2> 1280489 INFO  (TEST-PingRequestHandlerTest.testPingInClusterWithNoHealthCheck-seed#[2AE4E4E82A810B53]) [    ] o.a.s.c.c.SolrZkClient makePath: /configs/solrCloudCollectionConfig/missleading.extension.updateprocessor.js.txt
   [junit4]   2> 1280490 INFO  (TEST-PingRequestHandlerTest.testPingInClusterWithNoHealthCheck-seed#[2AE4E4E82A810B53]) [    ] o.a.s.c.c.SolrZkClient makePath: /configs/solrCloudCollectionConfig/bad-schema-multiple-asterisk-copyfield-source-should-fail-test.xml
   [junit4]   2> 1280490 INFO  (TEST-PingRequestHandlerTest.testPingInClusterWithNoHealthCheck-seed#[2AE4E4E82A810B53]) [    ] o.a.s.c.c.SolrZkClient makePath: /configs/solrCloudCollectionConfig/schema-replication2.xml
   [junit4]   2> 1280494 INFO  (TEST-PingRequestHandlerTest.testPingInClusterWithNoHealthCheck-seed#[2AE4E4E82A810B53]) [    ] o.a.s.c.c.SolrZkClient makePath: /configs/solrCloudCollectionConfig/solrconfig-infostream-logging.xml
   [junit4]   2> 1280495 INFO  (TEST-PingRequestHandlerTest.testPingInClusterWithNoHealthCheck-seed#[2AE4E4E82A810B53]) [    ] o.a.s.c.c.SolrZkClient makePath: /configs/solrCloudCollectionConfig/solrconfig-collapseqparser.xml
   [junit4]   2> 1280496 INFO  (TEST-PingRequestHandlerTest.testPingInClusterWithNoHealthCheck-seed#[2AE4E4E82A810B53]) [    ] o.a.s.c.c.SolrZkClient makePath: /configs/solrCloudCollectionConfig/bad-schema-currency-ft-bogus-code-in-xml.xml
   [junit4]   2> 1280497 INFO  (TEST-PingRequestHandlerTest.testPingInClusterWithNoHealthCheck-seed#[2AE4E4E82A810B53]) [    ] o.a.s.c.c.SolrZkClient makePath: /configs/solrCloudCollectionConfig/old_synonyms.txt
   [junit4]   2> 1280497 INFO  (TEST-PingRequestHandlerTest.testPingInClusterWithNoHealthCheck-seed#[2AE4E4E82A810B53]) [    ] o.a.s.c.c.SolrZkClient makePath: /configs/solrCloudCollectionConfig/enumsConfig.xml
   [junit4]   2> 1280498 INFO  (TEST-PingRequestHandlerTest.testPingInClusterWithNoHealthCheck-seed#[2AE4E4E82A810B53]) [    ] o.a.s.c.c.SolrZkClient makePath: /configs/solrCloudCollectionConfig/solrconfig-script-updateprocessor.xml
   [junit4]   2> 1280498 INFO  (TEST-PingRequestHandlerTest.testPingInClusterWithNoHealthCheck-seed#[2AE4E4E82A810B53]) [    ] o.a.s.c.c.SolrZkClient makePath: /configs/solrCloudCollectionConfig/schema-add-schema-fields-update-processor.xml
   [junit4]   2> 1280499 INFO  (TEST-PingRequestHandlerTest.testPingInClusterWithNoHealthCheck-seed#[2AE4E4E82A810B53]) [    ] o.a.s.c.c.SolrZkClient makePath: /configs/solrCloudCollectionConfig/solrconfig-mergepolicyfactory-nocfs.xml
   [junit4]   2> 1280499 INFO  (TEST-PingRequestHandlerTest.testPingInClusterWithNoHealthCheck-seed#[2AE4E4E82A810B53]) [    ] o.a.s.c.c.SolrZkClient makePath: /configs/solrCloudCollectionConfig/bad-schema-sweetspot-both-tf.xml
   [junit4]   2> 1280500 INFO  (TEST-PingRequestHandlerTest.testPingInClusterWithNoHealthCheck-seed#[2AE4E4E82A810B53]) [    ] o.a.s.c.c.SolrZkClient makePath: /configs/solrCloudCollectionConfig/schema-phrasesuggest.xml
   [junit4]   2> 1280500 INFO  (TEST-PingRequestHandlerTest.testPingInClusterWithNoHealthCheck-seed#[2AE4E4E82A810B53]) [    ] o.a.s.c.c.SolrZkClient makePath: /configs/solrCloudCollectionConfig/solrconfig.xml
   [junit4]   2> 1280501 INFO  (TEST-PingRequestHandlerTest.testPingInClusterWithNoHealthCheck-seed#[2AE4E4E82A810B53]) [    ] o.a.s.c.c.SolrZkClient makePath: /configs/solrCloudCollectionConfig/solrconfig-delpolicy1.xml
   [junit4]   2> 1280501 INFO  (TEST-PingRequestHandlerTest.testPingInClusterWithNoHealthCheck-seed#[2AE4E4E82A810B53]) [    ] o.a.s.c.c.SolrZkClient makePath: /configs/solrCloudCollectionConfig/schema-sim.xml
   [junit4]   2> 1280502 INFO  (TEST-PingRequestHandlerTest.testPingInClusterWithNoHealthCheck-seed#[2AE4E4E82A810B53]) [    ] o.a.s.c.c.SolrZkClient makePath: /configs/solrCloudCollectionConfig/schema15.xml
   [junit4]   2> 1280502 INFO  (TEST-PingRequestHandlerTest.testPingInClusterWithNoHealthCheck-seed#[2AE4E4E82A810B53]) [    ] o.a.s.c.c.SolrZkClient makePath: /configs/solrCloudCollectionConfig/schema-sql.xml
   [junit4]   2> 1280503 INFO  (TEST-PingRequestHandlerTest.testPingInClusterWithNoHealthCheck-seed#[2AE4E4E82A810B53]) [    ] o.a.s.c.c.SolrZkClient makePath: /configs/solrCloudCollectionConfig/bad-schema-misplaced-asterisk-copyfield-source-should-fail-test.xml
   [junit4]   2> 1280504 INFO  (TEST-PingRequestHandlerTest.testPingInClusterWithNoHealthCheck-seed#[2AE4E4E82A810B53]) [    ] o.a.s.c.c.SolrZkClient makePath: /configs/solrCloudCollectionConfig/stemdict.txt
   [junit4]   2> 1280504 INFO  (TEST-PingRequestHandlerTest.testPingInClusterWithNoHealthCheck-seed#[2AE4E4E82A810B53]) [    ] o.a.s.c.c.SolrZkClient makePath: /configs/solrCloudCollectionConfig/hunspell-test.aff
   [junit4]   2> 1280505 INFO  (TEST-PingRequestHandlerTest.testPingInClusterWithNoHealthCheck-seed#[2AE4E4E82A810B53]) [    ] o.a.s.c.c.SolrZkClient makeP

[...truncated too long message...]

va:953)
   [junit4]    > 	at org.apache.solr.client.solrj.impl.CloudSolrClient.requestWithRetryOnStaleState(CloudSolrClient.java:953)
   [junit4]    > 	at org.apache.solr.client.solrj.impl.CloudSolrClient.request(CloudSolrClient.java:806)
   [junit4]    > 	at org.apache.solr.client.solrj.SolrRequest.process(SolrRequest.java:149)
   [junit4]    > 	at org.apache.solr.handler.PingRequestHandlerTest.testPingInClusterWithNoHealthCheck(PingRequestHandlerTest.java:199)
   [junit4]    > 	at java.lang.Thread.run(Thread.java:745)
   [junit4]   2> 1288554 INFO  (TEST-PingRequestHandlerTest.testGettingStatus-seed#[2AE4E4E82A810B53]) [    ] o.a.s.SolrTestCaseJ4 ###Starting testGettingStatus
   [junit4]   2> 1288555 INFO  (TEST-PingRequestHandlerTest.testGettingStatus-seed#[2AE4E4E82A810B53]) [    ] o.a.s.SolrTestCaseJ4 ###Ending testGettingStatus
   [junit4]   2> 1288556 INFO  (TEST-PingRequestHandlerTest.testEnablingServer-seed#[2AE4E4E82A810B53]) [    ] o.a.s.SolrTestCaseJ4 ###Starting testEnablingServer
   [junit4]   2> 1288557 INFO  (TEST-PingRequestHandlerTest.testEnablingServer-seed#[2AE4E4E82A810B53]) [    ] o.a.s.c.S.Request [collection1]  webapp=null path=null params={wt=xml} hits=0 status=0 QTime=0
   [junit4]   2> 1288557 INFO  (TEST-PingRequestHandlerTest.testEnablingServer-seed#[2AE4E4E82A810B53]) [    ] o.a.s.SolrTestCaseJ4 ###Ending testEnablingServer
   [junit4]   2> 1288559 INFO  (TEST-PingRequestHandlerTest.testDisablingServer-seed#[2AE4E4E82A810B53]) [    ] o.a.s.SolrTestCaseJ4 ###Starting testDisablingServer
   [junit4]   2> 1288561 INFO  (TEST-PingRequestHandlerTest.testDisablingServer-seed#[2AE4E4E82A810B53]) [    ] o.a.s.c.S.Request [collection1]  webapp=null path=null params={wt=xml} hits=0 status=0 QTime=0
   [junit4]   2> 1288561 INFO  (TEST-PingRequestHandlerTest.testDisablingServer-seed#[2AE4E4E82A810B53]) [    ] o.a.s.SolrTestCaseJ4 ###Ending testDisablingServer
   [junit4]   2> 1288561 INFO  (SUITE-PingRequestHandlerTest-seed#[2AE4E4E82A810B53]-worker) [    ] o.a.s.SolrTestCaseJ4 ###deleteCore
   [junit4]   2> 1288561 INFO  (SUITE-PingRequestHandlerTest-seed#[2AE4E4E82A810B53]-worker) [    ] o.a.s.c.CoreContainer Shutting down CoreContainer instance=228851766
   [junit4]   2> 1288561 INFO  (coreCloseExecutor-4242-thread-1) [    x:collection1] o.a.s.c.SolrCore [collection1]  CLOSING SolrCore org.apache.solr.core.SolrCore@19409231
   [junit4]   2> 1288562 INFO  (coreCloseExecutor-4242-thread-1) [    x:collection1] o.a.s.u.DirectUpdateHandler2 closing DirectUpdateHandler2{commits=0,autocommits=0,soft autocommits=0,optimizes=0,rollbacks=0,expungeDeletes=0,docsPending=0,adds=0,deletesById=0,deletesByQuery=0,errors=0,cumulative_adds=0,cumulative_deletesById=0,cumulative_deletesByQuery=0,cumulative_errors=0,transaction_logs_total_size=0,transaction_logs_total_number=0}
   [junit4]   2> 1288562 INFO  (coreCloseExecutor-4242-thread-1) [    x:collection1] o.a.s.u.SolrCoreState Closing SolrCoreState
   [junit4]   2> 1288562 INFO  (coreCloseExecutor-4242-thread-1) [    x:collection1] o.a.s.u.DefaultSolrCoreState SolrCoreState ref count has reached 0 - closing IndexWriter
   [junit4]   2> 1288562 INFO  (coreCloseExecutor-4242-thread-1) [    x:collection1] o.a.s.u.DefaultSolrCoreState closing IndexWriter with IndexWriterCloser
   [junit4]   2> 1288562 INFO  (coreCloseExecutor-4242-thread-1) [    x:collection1] o.a.s.c.SolrCore [collection1] Closing main searcher on request.
   [junit4]   2> 1288567 INFO  (coreCloseExecutor-4242-thread-1) [    x:collection1] o.a.s.c.CachingDirectoryFactory Closing MockDirectoryFactory - 2 directories currently being tracked
   [junit4]   2> 1288567 INFO  (coreCloseExecutor-4242-thread-1) [    x:collection1] o.a.s.c.CachingDirectoryFactory looking to close /home/jenkins/workspace/Lucene-Solr-trunk-Linux/solr/build/solr-core/test/J2/temp/solr.handler.PingRequestHandlerTest_2AE4E4E82A810B53-001/init-core-data-001/index [CachedDir<<refCount=0;path=/home/jenkins/workspace/Lucene-Solr-trunk-Linux/solr/build/solr-core/test/J2/temp/solr.handler.PingRequestHandlerTest_2AE4E4E82A810B53-001/init-core-data-001/index;done=false>>]
   [junit4]   2> 1288567 INFO  (coreCloseExecutor-4242-thread-1) [    x:collection1] o.a.s.c.CachingDirectoryFactory Closing directory: /home/jenkins/workspace/Lucene-Solr-trunk-Linux/solr/build/solr-core/test/J2/temp/solr.handler.PingRequestHandlerTest_2AE4E4E82A810B53-001/init-core-data-001/index
   [junit4]   2> 1288567 INFO  (coreCloseExecutor-4242-thread-1) [    x:collection1] o.a.s.c.CachingDirectoryFactory looking to close /home/jenkins/workspace/Lucene-Solr-trunk-Linux/solr/build/solr-core/test/J2/temp/solr.handler.PingRequestHandlerTest_2AE4E4E82A810B53-001/init-core-data-001 [CachedDir<<refCount=0;path=/home/jenkins/workspace/Lucene-Solr-trunk-Linux/solr/build/solr-core/test/J2/temp/solr.handler.PingRequestHandlerTest_2AE4E4E82A810B53-001/init-core-data-001;done=false>>]
   [junit4]   2> 1288567 INFO  (coreCloseExecutor-4242-thread-1) [    x:collection1] o.a.s.c.CachingDirectoryFactory Closing directory: /home/jenkins/workspace/Lucene-Solr-trunk-Linux/solr/build/solr-core/test/J2/temp/solr.handler.PingRequestHandlerTest_2AE4E4E82A810B53-001/init-core-data-001
   [junit4]   2> NOTE: leaving temporary files on disk at: /home/jenkins/workspace/Lucene-Solr-trunk-Linux/solr/build/solr-core/test/J2/temp/solr.handler.PingRequestHandlerTest_2AE4E4E82A810B53-001
   [junit4]   2> Feb 14, 2016 7:05:34 PM com.carrotsearch.randomizedtesting.ThreadLeakControl checkThreadLeaks
   [junit4]   2> WARNING: Will linger awaiting termination of 2 leaked thread(s).
   [junit4]   2> NOTE: test params are: codec=Asserting(Lucene60): {}, docValues:{}, sim=RandomSimilarity(queryNorm=true,coord=no): {}, locale=fr-FR, timezone=Africa/Brazzaville
   [junit4]   2> NOTE: Linux 3.19.0-47-generic amd64/Oracle Corporation 1.8.0_72 (64-bit)/cpus=12,threads=1,free=256893976,total=518979584
   [junit4]   2> NOTE: All tests run in this JVM: [TestLeaderElectionZkExpiry, TestCloudPivotFacet, CloudMLTQParserTest, OverseerRolesTest, TestSerializedLuceneMatchVersion, RequestHandlersTest, TestSolrCloudWithKerberosAlt, UpdateParamsTest, TestUniqueKeyFieldResource, TestDistribIDF, TestAuthorizationFramework, TestDistributedStatsComponentCardinality, AddSchemaFieldsUpdateProcessorFactoryTest, TestFuzzyAnalyzedSuggestions, SampleTest, TestCloudSchemaless, TestSort, LeaderElectionTest, VMParamsZkACLAndCredentialsProvidersTest, DistributedFacetPivotSmallTest, SolrTestCaseJ4Test, SolrCoreCheckLockOnStartupTest, BadCopyFieldTest, TestFastWriter, HttpPartitionTest, PluginInfoTest, QueryParsingTest, TestSuggestSpellingConverter, TestScoreJoinQPNoScore, SpatialHeatmapFacetsTest, TestStressReorder, LukeRequestHandlerTest, SolrXmlInZkTest, TestReload, CoreAdminHandlerTest, ScriptEngineTest, SuggesterTSTTest, PreAnalyzedUpdateProcessorTest, SearchHandlerTest, BlockDirectoryTest, HdfsLockFactoryTest, TestSearchPerf, DistributedQueryComponentOptimizationTest, SuggesterWFSTTest, CircularListTest, TestSchemaManager, HdfsRestartWhileUpdatingTest, BigEndianAscendingWordSerializerTest, TestMaxScoreQueryParser, TermVectorComponentDistributedTest, ShowFileRequestHandlerTest, TestConfigSetsAPIExclusivity, SharedFSAutoReplicaFailoverUtilsTest, TestSolrIndexConfig, CustomCollectionTest, TestStressRecovery, TestDistributedMissingSort, ZkStateWriterTest, TestSolrConfigHandlerConcurrent, TestRandomRequestDistribution, TestRequestForwarding, TestGroupingSearch, DateMathParserTest, TestAddFieldRealTimeGet, RecoveryZkTest, TestReversedWildcardFilterFactory, UnloadDistributedZkTest, TestRestoreCore, TestUtils, PrimitiveFieldTypeTest, TestJmxMonitoredMap, AssignTest, DistribCursorPagingTest, WrapperMergePolicyFactoryTest, CleanupOldIndexTest, TestTolerantSearch, TestChildDocTransformer, TestBulkSchemaConcurrent, StatsComponentTest, TestCharFilters, RestartWhileUpdatingTest, TestExtendedDismaxParser, SimpleFacetsTest, CachingDirectoryFactoryTest, TestConfigSetImmutable, HdfsDirectoryFactoryTest, TestJettySolrRunner, TestSolrCLIRunExample, TestSha256AuthenticationProvider, CoreMergeIndexesAdminHandlerTest, BasicDistributedZk2Test, TestManagedResource, TestExceedMaxTermLength, BaseCdcrDistributedZkTest, BasicZkTest, FullSolrCloudDistribCmdsTest, AutoCommitTest, ZkControllerTest, TestRealTimeGet, HardAutoCommitTest, SolrCoreTest, QueryElevationComponentTest, BadIndexSchemaTest, TestFiltering, DirectSolrSpellCheckerTest, TermsComponentTest, TestValueSourceCache, RequiredFieldsTest, FastVectorHighlighterTest, RegexBoostProcessorTest, TestCollationField, JSONWriterTest, TestAnalyzedSuggestions, PingRequestHandlerTest]
   [junit4] Completed [422/579 (1!)] on J2 in 10.68s, 6 tests, 1 error <<< FAILURES!

[...truncated 555 lines...]
BUILD FAILED
/home/jenkins/workspace/Lucene-Solr-trunk-Linux/build.xml:740: The following error occurred while executing this line:
/home/jenkins/workspace/Lucene-Solr-trunk-Linux/build.xml:684: The following error occurred while executing this line:
/home/jenkins/workspace/Lucene-Solr-trunk-Linux/build.xml:59: The following error occurred while executing this line:
/home/jenkins/workspace/Lucene-Solr-trunk-Linux/solr/build.xml:233: The following error occurred while executing this line:
/home/jenkins/workspace/Lucene-Solr-trunk-Linux/solr/common-build.xml:524: The following error occurred while executing this line:
/home/jenkins/workspace/Lucene-Solr-trunk-Linux/lucene/common-build.xml:1457: The following error occurred while executing this line:
/home/jenkins/workspace/Lucene-Solr-trunk-Linux/lucene/common-build.xml:1014: There were test failures: 579 suites (8 ignored), 2331 tests, 1 error, 117 ignored (72 assumptions) [seed: 2AE4E4E82A810B53]

Total time: 49 minutes 54 seconds
Build step 'Invoke Ant' marked build as failure
Archiving artifacts
[WARNINGS] Skipping publisher since build result is FAILURE
Recording test results
Email was triggered for: Failure - Any
Sending email for trigger: Failure - Any



Mime
View raw message