lucene-dev mailing list archives

Site index · List index
Message view « Date » · « Thread »
Top « Date » · « Thread »
From Policeman Jenkins Server <jenk...@thetaphi.de>
Subject [JENKINS] Lucene-Solr-5.5-Linux (64bit/jdk1.7.0_80) - Build # 50 - Failure!
Date Sat, 20 Feb 2016 01:43:29 GMT
Build: http://jenkins.thetaphi.de/job/Lucene-Solr-5.5-Linux/50/
Java: 64bit/jdk1.7.0_80 -XX:-UseCompressedOops -XX:+UseParallelGC

3 tests failed.
FAILED:  junit.framework.TestSuite.org.apache.solr.cloud.CollectionsAPIDistributedZkTest

Error Message:
6 threads leaked from SUITE scope at org.apache.solr.cloud.CollectionsAPIDistributedZkTest:     1) Thread[id=7292, name=zkCallback-1003-thread-3, state=TIMED_WAITING, group=TGRP-CollectionsAPIDistributedZkTest]         at sun.misc.Unsafe.park(Native Method)         at java.util.concurrent.locks.LockSupport.parkNanos(LockSupport.java:226)         at java.util.concurrent.SynchronousQueue$TransferStack.awaitFulfill(SynchronousQueue.java:460)         at java.util.concurrent.SynchronousQueue$TransferStack.transfer(SynchronousQueue.java:359)         at java.util.concurrent.SynchronousQueue.poll(SynchronousQueue.java:942)         at java.util.concurrent.ThreadPoolExecutor.getTask(ThreadPoolExecutor.java:1068)         at java.util.concurrent.ThreadPoolExecutor.runWorker(ThreadPoolExecutor.java:1130)         at java.util.concurrent.ThreadPoolExecutor$Worker.run(ThreadPoolExecutor.java:615)         at java.lang.Thread.run(Thread.java:745)    2) Thread[id=7126, name=TEST-CollectionsAPIDistributedZkTest.test-seed#[140C4DFE77815F2E]-EventThread, state=WAITING, group=TGRP-CollectionsAPIDistributedZkTest]         at sun.misc.Unsafe.park(Native Method)         at java.util.concurrent.locks.LockSupport.park(LockSupport.java:186)         at java.util.concurrent.locks.AbstractQueuedSynchronizer$ConditionObject.await(AbstractQueuedSynchronizer.java:2043)         at java.util.concurrent.LinkedBlockingQueue.take(LinkedBlockingQueue.java:442)         at org.apache.zookeeper.ClientCnxn$EventThread.run(ClientCnxn.java:494)    3) Thread[id=7304, name=zkCallback-1003-thread-5, state=TIMED_WAITING, group=TGRP-CollectionsAPIDistributedZkTest]         at sun.misc.Unsafe.park(Native Method)         at java.util.concurrent.locks.LockSupport.parkNanos(LockSupport.java:226)         at java.util.concurrent.SynchronousQueue$TransferStack.awaitFulfill(SynchronousQueue.java:460)         at java.util.concurrent.SynchronousQueue$TransferStack.transfer(SynchronousQueue.java:359)         at java.util.concurrent.SynchronousQueue.poll(SynchronousQueue.java:942)         at java.util.concurrent.ThreadPoolExecutor.getTask(ThreadPoolExecutor.java:1068)         at java.util.concurrent.ThreadPoolExecutor.runWorker(ThreadPoolExecutor.java:1130)         at java.util.concurrent.ThreadPoolExecutor$Worker.run(ThreadPoolExecutor.java:615)         at java.lang.Thread.run(Thread.java:745)    4) Thread[id=7265, name=zkCallback-1003-thread-2, state=TIMED_WAITING, group=TGRP-CollectionsAPIDistributedZkTest]         at sun.misc.Unsafe.park(Native Method)         at java.util.concurrent.locks.LockSupport.parkNanos(LockSupport.java:226)         at java.util.concurrent.SynchronousQueue$TransferStack.awaitFulfill(SynchronousQueue.java:460)         at java.util.concurrent.SynchronousQueue$TransferStack.transfer(SynchronousQueue.java:359)         at java.util.concurrent.SynchronousQueue.poll(SynchronousQueue.java:942)         at java.util.concurrent.ThreadPoolExecutor.getTask(ThreadPoolExecutor.java:1068)         at java.util.concurrent.ThreadPoolExecutor.runWorker(ThreadPoolExecutor.java:1130)         at java.util.concurrent.ThreadPoolExecutor$Worker.run(ThreadPoolExecutor.java:615)         at java.lang.Thread.run(Thread.java:745)    5) Thread[id=7125, name=TEST-CollectionsAPIDistributedZkTest.test-seed#[140C4DFE77815F2E]-SendThread(127.0.0.1:55041), state=TIMED_WAITING, group=TGRP-CollectionsAPIDistributedZkTest]         at java.lang.Thread.sleep(Native Method)         at org.apache.zookeeper.client.StaticHostProvider.next(StaticHostProvider.java:101)         at org.apache.zookeeper.ClientCnxn$SendThread.startConnect(ClientCnxn.java:940)         at org.apache.zookeeper.ClientCnxn$SendThread.run(ClientCnxn.java:1003)    6) Thread[id=7303, name=zkCallback-1003-thread-4, state=TIMED_WAITING, group=TGRP-CollectionsAPIDistributedZkTest]         at sun.misc.Unsafe.park(Native Method)         at java.util.concurrent.locks.LockSupport.parkNanos(LockSupport.java:226)         at java.util.concurrent.SynchronousQueue$TransferStack.awaitFulfill(SynchronousQueue.java:460)         at java.util.concurrent.SynchronousQueue$TransferStack.transfer(SynchronousQueue.java:359)         at java.util.concurrent.SynchronousQueue.poll(SynchronousQueue.java:942)         at java.util.concurrent.ThreadPoolExecutor.getTask(ThreadPoolExecutor.java:1068)         at java.util.concurrent.ThreadPoolExecutor.runWorker(ThreadPoolExecutor.java:1130)         at java.util.concurrent.ThreadPoolExecutor$Worker.run(ThreadPoolExecutor.java:615)         at java.lang.Thread.run(Thread.java:745)

Stack Trace:
com.carrotsearch.randomizedtesting.ThreadLeakError: 6 threads leaked from SUITE scope at org.apache.solr.cloud.CollectionsAPIDistributedZkTest: 
   1) Thread[id=7292, name=zkCallback-1003-thread-3, state=TIMED_WAITING, group=TGRP-CollectionsAPIDistributedZkTest]
        at sun.misc.Unsafe.park(Native Method)
        at java.util.concurrent.locks.LockSupport.parkNanos(LockSupport.java:226)
        at java.util.concurrent.SynchronousQueue$TransferStack.awaitFulfill(SynchronousQueue.java:460)
        at java.util.concurrent.SynchronousQueue$TransferStack.transfer(SynchronousQueue.java:359)
        at java.util.concurrent.SynchronousQueue.poll(SynchronousQueue.java:942)
        at java.util.concurrent.ThreadPoolExecutor.getTask(ThreadPoolExecutor.java:1068)
        at java.util.concurrent.ThreadPoolExecutor.runWorker(ThreadPoolExecutor.java:1130)
        at java.util.concurrent.ThreadPoolExecutor$Worker.run(ThreadPoolExecutor.java:615)
        at java.lang.Thread.run(Thread.java:745)
   2) Thread[id=7126, name=TEST-CollectionsAPIDistributedZkTest.test-seed#[140C4DFE77815F2E]-EventThread, state=WAITING, group=TGRP-CollectionsAPIDistributedZkTest]
        at sun.misc.Unsafe.park(Native Method)
        at java.util.concurrent.locks.LockSupport.park(LockSupport.java:186)
        at java.util.concurrent.locks.AbstractQueuedSynchronizer$ConditionObject.await(AbstractQueuedSynchronizer.java:2043)
        at java.util.concurrent.LinkedBlockingQueue.take(LinkedBlockingQueue.java:442)
        at org.apache.zookeeper.ClientCnxn$EventThread.run(ClientCnxn.java:494)
   3) Thread[id=7304, name=zkCallback-1003-thread-5, state=TIMED_WAITING, group=TGRP-CollectionsAPIDistributedZkTest]
        at sun.misc.Unsafe.park(Native Method)
        at java.util.concurrent.locks.LockSupport.parkNanos(LockSupport.java:226)
        at java.util.concurrent.SynchronousQueue$TransferStack.awaitFulfill(SynchronousQueue.java:460)
        at java.util.concurrent.SynchronousQueue$TransferStack.transfer(SynchronousQueue.java:359)
        at java.util.concurrent.SynchronousQueue.poll(SynchronousQueue.java:942)
        at java.util.concurrent.ThreadPoolExecutor.getTask(ThreadPoolExecutor.java:1068)
        at java.util.concurrent.ThreadPoolExecutor.runWorker(ThreadPoolExecutor.java:1130)
        at java.util.concurrent.ThreadPoolExecutor$Worker.run(ThreadPoolExecutor.java:615)
        at java.lang.Thread.run(Thread.java:745)
   4) Thread[id=7265, name=zkCallback-1003-thread-2, state=TIMED_WAITING, group=TGRP-CollectionsAPIDistributedZkTest]
        at sun.misc.Unsafe.park(Native Method)
        at java.util.concurrent.locks.LockSupport.parkNanos(LockSupport.java:226)
        at java.util.concurrent.SynchronousQueue$TransferStack.awaitFulfill(SynchronousQueue.java:460)
        at java.util.concurrent.SynchronousQueue$TransferStack.transfer(SynchronousQueue.java:359)
        at java.util.concurrent.SynchronousQueue.poll(SynchronousQueue.java:942)
        at java.util.concurrent.ThreadPoolExecutor.getTask(ThreadPoolExecutor.java:1068)
        at java.util.concurrent.ThreadPoolExecutor.runWorker(ThreadPoolExecutor.java:1130)
        at java.util.concurrent.ThreadPoolExecutor$Worker.run(ThreadPoolExecutor.java:615)
        at java.lang.Thread.run(Thread.java:745)
   5) Thread[id=7125, name=TEST-CollectionsAPIDistributedZkTest.test-seed#[140C4DFE77815F2E]-SendThread(127.0.0.1:55041), state=TIMED_WAITING, group=TGRP-CollectionsAPIDistributedZkTest]
        at java.lang.Thread.sleep(Native Method)
        at org.apache.zookeeper.client.StaticHostProvider.next(StaticHostProvider.java:101)
        at org.apache.zookeeper.ClientCnxn$SendThread.startConnect(ClientCnxn.java:940)
        at org.apache.zookeeper.ClientCnxn$SendThread.run(ClientCnxn.java:1003)
   6) Thread[id=7303, name=zkCallback-1003-thread-4, state=TIMED_WAITING, group=TGRP-CollectionsAPIDistributedZkTest]
        at sun.misc.Unsafe.park(Native Method)
        at java.util.concurrent.locks.LockSupport.parkNanos(LockSupport.java:226)
        at java.util.concurrent.SynchronousQueue$TransferStack.awaitFulfill(SynchronousQueue.java:460)
        at java.util.concurrent.SynchronousQueue$TransferStack.transfer(SynchronousQueue.java:359)
        at java.util.concurrent.SynchronousQueue.poll(SynchronousQueue.java:942)
        at java.util.concurrent.ThreadPoolExecutor.getTask(ThreadPoolExecutor.java:1068)
        at java.util.concurrent.ThreadPoolExecutor.runWorker(ThreadPoolExecutor.java:1130)
        at java.util.concurrent.ThreadPoolExecutor$Worker.run(ThreadPoolExecutor.java:615)
        at java.lang.Thread.run(Thread.java:745)
	at __randomizedtesting.SeedInfo.seed([140C4DFE77815F2E]:0)


FAILED:  junit.framework.TestSuite.org.apache.solr.cloud.CollectionsAPIDistributedZkTest

Error Message:
There are still zombie threads that couldn't be terminated:    1) Thread[id=7265, name=zkCallback-1003-thread-2, state=TIMED_WAITING, group=TGRP-CollectionsAPIDistributedZkTest]         at sun.misc.Unsafe.park(Native Method)         at java.util.concurrent.locks.LockSupport.parkNanos(LockSupport.java:226)         at java.util.concurrent.SynchronousQueue$TransferStack.awaitFulfill(SynchronousQueue.java:460)         at java.util.concurrent.SynchronousQueue$TransferStack.transfer(SynchronousQueue.java:359)         at java.util.concurrent.SynchronousQueue.poll(SynchronousQueue.java:942)         at java.util.concurrent.ThreadPoolExecutor.getTask(ThreadPoolExecutor.java:1068)         at java.util.concurrent.ThreadPoolExecutor.runWorker(ThreadPoolExecutor.java:1130)         at java.util.concurrent.ThreadPoolExecutor$Worker.run(ThreadPoolExecutor.java:615)         at java.lang.Thread.run(Thread.java:745)    2) Thread[id=7125, name=TEST-CollectionsAPIDistributedZkTest.test-seed#[140C4DFE77815F2E]-SendThread(127.0.0.1:55041), state=TIMED_WAITING, group=TGRP-CollectionsAPIDistributedZkTest]         at java.lang.Thread.sleep(Native Method)         at org.apache.zookeeper.client.StaticHostProvider.next(StaticHostProvider.java:101)         at org.apache.zookeeper.ClientCnxn$SendThread.startConnect(ClientCnxn.java:940)         at org.apache.zookeeper.ClientCnxn$SendThread.run(ClientCnxn.java:1003)    3) Thread[id=7303, name=zkCallback-1003-thread-4, state=TIMED_WAITING, group=TGRP-CollectionsAPIDistributedZkTest]         at sun.misc.Unsafe.park(Native Method)         at java.util.concurrent.locks.LockSupport.parkNanos(LockSupport.java:226)         at java.util.concurrent.SynchronousQueue$TransferStack.awaitFulfill(SynchronousQueue.java:460)         at java.util.concurrent.SynchronousQueue$TransferStack.transfer(SynchronousQueue.java:359)         at java.util.concurrent.SynchronousQueue.poll(SynchronousQueue.java:942)         at java.util.concurrent.ThreadPoolExecutor.getTask(ThreadPoolExecutor.java:1068)         at java.util.concurrent.ThreadPoolExecutor.runWorker(ThreadPoolExecutor.java:1130)         at java.util.concurrent.ThreadPoolExecutor$Worker.run(ThreadPoolExecutor.java:615)         at java.lang.Thread.run(Thread.java:745)    4) Thread[id=7292, name=zkCallback-1003-thread-3, state=TIMED_WAITING, group=TGRP-CollectionsAPIDistributedZkTest]         at sun.misc.Unsafe.park(Native Method)         at java.util.concurrent.locks.LockSupport.parkNanos(LockSupport.java:226)         at java.util.concurrent.SynchronousQueue$TransferStack.awaitFulfill(SynchronousQueue.java:460)         at java.util.concurrent.SynchronousQueue$TransferStack.transfer(SynchronousQueue.java:359)         at java.util.concurrent.SynchronousQueue.poll(SynchronousQueue.java:942)         at java.util.concurrent.ThreadPoolExecutor.getTask(ThreadPoolExecutor.java:1068)         at java.util.concurrent.ThreadPoolExecutor.runWorker(ThreadPoolExecutor.java:1130)         at java.util.concurrent.ThreadPoolExecutor$Worker.run(ThreadPoolExecutor.java:615)         at java.lang.Thread.run(Thread.java:745)    5) Thread[id=7304, name=zkCallback-1003-thread-5, state=TIMED_WAITING, group=TGRP-CollectionsAPIDistributedZkTest]         at sun.misc.Unsafe.park(Native Method)         at java.util.concurrent.locks.LockSupport.parkNanos(LockSupport.java:226)         at java.util.concurrent.SynchronousQueue$TransferStack.awaitFulfill(SynchronousQueue.java:460)         at java.util.concurrent.SynchronousQueue$TransferStack.transfer(SynchronousQueue.java:359)         at java.util.concurrent.SynchronousQueue.poll(SynchronousQueue.java:942)         at java.util.concurrent.ThreadPoolExecutor.getTask(ThreadPoolExecutor.java:1068)         at java.util.concurrent.ThreadPoolExecutor.runWorker(ThreadPoolExecutor.java:1130)         at java.util.concurrent.ThreadPoolExecutor$Worker.run(ThreadPoolExecutor.java:615)         at java.lang.Thread.run(Thread.java:745)

Stack Trace:
com.carrotsearch.randomizedtesting.ThreadLeakError: There are still zombie threads that couldn't be terminated:
   1) Thread[id=7265, name=zkCallback-1003-thread-2, state=TIMED_WAITING, group=TGRP-CollectionsAPIDistributedZkTest]
        at sun.misc.Unsafe.park(Native Method)
        at java.util.concurrent.locks.LockSupport.parkNanos(LockSupport.java:226)
        at java.util.concurrent.SynchronousQueue$TransferStack.awaitFulfill(SynchronousQueue.java:460)
        at java.util.concurrent.SynchronousQueue$TransferStack.transfer(SynchronousQueue.java:359)
        at java.util.concurrent.SynchronousQueue.poll(SynchronousQueue.java:942)
        at java.util.concurrent.ThreadPoolExecutor.getTask(ThreadPoolExecutor.java:1068)
        at java.util.concurrent.ThreadPoolExecutor.runWorker(ThreadPoolExecutor.java:1130)
        at java.util.concurrent.ThreadPoolExecutor$Worker.run(ThreadPoolExecutor.java:615)
        at java.lang.Thread.run(Thread.java:745)
   2) Thread[id=7125, name=TEST-CollectionsAPIDistributedZkTest.test-seed#[140C4DFE77815F2E]-SendThread(127.0.0.1:55041), state=TIMED_WAITING, group=TGRP-CollectionsAPIDistributedZkTest]
        at java.lang.Thread.sleep(Native Method)
        at org.apache.zookeeper.client.StaticHostProvider.next(StaticHostProvider.java:101)
        at org.apache.zookeeper.ClientCnxn$SendThread.startConnect(ClientCnxn.java:940)
        at org.apache.zookeeper.ClientCnxn$SendThread.run(ClientCnxn.java:1003)
   3) Thread[id=7303, name=zkCallback-1003-thread-4, state=TIMED_WAITING, group=TGRP-CollectionsAPIDistributedZkTest]
        at sun.misc.Unsafe.park(Native Method)
        at java.util.concurrent.locks.LockSupport.parkNanos(LockSupport.java:226)
        at java.util.concurrent.SynchronousQueue$TransferStack.awaitFulfill(SynchronousQueue.java:460)
        at java.util.concurrent.SynchronousQueue$TransferStack.transfer(SynchronousQueue.java:359)
        at java.util.concurrent.SynchronousQueue.poll(SynchronousQueue.java:942)
        at java.util.concurrent.ThreadPoolExecutor.getTask(ThreadPoolExecutor.java:1068)
        at java.util.concurrent.ThreadPoolExecutor.runWorker(ThreadPoolExecutor.java:1130)
        at java.util.concurrent.ThreadPoolExecutor$Worker.run(ThreadPoolExecutor.java:615)
        at java.lang.Thread.run(Thread.java:745)
   4) Thread[id=7292, name=zkCallback-1003-thread-3, state=TIMED_WAITING, group=TGRP-CollectionsAPIDistributedZkTest]
        at sun.misc.Unsafe.park(Native Method)
        at java.util.concurrent.locks.LockSupport.parkNanos(LockSupport.java:226)
        at java.util.concurrent.SynchronousQueue$TransferStack.awaitFulfill(SynchronousQueue.java:460)
        at java.util.concurrent.SynchronousQueue$TransferStack.transfer(SynchronousQueue.java:359)
        at java.util.concurrent.SynchronousQueue.poll(SynchronousQueue.java:942)
        at java.util.concurrent.ThreadPoolExecutor.getTask(ThreadPoolExecutor.java:1068)
        at java.util.concurrent.ThreadPoolExecutor.runWorker(ThreadPoolExecutor.java:1130)
        at java.util.concurrent.ThreadPoolExecutor$Worker.run(ThreadPoolExecutor.java:615)
        at java.lang.Thread.run(Thread.java:745)
   5) Thread[id=7304, name=zkCallback-1003-thread-5, state=TIMED_WAITING, group=TGRP-CollectionsAPIDistributedZkTest]
        at sun.misc.Unsafe.park(Native Method)
        at java.util.concurrent.locks.LockSupport.parkNanos(LockSupport.java:226)
        at java.util.concurrent.SynchronousQueue$TransferStack.awaitFulfill(SynchronousQueue.java:460)
        at java.util.concurrent.SynchronousQueue$TransferStack.transfer(SynchronousQueue.java:359)
        at java.util.concurrent.SynchronousQueue.poll(SynchronousQueue.java:942)
        at java.util.concurrent.ThreadPoolExecutor.getTask(ThreadPoolExecutor.java:1068)
        at java.util.concurrent.ThreadPoolExecutor.runWorker(ThreadPoolExecutor.java:1130)
        at java.util.concurrent.ThreadPoolExecutor$Worker.run(ThreadPoolExecutor.java:615)
        at java.lang.Thread.run(Thread.java:745)
	at __randomizedtesting.SeedInfo.seed([140C4DFE77815F2E]:0)


FAILED:  org.apache.solr.cloud.CollectionsAPIDistributedZkTest.test

Error Message:
some core start times did not change on reload

Stack Trace:
java.lang.AssertionError: some core start times did not change on reload
	at __randomizedtesting.SeedInfo.seed([140C4DFE77815F2E:9C587224D97D32D6]:0)
	at org.junit.Assert.fail(Assert.java:93)
	at org.junit.Assert.assertTrue(Assert.java:43)
	at org.apache.solr.cloud.CollectionsAPIDistributedZkTest.testCollectionsAPI(CollectionsAPIDistributedZkTest.java:822)
	at org.apache.solr.cloud.CollectionsAPIDistributedZkTest.test(CollectionsAPIDistributedZkTest.java:160)
	at sun.reflect.NativeMethodAccessorImpl.invoke0(Native Method)
	at sun.reflect.NativeMethodAccessorImpl.invoke(NativeMethodAccessorImpl.java:57)
	at sun.reflect.DelegatingMethodAccessorImpl.invoke(DelegatingMethodAccessorImpl.java:43)
	at java.lang.reflect.Method.invoke(Method.java:606)
	at com.carrotsearch.randomizedtesting.RandomizedRunner.invoke(RandomizedRunner.java:1764)
	at com.carrotsearch.randomizedtesting.RandomizedRunner$8.evaluate(RandomizedRunner.java:871)
	at com.carrotsearch.randomizedtesting.RandomizedRunner$9.evaluate(RandomizedRunner.java:907)
	at com.carrotsearch.randomizedtesting.RandomizedRunner$10.evaluate(RandomizedRunner.java:921)
	at org.apache.solr.BaseDistributedSearchTestCase$ShardsRepeatRule$ShardsFixedStatement.callStatement(BaseDistributedSearchTestCase.java:964)
	at org.apache.solr.BaseDistributedSearchTestCase$ShardsRepeatRule$ShardsStatement.evaluate(BaseDistributedSearchTestCase.java:939)
	at com.carrotsearch.randomizedtesting.rules.SystemPropertiesRestoreRule$1.evaluate(SystemPropertiesRestoreRule.java:57)
	at org.apache.lucene.util.TestRuleSetupTeardownChained$1.evaluate(TestRuleSetupTeardownChained.java:49)
	at org.apache.lucene.util.AbstractBeforeAfterRule$1.evaluate(AbstractBeforeAfterRule.java:45)
	at org.apache.lucene.util.TestRuleThreadAndTestName$1.evaluate(TestRuleThreadAndTestName.java:48)
	at org.apache.lucene.util.TestRuleIgnoreAfterMaxFailures$1.evaluate(TestRuleIgnoreAfterMaxFailures.java:64)
	at org.apache.lucene.util.TestRuleMarkFailure$1.evaluate(TestRuleMarkFailure.java:47)
	at com.carrotsearch.randomizedtesting.rules.StatementAdapter.evaluate(StatementAdapter.java:36)
	at com.carrotsearch.randomizedtesting.ThreadLeakControl$StatementRunner.run(ThreadLeakControl.java:367)
	at com.carrotsearch.randomizedtesting.ThreadLeakControl.forkTimeoutingTask(ThreadLeakControl.java:809)
	at com.carrotsearch.randomizedtesting.ThreadLeakControl$3.evaluate(ThreadLeakControl.java:460)
	at com.carrotsearch.randomizedtesting.RandomizedRunner.runSingleTest(RandomizedRunner.java:880)
	at com.carrotsearch.randomizedtesting.RandomizedRunner$5.evaluate(RandomizedRunner.java:781)
	at com.carrotsearch.randomizedtesting.RandomizedRunner$6.evaluate(RandomizedRunner.java:816)
	at com.carrotsearch.randomizedtesting.RandomizedRunner$7.evaluate(RandomizedRunner.java:827)
	at com.carrotsearch.randomizedtesting.rules.StatementAdapter.evaluate(StatementAdapter.java:36)
	at com.carrotsearch.randomizedtesting.rules.SystemPropertiesRestoreRule$1.evaluate(SystemPropertiesRestoreRule.java:57)
	at org.apache.lucene.util.AbstractBeforeAfterRule$1.evaluate(AbstractBeforeAfterRule.java:45)
	at com.carrotsearch.randomizedtesting.rules.StatementAdapter.evaluate(StatementAdapter.java:36)
	at org.apache.lucene.util.TestRuleStoreClassName$1.evaluate(TestRuleStoreClassName.java:41)
	at com.carrotsearch.randomizedtesting.rules.NoShadowingOrOverridesOnMethodsRule$1.evaluate(NoShadowingOrOverridesOnMethodsRule.java:40)
	at com.carrotsearch.randomizedtesting.rules.NoShadowingOrOverridesOnMethodsRule$1.evaluate(NoShadowingOrOverridesOnMethodsRule.java:40)
	at com.carrotsearch.randomizedtesting.rules.StatementAdapter.evaluate(StatementAdapter.java:36)
	at com.carrotsearch.randomizedtesting.rules.StatementAdapter.evaluate(StatementAdapter.java:36)
	at com.carrotsearch.randomizedtesting.rules.StatementAdapter.evaluate(StatementAdapter.java:36)
	at org.apache.lucene.util.TestRuleAssertionsRequired$1.evaluate(TestRuleAssertionsRequired.java:53)
	at org.apache.lucene.util.TestRuleMarkFailure$1.evaluate(TestRuleMarkFailure.java:47)
	at org.apache.lucene.util.TestRuleIgnoreAfterMaxFailures$1.evaluate(TestRuleIgnoreAfterMaxFailures.java:64)
	at org.apache.lucene.util.TestRuleIgnoreTestSuites$1.evaluate(TestRuleIgnoreTestSuites.java:54)
	at com.carrotsearch.randomizedtesting.rules.StatementAdapter.evaluate(StatementAdapter.java:36)
	at com.carrotsearch.randomizedtesting.ThreadLeakControl$StatementRunner.run(ThreadLeakControl.java:367)
	at java.lang.Thread.run(Thread.java:745)




Build Log:
[...truncated 11493 lines...]
   [junit4] Suite: org.apache.solr.cloud.CollectionsAPIDistributedZkTest
   [junit4]   2> Creating dataDir: /home/jenkins/workspace/Lucene-Solr-5.5-Linux/solr/build/solr-core/test/J1/temp/solr.cloud.CollectionsAPIDistributedZkTest_140C4DFE77815F2E-001/init-core-data-001
   [junit4]   2> 930170 INFO  (SUITE-CollectionsAPIDistributedZkTest-seed#[140C4DFE77815F2E]-worker) [    ] o.a.s.SolrTestCaseJ4 Randomized ssl (true) and clientAuth (false)
   [junit4]   2> 930170 INFO  (SUITE-CollectionsAPIDistributedZkTest-seed#[140C4DFE77815F2E]-worker) [    ] o.a.s.BaseDistributedSearchTestCase Setting hostContext system property: /
   [junit4]   2> 930174 INFO  (TEST-CollectionsAPIDistributedZkTest.test-seed#[140C4DFE77815F2E]) [    ] o.a.s.c.ZkTestServer STARTING ZK TEST SERVER
   [junit4]   2> 930174 INFO  (Thread-2615) [    ] o.a.s.c.ZkTestServer client port:0.0.0.0/0.0.0.0:0
   [junit4]   2> 930174 INFO  (Thread-2615) [    ] o.a.s.c.ZkTestServer Starting server
   [junit4]   2> 930274 INFO  (TEST-CollectionsAPIDistributedZkTest.test-seed#[140C4DFE77815F2E]) [    ] o.a.s.c.ZkTestServer start zk server on port:55041
   [junit4]   2> 930274 INFO  (TEST-CollectionsAPIDistributedZkTest.test-seed#[140C4DFE77815F2E]) [    ] o.a.s.c.c.SolrZkClient Using default ZkCredentialsProvider
   [junit4]   2> 930274 INFO  (TEST-CollectionsAPIDistributedZkTest.test-seed#[140C4DFE77815F2E]) [    ] o.a.s.c.c.ConnectionManager Waiting for client to connect to ZooKeeper
   [junit4]   2> 930276 INFO  (zkCallback-965-thread-1) [    ] o.a.s.c.c.ConnectionManager Watcher org.apache.solr.common.cloud.ConnectionManager@6731ad72 name:ZooKeeperConnection Watcher:127.0.0.1:55041 got event WatchedEvent state:SyncConnected type:None path:null path:null type:None
   [junit4]   2> 930276 INFO  (TEST-CollectionsAPIDistributedZkTest.test-seed#[140C4DFE77815F2E]) [    ] o.a.s.c.c.ConnectionManager Client is connected to ZooKeeper
   [junit4]   2> 930276 INFO  (TEST-CollectionsAPIDistributedZkTest.test-seed#[140C4DFE77815F2E]) [    ] o.a.s.c.c.SolrZkClient Using default ZkACLProvider
   [junit4]   2> 930276 INFO  (TEST-CollectionsAPIDistributedZkTest.test-seed#[140C4DFE77815F2E]) [    ] o.a.s.c.c.SolrZkClient makePath: /solr
   [junit4]   2> 930277 INFO  (TEST-CollectionsAPIDistributedZkTest.test-seed#[140C4DFE77815F2E]) [    ] o.a.s.c.c.SolrZkClient Using default ZkCredentialsProvider
   [junit4]   2> 930277 INFO  (TEST-CollectionsAPIDistributedZkTest.test-seed#[140C4DFE77815F2E]) [    ] o.a.s.c.c.ConnectionManager Waiting for client to connect to ZooKeeper
   [junit4]   2> 930278 INFO  (zkCallback-966-thread-1) [    ] o.a.s.c.c.ConnectionManager Watcher org.apache.solr.common.cloud.ConnectionManager@10e4f53f name:ZooKeeperConnection Watcher:127.0.0.1:55041/solr got event WatchedEvent state:SyncConnected type:None path:null path:null type:None
   [junit4]   2> 930278 INFO  (TEST-CollectionsAPIDistributedZkTest.test-seed#[140C4DFE77815F2E]) [    ] o.a.s.c.c.ConnectionManager Client is connected to ZooKeeper
   [junit4]   2> 930278 INFO  (TEST-CollectionsAPIDistributedZkTest.test-seed#[140C4DFE77815F2E]) [    ] o.a.s.c.c.SolrZkClient Using default ZkACLProvider
   [junit4]   2> 930278 INFO  (TEST-CollectionsAPIDistributedZkTest.test-seed#[140C4DFE77815F2E]) [    ] o.a.s.c.c.SolrZkClient makePath: /collections/collection1
   [junit4]   2> 930279 INFO  (TEST-CollectionsAPIDistributedZkTest.test-seed#[140C4DFE77815F2E]) [    ] o.a.s.c.c.SolrZkClient makePath: /collections/collection1/shards
   [junit4]   2> 930280 INFO  (TEST-CollectionsAPIDistributedZkTest.test-seed#[140C4DFE77815F2E]) [    ] o.a.s.c.c.SolrZkClient makePath: /collections/control_collection
   [junit4]   2> 930280 INFO  (TEST-CollectionsAPIDistributedZkTest.test-seed#[140C4DFE77815F2E]) [    ] o.a.s.c.c.SolrZkClient makePath: /collections/control_collection/shards
   [junit4]   2> 930280 INFO  (TEST-CollectionsAPIDistributedZkTest.test-seed#[140C4DFE77815F2E]) [    ] o.a.s.c.AbstractZkTestCase put /home/jenkins/workspace/Lucene-Solr-5.5-Linux/solr/core/src/test-files/solr/collection1/conf/solrconfig-tlog.xml to /configs/conf1/solrconfig.xml
   [junit4]   2> 930281 INFO  (TEST-CollectionsAPIDistributedZkTest.test-seed#[140C4DFE77815F2E]) [    ] o.a.s.c.c.SolrZkClient makePath: /configs/conf1/solrconfig.xml
   [junit4]   2> 930281 INFO  (TEST-CollectionsAPIDistributedZkTest.test-seed#[140C4DFE77815F2E]) [    ] o.a.s.c.AbstractZkTestCase put /home/jenkins/workspace/Lucene-Solr-5.5-Linux/solr/core/src/test-files/solr/collection1/conf/schema.xml to /configs/conf1/schema.xml
   [junit4]   2> 930281 INFO  (TEST-CollectionsAPIDistributedZkTest.test-seed#[140C4DFE77815F2E]) [    ] o.a.s.c.c.SolrZkClient makePath: /configs/conf1/schema.xml
   [junit4]   2> 930282 INFO  (TEST-CollectionsAPIDistributedZkTest.test-seed#[140C4DFE77815F2E]) [    ] o.a.s.c.AbstractZkTestCase put /home/jenkins/workspace/Lucene-Solr-5.5-Linux/solr/core/src/test-files/solr/collection1/conf/solrconfig.snippet.randomindexconfig.xml to /configs/conf1/solrconfig.snippet.randomindexconfig.xml
   [junit4]   2> 930282 INFO  (TEST-CollectionsAPIDistributedZkTest.test-seed#[140C4DFE77815F2E]) [    ] o.a.s.c.c.SolrZkClient makePath: /configs/conf1/solrconfig.snippet.randomindexconfig.xml
   [junit4]   2> 930283 INFO  (TEST-CollectionsAPIDistributedZkTest.test-seed#[140C4DFE77815F2E]) [    ] o.a.s.c.AbstractZkTestCase put /home/jenkins/workspace/Lucene-Solr-5.5-Linux/solr/core/src/test-files/solr/collection1/conf/stopwords.txt to /configs/conf1/stopwords.txt
   [junit4]   2> 930283 INFO  (TEST-CollectionsAPIDistributedZkTest.test-seed#[140C4DFE77815F2E]) [    ] o.a.s.c.c.SolrZkClient makePath: /configs/conf1/stopwords.txt
   [junit4]   2> 930283 INFO  (TEST-CollectionsAPIDistributedZkTest.test-seed#[140C4DFE77815F2E]) [    ] o.a.s.c.AbstractZkTestCase put /home/jenkins/workspace/Lucene-Solr-5.5-Linux/solr/core/src/test-files/solr/collection1/conf/protwords.txt to /configs/conf1/protwords.txt
   [junit4]   2> 930283 INFO  (TEST-CollectionsAPIDistributedZkTest.test-seed#[140C4DFE77815F2E]) [    ] o.a.s.c.c.SolrZkClient makePath: /configs/conf1/protwords.txt
   [junit4]   2> 930291 INFO  (TEST-CollectionsAPIDistributedZkTest.test-seed#[140C4DFE77815F2E]) [    ] o.a.s.c.AbstractZkTestCase put /home/jenkins/workspace/Lucene-Solr-5.5-Linux/solr/core/src/test-files/solr/collection1/conf/currency.xml to /configs/conf1/currency.xml
   [junit4]   2> 930291 INFO  (TEST-CollectionsAPIDistributedZkTest.test-seed#[140C4DFE77815F2E]) [    ] o.a.s.c.c.SolrZkClient makePath: /configs/conf1/currency.xml
   [junit4]   2> 930292 INFO  (TEST-CollectionsAPIDistributedZkTest.test-seed#[140C4DFE77815F2E]) [    ] o.a.s.c.AbstractZkTestCase put /home/jenkins/workspace/Lucene-Solr-5.5-Linux/solr/core/src/test-files/solr/collection1/conf/enumsConfig.xml to /configs/conf1/enumsConfig.xml
   [junit4]   2> 930292 INFO  (TEST-CollectionsAPIDistributedZkTest.test-seed#[140C4DFE77815F2E]) [    ] o.a.s.c.c.SolrZkClient makePath: /configs/conf1/enumsConfig.xml
   [junit4]   2> 930292 INFO  (TEST-CollectionsAPIDistributedZkTest.test-seed#[140C4DFE77815F2E]) [    ] o.a.s.c.AbstractZkTestCase put /home/jenkins/workspace/Lucene-Solr-5.5-Linux/solr/core/src/test-files/solr/collection1/conf/open-exchange-rates.json to /configs/conf1/open-exchange-rates.json
   [junit4]   2> 930292 INFO  (TEST-CollectionsAPIDistributedZkTest.test-seed#[140C4DFE77815F2E]) [    ] o.a.s.c.c.SolrZkClient makePath: /configs/conf1/open-exchange-rates.json
   [junit4]   2> 930293 INFO  (TEST-CollectionsAPIDistributedZkTest.test-seed#[140C4DFE77815F2E]) [    ] o.a.s.c.AbstractZkTestCase put /home/jenkins/workspace/Lucene-Solr-5.5-Linux/solr/core/src/test-files/solr/collection1/conf/mapping-ISOLatin1Accent.txt to /configs/conf1/mapping-ISOLatin1Accent.txt
   [junit4]   2> 930293 INFO  (TEST-CollectionsAPIDistributedZkTest.test-seed#[140C4DFE77815F2E]) [    ] o.a.s.c.c.SolrZkClient makePath: /configs/conf1/mapping-ISOLatin1Accent.txt
   [junit4]   2> 930294 INFO  (TEST-CollectionsAPIDistributedZkTest.test-seed#[140C4DFE77815F2E]) [    ] o.a.s.c.AbstractZkTestCase put /home/jenkins/workspace/Lucene-Solr-5.5-Linux/solr/core/src/test-files/solr/collection1/conf/old_synonyms.txt to /configs/conf1/old_synonyms.txt
   [junit4]   2> 930294 INFO  (TEST-CollectionsAPIDistributedZkTest.test-seed#[140C4DFE77815F2E]) [    ] o.a.s.c.c.SolrZkClient makePath: /configs/conf1/old_synonyms.txt
   [junit4]   2> 930294 INFO  (TEST-CollectionsAPIDistributedZkTest.test-seed#[140C4DFE77815F2E]) [    ] o.a.s.c.AbstractZkTestCase put /home/jenkins/workspace/Lucene-Solr-5.5-Linux/solr/core/src/test-files/solr/collection1/conf/synonyms.txt to /configs/conf1/synonyms.txt
   [junit4]   2> 930295 INFO  (TEST-CollectionsAPIDistributedZkTest.test-seed#[140C4DFE77815F2E]) [    ] o.a.s.c.c.SolrZkClient makePath: /configs/conf1/synonyms.txt
   [junit4]   2> 930295 INFO  (TEST-CollectionsAPIDistributedZkTest.test-seed#[140C4DFE77815F2E]) [    ] o.a.s.c.c.SolrZkClient Using default ZkCredentialsProvider
   [junit4]   2> 930295 INFO  (TEST-CollectionsAPIDistributedZkTest.test-seed#[140C4DFE77815F2E]) [    ] o.a.s.c.c.ConnectionManager Waiting for client to connect to ZooKeeper
   [junit4]   2> 930296 INFO  (zkCallback-967-thread-1) [    ] o.a.s.c.c.ConnectionManager Watcher org.apache.solr.common.cloud.ConnectionManager@12617059 name:ZooKeeperConnection Watcher:127.0.0.1:55041/solr got event WatchedEvent state:SyncConnected type:None path:null path:null type:None
   [junit4]   2> 930296 INFO  (TEST-CollectionsAPIDistributedZkTest.test-seed#[140C4DFE77815F2E]) [    ] o.a.s.c.c.ConnectionManager Client is connected to ZooKeeper
   [junit4]   2> 930296 INFO  (TEST-CollectionsAPIDistributedZkTest.test-seed#[140C4DFE77815F2E]) [    ] o.a.s.c.c.SolrZkClient Using default ZkACLProvider
   [junit4]   2> 930345 INFO  (TEST-CollectionsAPIDistributedZkTest.test-seed#[140C4DFE77815F2E]) [    ] o.a.s.SolrTestCaseJ4 Writing core.properties file to /home/jenkins/workspace/Lucene-Solr-5.5-Linux/solr/build/solr-core/test/J1/temp/solr.cloud.CollectionsAPIDistributedZkTest_140C4DFE77815F2E-001/control-001/cores/collection1
   [junit4]   2> 930346 INFO  (TEST-CollectionsAPIDistributedZkTest.test-seed#[140C4DFE77815F2E]) [    ] o.e.j.s.Server jetty-9.2.13.v20150730
   [junit4]   2> 930347 INFO  (TEST-CollectionsAPIDistributedZkTest.test-seed#[140C4DFE77815F2E]) [    ] o.e.j.s.h.ContextHandler Started o.e.j.s.ServletContextHandler@4655698c{/,null,AVAILABLE}
   [junit4]   2> 930353 INFO  (TEST-CollectionsAPIDistributedZkTest.test-seed#[140C4DFE77815F2E]) [    ] o.e.j.s.ServerConnector Started ServerConnector@7e6656ac{SSL-http/1.1}{127.0.0.1:50177}
   [junit4]   2> 930353 INFO  (TEST-CollectionsAPIDistributedZkTest.test-seed#[140C4DFE77815F2E]) [    ] o.e.j.s.Server Started @932057ms
   [junit4]   2> 930353 INFO  (TEST-CollectionsAPIDistributedZkTest.test-seed#[140C4DFE77815F2E]) [    ] o.a.s.c.s.e.JettySolrRunner Jetty properties: {hostContext=/, hostPort=50177, coreRootDirectory=/home/jenkins/workspace/Lucene-Solr-5.5-Linux/solr/build/solr-core/test/J1/../../../../../../../../../home/jenkins/workspace/Lucene-Solr-5.5-Linux/solr/build/solr-core/test/J1/temp/solr.cloud.CollectionsAPIDistributedZkTest_140C4DFE77815F2E-001/control-001/cores, solr.data.dir=/home/jenkins/workspace/Lucene-Solr-5.5-Linux/solr/build/solr-core/test/J1/temp/solr.cloud.CollectionsAPIDistributedZkTest_140C4DFE77815F2E-001/tempDir-001/control/data}
   [junit4]   2> 930353 INFO  (TEST-CollectionsAPIDistributedZkTest.test-seed#[140C4DFE77815F2E]) [    ] o.a.s.s.SolrDispatchFilter SolrDispatchFilter.init(): sun.misc.Launcher$AppClassLoader@36d98810
   [junit4]   2> 930353 INFO  (TEST-CollectionsAPIDistributedZkTest.test-seed#[140C4DFE77815F2E]) [    ] o.a.s.c.SolrResourceLoader new SolrResourceLoader for directory: '/home/jenkins/workspace/Lucene-Solr-5.5-Linux/solr/build/solr-core/test/J1/temp/solr.cloud.CollectionsAPIDistributedZkTest_140C4DFE77815F2E-001/control-001'
   [junit4]   2> 930354 INFO  (TEST-CollectionsAPIDistributedZkTest.test-seed#[140C4DFE77815F2E]) [    ] o.a.s.c.SolrResourceLoader JNDI not configured for solr (NoInitialContextEx)
   [junit4]   2> 930354 INFO  (TEST-CollectionsAPIDistributedZkTest.test-seed#[140C4DFE77815F2E]) [    ] o.a.s.c.SolrResourceLoader solr home defaulted to 'solr/' (could not find system property or JNDI)
   [junit4]   2> 930354 INFO  (TEST-CollectionsAPIDistributedZkTest.test-seed#[140C4DFE77815F2E]) [    ] o.a.s.c.c.SolrZkClient Using default ZkCredentialsProvider
   [junit4]   2> 930354 INFO  (TEST-CollectionsAPIDistributedZkTest.test-seed#[140C4DFE77815F2E]) [    ] o.a.s.c.c.ConnectionManager Waiting for client to connect to ZooKeeper
   [junit4]   2> 930355 INFO  (zkCallback-968-thread-1) [    ] o.a.s.c.c.ConnectionManager Watcher org.apache.solr.common.cloud.ConnectionManager@c032ba5 name:ZooKeeperConnection Watcher:127.0.0.1:55041/solr got event WatchedEvent state:SyncConnected type:None path:null path:null type:None
   [junit4]   2> 930355 INFO  (TEST-CollectionsAPIDistributedZkTest.test-seed#[140C4DFE77815F2E]) [    ] o.a.s.c.c.ConnectionManager Client is connected to ZooKeeper
   [junit4]   2> 930355 INFO  (TEST-CollectionsAPIDistributedZkTest.test-seed#[140C4DFE77815F2E]) [    ] o.a.s.c.c.SolrZkClient Using default ZkACLProvider
   [junit4]   2> 930356 INFO  (TEST-CollectionsAPIDistributedZkTest.test-seed#[140C4DFE77815F2E]) [    ] o.a.s.s.SolrDispatchFilter Loading solr.xml from SolrHome (not found in ZooKeeper)
   [junit4]   2> 930356 INFO  (TEST-CollectionsAPIDistributedZkTest.test-seed#[140C4DFE77815F2E]) [    ] o.a.s.c.SolrXmlConfig Loading container configuration from /home/jenkins/workspace/Lucene-Solr-5.5-Linux/solr/build/solr-core/test/J1/temp/solr.cloud.CollectionsAPIDistributedZkTest_140C4DFE77815F2E-001/control-001/solr.xml
   [junit4]   2> 930365 INFO  (TEST-CollectionsAPIDistributedZkTest.test-seed#[140C4DFE77815F2E]) [    ] o.a.s.c.CorePropertiesLocator Config-defined core root directory: /home/jenkins/workspace/Lucene-Solr-5.5-Linux/solr/build/solr-core/test/J1/../../../../../../../../../home/jenkins/workspace/Lucene-Solr-5.5-Linux/solr/build/solr-core/test/J1/temp/solr.cloud.CollectionsAPIDistributedZkTest_140C4DFE77815F2E-001/control-001/cores
   [junit4]   2> 930365 INFO  (TEST-CollectionsAPIDistributedZkTest.test-seed#[140C4DFE77815F2E]) [    ] o.a.s.c.CoreContainer New CoreContainer 1869706501
   [junit4]   2> 930365 INFO  (TEST-CollectionsAPIDistributedZkTest.test-seed#[140C4DFE77815F2E]) [    ] o.a.s.c.CoreContainer Loading cores into CoreContainer [instanceDir=/home/jenkins/workspace/Lucene-Solr-5.5-Linux/solr/build/solr-core/test/J1/temp/solr.cloud.CollectionsAPIDistributedZkTest_140C4DFE77815F2E-001/control-001]
   [junit4]   2> 930365 WARN  (TEST-CollectionsAPIDistributedZkTest.test-seed#[140C4DFE77815F2E]) [    ] o.a.s.c.CoreContainer Couldn't add files from /home/jenkins/workspace/Lucene-Solr-5.5-Linux/solr/build/solr-core/test/J1/temp/solr.cloud.CollectionsAPIDistributedZkTest_140C4DFE77815F2E-001/control-001/lib to classpath: /home/jenkins/workspace/Lucene-Solr-5.5-Linux/solr/build/solr-core/test/J1/temp/solr.cloud.CollectionsAPIDistributedZkTest_140C4DFE77815F2E-001/control-001/lib
   [junit4]   2> 930365 INFO  (TEST-CollectionsAPIDistributedZkTest.test-seed#[140C4DFE77815F2E]) [    ] o.a.s.h.c.HttpShardHandlerFactory created with socketTimeout : 90000,urlScheme : ,connTimeout : 15000,maxConnectionsPerHost : 20,maxConnections : 10000,corePoolSize : 0,maximumPoolSize : 2147483647,maxThreadIdleTime : 5,sizeOfQueue : -1,fairnessPolicy : false,useRetries : false,
   [junit4]   2> 930367 INFO  (TEST-CollectionsAPIDistributedZkTest.test-seed#[140C4DFE77815F2E]) [    ] o.a.s.u.UpdateShardHandler Creating UpdateShardHandler HTTP client with params: socketTimeout=340000&connTimeout=45000&retry=true
   [junit4]   2> 930368 INFO  (TEST-CollectionsAPIDistributedZkTest.test-seed#[140C4DFE77815F2E]) [    ] o.a.s.l.LogWatcher SLF4J impl is org.slf4j.impl.Log4jLoggerFactory
   [junit4]   2> 930368 INFO  (TEST-CollectionsAPIDistributedZkTest.test-seed#[140C4DFE77815F2E]) [    ] o.a.s.l.LogWatcher Registering Log Listener [Log4j (org.slf4j.impl.Log4jLoggerFactory)]
   [junit4]   2> 930368 INFO  (TEST-CollectionsAPIDistributedZkTest.test-seed#[140C4DFE77815F2E]) [    ] o.a.s.c.ZkContainer Zookeeper client=127.0.0.1:55041/solr
   [junit4]   2> 930368 INFO  (TEST-CollectionsAPIDistributedZkTest.test-seed#[140C4DFE77815F2E]) [    ] o.a.s.c.ZkController zkHost includes chroot
   [junit4]   2> 930368 INFO  (TEST-CollectionsAPIDistributedZkTest.test-seed#[140C4DFE77815F2E]) [    ] o.a.s.c.c.SolrZkClient Using default ZkCredentialsProvider
   [junit4]   2> 930368 INFO  (TEST-CollectionsAPIDistributedZkTest.test-seed#[140C4DFE77815F2E]) [    ] o.a.s.c.c.ConnectionManager Waiting for client to connect to ZooKeeper
   [junit4]   2> 930369 INFO  (zkCallback-971-thread-1) [    ] o.a.s.c.c.ConnectionManager Watcher org.apache.solr.common.cloud.ConnectionManager@3d1cbaa name:ZooKeeperConnection Watcher:127.0.0.1:55041 got event WatchedEvent state:SyncConnected type:None path:null path:null type:None
   [junit4]   2> 930369 INFO  (TEST-CollectionsAPIDistributedZkTest.test-seed#[140C4DFE77815F2E]) [    ] o.a.s.c.c.ConnectionManager Client is connected to ZooKeeper
   [junit4]   2> 930370 INFO  (TEST-CollectionsAPIDistributedZkTest.test-seed#[140C4DFE77815F2E]) [    ] o.a.s.c.c.SolrZkClient Using default ZkACLProvider
   [junit4]   2> 930370 INFO  (TEST-CollectionsAPIDistributedZkTest.test-seed#[140C4DFE77815F2E]) [n:127.0.0.1:50177_    ] o.a.s.c.c.ConnectionManager Waiting for client to connect to ZooKeeper
   [junit4]   2> 930371 INFO  (zkCallback-972-thread-1-processing-n:127.0.0.1:50177_) [n:127.0.0.1:50177_    ] o.a.s.c.c.ConnectionManager Watcher org.apache.solr.common.cloud.ConnectionManager@3afbd89c name:ZooKeeperConnection Watcher:127.0.0.1:55041/solr got event WatchedEvent state:SyncConnected type:None path:null path:null type:None
   [junit4]   2> 930371 INFO  (TEST-CollectionsAPIDistributedZkTest.test-seed#[140C4DFE77815F2E]) [n:127.0.0.1:50177_    ] o.a.s.c.c.ConnectionManager Client is connected to ZooKeeper
   [junit4]   2> 930372 INFO  (TEST-CollectionsAPIDistributedZkTest.test-seed#[140C4DFE77815F2E]) [n:127.0.0.1:50177_    ] o.a.s.c.c.SolrZkClient makePath: /overseer/queue
   [junit4]   2> 930372 INFO  (TEST-CollectionsAPIDistributedZkTest.test-seed#[140C4DFE77815F2E]) [n:127.0.0.1:50177_    ] o.a.s.c.c.SolrZkClient makePath: /overseer/collection-queue-work
   [junit4]   2> 930373 INFO  (TEST-CollectionsAPIDistributedZkTest.test-seed#[140C4DFE77815F2E]) [n:127.0.0.1:50177_    ] o.a.s.c.c.SolrZkClient makePath: /overseer/collection-map-running
   [junit4]   2> 930374 INFO  (TEST-CollectionsAPIDistributedZkTest.test-seed#[140C4DFE77815F2E]) [n:127.0.0.1:50177_    ] o.a.s.c.c.SolrZkClient makePath: /overseer/collection-map-completed
   [junit4]   2> 930374 INFO  (TEST-CollectionsAPIDistributedZkTest.test-seed#[140C4DFE77815F2E]) [n:127.0.0.1:50177_    ] o.a.s.c.c.SolrZkClient makePath: /overseer/collection-map-failure
   [junit4]   2> 930375 INFO  (TEST-CollectionsAPIDistributedZkTest.test-seed#[140C4DFE77815F2E]) [n:127.0.0.1:50177_    ] o.a.s.c.c.SolrZkClient makePath: /live_nodes
   [junit4]   2> 930375 INFO  (TEST-CollectionsAPIDistributedZkTest.test-seed#[140C4DFE77815F2E]) [n:127.0.0.1:50177_    ] o.a.s.c.c.SolrZkClient makePath: /aliases.json
   [junit4]   2> 930376 INFO  (TEST-CollectionsAPIDistributedZkTest.test-seed#[140C4DFE77815F2E]) [n:127.0.0.1:50177_    ] o.a.s.c.c.SolrZkClient makePath: /clusterstate.json
   [junit4]   2> 930376 INFO  (TEST-CollectionsAPIDistributedZkTest.test-seed#[140C4DFE77815F2E]) [n:127.0.0.1:50177_    ] o.a.s.c.c.SolrZkClient makePath: /security.json
   [junit4]   2> 930377 INFO  (TEST-CollectionsAPIDistributedZkTest.test-seed#[140C4DFE77815F2E]) [n:127.0.0.1:50177_    ] o.a.s.c.ZkController Register node as live in ZooKeeper:/live_nodes/127.0.0.1:50177_
   [junit4]   2> 930377 INFO  (TEST-CollectionsAPIDistributedZkTest.test-seed#[140C4DFE77815F2E]) [n:127.0.0.1:50177_    ] o.a.s.c.c.SolrZkClient makePath: /live_nodes/127.0.0.1:50177_
   [junit4]   2> 930377 INFO  (TEST-CollectionsAPIDistributedZkTest.test-seed#[140C4DFE77815F2E]) [n:127.0.0.1:50177_    ] o.a.s.c.c.SolrZkClient makePath: /overseer_elect
   [junit4]   2> 930377 INFO  (TEST-CollectionsAPIDistributedZkTest.test-seed#[140C4DFE77815F2E]) [n:127.0.0.1:50177_    ] o.a.s.c.c.SolrZkClient makePath: /overseer_elect/election
   [junit4]   2> 930378 INFO  (TEST-CollectionsAPIDistributedZkTest.test-seed#[140C4DFE77815F2E]) [n:127.0.0.1:50177_    ] o.a.s.c.Overseer Overseer (id=null) closing
   [junit4]   2> 930378 INFO  (TEST-CollectionsAPIDistributedZkTest.test-seed#[140C4DFE77815F2E]) [n:127.0.0.1:50177_    ] o.a.s.c.LeaderElector Joined leadership election with path: /overseer_elect/election/95415985199513605-127.0.0.1:50177_-n_0000000000
   [junit4]   2> 930378 INFO  (TEST-CollectionsAPIDistributedZkTest.test-seed#[140C4DFE77815F2E]) [n:127.0.0.1:50177_    ] o.a.s.c.OverseerElectionContext I am going to be the leader 127.0.0.1:50177_
   [junit4]   2> 930378 INFO  (TEST-CollectionsAPIDistributedZkTest.test-seed#[140C4DFE77815F2E]) [n:127.0.0.1:50177_    ] o.a.s.c.c.SolrZkClient makePath: /overseer_elect/leader
   [junit4]   2> 930379 INFO  (TEST-CollectionsAPIDistributedZkTest.test-seed#[140C4DFE77815F2E]) [n:127.0.0.1:50177_    ] o.a.s.c.Overseer Overseer (id=95415985199513605-127.0.0.1:50177_-n_0000000000) starting
   [junit4]   2> 930379 INFO  (TEST-CollectionsAPIDistributedZkTest.test-seed#[140C4DFE77815F2E]) [n:127.0.0.1:50177_    ] o.a.s.c.c.SolrZkClient makePath: /overseer/queue-work
   [junit4]   2> 930389 INFO  (TEST-CollectionsAPIDistributedZkTest.test-seed#[140C4DFE77815F2E]) [n:127.0.0.1:50177_    ] o.a.s.c.OverseerAutoReplicaFailoverThread Starting OverseerAutoReplicaFailoverThread autoReplicaFailoverWorkLoopDelay=10000 autoReplicaFailoverWaitAfterExpiration=10000 autoReplicaFailoverBadNodeExpiration=60000
   [junit4]   2> 930389 INFO  (OverseerCollectionConfigSetProcessor-95415985199513605-127.0.0.1:50177_-n_0000000000) [n:127.0.0.1:50177_    ] o.a.s.c.OverseerTaskProcessor Process current queue of overseer operations
   [junit4]   2> 930389 INFO  (TEST-CollectionsAPIDistributedZkTest.test-seed#[140C4DFE77815F2E]) [n:127.0.0.1:50177_    ] o.a.s.c.c.ZkStateReader Updating cluster state from ZooKeeper... 
   [junit4]   2> 930390 INFO  (OverseerStateUpdate-95415985199513605-127.0.0.1:50177_-n_0000000000) [n:127.0.0.1:50177_    ] o.a.s.c.Overseer Starting to work on the main queue
   [junit4]   2> 930401 INFO  (TEST-CollectionsAPIDistributedZkTest.test-seed#[140C4DFE77815F2E]) [n:127.0.0.1:50177_    ] o.a.s.c.CoreContainer Security conf doesn't exist. Skipping setup for authorization module.
   [junit4]   2> 930401 INFO  (TEST-CollectionsAPIDistributedZkTest.test-seed#[140C4DFE77815F2E]) [n:127.0.0.1:50177_    ] o.a.s.c.CoreContainer No authentication plugin used.
   [junit4]   2> 930401 INFO  (TEST-CollectionsAPIDistributedZkTest.test-seed#[140C4DFE77815F2E]) [n:127.0.0.1:50177_    ] o.a.s.c.CorePropertiesLocator Looking for core definitions underneath /home/jenkins/workspace/Lucene-Solr-5.5-Linux/solr/build/solr-core/test/J1/../../../../../../../../../home/jenkins/workspace/Lucene-Solr-5.5-Linux/solr/build/solr-core/test/J1/temp/solr.cloud.CollectionsAPIDistributedZkTest_140C4DFE77815F2E-001/control-001/cores
   [junit4]   2> 930402 INFO  (TEST-CollectionsAPIDistributedZkTest.test-seed#[140C4DFE77815F2E]) [n:127.0.0.1:50177_    ] o.a.s.c.CoreDescriptor Created CoreDescriptor: {config=solrconfig.xml, configSetProperties=configsetprops.json, schema=schema.xml, dataDir=data/, loadOnStartup=true, coreNodeName=, shard=, collection=control_collection, transient=false, name=collection1}
   [junit4]   2> 930402 INFO  (TEST-CollectionsAPIDistributedZkTest.test-seed#[140C4DFE77815F2E]) [n:127.0.0.1:50177_    ] o.a.s.c.CorePropertiesLocator Found core collection1 in /home/jenkins/workspace/Lucene-Solr-5.5-Linux/solr/build/solr-core/test/J1/../../../../../../../../../home/jenkins/workspace/Lucene-Solr-5.5-Linux/solr/build/solr-core/test/J1/temp/solr.cloud.CollectionsAPIDistributedZkTest_140C4DFE77815F2E-001/control-001/cores/collection1
   [junit4]   2> 930402 INFO  (TEST-CollectionsAPIDistributedZkTest.test-seed#[140C4DFE77815F2E]) [n:127.0.0.1:50177_    ] o.a.s.c.CorePropertiesLocator Found 1 core definitions
   [junit4]   2> 930402 INFO  (TEST-CollectionsAPIDistributedZkTest.test-seed#[140C4DFE77815F2E]) [n:127.0.0.1:50177_    ] o.a.s.s.SolrDispatchFilter user.dir=/home/jenkins/workspace/Lucene-Solr-5.5-Linux/solr/build/solr-core/test/J1
   [junit4]   2> 930402 INFO  (TEST-CollectionsAPIDistributedZkTest.test-seed#[140C4DFE77815F2E]) [n:127.0.0.1:50177_    ] o.a.s.s.SolrDispatchFilter SolrDispatchFilter.init() done
   [junit4]   2> 930403 INFO  (coreLoadExecutor-2952-thread-1-processing-n:127.0.0.1:50177_) [n:127.0.0.1:50177_ c:control_collection   x:collection1] o.a.s.c.ZkController publishing state=down
   [junit4]   2> 930403 INFO  (coreLoadExecutor-2952-thread-1-processing-n:127.0.0.1:50177_) [n:127.0.0.1:50177_ c:control_collection   x:collection1] o.a.s.c.ZkController numShards not found on descriptor - reading it from system property
   [junit4]   2> 930403 INFO  (OverseerStateUpdate-95415985199513605-127.0.0.1:50177_-n_0000000000) [n:127.0.0.1:50177_    ] o.a.s.c.Overseer processMessage: queueSize: 1, message = {
   [junit4]   2>   "base_url":"https://127.0.0.1:50177",
   [junit4]   2>   "shard":null,
   [junit4]   2>   "operation":"state",
   [junit4]   2>   "node_name":"127.0.0.1:50177_",
   [junit4]   2>   "core":"collection1",
   [junit4]   2>   "roles":null,
   [junit4]   2>   "numShards":"1",
   [junit4]   2>   "collection":"control_collection",
   [junit4]   2>   "state":"down"} current state version: 0
   [junit4]   2> 930403 INFO  (coreLoadExecutor-2952-thread-1-processing-n:127.0.0.1:50177_) [n:127.0.0.1:50177_ c:control_collection   x:collection1] o.a.s.c.ZkController look for our core node name
   [junit4]   2> 930404 INFO  (OverseerStateUpdate-95415985199513605-127.0.0.1:50177_-n_0000000000) [n:127.0.0.1:50177_    ] o.a.s.c.o.ReplicaMutator Update state numShards=1 message={
   [junit4]   2>   "base_url":"https://127.0.0.1:50177",
   [junit4]   2>   "shard":null,
   [junit4]   2>   "operation":"state",
   [junit4]   2>   "node_name":"127.0.0.1:50177_",
   [junit4]   2>   "core":"collection1",
   [junit4]   2>   "roles":null,
   [junit4]   2>   "numShards":"1",
   [junit4]   2>   "collection":"control_collection",
   [junit4]   2>   "state":"down"}
   [junit4]   2> 930404 INFO  (OverseerStateUpdate-95415985199513605-127.0.0.1:50177_-n_0000000000) [n:127.0.0.1:50177_    ] o.a.s.c.o.ClusterStateMutator building a new cName: control_collection
   [junit4]   2> 930404 INFO  (OverseerStateUpdate-95415985199513605-127.0.0.1:50177_-n_0000000000) [n:127.0.0.1:50177_    ] o.a.s.c.o.ReplicaMutator Assigning new node to shard shard=shard1
   [junit4]   2> 930405 INFO  (zkCallback-972-thread-1-processing-n:127.0.0.1:50177_) [n:127.0.0.1:50177_    ] o.a.s.c.c.ZkStateReader A cluster state change: [WatchedEvent state:SyncConnected type:NodeDataChanged path:/clusterstate.json], has occurred - updating... (live nodes size: [1])
   [junit4]   2> 931404 INFO  (coreLoadExecutor-2952-thread-1-processing-n:127.0.0.1:50177_) [n:127.0.0.1:50177_ c:control_collection   x:collection1] o.a.s.c.ZkController waiting to find shard id in clusterstate for collection1
   [junit4]   2> 931404 INFO  (coreLoadExecutor-2952-thread-1-processing-n:127.0.0.1:50177_) [n:127.0.0.1:50177_ c:control_collection   x:collection1] o.a.s.c.ZkController Check for collection zkNode:control_collection
   [junit4]   2> 931404 INFO  (coreLoadExecutor-2952-thread-1-processing-n:127.0.0.1:50177_) [n:127.0.0.1:50177_ c:control_collection   x:collection1] o.a.s.c.ZkController Collection zkNode exists
   [junit4]   2> 931404 INFO  (coreLoadExecutor-2952-thread-1-processing-n:127.0.0.1:50177_) [n:127.0.0.1:50177_ c:control_collection   x:collection1] o.a.s.c.c.ZkStateReader Load collection config from: [/collections/control_collection]
   [junit4]   2> 931404 INFO  (coreLoadExecutor-2952-thread-1-processing-n:127.0.0.1:50177_) [n:127.0.0.1:50177_ c:control_collection   x:collection1] o.a.s.c.c.ZkStateReader path=[/collections/control_collection] [configName]=[conf1] specified config exists in ZooKeeper
   [junit4]   2> 931404 INFO  (coreLoadExecutor-2952-thread-1-processing-n:127.0.0.1:50177_) [n:127.0.0.1:50177_ c:control_collection   x:collection1] o.a.s.c.SolrResourceLoader new SolrResourceLoader for directory: '/home/jenkins/workspace/Lucene-Solr-5.5-Linux/solr/build/solr-core/test/J1/temp/solr.cloud.CollectionsAPIDistributedZkTest_140C4DFE77815F2E-001/control-001/cores/collection1'
   [junit4]   2> 931404 INFO  (coreLoadExecutor-2952-thread-1-processing-n:127.0.0.1:50177_) [n:127.0.0.1:50177_ c:control_collection   x:collection1] o.a.s.c.SolrResourceLoader JNDI not configured for solr (NoInitialContextEx)
   [junit4]   2> 931404 INFO  (coreLoadExecutor-2952-thread-1-processing-n:127.0.0.1:50177_) [n:127.0.0.1:50177_ c:control_collection   x:collection1] o.a.s.c.SolrResourceLoader solr home defaulted to 'solr/' (could not find system property or JNDI)
   [junit4]   2> 931405 INFO  (coreLoadExecutor-2952-thread-1-processing-n:127.0.0.1:50177_) [n:127.0.0.1:50177_ c:control_collection   x:collection1] o.a.s.c.Config loaded config solrconfig.xml with version 0 
   [junit4]   2> 931409 INFO  (coreLoadExecutor-2952-thread-1-processing-n:127.0.0.1:50177_) [n:127.0.0.1:50177_ c:control_collection   x:collection1] o.a.s.c.SolrConfig current version of requestparams : -1
   [junit4]   2> 931417 INFO  (coreLoadExecutor-2952-thread-1-processing-n:127.0.0.1:50177_) [n:127.0.0.1:50177_ c:control_collection   x:collection1] o.a.s.c.SolrConfig Using Lucene MatchVersion: 5.5.0
   [junit4]   2> 931441 INFO  (coreLoadExecutor-2952-thread-1-processing-n:127.0.0.1:50177_) [n:127.0.0.1:50177_ c:control_collection   x:collection1] o.a.s.c.SolrConfig Loaded SolrConfig: solrconfig.xml
   [junit4]   2> 931446 INFO  (coreLoadExecutor-2952-thread-1-processing-n:127.0.0.1:50177_) [n:127.0.0.1:50177_ c:control_collection   x:collection1] o.a.s.s.IndexSchema [collection1] Schema name=test
   [junit4]   2> 931586 INFO  (coreLoadExecutor-2952-thread-1-processing-n:127.0.0.1:50177_) [n:127.0.0.1:50177_ c:control_collection   x:collection1] o.a.s.s.OpenExchangeRatesOrgProvider Initialized with rates=open-exchange-rates.json, refreshInterval=1440.
   [junit4]   2> 931590 INFO  (coreLoadExecutor-2952-thread-1-processing-n:127.0.0.1:50177_) [n:127.0.0.1:50177_ c:control_collection   x:collection1] o.a.s.s.IndexSchema default search field in schema is text
   [junit4]   2> 931591 INFO  (coreLoadExecutor-2952-thread-1-processing-n:127.0.0.1:50177_) [n:127.0.0.1:50177_ c:control_collection   x:collection1] o.a.s.s.IndexSchema unique key field: id
   [junit4]   2> 931595 INFO  (coreLoadExecutor-2952-thread-1-processing-n:127.0.0.1:50177_) [n:127.0.0.1:50177_ c:control_collection   x:collection1] o.a.s.s.FileExchangeRateProvider Reloading exchange rates from file currency.xml
   [junit4]   2> 931597 INFO  (coreLoadExecutor-2952-thread-1-processing-n:127.0.0.1:50177_) [n:127.0.0.1:50177_ c:control_collection   x:collection1] o.a.s.s.FileExchangeRateProvider Reloading exchange rates from file currency.xml
   [junit4]   2> 931599 INFO  (coreLoadExecutor-2952-thread-1-processing-n:127.0.0.1:50177_) [n:127.0.0.1:50177_ c:control_collection   x:collection1] o.a.s.s.OpenExchangeRatesOrgProvider Reloading exchange rates from open-exchange-rates.json
   [junit4]   2> 931599 INFO  (coreLoadExecutor-2952-thread-1-processing-n:127.0.0.1:50177_) [n:127.0.0.1:50177_ c:control_collection   x:collection1] o.a.s.s.OpenExchangeRatesOrgProvider Reloading exchange rates from open-exchange-rates.json
   [junit4]   2> 931600 INFO  (coreLoadExecutor-2952-thread-1-processing-n:127.0.0.1:50177_) [n:127.0.0.1:50177_ c:control_collection   x:collection1] o.a.s.c.ConfigSetProperties Did not find ConfigSet properties, assuming default properties: Can't find resource 'configsetprops.json' in classpath or '/configs/conf1', cwd=/home/jenkins/workspace/Lucene-Solr-5.5-Linux/solr/build/solr-core/test/J1
   [junit4]   2> 931600 INFO  (coreLoadExecutor-2952-thread-1-processing-n:127.0.0.1:50177_) [n:127.0.0.1:50177_ c:control_collection   x:collection1] o.a.s.c.CoreContainer Creating SolrCore 'collection1' using configuration from collection control_collection
   [junit4]   2> 931600 INFO  (coreLoadExecutor-2952-thread-1-processing-n:127.0.0.1:50177_) [n:127.0.0.1:50177_ c:control_collection s:shard1 r:core_node1 x:collection1] o.a.s.c.SolrCore org.apache.solr.core.MockDirectoryFactory
   [junit4]   2> 931600 INFO  (coreLoadExecutor-2952-thread-1-processing-n:127.0.0.1:50177_) [n:127.0.0.1:50177_ c:control_collection s:shard1 r:core_node1 x:collection1] o.a.s.c.SolrCore [[collection1] ] Opening new SolrCore at [/home/jenkins/workspace/Lucene-Solr-5.5-Linux/solr/build/solr-core/test/J1/temp/solr.cloud.CollectionsAPIDistributedZkTest_140C4DFE77815F2E-001/control-001/cores/collection1], dataDir=[/home/jenkins/workspace/Lucene-Solr-5.5-Linux/solr/build/solr-core/test/J1/../../../../../../../../../home/jenkins/workspace/Lucene-Solr-5.5-Linux/solr/build/solr-core/test/J1/temp/solr.cloud.CollectionsAPIDistributedZkTest_140C4DFE77815F2E-001/control-001/cores/collection1/data/]
   [junit4]   2> 931600 INFO  (coreLoadExecutor-2952-thread-1-processing-n:127.0.0.1:50177_) [n:127.0.0.1:50177_ c:control_collection s:shard1 r:core_node1 x:collection1] o.a.s.c.JmxMonitoredMap JMX monitoring is enabled. Adding Solr mbeans to JMX Server: com.sun.jmx.mbeanserver.JmxMBeanServer@4a87a8df
   [junit4]   2> 931601 INFO  (coreLoadExecutor-2952-thread-1-processing-n:127.0.0.1:50177_) [n:127.0.0.1:50177_ c:control_collection s:shard1 r:core_node1 x:collection1] o.a.s.c.CachingDirectoryFactory return new directory for /home/jenkins/workspace/Lucene-Solr-5.5-Linux/solr/build/solr-core/test/J1/../../../../../../../../../home/jenkins/workspace/Lucene-Solr-5.5-Linux/solr/build/solr-core/test/J1/temp/solr.cloud.CollectionsAPIDistributedZkTest_140C4DFE77815F2E-001/control-001/cores/collection1/data
   [junit4]   2> 931601 INFO  (coreLoadExecutor-2952-thread-1-processing-n:127.0.0.1:50177_) [n:127.0.0.1:50177_ c:control_collection s:shard1 r:core_node1 x:collection1] o.a.s.c.SolrCore New index directory detected: old=null new=/home/jenkins/workspace/Lucene-Solr-5.5-Linux/solr/build/solr-core/test/J1/../../../../../../../../../home/jenkins/workspace/Lucene-Solr-5.5-Linux/solr/build/solr-core/test/J1/temp/solr.cloud.CollectionsAPIDistributedZkTest_140C4DFE77815F2E-001/control-001/cores/collection1/data/index/
   [junit4]   2> 931601 WARN  (coreLoadExecutor-2952-thread-1-processing-n:127.0.0.1:50177_) [n:127.0.0.1:50177_ c:control_collection s:shard1 r:core_node1 x:collection1] o.a.s.c.SolrCore [collection1] Solr index directory '/home/jenkins/workspace/Lucene-Solr-5.5-Linux/solr/build/solr-core/test/J1/../../../../../../../../../home/jenkins/workspace/Lucene-Solr-5.5-Linux/solr/build/solr-core/test/J1/temp/solr.cloud.CollectionsAPIDistributedZkTest_140C4DFE77815F2E-001/control-001/cores/collection1/data/index' doesn't exist. Creating new index...
   [junit4]   2> 931601 INFO  (coreLoadExecutor-2952-thread-1-processing-n:127.0.0.1:50177_) [n:127.0.0.1:50177_ c:control_collection s:shard1 r:core_node1 x:collection1] o.a.s.c.CachingDirectoryFactory return new directory for /home/jenkins/workspace/Lucene-Solr-5.5-Linux/solr/build/solr-core/test/J1/../../../../../../../../../home/jenkins/workspace/Lucene-Solr-5.5-Linux/solr/build/solr-core/test/J1/temp/solr.cloud.CollectionsAPIDistributedZkTest_140C4DFE77815F2E-001/control-001/cores/collection1/data/index
   [junit4]   2> 931601 INFO  (coreLoadExecutor-2952-thread-1-processing-n:127.0.0.1:50177_) [n:127.0.0.1:50177_ c:control_collection s:shard1 r:core_node1 x:collection1] o.a.s.u.RandomMergePolicy RandomMergePolicy wrapping class org.apache.lucene.index.TieredMergePolicy: [TieredMergePolicy: maxMergeAtOnce=45, maxMergeAtOnceExplicit=21, maxMergedSegmentMB=98.533203125, floorSegmentMB=1.796875, forceMergeDeletesPctAllowed=4.638619101291791, segmentsPerTier=26.0, maxCFSSegmentSizeMB=8.796093022207999E12, noCFSRatio=1.0
   [junit4]   2> 931601 INFO  (coreLoadExecutor-2952-thread-1-processing-n:127.0.0.1:50177_) [n:127.0.0.1:50177_ c:control_collection s:shard1 r:core_node1 x:collection1] o.a.s.c.SolrDeletionPolicy SolrDeletionPolicy.onCommit: commits: num=1
   [junit4]   2> 	commit{dir=MockDirectoryWrapper(RAMDirectory@78d2a8f5 lockFactory=org.apache.lucene.store.SingleInstanceLockFactory@4e52aacb),segFN=segments_1,generation=1}
   [junit4]   2> 931601 INFO  (coreLoadExecutor-2952-thread-1-processing-n:127.0.0.1:50177_) [n:127.0.0.1:50177_ c:control_collection s:shard1 r:core_node1 x:collection1] o.a.s.c.SolrDeletionPolicy newest commit generation = 1
   [junit4]   2> 931602 INFO  (OldIndexDirectoryCleanupThreadForCore-collection1) [n:127.0.0.1:50177_ c:control_collection s:shard1 r:core_node1 x:collection1] o.a.s.c.SolrCore Looking for old index directories to cleanup for core collection1 in /home/jenkins/workspace/Lucene-Solr-5.5-Linux/solr/build/solr-core/test/J1/../../../../../../../../../home/jenkins/workspace/Lucene-Solr-5.5-Linux/solr/build/solr-core/test/J1/temp/solr.cloud.CollectionsAPIDistributedZkTest_140C4DFE77815F2E-001/control-001/cores/collection1/data/
   [junit4]   2> 931602 WARN  (OldIndexDirectoryCleanupThreadForCore-collection1) [n:127.0.0.1:50177_ c:control_collection s:shard1 r:core_node1 x:collection1] o.a.s.c.DirectoryFactory /home/jenkins/workspace/Lucene-Solr-5.5-Linux/solr/build/solr-core/test/J1/../../../../../../../../../home/jenkins/workspace/Lucene-Solr-5.5-Linux/solr/build/solr-core/test/J1/temp/solr.cloud.CollectionsAPIDistributedZkTest_140C4DFE77815F2E-001/control-001/cores/collection1/data/ does not point to a valid data directory; skipping clean-up of old index directories.
   [junit4]   2> 931603 INFO  (coreLoadExecutor-2952-thread-1-processing-n:127.0.0.1:50177_) [n:127.0.0.1:50177_ c:control_collection s:shard1 r:core_node1 x:collection1] o.a.s.u.p.UpdateRequestProcessorChain creating updateRequestProcessorChain "nodistrib"
   [junit4]   2> 931603 INFO  (coreLoadExecutor-2952-thread-1-processing-n:127.0.0.1:50177_) [n:127.0.0.1:50177_ c:control_collection s:shard1 r:core_node1 x:collection1] o.a.s.u.p.UpdateRequestProcessorChain creating updateRequestProcessorChain "dedupe"
   [junit4]   2> 931604 INFO  (coreLoadExecutor-2952-thread-1-processing-n:127.0.0.1:50177_) [n:127.0.0.1:50177_ c:control_collection s:shard1 r:core_node1 x:collection1] o.a.s.u.p.UpdateRequestProcessorChain inserting DistributedUpdateProcessorFactory into updateRequestProcessorChain "dedupe"
   [junit4]   2> 931604 INFO  (coreLoadExecutor-2952-thread-1-processing-n:127.0.0.1:50177_) [n:127.0.0.1:50177_ c:control_collection s:shard1 r:core_node1 x:collection1] o.a.s.u.p.UpdateRequestProcessorChain creating updateRequestProcessorChain "stored_sig"
   [junit4]   2> 931604 INFO  (coreLoadExecutor-2952-thread-1-processing-n:127.0.0.1:50177_) [n:127.0.0.1:50177_ c:control_collection s:shard1 r:core_node1 x:collection1] o.a.s.u.p.UpdateRequestProcessorChain inserting DistributedUpdateProcessorFactory into updateRequestProcessorChain "stored_sig"
   [junit4]   2> 931604 INFO  (coreLoadExecutor-2952-thread-1-processing-n:127.0.0.1:50177_) [n:127.0.0.1:50177_ c:control_collection s:shard1 r:core_node1 x:collection1] o.a.s.u.p.UpdateRequestProcessorChain creating updateRequestProcessorChain "distrib-dup-test-chain-explicit"
   [junit4]   2> 931604 INFO  (coreLoadExecutor-2952-thread-1-processing-n:127.0.0.1:50177_) [n:127.0.0.1:50177_ c:control_collection s:shard1 r:core_node1 x:collection1] o.a.s.u.p.UpdateRequestProcessorChain creating updateRequestProcessorChain "distrib-dup-test-chain-implicit"
   [junit4]   2> 931604 INFO  (coreLoadExecutor-2952-thread-1-processing-n:127.0.0.1:50177_) [n:127.0.0.1:50177_ c:control_collection s:shard1 r:core_node1 x:collection1] o.a.s.u.p.UpdateRequestProcessorChain inserting DistributedUpdateProcessorFactory into updateRequestProcessorChain "distrib-dup-test-chain-implicit"
   [junit4]   2> 931604 INFO  (coreLoadExecutor-2952-thread-1-processing-n:127.0.0.1:50177_) [n:127.0.0.1:50177_ c:control_collection s:shard1 r:core_node1 x:collection1] o.a.s.c.SolrCore no updateRequestProcessorChain defined as default, creating implicit default
   [junit4]   2> 931604 WARN  (coreLoadExecutor-2952-thread-1-processing-n:127.0.0.1:50177_) [n:127.0.0.1:50177_ c:control_collection s:shard1 r:core_node1 x:collection1] o.a.s.c.RequestHandlers INVALID paramSet a in requestHandler {type = requestHandler,name = /dump,class = DumpRequestHandler,args = {defaults={a=A,b=B}}}
   [junit4]   2> 931605 INFO  (coreLoadExecutor-2952-thread-1-processing-n:127.0.0.1:50177_) [n:127.0.0.1:50177_ c:control_collection s:shard1 r:core_node1 x:collection1] o.a.s.h.l.XMLLoader xsltCacheLifetimeSeconds=60
   [junit4]   2> 931606 INFO  (coreLoadExecutor-2952-thread-1-processing-n:127.0.0.1:50177_) [n:127.0.0.1:50177_ c:control_collection s:shard1 r:core_node1 x:collection1] o.a.s.h.l.XMLLoader xsltCacheLifetimeSeconds=60
   [junit4]   2> 931607 INFO  (coreLoadExecutor-2952-thread-1-processing-n:127.0.0.1:50177_) [n:127.0.0.1:50177_ c:control_collection s:shard1 r:core_node1 x:collection1] o.a.s.h.l.XMLLoader xsltCacheLifetimeSeconds=60
   [junit4]   2> 931608 INFO  (coreLoadExecutor-2952-thread-1-processing-n:127.0.0.1:50177_) [n:127.0.0.1:50177_ c:control_collection s:shard1 r:core_node1 x:collection1] o.a.s.h.l.XMLLoader xsltCacheLifetimeSeconds=60
   [junit4]   2> 931610 INFO  (coreLoadExecutor-2952-thread-1-processing-n:127.0.0.1:50177_) [n:127.0.0.1:50177_ c:control_collection s:shard1 r:core_node1 x:collection1] o.a.s.c.RequestHandlers Registered paths: /admin/file,/get,/update/json/docs,/admin/system,/admin/logging,/admin/luke,/admin/ping,/admin/threads,/update,/dump,/admin/properties,/admin/plugins,/schema,standard,/update/json,/update/csv,/replication,/admin/segments,/admin/mbeans,/config
   [junit4]   2> 931610 INFO  (coreLoadExecutor-2952-thread-1-processing-n:127.0.0.1:50177_) [n:127.0.0.1:50177_ c:control_collection s:shard1 r:core_node1 x:collection1] o.a.s.c.SolrCore Using default statsCache cache: org.apache.solr.search.stats.LocalStatsCache
   [junit4]   2> 931611 INFO  (coreLoadExecutor-2952-thread-1-processing-n:127.0.0.1:50177_) [n:127.0.0.1:50177_ c:control_collection s:shard1 r:core_node1 x:collection1] o.a.s.u.UpdateHandler Using UpdateLog implementation: org.apache.solr.update.UpdateLog
   [junit4]   2> 931611 INFO  (coreLoadExecutor-2952-thread-1-processing-n:127.0.0.1:50177_) [n:127.0.0.1:50177_ c:control_collection s:shard1 r:core_node1 x:collection1] o.a.s.u.UpdateLog Initializing UpdateLog: dataDir= defaultSyncLevel=FLUSH numRecordsToKeep=100 maxNumLogsToKeep=10 numVersionBuckets=65536
   [junit4]   2> 931611 INFO  (coreLoadExecutor-2952-thread-1-processing-n:127.0.0.1:50177_) [n:127.0.0.1:50177_ c:control_collection s:shard1 r:core_node1 x:collection1] o.a.s.u.CommitTracker Hard AutoCommit: disabled
   [junit4]   2> 931611 INFO  (coreLoadExecutor-2952-thread-1-processing-n:127.0.0.1:50177_) [n:127.0.0.1:50177_ c:control_collection s:shard1 r:core_node1 x:collection1] o.a.s.u.CommitTracker Soft AutoCommit: disabled
   [junit4]   2> 931612 INFO  (coreLoadExecutor-2952-thread-1-processing-n:127.0.0.1:50177_) [n:127.0.0.1:50177_ c:control_collection s:shard1 r:core_node1 x:collection1] o.a.s.u.RandomMergePolicy RandomMergePolicy wrapping class org.apache.lucene.index.TieredMergePolicy: [TieredMergePolicy: maxMergeAtOnce=31, maxMergeAtOnceExplicit=14, maxMergedSegmentMB=96.376953125, floorSegmentMB=1.6494140625, forceMergeDeletesPctAllowed=25.97068628412612, segmentsPerTier=46.0, maxCFSSegmentSizeMB=0.376953125, noCFSRatio=0.8383270383609993
   [junit4]   2> 931612 INFO  (coreLoadExecutor-2952-thread-1-processing-n:127.0.0.1:50177_) [n:127.0.0.1:50177_ c:control_collection s:shard1 r:core_node1 x:collection1] o.a.s.c.SolrDeletionPolicy SolrDeletionPolicy.onInit: commits: num=1
   [junit4]   2> 	commit{dir=MockDirectoryWrapper(RAMDirectory@78d2a8f5 lockFactory=org.apache.lucene.store.SingleInstanceLockFactory@4e52aacb),segFN=segments_1,generation=1}
   [junit4]   2> 931612 INFO  (coreLoadExecutor-2952-thread-1-processing-n:127.0.0.1:50177_) [n:127.0.0.1:50177_ c:control_collection s:shard1 r:core_node1 x:collection1] o.a.s.c.SolrDeletionPolicy newest commit generation = 1
   [junit4]   2> 931612 INFO  (coreLoadExecutor-2952-thread-1-processing-n:127.0.0.1:50177_) [n:127.0.0.1:50177_ c:control_collection s:shard1 r:core_node1 x:collection1] o.a.s.s.SolrIndexSearcher Opening Searcher@5faa28dc[collection1] main
   [junit4]   2> 931612 INFO  (coreLoadExecutor-2952-thread-1-processing-n:127.0.0.1:50177_) [n:127.0.0.1:50177_ c:control_collection s:shard1 r:core_node1 x:collection1] o.a.s.c.c.ZkStateReader Load collection config from: [/collections/control_collection]
   [junit4]   2> 931613 INFO  (coreLoadExecutor-2952-thread-1-processing-n:127.0.0.1:50177_) [n:127.0.0.1:50177_ c:control_collection s:shard1 r:core_node1 x:collection1] o.a.s.c.c.ZkStateReader path=[/collections/control_collection] [configName]=[conf1] specified config exists in ZooKeeper
   [junit4]   2> 931613 INFO  (coreLoadExecutor-2952-thread-1-processing-n:127.0.0.1:50177_) [n:127.0.0.1:50177_ c:control_collection s:shard1 r:core_node1 x:collection1] o.a.s.r.ManagedResourceStorage Setting up ZooKeeper-based storage for the RestManager with znodeBase: /configs/conf1
   [junit4]   2> 931613 INFO  (coreLoadExecutor-2952-thread-1-processing-n:127.0.0.1:50177_) [n:127.0.0.1:50177_ c:control_collection s:shard1 r:core_node1 x:collection1] o.a.s.r.ManagedResourceStorage Configured ZooKeeperStorageIO with znodeBase: /configs/conf1
   [junit4]   2> 931613 INFO  (coreLoadExecutor-2952-thread-1-processing-n:127.0.0.1:50177_) [n:127.0.0.1:50177_ c:control_collection s:shard1 r:core_node1 x:collection1] o.a.s.r.RestManager Initializing RestManager with initArgs: {}
   [junit4]   2> 931613 INFO  (coreLoadExecutor-2952-thread-1-processing-n:127.0.0.1:50177_) [n:127.0.0.1:50177_ c:control_collection s:shard1 r:core_node1 x:collection1] o.a.s.r.ManagedResourceStorage Reading _rest_managed.json using ZooKeeperStorageIO:path=/configs/conf1
   [junit4]   2> 931613 INFO  (coreLoadExecutor-2952-thread-1-processing-n:127.0.0.1:50177_) [n:127.0.0.1:50177_ c:control_collection s:shard1 r:core_node1 x:collection1] o.a.s.r.ManagedResourceStorage No data found for znode /configs/conf1/_rest_managed.json
   [junit4]   2> 931613 INFO  (coreLoadExecutor-2952-thread-1-processing-n:127.0.0.1:50177_) [n:127.0.0.1:50177_ c:control_collection s:shard1 r:core_node1 x:collection1] o.a.s.r.ManagedResourceStorage Loaded null at path _rest_managed.json using ZooKeeperStorageIO:path=/configs/conf1
   [junit4]   2> 931613 INFO  (coreLoadExecutor-2952-thread-1-processing-n:127.0.0.1:50177_) [n:127.0.0.1:50177_ c:control_collection s:shard1 r:core_node1 x:collection1] o.a.s.r.RestManager Initializing 0 registered ManagedResources
   [junit4]   2> 931613 INFO  (coreLoadExecutor-2952-thread-1-processing-n:127.0.0.1:50177_) [n:127.0.0.1:50177_ c:control_collection s:shard1 r:core_node1 x:collection1] o.a.s.h.ReplicationHandler Commits will be reserved for  10000
   [junit4]   2> 931614 INFO  (searcherExecutor-2953-thread-1-processing-s:shard1 x:collection1 n:127.0.0.1:50177_ c:control_collection r:core_node1) [n:127.0.0.1:50177_ c:control_collection s:shard1 r:core_node1 x:collection1] o.a.s.c.SolrCore [collection1] Registered new searcher Searcher@5faa28dc[collection1] main{ExitableDirectoryReader(UninvertingDirectoryReader())}
   [junit4]   2> 931614 INFO  (coreLoadExecutor-2952-thread-1-processing-n:127.0.0.1:50177_) [n:127.0.0.1:50177_ c:control_collection s:shard1 r:core_node1 x:collection1] o.a.s.u.UpdateLog Looking up max value of version field to seed version buckets
   [junit4]   2> 931614 INFO  (coreLoadExecutor-2952-thread-1-processing-n:127.0.0.1:50177_) [n:127.0.0.1:50177_ c:control_collection s:shard1 r:core_node1 x:collection1] o.a.s.u.VersionInfo Refreshing highest value of _version_ for 65536 version buckets from index
   [junit4]   2> 931614 INFO  (coreLoadExecutor-2952-thread-1-processing-n:127.0.0.1:50177_) [n:127.0.0.1:50177_ c:control_collection s:shard1 r:core_node1 x:collection1] o.a.s.u.VersionInfo No terms found for _version_, cannot seed version bucket highest value from index
   [junit4]   2> 931614 INFO  (coreLoadExecutor-2952-thread-1-processing-n:127.0.0.1:50177_) [n:127.0.0.1:50177_ c:control_collection s:shard1 r:core_node1 x:collection1] o.a.s.u.UpdateLog Could not find max version in index or recent updates, using new clock 1526655764701118464
   [junit4]   2> 931616 INFO  (coreLoadExecutor-2952-thread-1-processing-n:127.0.0.1:50177_) [n:127.0.0.1:50177_ c:control_collection s:shard1 r:core_node1 x:collection1] o.a.s.u.UpdateLog Took 1.0ms to seed version buckets with highest version 1526655764701118464
   [junit4]   2> 931616 INFO  (coreLoadExecutor-2952-thread-1-processing-n:127.0.0.1:50177_) [n:127.0.0.1:50177_ c:control_collection s:shard1 r:core_node1 x:collection1] o.a.s.c.ZkController watch zkdir /configs/conf1
   [junit4]   2> 931616 INFO  (coreLoadExecutor-2952-thread-1-processing-n:127.0.0.1:50177_) [n:127.0.0.1:50177_ c:control_collection s:shard1 r:core_node1 x:collection1] o.a.s.c.CoreContainer registering core: collection1
   [junit4]   2> 931616 INFO  (coreZkRegister-2946-thread-1-processing-s:shard1 x:collection1 n:127.0.0.1:50177_ c:control_collection r:core_node1) [n:127.0.0.1:50177_ c:control_collection s:shard1 r:core_node1 x:collection1] o.a.s.c.ZkController Register replica - core:collection1 address:https://127.0.0.1:50177 collection:control_collection shard:shard1
   [junit4]   2> 931616 INFO  (coreZkRegister-2946-thread-1-processing-s:shard1 x:collection1 n:127.0.0.1:50177_ c:control_collection r:core_node1) [n:127.0.0.1:50177_ c:control_collection s:shard1 r:core_node1 x:collection1] o.a.s.c.c.SolrZkClient makePath: /collections/control_collection/leader_elect/shard1/election
   [junit4]   2> 931618 INFO  (coreZkRegister-2946-thread-1-processing-s:shard1 x:collection1 n:127.0.0.1:50177_ c:control_collection r:core_node1) [n:127.0.0.1:50177_ c:control_collection s:shard1 r:core_node1 x:collection1] o.a.s.c.LeaderElector Joined leadership election with path: /collections/control_collection/leader_elect/shard1/election/95415985199513605-core_node1-n_0000000000
   [junit4]   2> 931618 INFO  (coreZkRegister-2946-thread-1-processing-s:shard1 x:collection1 n:127.0.0.1:50177_ c:control_collection r:core_node1) [n:127.0.0.1:50177_ c:control_collection s:shard1 r:core_node1 x:collection1] o.a.s.c.ShardLeaderElectionContext Running the leader process for shard=shard1 and weAreReplacement=false and leaderVoteWait=180000
   [junit4]   2> 931618 INFO  (coreZkRegister-2946-thread-1-processing-s:shard1 x:collection1 n:127.0.0.1:50177_ c:control_collection r:core_node1) [n:127.0.0.1:50177_ c:control_collection s:shard1 r:core_node1 x:collection1] o.a.s.c.ShardLeaderElectionContext Enough replicas found to continue.
   [junit4]   2> 931618 INFO  (coreZkRegister-2946-thread-1-processing-s:shard1 x:collection1 n:127.0.0.1:50177_ c:control_collection r:core_node1) [n:127.0.0.1:50177_ c:control_collection s:shard1 r:core_node1 x:collection1] o.a.s.c.ShardLeaderElectionContext I may be the new leader - try and sync
   [junit4]   2> 931618 INFO  (coreZkRegister-2946-thread-1-processing-s:shard1 x:collection1 n:127.0.0.1:50177_ c:control_collection r:core_node1) [n:127.0.0.1:50177_ c:control_collection s:shard1 r:core_node1 x:collection1] o.a.s.c.SyncStrategy Sync replicas to https://127.0.0.1:50177/collection1/
   [junit4]   2> 931618 INFO  (coreZkRegister-2946-thread-1-processing-s:shard1 x:collection1 n:127.0.0.1:50177_ c:control_collection r:core_node1) [n:127.0.0.1:50177_ c:control_collection s:shard1 r:core_node1 x:collection1] o.a.s.c.SyncStrategy Sync Success - now sync replicas to me
   [junit4]   2> 931619 INFO  (OverseerStateUpdate-95415985199513605-127.0.0.1:50177_-n_0000000000) [n:127.0.0.1:50177_    ] o.a.s.c.Overseer processMessage: queueSize: 1, message = {
   [junit4]   2>   "operation":"leader",
   [junit4]   2>   "shard":"shard1",
   [junit4]   2>   "collection":"control_collection"} current state version: 1
   [junit4]   2> 931623 INFO  (coreZkRegister-2946-thread-1-processing-s:shard1 x:collection1 n:127.0.0.1:50177_ c:control_collection r:core_node1) [n:127.0.0.1:50177_ c:control_collection s:shard1 r:core_node1 x:collection1] o.a.s.c.SyncStrategy https://127.0.0.1:50177/collection1/ has no replicas
   [junit4]   2> 931624 INFO  (coreZkRegister-2946-thread-1-processing-s:shard1 x:collection1 n:127.0.0.1:50177_ c:control_collection r:core_node1) [n:127.0.0.1:50177_ c:control_collection s:shard1 r:core_node1 x:collection1] o.a.s.c.c.SolrZkClient makePath: /collections/control_collection/leaders/shard1
   [junit4]   2> 931625 INFO  (coreZkRegister-2946-thread-1-processing-s:shard1 x:collection1 n:127.0.0.1:50177_ c:control_collection r:core_node1) [n:127.0.0.1:50177_ c:control_collection s:shard1 r:core_node1 x:collection1] o.a.s.c.ShardLeaderElectionContextBase Creating leader registration node
   [junit4]   2> 931626 INFO  (coreZkRegister-2946-thread-1-processing-s:shard1 x:collection1 n:127.0.0.1:50177_ c:control_collection r:core_node1) [n:127.0.0.1:50177_ c:control_collection s:shard1 r:core_node1 x:collection1] o.a.s.c.ShardLeaderElectionContext I am the new leader: https://127.0.0.1:50177/collection1/ shard1
   [junit4]   2> 931626 INFO  (OverseerStateUpdate-95415985199513605-127.0.0.1:50177_-n_0000000000) [n:127.0.0.1:50177_    ] o.a.s.c.Overseer processMessage: queueSize: 1, message = {
   [junit4]   2>   "operation":"leader",
   [junit4]   2>   "shard":"shard1",
   [junit4]   2>   "collection":"control_collection",
   [junit4]   2>   "base_url":"https://127.0.0.1:50177",
   [junit4]   2>   "core":"collection1",
   [junit4]   2>   "state":"active"} current state version: 1
   [junit4]   2> 931727 INFO  (zkCallback-972-thread-1-processing-n:127.0.0.1:50177_) [n:127.0.0.1:50177_    ] o.a.s.c.c.ZkStateReader A cluster state change: [WatchedEvent state:SyncConnected type:NodeDataChanged path:/clusterstate.json], has occurred - updating... (live nodes size: [1])
   [junit4]   2> 931776 INFO  (coreZkRegister-2946-thread-1-processing-s:shard1 x:collection1 n:127.0.0.1:50177_ c:control_collection r:core_node1) [n:127.0.0.1:50177_ c:control_collection s:shard1 r:core_node1 x:collection1] o.a.s.c.ZkController We are https://127.0.0.1:50177/collection1/ and leader is https://127.0.0.1:50177/collection1/
   [junit4]   2> 931776 INFO  (coreZkRegister-2946-thread-1-processing-s:shard1 x:collection1 n:127.0.0.1:50177_ c:control_collection r:core_node1) [n:127.0.0.1:50177_ c:control_collection s:shard1 r:core_node1 x:collection1] o.a.s.c.ZkController No LogReplay needed for core=collection1 baseURL=https://127.0.0.1:50177
   [junit4]   2> 931776 INFO  (coreZkRegister-2946-thread-1-processing-s:shard1 x:collection1 n:127.0.0.1:50177_ c:control_collection r:core_node1) [n:127.0.0.1:50177_ c:control_collection s:shard1 r:core_node1 x:collection1] o.a.s.c.ZkController I am the leader, no recovery necessary
   [junit4]   2> 931776 INFO  (coreZkRegister-2946-thread-1-processing-s:shard1 x:collection1 n:127.0.0.1:50177_ c:control_collection r:core_node1) [n:127.0.0.1:50177_ c:control_collection s:shard1 r:core_node1 x:collection1] o.a.s.c.ZkController publishing state=active
   [junit4]   2> 931776 INFO  (coreZkRegister-2946-thread-1-processing-s:shard1 x:collection1 n:127.0.0.1:50177_ c:control_collection r:core_node1) [n:127.0.0.1:50177_ c:control_collection s:shard1 r:core_node1 x:collection1] o.a.s.c.ZkController numShards not found on descriptor - reading it from system property
   [junit4]   2> 931777 INFO  (OverseerStateUpdate-95415985199513605-127.0.0.1:50177_-n_0000000000) [n:127.0.0.1:50177_    ] o.a.s.c.Overseer processMessage: queueSize: 1, message = {
   [junit4]   2>   "base_url":"https://127.0.0.1:50177",
   [junit4]   2>   "shard":"shard1",
   [junit4]   2>   "operation":"state",
   [junit4]   2>   "core_node_name":"core_node1",
   [junit4]   2>   "node_name":"127.0.0.1:50177_",
   [junit4]   2>   "core":"collection1",
   [junit4]   2>   "roles":null,
   [junit4]   2>   "numShards":"1",
   [junit4]   2>   "collection":"control_collection",
   [junit4]   2>   "state":"active"} current state version: 2
   [junit4]   2> 931777 INFO  (OverseerStateUpdate-95415985199513605-127.0.0.1:50177_-n_0000000000) [n:127.0.0.1:50177_    ] o.a.s.c.o.ReplicaMutator Update state numShards=1 message={
   [junit4]   2>   "base_url":"https://127.0.0.1:50177",
   [junit4]   2>   "shard":"shard1",
   [junit4]   2>   "operation":"state",
   [junit4]   2>   "core_node_name":"core_node1",
   [junit4]   2>   "node_name":"127.0.0.1:50177_",
   [junit4]   2>   "core":"collection1",
   [junit4]   2>   "roles":null,
   [junit4]   2>   "numShards":"1",
   [junit4]   2>   "collection":"control_collection",
   [junit4]   2>   "state":"active"}
   [junit4]   2> 931878 INFO  (zkCallback-972-thread-2-processing-n:127.0.0.1:50177_) [n:127.0.0.1:50177_    ] o.a.s.c.c.ZkStateReader A cluster state change: [WatchedEvent state:SyncConnected type:NodeDataChanged path:/clusterstate.json], has occurred - updating... (live nodes size: [1])
   [junit4]   2> 931905 INFO  (TEST-CollectionsAPIDistributedZkTest.test-seed#[140C4DFE77815F2E]) [    ] o.a.s.c.c.SolrZkClient Using default ZkCredentialsProvider
   [junit4]   2> 931910 INFO  (TEST-CollectionsAPIDistributedZkTest.test-seed#[140C4DFE77815F2E]) [    ] o.a.s.c.c.ConnectionManager Waiting for client to connect to ZooKeeper
   [junit4]   2> 931911 INFO  (zkCallback-974-thread-1) [    ] o.a.s.c.c.ConnectionManager Watcher org.apache.solr.common.cloud.ConnectionManager@61d623b2 name:ZooKeeperConnection Watcher:127.0.0.1:55041/solr got event WatchedEvent state:SyncConnected type:None path:null path:null type:None
   [junit4]   2> 931911 INFO  (TEST-CollectionsAPIDistributedZkTest.test-seed#[140C4DFE77815F2E]) [    ] o.a.s.c.c.ConnectionManager Client is connected to ZooKeeper
   [junit4]   2> 931912 INFO  (TEST-CollectionsAPIDistributedZkTest.test-seed#[140C4DFE77815F2E]) [    ] o.a.s.c.c.SolrZkClient Using default ZkACLProvider
   [junit4]   2> 931912 INFO  (TEST-CollectionsAPIDistributedZkTest.test-seed#[140C4DFE77815F2E]) [    ] o.a.s.c.c.ZkStateReader Updating cluster state from ZooKeeper... 
   [junit4]   2> 931913 INFO  (TEST-CollectionsAPIDistributedZkTest.test-seed#[140C4DFE77815F2E]) [    ] o.a.s.c.ChaosMonkey monkey: init - expire sessions:false cause connection loss:false
   [junit4]   2> 931913 INFO  (TEST-CollectionsAPIDistributedZkTest.test-seed#[140C4DFE77815F2E]) [    ] o.a.s.c.AbstractFullDistribZkTestBase Creating collection1 with stateFormat=2
   [junit4]   2> 931913 INFO  (TEST-CollectionsAPIDistributedZkTest.test-seed#[140C4DFE77815F2E]) [    ] o.a.s.c.c.SolrZkClient Using default ZkCredentialsProvider
   [junit4]   2> 931913 INFO  (TEST-CollectionsAPIDistributedZkTest.test-seed#[140C4DFE77815F2E]) [    ] o.a.s.c.c.ConnectionManager Waiting for client to connect to ZooKeeper
   [junit4]   2> 931914 INFO  (zkCallback-975-thread-1) [    ] o.a.s.c.c.ConnectionManager Watcher org.apache.solr.common.cloud.ConnectionManager@2d298a76 name:ZooKeeperConnection Watcher:127.0.0.1:55041/solr got event WatchedEvent state:SyncConnected type:None path:null path:null type:None
   [junit4]   2> 931914 INFO  (TEST-CollectionsAPIDistributedZkTest.test-seed#[140C4DFE77815F2E]) [    ] o.a.s.c.c.ConnectionManager Client is connected to ZooKeeper
   [junit4]   2> 931914 INFO  (TEST-CollectionsAPIDistributedZkTest.test-seed#[140C4DFE77815F2E]) [    ] o.a.s.c.c.SolrZkClient Using default ZkACLProvider
   [junit4]   2> 931915 INFO  (OverseerStateUpdate-95415985199513605-127.0.0.1:50177_-n_0000000000) [n:127.0.0.1:50177_    ] o.a.s.c.Overseer processMessage: queueSize: 1, message = {
   [junit4]   2>   "operation":"create",
   [junit4]   2>   "name":"collection1",
   [junit4]   2>   "numShards":"2",
   [junit4]   2>   "stateFormat":"2"} current state version: 3
   [junit4]   2> 931915 INFO  (OverseerStateUpdate-95415985199513605-127.0.0.1:50177_-n_0000000000) [n:127.0.0.1:50177_    ] o.a.s.c.o.ClusterStateMutator building a new cName: collection1
   [junit4]   2> 931973 INFO  (TEST-CollectionsAPIDistributedZkTest.test-seed#[140C4DFE77815F2E]) [    ] o.a.s.SolrTestCaseJ4 Writing core.properties file to /home/jenkins/workspace/Lucene-Solr-5.5-Linux/solr/build/solr-core/test/J1/temp/solr.cloud.CollectionsAPIDistributedZkTest_140C4DFE77815F2E-001/shard-1-001/cores/collection1
   [junit4]   2> 931992 INFO  (TEST-CollectionsAPIDistributedZkTest.test-seed#[140C4DFE77815F2E]) [    ] o.a.s.c.AbstractFullDistribZkTestBase create jetty 1 in directory /home/jenkins/workspace/Lucene-Solr-5.5-Linux/solr/build/solr-core/test/J1/temp/solr.cloud.CollectionsAPIDistributedZkTest_140C4DFE77815F2E-001/shard-1-001
   [junit4]   2> 931993 INFO  (TEST-CollectionsAPIDistributedZkTest.test-seed#[140C4DFE77815F2E]) [    ] o.e.j.s.Server jetty-9.2.13.v20150730
   [junit4]   2> 931994 INFO  (TEST-CollectionsAPIDistributedZkTest.test-seed#[140C4DFE77815F2E]) [    ] o.e.j.s.h.ContextHandler Started o.e.j.s.ServletContextHandler@3437ff37{/,null,AVAILABLE}
   [junit4]   2> 931998 INFO  (TEST-CollectionsAPIDistributedZkTest.test-seed#[140C4DFE77815F2E]) [    ] o.e.j.s.ServerConnector Started ServerConnector@27621e58{SSL-http/1.1}{127.0.0.1:60143}
   [junit4]   2> 931998 INFO  (TEST-CollectionsAPIDistributedZkTest.test-seed#[140C4DFE77815F2E]) [    ] o.e.j.s.Server Started @933702ms
   [junit4]   2> 931998 INFO  (TEST-CollectionsAPIDistributedZkTest.test-seed#[140C4DFE77815F2E]) [    ] o.a.s.c.s.e.JettySolrRunner Jetty properties: {coreRootDirectory=/home/jenkins/workspace/Lucene-Solr-5.5-Linux/solr/build/solr-core/test/J1/temp/solr.cloud.CollectionsAPIDistributedZkTest_140C4DFE77815F2E-001/shard-1-001/cores, solrconfig=solrconfig.xml, solr.data.dir=/home/jenkins/workspace/Lucene-Solr-5.5-Linux/solr/build/solr-core/test/J1/temp/solr.cloud.CollectionsAPIDistributedZkTest_140C4DFE77815F2E-001/tempDir-001/jetty1, hostContext=/, hostPort=60143}
   [junit4]   2> 931998 INFO  (TEST-CollectionsAPIDistributedZkTest.test-seed#[140C4DFE77815F2E]) [    ] o.a.s.s.SolrDispatchFilter SolrDispatchFilter.init(): sun.misc.Launcher$AppClassLoader@36d98810
   [junit4]   2> 931998 INFO  (TEST-CollectionsAPIDistributedZkTest.test-seed#[140C4DFE77815F2E]) [    ] o.a.s.c.SolrResourceLoader new SolrResourceLoader for directory: '/home/jenkins/workspace/Lucene-Solr-5.5-Linux/solr/build/solr-core/test/J1/temp/solr.cloud.CollectionsAPIDistributedZkTest_140C4DFE77815F2E-001/shard-1-001'
   [junit4]   2> 931999 INFO  (TEST-CollectionsAPIDistributedZkTest.test-seed#[140C4DFE77815F2E]) [    ] o.a.s.c.SolrResourceLoader JNDI not configured for solr (NoInitialContextEx)
   [junit4]   2> 931999 INFO  (TEST-CollectionsAPIDistributedZkTest.test-seed#[140C4DFE77815F2E]) [    ] o.a.s.c.SolrResourceLoader solr home defaulted to 'solr/' (could not find system property or JNDI)
   [junit4]   2> 931999 INFO  (TEST-CollectionsAPIDistributedZkTest.test-seed#[140C4DFE77815F2E]) [    ] o.a.s.c.c.SolrZkClient Using default ZkCredentialsProvider
   [junit4]   2> 931999 INFO  (TEST-CollectionsAPIDistributedZkTest.test-seed#[140C4DFE77815F2E]) [    ] o.a.s.c.c.ConnectionManager Waiting for client to connect to ZooKeeper
   [junit4]   2> 932000 INFO  (zkCallback-976-thread-1) [    ] o.a.s.c.c.ConnectionManager Watcher org.apache.solr.common.cloud.ConnectionManager@6310a113 name:ZooKeeperConnection Watcher:127.0.0.1:55041/solr got event WatchedEvent state:SyncConnected type:None path:null path:null type:None
   [junit4]   2> 932000 INFO  (TEST-CollectionsAPIDistributedZkTest.test-seed#[140C4DFE77815F2E]) [    ] o.a.s.c.c.ConnectionManager Client is connected to ZooKeeper
   [junit4]   2> 932000 INFO  (TEST-CollectionsAPIDistributedZkTest.test-seed#[140C4DFE77815F2E]) [    ] o.a.s.c.c.SolrZkClient Using default ZkACLProvider
   [junit4]   2> 932001 INFO  (TEST-CollectionsAPIDistributedZkTest.test-seed#[140C4DFE77815F2E]) [    ] o.a.s.s.SolrDispatchFilter Loading solr.xml from SolrHome (not found in ZooKeeper)
   [junit4]   2> 932001 INFO  (TEST-CollectionsAPIDistributedZkTest.test-seed#[140C4DFE77815F2E]) [    ] o.a.s.c.SolrXmlConfig Loading container configuration from /home/jenkins/workspace/Lucene-Solr-5.5-Linux/solr/build/solr-core/test/J1/temp/solr.cloud.CollectionsAPIDistributedZkTest_140C4DFE77815F2E-001/shard-1-001/solr.xml
   [junit4]   2> 932009 INFO  (TEST-CollectionsAPIDistributedZkTest.test-seed#[140C4DFE77815F2E]) [    ] o.a.s.c.CorePropertiesLocator Config-defined core root directory: /home/jenkins/workspace/Lucene-Solr-5.5-Linux/solr/build/solr-core/test/J1/temp/solr.cloud.CollectionsAPIDistributedZkTest_140C4DFE77815F2E-001/shard-1-001/cores
   [junit4]   2> 932009 INFO  (TEST-CollectionsAPIDistributedZkTest.test-seed#[140C4DFE77815F2E]) [    ] o.a.s.c.CoreContainer New CoreContainer 1760471338
   [junit4]   2> 932009 INFO  (TEST-CollectionsAPIDistributedZkTest.test-seed#[140C4DFE77815F2E]) [    ] o.a.s.c.CoreContainer Loading cores into CoreContainer [instanceDir=/home/jenkins/workspace/Lucene-Solr-5.5-Linux/solr/build/solr-core/test/J1/temp/solr.cloud.CollectionsAPIDistributedZkTest_140C4DFE77815F2E-001/shard-1-001]
   [junit4]   2> 932009 WARN  (TEST-CollectionsAPIDistributedZkTest.test-seed#[140C4DFE77815F2E]) [    ] o.a.s.c.CoreContainer Couldn't add files from /home/jenkins/workspace/Lucene-Solr-5.5-Linux/solr/build/solr-core/test/J1/temp/solr.cloud.CollectionsAPIDistributedZkTest_140C4DFE77815F2E-001/shard-1-001/lib to classpath: /home/jenkins/workspace/Lucene-Solr-5.5-Linux/solr/build/solr-core/test/J1/temp/solr.cloud.CollectionsAPIDistributedZkTest_140C4DFE77815F2E-001/shard-1-001/lib
   [junit4]   2> 932009 INFO  (TEST-CollectionsAPIDistributedZkTest.test-seed#[140C4DFE77815F2E]) [    ] o.a.s.h.c.HttpShardHandlerFactory created with socketTimeout : 90000,urlScheme : ,connTimeout : 15000,maxConnectionsPerHost : 20,maxConnections : 10000,corePoolSize : 0,maximumPoolSize : 2147483647,maxThreadIdleTime : 5,sizeOfQueue : -1,fairnessPolicy : false,useRetries : false,
   [junit4]   2> 932011 INFO  (TEST-CollectionsAPIDistributedZkTest.test-seed#[140C4DFE77815F2E]) [    ] o.a.s.u.UpdateShardHandler Creating UpdateShardHandler HTTP client with params: socketTimeout=340000&connTimeout=45000&retry=true
   [junit4]   2> 932012 INFO  (TEST-CollectionsAPIDistributedZkTest.test-seed#[140C4DFE77815F2E]) [    ] o.a.s.l.LogWatcher SLF4J impl is org.slf4j.impl.Log4jLoggerFactory
   [junit4]   2> 932012 INFO  (TEST-CollectionsAPIDistributedZkTest.test-seed#[140C4DFE77815F2E]) [    ] o.a.s.l.LogWatcher Registering Log Listener [Log4j (org.slf4j.impl.Log4jLoggerFactory)]
   [junit4]   2> 932012 INFO  (TEST-CollectionsAPIDistributedZkTest.

[...truncated too long message...]

keeper.ClientCnxn$EventThread.run(ClientCnxn.java:494)
   [junit4]    >    3) Thread[id=7304, name=zkCallback-1003-thread-5, state=TIMED_WAITING, group=TGRP-CollectionsAPIDistributedZkTest]
   [junit4]    >         at sun.misc.Unsafe.park(Native Method)
   [junit4]    >         at java.util.concurrent.locks.LockSupport.parkNanos(LockSupport.java:226)
   [junit4]    >         at java.util.concurrent.SynchronousQueue$TransferStack.awaitFulfill(SynchronousQueue.java:460)
   [junit4]    >         at java.util.concurrent.SynchronousQueue$TransferStack.transfer(SynchronousQueue.java:359)
   [junit4]    >         at java.util.concurrent.SynchronousQueue.poll(SynchronousQueue.java:942)
   [junit4]    >         at java.util.concurrent.ThreadPoolExecutor.getTask(ThreadPoolExecutor.java:1068)
   [junit4]    >         at java.util.concurrent.ThreadPoolExecutor.runWorker(ThreadPoolExecutor.java:1130)
   [junit4]    >         at java.util.concurrent.ThreadPoolExecutor$Worker.run(ThreadPoolExecutor.java:615)
   [junit4]    >         at java.lang.Thread.run(Thread.java:745)
   [junit4]    >    4) Thread[id=7265, name=zkCallback-1003-thread-2, state=TIMED_WAITING, group=TGRP-CollectionsAPIDistributedZkTest]
   [junit4]    >         at sun.misc.Unsafe.park(Native Method)
   [junit4]    >         at java.util.concurrent.locks.LockSupport.parkNanos(LockSupport.java:226)
   [junit4]    >         at java.util.concurrent.SynchronousQueue$TransferStack.awaitFulfill(SynchronousQueue.java:460)
   [junit4]    >         at java.util.concurrent.SynchronousQueue$TransferStack.transfer(SynchronousQueue.java:359)
   [junit4]    >         at java.util.concurrent.SynchronousQueue.poll(SynchronousQueue.java:942)
   [junit4]    >         at java.util.concurrent.ThreadPoolExecutor.getTask(ThreadPoolExecutor.java:1068)
   [junit4]    >         at java.util.concurrent.ThreadPoolExecutor.runWorker(ThreadPoolExecutor.java:1130)
   [junit4]    >         at java.util.concurrent.ThreadPoolExecutor$Worker.run(ThreadPoolExecutor.java:615)
   [junit4]    >         at java.lang.Thread.run(Thread.java:745)
   [junit4]    >    5) Thread[id=7125, name=TEST-CollectionsAPIDistributedZkTest.test-seed#[140C4DFE77815F2E]-SendThread(127.0.0.1:55041), state=TIMED_WAITING, group=TGRP-CollectionsAPIDistributedZkTest]
   [junit4]    >         at java.lang.Thread.sleep(Native Method)
   [junit4]    >         at org.apache.zookeeper.client.StaticHostProvider.next(StaticHostProvider.java:101)
   [junit4]    >         at org.apache.zookeeper.ClientCnxn$SendThread.startConnect(ClientCnxn.java:940)
   [junit4]    >         at org.apache.zookeeper.ClientCnxn$SendThread.run(ClientCnxn.java:1003)
   [junit4]    >    6) Thread[id=7303, name=zkCallback-1003-thread-4, state=TIMED_WAITING, group=TGRP-CollectionsAPIDistributedZkTest]
   [junit4]    >         at sun.misc.Unsafe.park(Native Method)
   [junit4]    >         at java.util.concurrent.locks.LockSupport.parkNanos(LockSupport.java:226)
   [junit4]    >         at java.util.concurrent.SynchronousQueue$TransferStack.awaitFulfill(SynchronousQueue.java:460)
   [junit4]    >         at java.util.concurrent.SynchronousQueue$TransferStack.transfer(SynchronousQueue.java:359)
   [junit4]    >         at java.util.concurrent.SynchronousQueue.poll(SynchronousQueue.java:942)
   [junit4]    >         at java.util.concurrent.ThreadPoolExecutor.getTask(ThreadPoolExecutor.java:1068)
   [junit4]    >         at java.util.concurrent.ThreadPoolExecutor.runWorker(ThreadPoolExecutor.java:1130)
   [junit4]    >         at java.util.concurrent.ThreadPoolExecutor$Worker.run(ThreadPoolExecutor.java:615)
   [junit4]    >         at java.lang.Thread.run(Thread.java:745)
   [junit4]    > 	at __randomizedtesting.SeedInfo.seed([140C4DFE77815F2E]:0)Throwable #2: com.carrotsearch.randomizedtesting.ThreadLeakError: There are still zombie threads that couldn't be terminated:
   [junit4]    >    1) Thread[id=7265, name=zkCallback-1003-thread-2, state=TIMED_WAITING, group=TGRP-CollectionsAPIDistributedZkTest]
   [junit4]    >         at sun.misc.Unsafe.park(Native Method)
   [junit4]    >         at java.util.concurrent.locks.LockSupport.parkNanos(LockSupport.java:226)
   [junit4]    >         at java.util.concurrent.SynchronousQueue$TransferStack.awaitFulfill(SynchronousQueue.java:460)
   [junit4]    >         at java.util.concurrent.SynchronousQueue$TransferStack.transfer(SynchronousQueue.java:359)
   [junit4]    >         at java.util.concurrent.SynchronousQueue.poll(SynchronousQueue.java:942)
   [junit4]    >         at java.util.concurrent.ThreadPoolExecutor.getTask(ThreadPoolExecutor.java:1068)
   [junit4]    >         at java.util.concurrent.ThreadPoolExecutor.runWorker(ThreadPoolExecutor.java:1130)
   [junit4]    >         at java.util.concurrent.ThreadPoolExecutor$Worker.run(ThreadPoolExecutor.java:615)
   [junit4]    >         at java.lang.Thread.run(Thread.java:745)
   [junit4]    >    2) Thread[id=7125, name=TEST-CollectionsAPIDistributedZkTest.test-seed#[140C4DFE77815F2E]-SendThread(127.0.0.1:55041), state=TIMED_WAITING, group=TGRP-CollectionsAPIDistributedZkTest]
   [junit4]    >         at java.lang.Thread.sleep(Native Method)
   [junit4]    >         at org.apache.zookeeper.client.StaticHostProvider.next(StaticHostProvider.java:101)
   [junit4]    >         at org.apache.zookeeper.ClientCnxn$SendThread.startConnect(ClientCnxn.java:940)
   [junit4]    >         at org.apache.zookeeper.ClientCnxn$SendThread.run(ClientCnxn.java:1003)
   [junit4]    >    3) Thread[id=7303, name=zkCallback-1003-thread-4, state=TIMED_WAITING, group=TGRP-CollectionsAPIDistributedZkTest]
   [junit4]    >         at sun.misc.Unsafe.park(Native Method)
   [junit4]    >         at java.util.concurrent.locks.LockSupport.parkNanos(LockSupport.java:226)
   [junit4]    >         at java.util.concurrent.SynchronousQueue$TransferStack.awaitFulfill(SynchronousQueue.java:460)
   [junit4]    >         at java.util.concurrent.SynchronousQueue$TransferStack.transfer(SynchronousQueue.java:359)
   [junit4]    >         at java.util.concurrent.SynchronousQueue.poll(SynchronousQueue.java:942)
   [junit4]    >         at java.util.concurrent.ThreadPoolExecutor.getTask(ThreadPoolExecutor.java:1068)
   [junit4]    >         at java.util.concurrent.ThreadPoolExecutor.runWorker(ThreadPoolExecutor.java:1130)
   [junit4]    >         at java.util.concurrent.ThreadPoolExecutor$Worker.run(ThreadPoolExecutor.java:615)
   [junit4]    >         at java.lang.Thread.run(Thread.java:745)
   [junit4]    >    4) Thread[id=7292, name=zkCallback-1003-thread-3, state=TIMED_WAITING, group=TGRP-CollectionsAPIDistributedZkTest]
   [junit4]    >         at sun.misc.Unsafe.park(Native Method)
   [junit4]    >         at java.util.concurrent.locks.LockSupport.parkNanos(LockSupport.java:226)
   [junit4]    >         at java.util.concurrent.SynchronousQueue$TransferStack.awaitFulfill(SynchronousQueue.java:460)
   [junit4]    >         at java.util.concurrent.SynchronousQueue$TransferStack.transfer(SynchronousQueue.java:359)
   [junit4]    >         at java.util.concurrent.SynchronousQueue.poll(SynchronousQueue.java:942)
   [junit4]    >         at java.util.concurrent.ThreadPoolExecutor.getTask(ThreadPoolExecutor.java:1068)
   [junit4]    >         at java.util.concurrent.ThreadPoolExecutor.runWorker(ThreadPoolExecutor.java:1130)
   [junit4]    >         at java.util.concurrent.ThreadPoolExecutor$Worker.run(ThreadPoolExecutor.java:615)
   [junit4]    >         at java.lang.Thread.run(Thread.java:745)
   [junit4]    >    5) Thread[id=7304, name=zkCallback-1003-thread-5, state=TIMED_WAITING, group=TGRP-CollectionsAPIDistributedZkTest]
   [junit4]    >         at sun.misc.Unsafe.park(Native Method)
   [junit4]    >         at java.util.concurrent.locks.LockSupport.parkNanos(LockSupport.java:226)
   [junit4]    >         at java.util.concurrent.SynchronousQueue$TransferStack.awaitFulfill(SynchronousQueue.java:460)
   [junit4]    >         at java.util.concurrent.SynchronousQueue$TransferStack.transfer(SynchronousQueue.java:359)
   [junit4]    >         at java.util.concurrent.SynchronousQueue.poll(SynchronousQueue.java:942)
   [junit4]    >         at java.util.concurrent.ThreadPoolExecutor.getTask(ThreadPoolExecutor.java:1068)
   [junit4]    >         at java.util.concurrent.ThreadPoolExecutor.runWorker(ThreadPoolExecutor.java:1130)
   [junit4]    >         at java.util.concurrent.ThreadPoolExecutor$Worker.run(ThreadPoolExecutor.java:615)
   [junit4]    >         at java.lang.Thread.run(Thread.java:745)
   [junit4]    > 	at __randomizedtesting.SeedInfo.seed([140C4DFE77815F2E]:0)
   [junit4] Completed [286/566 (1!)] on J1 in 110.39s, 1 test, 1 failure, 2 errors <<< FAILURES!

[...truncated 873 lines...]
BUILD FAILED
/home/jenkins/workspace/Lucene-Solr-5.5-Linux/build.xml:750: The following error occurred while executing this line:
/home/jenkins/workspace/Lucene-Solr-5.5-Linux/build.xml:694: The following error occurred while executing this line:
/home/jenkins/workspace/Lucene-Solr-5.5-Linux/build.xml:59: The following error occurred while executing this line:
/home/jenkins/workspace/Lucene-Solr-5.5-Linux/solr/build.xml:233: The following error occurred while executing this line:
/home/jenkins/workspace/Lucene-Solr-5.5-Linux/solr/common-build.xml:534: The following error occurred while executing this line:
/home/jenkins/workspace/Lucene-Solr-5.5-Linux/lucene/common-build.xml:1477: The following error occurred while executing this line:
/home/jenkins/workspace/Lucene-Solr-5.5-Linux/lucene/common-build.xml:1033: There were test failures: 566 suites (7 ignored), 2275 tests, 2 suite-level errors, 1 failure, 929 ignored (35 assumptions) [seed: 140C4DFE77815F2E]

Total time: 39 minutes 40 seconds
Build step 'Invoke Ant' marked build as failure
Archiving artifacts
[WARNINGS] Skipping publisher since build result is FAILURE
Recording test results
Email was triggered for: Failure - Any
Sending email for trigger: Failure - Any



Mime
View raw message