lucene-dev mailing list archives

Site index · List index
Message view « Date » · « Thread »
Top « Date » · « Thread »
From Policeman Jenkins Server <jenk...@thetaphi.de>
Subject [JENKINS-EA] Lucene-Solr-trunk-Linux (32bit/jdk-9-ea+104) - Build # 15883 - Failure!
Date Sun, 14 Feb 2016 11:01:35 GMT
Build: http://jenkins.thetaphi.de/job/Lucene-Solr-trunk-Linux/15883/
Java: 32bit/jdk-9-ea+104 -server -XX:+UseG1GC -XX:-CompactStrings -XX:-UseSuperWord

1 tests failed.
FAILED:  org.apache.lucene.analysis.phonetic.TestPhoneticFilter.testRandomStrings

Error Message:


Stack Trace:
java.lang.AssertionError
	at __randomizedtesting.SeedInfo.seed([C33E2BF37F3DB5C6:4BB72B4DDC39E2F3]:0)
	at org.apache.lucene.util.TestUtil.randomSubString(TestUtil.java:1251)
	at org.apache.lucene.util.TestUtil.randomAnalysisString(TestUtil.java:1192)
	at org.apache.lucene.analysis.BaseTokenStreamTestCase.checkRandomData(BaseTokenStreamTestCase.java:623)
	at org.apache.lucene.analysis.BaseTokenStreamTestCase.checkRandomData(BaseTokenStreamTestCase.java:525)
	at org.apache.lucene.analysis.BaseTokenStreamTestCase.checkRandomData(BaseTokenStreamTestCase.java:433)
	at org.apache.lucene.analysis.phonetic.TestPhoneticFilter.testRandomStrings(TestPhoneticFilter.java:108)
	at sun.reflect.NativeMethodAccessorImpl.invoke0(Native Method)
	at sun.reflect.NativeMethodAccessorImpl.invoke(NativeMethodAccessorImpl.java:62)
	at sun.reflect.DelegatingMethodAccessorImpl.invoke(DelegatingMethodAccessorImpl.java:43)
	at java.lang.reflect.Method.invoke(Method.java:520)
	at com.carrotsearch.randomizedtesting.RandomizedRunner.invoke(RandomizedRunner.java:1764)
	at com.carrotsearch.randomizedtesting.RandomizedRunner$8.evaluate(RandomizedRunner.java:871)
	at com.carrotsearch.randomizedtesting.RandomizedRunner$9.evaluate(RandomizedRunner.java:907)
	at com.carrotsearch.randomizedtesting.RandomizedRunner$10.evaluate(RandomizedRunner.java:921)
	at org.apache.lucene.util.TestRuleSetupTeardownChained$1.evaluate(TestRuleSetupTeardownChained.java:49)
	at org.apache.lucene.util.AbstractBeforeAfterRule$1.evaluate(AbstractBeforeAfterRule.java:45)
	at org.apache.lucene.util.TestRuleThreadAndTestName$1.evaluate(TestRuleThreadAndTestName.java:48)
	at org.apache.lucene.util.TestRuleIgnoreAfterMaxFailures$1.evaluate(TestRuleIgnoreAfterMaxFailures.java:64)
	at org.apache.lucene.util.TestRuleMarkFailure$1.evaluate(TestRuleMarkFailure.java:47)
	at com.carrotsearch.randomizedtesting.rules.StatementAdapter.evaluate(StatementAdapter.java:36)
	at com.carrotsearch.randomizedtesting.ThreadLeakControl$StatementRunner.run(ThreadLeakControl.java:367)
	at com.carrotsearch.randomizedtesting.ThreadLeakControl.forkTimeoutingTask(ThreadLeakControl.java:809)
	at com.carrotsearch.randomizedtesting.ThreadLeakControl$3.evaluate(ThreadLeakControl.java:460)
	at com.carrotsearch.randomizedtesting.RandomizedRunner.runSingleTest(RandomizedRunner.java:880)
	at com.carrotsearch.randomizedtesting.RandomizedRunner$5.evaluate(RandomizedRunner.java:781)
	at com.carrotsearch.randomizedtesting.RandomizedRunner$6.evaluate(RandomizedRunner.java:816)
	at com.carrotsearch.randomizedtesting.RandomizedRunner$7.evaluate(RandomizedRunner.java:827)
	at org.apache.lucene.util.AbstractBeforeAfterRule$1.evaluate(AbstractBeforeAfterRule.java:45)
	at com.carrotsearch.randomizedtesting.rules.StatementAdapter.evaluate(StatementAdapter.java:36)
	at org.apache.lucene.util.TestRuleStoreClassName$1.evaluate(TestRuleStoreClassName.java:41)
	at com.carrotsearch.randomizedtesting.rules.NoShadowingOrOverridesOnMethodsRule$1.evaluate(NoShadowingOrOverridesOnMethodsRule.java:40)
	at com.carrotsearch.randomizedtesting.rules.NoShadowingOrOverridesOnMethodsRule$1.evaluate(NoShadowingOrOverridesOnMethodsRule.java:40)
	at com.carrotsearch.randomizedtesting.rules.StatementAdapter.evaluate(StatementAdapter.java:36)
	at com.carrotsearch.randomizedtesting.rules.StatementAdapter.evaluate(StatementAdapter.java:36)
	at com.carrotsearch.randomizedtesting.rules.StatementAdapter.evaluate(StatementAdapter.java:36)
	at org.apache.lucene.util.TestRuleAssertionsRequired$1.evaluate(TestRuleAssertionsRequired.java:53)
	at org.apache.lucene.util.TestRuleMarkFailure$1.evaluate(TestRuleMarkFailure.java:47)
	at org.apache.lucene.util.TestRuleIgnoreAfterMaxFailures$1.evaluate(TestRuleIgnoreAfterMaxFailures.java:64)
	at org.apache.lucene.util.TestRuleIgnoreTestSuites$1.evaluate(TestRuleIgnoreTestSuites.java:54)
	at com.carrotsearch.randomizedtesting.rules.StatementAdapter.evaluate(StatementAdapter.java:36)
	at com.carrotsearch.randomizedtesting.ThreadLeakControl$StatementRunner.run(ThreadLeakControl.java:367)
	at java.lang.Thread.run(Thread.java:804)




Build Log:
[...truncated 3638 lines...]
   [junit4] Suite: org.apache.lucene.analysis.phonetic.TestPhoneticFilter
   [junit4]   2> NOTE: reproduce with: ant test  -Dtestcase=TestPhoneticFilter -Dtests.method=testRandomStrings
-Dtests.seed=C33E2BF37F3DB5C6 -Dtests.multiplier=3 -Dtests.slow=true -Dtests.locale=es-EC
-Dtests.timezone=Australia/Canberra -Dtests.asserts=true -Dtests.file.encoding=ISO-8859-1
   [junit4] FAILURE 2.23s J1 | TestPhoneticFilter.testRandomStrings <<<
   [junit4]    > Throwable #1: java.lang.AssertionError
   [junit4]    > 	at __randomizedtesting.SeedInfo.seed([C33E2BF37F3DB5C6:4BB72B4DDC39E2F3]:0)
   [junit4]    > 	at org.apache.lucene.util.TestUtil.randomSubString(TestUtil.java:1251)
   [junit4]    > 	at org.apache.lucene.util.TestUtil.randomAnalysisString(TestUtil.java:1192)
   [junit4]    > 	at org.apache.lucene.analysis.BaseTokenStreamTestCase.checkRandomData(BaseTokenStreamTestCase.java:623)
   [junit4]    > 	at org.apache.lucene.analysis.BaseTokenStreamTestCase.checkRandomData(BaseTokenStreamTestCase.java:525)
   [junit4]    > 	at org.apache.lucene.analysis.BaseTokenStreamTestCase.checkRandomData(BaseTokenStreamTestCase.java:433)
   [junit4]    > 	at org.apache.lucene.analysis.phonetic.TestPhoneticFilter.testRandomStrings(TestPhoneticFilter.java:108)
   [junit4]    > 	at java.lang.Thread.run(Thread.java:804)
   [junit4]   2> NOTE: test params are: codec=HighCompressionCompressingStoredFields(storedFieldsFormat=CompressingStoredFieldsFormat(compressionMode=HIGH_COMPRESSION,
chunkSize=6, maxDocsPerChunk=2, blockSize=6), termVectorsFormat=CompressingTermVectorsFormat(compressionMode=HIGH_COMPRESSION,
chunkSize=6, blockSize=6)), sim=ClassicSimilarity, locale=es-EC, timezone=Australia/Canberra
   [junit4]   2> NOTE: Linux 3.19.0-47-generic i386/Oracle Corporation 9-ea (32-bit)/cpus=12,threads=1,free=30268704,total=73400320
   [junit4]   2> NOTE: All tests run in this JVM: [TestDaitchMokotoffSoundexFilterFactory,
TestPhoneticFilter]
   [junit4] Completed [3/8 (1!)] on J1 in 2.29s, 3 tests, 1 failure <<< FAILURES!

[...truncated 26 lines...]
BUILD FAILED
/home/jenkins/workspace/Lucene-Solr-trunk-Linux/build.xml:740: The following error occurred
while executing this line:
/home/jenkins/workspace/Lucene-Solr-trunk-Linux/build.xml:684: The following error occurred
while executing this line:
/home/jenkins/workspace/Lucene-Solr-trunk-Linux/build.xml:59: The following error occurred
while executing this line:
/home/jenkins/workspace/Lucene-Solr-trunk-Linux/lucene/build.xml:475: The following error
occurred while executing this line:
/home/jenkins/workspace/Lucene-Solr-trunk-Linux/lucene/common-build.xml:2187: The following
error occurred while executing this line:
/home/jenkins/workspace/Lucene-Solr-trunk-Linux/lucene/analysis/build.xml:106: The following
error occurred while executing this line:
/home/jenkins/workspace/Lucene-Solr-trunk-Linux/lucene/analysis/build.xml:38: The following
error occurred while executing this line:
/home/jenkins/workspace/Lucene-Solr-trunk-Linux/lucene/module-build.xml:58: The following
error occurred while executing this line:
/home/jenkins/workspace/Lucene-Solr-trunk-Linux/lucene/common-build.xml:1457: The following
error occurred while executing this line:
/home/jenkins/workspace/Lucene-Solr-trunk-Linux/lucene/common-build.xml:1014: There were test
failures: 8 suites, 41 tests, 1 failure [seed: C33E2BF37F3DB5C6]

Total time: 13 minutes 10 seconds
Build step 'Invoke Ant' marked build as failure
Archiving artifacts
[WARNINGS] Skipping publisher since build result is FAILURE
Recording test results
Email was triggered for: Failure - Any
Sending email for trigger: Failure - Any



Mime
View raw message