lucene-dev mailing list archives

Site index · List index
Message view « Date » · « Thread »
Top « Date » · « Thread »
From Policeman Jenkins Server <jenk...@thetaphi.de>
Subject [JENKINS] Lucene-Solr-5.5-Windows (64bit/jdk1.8.0_72) - Build # 2 - Failure!
Date Sun, 14 Feb 2016 13:05:52 GMT
Build: http://jenkins.thetaphi.de/job/Lucene-Solr-5.5-Windows/2/
Java: 64bit/jdk1.8.0_72 -XX:-UseCompressedOops -XX:+UseConcMarkSweepGC

1 tests failed.
FAILED:  org.apache.solr.cloud.CollectionsAPIDistributedZkTest.test

Error Message:
Error from server at http://127.0.0.1:63969/_vdb/awholynewcollection_0: non ok status: 500, message:Server Error

Stack Trace:
org.apache.solr.client.solrj.impl.HttpSolrClient$RemoteSolrException: Error from server at http://127.0.0.1:63969/_vdb/awholynewcollection_0: non ok status: 500, message:Server Error
	at __randomizedtesting.SeedInfo.seed([8E314AF9681C4366:6657523C6E02E9E]:0)
	at org.apache.solr.client.solrj.impl.HttpSolrClient.executeMethod(HttpSolrClient.java:511)
	at org.apache.solr.client.solrj.impl.HttpSolrClient.request(HttpSolrClient.java:240)
	at org.apache.solr.client.solrj.impl.HttpSolrClient.request(HttpSolrClient.java:229)
	at org.apache.solr.client.solrj.SolrRequest.process(SolrRequest.java:149)
	at org.apache.solr.client.solrj.SolrClient.query(SolrClient.java:942)
	at org.apache.solr.client.solrj.SolrClient.query(SolrClient.java:957)
	at org.apache.solr.cloud.AbstractFullDistribZkTestBase.waitForNon403or404or503(AbstractFullDistribZkTestBase.java:1753)
	at org.apache.solr.cloud.CollectionsAPIDistributedZkTest.testCollectionsAPI(CollectionsAPIDistributedZkTest.java:737)
	at org.apache.solr.cloud.CollectionsAPIDistributedZkTest.test(CollectionsAPIDistributedZkTest.java:160)
	at sun.reflect.NativeMethodAccessorImpl.invoke0(Native Method)
	at sun.reflect.NativeMethodAccessorImpl.invoke(NativeMethodAccessorImpl.java:62)
	at sun.reflect.DelegatingMethodAccessorImpl.invoke(DelegatingMethodAccessorImpl.java:43)
	at java.lang.reflect.Method.invoke(Method.java:498)
	at com.carrotsearch.randomizedtesting.RandomizedRunner.invoke(RandomizedRunner.java:1764)
	at com.carrotsearch.randomizedtesting.RandomizedRunner$8.evaluate(RandomizedRunner.java:871)
	at com.carrotsearch.randomizedtesting.RandomizedRunner$9.evaluate(RandomizedRunner.java:907)
	at com.carrotsearch.randomizedtesting.RandomizedRunner$10.evaluate(RandomizedRunner.java:921)
	at org.apache.solr.BaseDistributedSearchTestCase$ShardsRepeatRule$ShardsFixedStatement.callStatement(BaseDistributedSearchTestCase.java:964)
	at org.apache.solr.BaseDistributedSearchTestCase$ShardsRepeatRule$ShardsStatement.evaluate(BaseDistributedSearchTestCase.java:939)
	at com.carrotsearch.randomizedtesting.rules.SystemPropertiesRestoreRule$1.evaluate(SystemPropertiesRestoreRule.java:57)
	at org.apache.lucene.util.TestRuleSetupTeardownChained$1.evaluate(TestRuleSetupTeardownChained.java:49)
	at org.apache.lucene.util.AbstractBeforeAfterRule$1.evaluate(AbstractBeforeAfterRule.java:45)
	at org.apache.lucene.util.TestRuleThreadAndTestName$1.evaluate(TestRuleThreadAndTestName.java:48)
	at org.apache.lucene.util.TestRuleIgnoreAfterMaxFailures$1.evaluate(TestRuleIgnoreAfterMaxFailures.java:64)
	at org.apache.lucene.util.TestRuleMarkFailure$1.evaluate(TestRuleMarkFailure.java:47)
	at com.carrotsearch.randomizedtesting.rules.StatementAdapter.evaluate(StatementAdapter.java:36)
	at com.carrotsearch.randomizedtesting.ThreadLeakControl$StatementRunner.run(ThreadLeakControl.java:367)
	at com.carrotsearch.randomizedtesting.ThreadLeakControl.forkTimeoutingTask(ThreadLeakControl.java:809)
	at com.carrotsearch.randomizedtesting.ThreadLeakControl$3.evaluate(ThreadLeakControl.java:460)
	at com.carrotsearch.randomizedtesting.RandomizedRunner.runSingleTest(RandomizedRunner.java:880)
	at com.carrotsearch.randomizedtesting.RandomizedRunner$5.evaluate(RandomizedRunner.java:781)
	at com.carrotsearch.randomizedtesting.RandomizedRunner$6.evaluate(RandomizedRunner.java:816)
	at com.carrotsearch.randomizedtesting.RandomizedRunner$7.evaluate(RandomizedRunner.java:827)
	at com.carrotsearch.randomizedtesting.rules.StatementAdapter.evaluate(StatementAdapter.java:36)
	at com.carrotsearch.randomizedtesting.rules.SystemPropertiesRestoreRule$1.evaluate(SystemPropertiesRestoreRule.java:57)
	at org.apache.lucene.util.AbstractBeforeAfterRule$1.evaluate(AbstractBeforeAfterRule.java:45)
	at com.carrotsearch.randomizedtesting.rules.StatementAdapter.evaluate(StatementAdapter.java:36)
	at org.apache.lucene.util.TestRuleStoreClassName$1.evaluate(TestRuleStoreClassName.java:41)
	at com.carrotsearch.randomizedtesting.rules.NoShadowingOrOverridesOnMethodsRule$1.evaluate(NoShadowingOrOverridesOnMethodsRule.java:40)
	at com.carrotsearch.randomizedtesting.rules.NoShadowingOrOverridesOnMethodsRule$1.evaluate(NoShadowingOrOverridesOnMethodsRule.java:40)
	at com.carrotsearch.randomizedtesting.rules.StatementAdapter.evaluate(StatementAdapter.java:36)
	at com.carrotsearch.randomizedtesting.rules.StatementAdapter.evaluate(StatementAdapter.java:36)
	at com.carrotsearch.randomizedtesting.rules.StatementAdapter.evaluate(StatementAdapter.java:36)
	at org.apache.lucene.util.TestRuleAssertionsRequired$1.evaluate(TestRuleAssertionsRequired.java:53)
	at org.apache.lucene.util.TestRuleMarkFailure$1.evaluate(TestRuleMarkFailure.java:47)
	at org.apache.lucene.util.TestRuleIgnoreAfterMaxFailures$1.evaluate(TestRuleIgnoreAfterMaxFailures.java:64)
	at org.apache.lucene.util.TestRuleIgnoreTestSuites$1.evaluate(TestRuleIgnoreTestSuites.java:54)
	at com.carrotsearch.randomizedtesting.rules.StatementAdapter.evaluate(StatementAdapter.java:36)
	at com.carrotsearch.randomizedtesting.ThreadLeakControl$StatementRunner.run(ThreadLeakControl.java:367)
	at java.lang.Thread.run(Thread.java:745)




Build Log:
[...truncated 11407 lines...]
   [junit4] Suite: org.apache.solr.cloud.CollectionsAPIDistributedZkTest
   [junit4]   2> Creating dataDir: C:\Users\JenkinsSlave\workspace\Lucene-Solr-5.5-Windows\solr\build\solr-core\test\J1\temp\solr.cloud.CollectionsAPIDistributedZkTest_8E314AF9681C4366-001\init-core-data-001
   [junit4]   2> 1174710 INFO  (SUITE-CollectionsAPIDistributedZkTest-seed#[8E314AF9681C4366]-worker) [    ] o.a.s.SolrTestCaseJ4 Randomized ssl (false) and clientAuth (true)
   [junit4]   2> 1174710 INFO  (SUITE-CollectionsAPIDistributedZkTest-seed#[8E314AF9681C4366]-worker) [    ] o.a.s.BaseDistributedSearchTestCase Setting hostContext system property: /_vdb/
   [junit4]   2> 1174712 INFO  (TEST-CollectionsAPIDistributedZkTest.test-seed#[8E314AF9681C4366]) [    ] o.a.s.c.ZkTestServer STARTING ZK TEST SERVER
   [junit4]   2> 1174713 INFO  (Thread-3006) [    ] o.a.s.c.ZkTestServer client port:0.0.0.0/0.0.0.0:0
   [junit4]   2> 1174713 INFO  (Thread-3006) [    ] o.a.s.c.ZkTestServer Starting server
   [junit4]   2> 1174812 INFO  (TEST-CollectionsAPIDistributedZkTest.test-seed#[8E314AF9681C4366]) [    ] o.a.s.c.ZkTestServer start zk server on port:63903
   [junit4]   2> 1174812 INFO  (TEST-CollectionsAPIDistributedZkTest.test-seed#[8E314AF9681C4366]) [    ] o.a.s.c.c.SolrZkClient Using default ZkCredentialsProvider
   [junit4]   2> 1174813 INFO  (TEST-CollectionsAPIDistributedZkTest.test-seed#[8E314AF9681C4366]) [    ] o.a.s.c.c.ConnectionManager Waiting for client to connect to ZooKeeper
   [junit4]   2> 1174816 INFO  (zkCallback-1060-thread-1) [    ] o.a.s.c.c.ConnectionManager Watcher org.apache.solr.common.cloud.ConnectionManager@9990b52 name:ZooKeeperConnection Watcher:127.0.0.1:63903 got event WatchedEvent state:SyncConnected type:None path:null path:null type:None
   [junit4]   2> 1174816 INFO  (TEST-CollectionsAPIDistributedZkTest.test-seed#[8E314AF9681C4366]) [    ] o.a.s.c.c.ConnectionManager Client is connected to ZooKeeper
   [junit4]   2> 1174816 INFO  (TEST-CollectionsAPIDistributedZkTest.test-seed#[8E314AF9681C4366]) [    ] o.a.s.c.c.SolrZkClient Using default ZkACLProvider
   [junit4]   2> 1174816 INFO  (TEST-CollectionsAPIDistributedZkTest.test-seed#[8E314AF9681C4366]) [    ] o.a.s.c.c.SolrZkClient makePath: /solr
   [junit4]   2> 1174818 WARN  (NIOServerCxn.Factory:0.0.0.0/0.0.0.0:0) [    ] o.a.z.s.NIOServerCnxn caught end of stream exception
   [junit4]   2> EndOfStreamException: Unable to read additional data from client sessionid 0x152dfc5f9cb0000, likely client has closed socket
   [junit4]   2> 	at org.apache.zookeeper.server.NIOServerCnxn.doIO(NIOServerCnxn.java:228)
   [junit4]   2> 	at org.apache.zookeeper.server.NIOServerCnxnFactory.run(NIOServerCnxnFactory.java:208)
   [junit4]   2> 	at java.lang.Thread.run(Thread.java:745)
   [junit4]   2> 1174819 INFO  (TEST-CollectionsAPIDistributedZkTest.test-seed#[8E314AF9681C4366]) [    ] o.a.s.c.c.SolrZkClient Using default ZkCredentialsProvider
   [junit4]   2> 1174820 INFO  (TEST-CollectionsAPIDistributedZkTest.test-seed#[8E314AF9681C4366]) [    ] o.a.s.c.c.ConnectionManager Waiting for client to connect to ZooKeeper
   [junit4]   2> 1174821 INFO  (zkCallback-1061-thread-1) [    ] o.a.s.c.c.ConnectionManager Watcher org.apache.solr.common.cloud.ConnectionManager@1888c5c5 name:ZooKeeperConnection Watcher:127.0.0.1:63903/solr got event WatchedEvent state:SyncConnected type:None path:null path:null type:None
   [junit4]   2> 1174821 INFO  (TEST-CollectionsAPIDistributedZkTest.test-seed#[8E314AF9681C4366]) [    ] o.a.s.c.c.ConnectionManager Client is connected to ZooKeeper
   [junit4]   2> 1174821 INFO  (TEST-CollectionsAPIDistributedZkTest.test-seed#[8E314AF9681C4366]) [    ] o.a.s.c.c.SolrZkClient Using default ZkACLProvider
   [junit4]   2> 1174821 INFO  (TEST-CollectionsAPIDistributedZkTest.test-seed#[8E314AF9681C4366]) [    ] o.a.s.c.c.SolrZkClient makePath: /collections/collection1
   [junit4]   2> 1174823 INFO  (TEST-CollectionsAPIDistributedZkTest.test-seed#[8E314AF9681C4366]) [    ] o.a.s.c.c.SolrZkClient makePath: /collections/collection1/shards
   [junit4]   2> 1174824 INFO  (TEST-CollectionsAPIDistributedZkTest.test-seed#[8E314AF9681C4366]) [    ] o.a.s.c.c.SolrZkClient makePath: /collections/control_collection
   [junit4]   2> 1174826 INFO  (TEST-CollectionsAPIDistributedZkTest.test-seed#[8E314AF9681C4366]) [    ] o.a.s.c.c.SolrZkClient makePath: /collections/control_collection/shards
   [junit4]   2> 1174828 INFO  (TEST-CollectionsAPIDistributedZkTest.test-seed#[8E314AF9681C4366]) [    ] o.a.s.c.AbstractZkTestCase put C:\Users\JenkinsSlave\workspace\Lucene-Solr-5.5-Windows\solr\core\src\test-files\solr\collection1\conf\solrconfig-tlog.xml to /configs/conf1/solrconfig.xml
   [junit4]   2> 1174829 INFO  (TEST-CollectionsAPIDistributedZkTest.test-seed#[8E314AF9681C4366]) [    ] o.a.s.c.c.SolrZkClient makePath: /configs/conf1/solrconfig.xml
   [junit4]   2> 1174831 INFO  (TEST-CollectionsAPIDistributedZkTest.test-seed#[8E314AF9681C4366]) [    ] o.a.s.c.AbstractZkTestCase put C:\Users\JenkinsSlave\workspace\Lucene-Solr-5.5-Windows\solr\core\src\test-files\solr\collection1\conf\schema.xml to /configs/conf1/schema.xml
   [junit4]   2> 1174831 INFO  (TEST-CollectionsAPIDistributedZkTest.test-seed#[8E314AF9681C4366]) [    ] o.a.s.c.c.SolrZkClient makePath: /configs/conf1/schema.xml
   [junit4]   2> 1174833 INFO  (TEST-CollectionsAPIDistributedZkTest.test-seed#[8E314AF9681C4366]) [    ] o.a.s.c.AbstractZkTestCase put C:\Users\JenkinsSlave\workspace\Lucene-Solr-5.5-Windows\solr\core\src\test-files\solr\collection1\conf\solrconfig.snippet.randomindexconfig.xml to /configs/conf1/solrconfig.snippet.randomindexconfig.xml
   [junit4]   2> 1174834 INFO  (TEST-CollectionsAPIDistributedZkTest.test-seed#[8E314AF9681C4366]) [    ] o.a.s.c.c.SolrZkClient makePath: /configs/conf1/solrconfig.snippet.randomindexconfig.xml
   [junit4]   2> 1174835 INFO  (TEST-CollectionsAPIDistributedZkTest.test-seed#[8E314AF9681C4366]) [    ] o.a.s.c.AbstractZkTestCase put C:\Users\JenkinsSlave\workspace\Lucene-Solr-5.5-Windows\solr\core\src\test-files\solr\collection1\conf\stopwords.txt to /configs/conf1/stopwords.txt
   [junit4]   2> 1174835 INFO  (TEST-CollectionsAPIDistributedZkTest.test-seed#[8E314AF9681C4366]) [    ] o.a.s.c.c.SolrZkClient makePath: /configs/conf1/stopwords.txt
   [junit4]   2> 1174837 INFO  (TEST-CollectionsAPIDistributedZkTest.test-seed#[8E314AF9681C4366]) [    ] o.a.s.c.AbstractZkTestCase put C:\Users\JenkinsSlave\workspace\Lucene-Solr-5.5-Windows\solr\core\src\test-files\solr\collection1\conf\protwords.txt to /configs/conf1/protwords.txt
   [junit4]   2> 1174837 INFO  (TEST-CollectionsAPIDistributedZkTest.test-seed#[8E314AF9681C4366]) [    ] o.a.s.c.c.SolrZkClient makePath: /configs/conf1/protwords.txt
   [junit4]   2> 1174839 INFO  (TEST-CollectionsAPIDistributedZkTest.test-seed#[8E314AF9681C4366]) [    ] o.a.s.c.AbstractZkTestCase put C:\Users\JenkinsSlave\workspace\Lucene-Solr-5.5-Windows\solr\core\src\test-files\solr\collection1\conf\currency.xml to /configs/conf1/currency.xml
   [junit4]   2> 1174839 INFO  (TEST-CollectionsAPIDistributedZkTest.test-seed#[8E314AF9681C4366]) [    ] o.a.s.c.c.SolrZkClient makePath: /configs/conf1/currency.xml
   [junit4]   2> 1174841 INFO  (TEST-CollectionsAPIDistributedZkTest.test-seed#[8E314AF9681C4366]) [    ] o.a.s.c.AbstractZkTestCase put C:\Users\JenkinsSlave\workspace\Lucene-Solr-5.5-Windows\solr\core\src\test-files\solr\collection1\conf\enumsConfig.xml to /configs/conf1/enumsConfig.xml
   [junit4]   2> 1174841 INFO  (TEST-CollectionsAPIDistributedZkTest.test-seed#[8E314AF9681C4366]) [    ] o.a.s.c.c.SolrZkClient makePath: /configs/conf1/enumsConfig.xml
   [junit4]   2> 1174842 INFO  (TEST-CollectionsAPIDistributedZkTest.test-seed#[8E314AF9681C4366]) [    ] o.a.s.c.AbstractZkTestCase put C:\Users\JenkinsSlave\workspace\Lucene-Solr-5.5-Windows\solr\core\src\test-files\solr\collection1\conf\open-exchange-rates.json to /configs/conf1/open-exchange-rates.json
   [junit4]   2> 1174843 INFO  (TEST-CollectionsAPIDistributedZkTest.test-seed#[8E314AF9681C4366]) [    ] o.a.s.c.c.SolrZkClient makePath: /configs/conf1/open-exchange-rates.json
   [junit4]   2> 1174844 INFO  (TEST-CollectionsAPIDistributedZkTest.test-seed#[8E314AF9681C4366]) [    ] o.a.s.c.AbstractZkTestCase put C:\Users\JenkinsSlave\workspace\Lucene-Solr-5.5-Windows\solr\core\src\test-files\solr\collection1\conf\mapping-ISOLatin1Accent.txt to /configs/conf1/mapping-ISOLatin1Accent.txt
   [junit4]   2> 1174845 INFO  (TEST-CollectionsAPIDistributedZkTest.test-seed#[8E314AF9681C4366]) [    ] o.a.s.c.c.SolrZkClient makePath: /configs/conf1/mapping-ISOLatin1Accent.txt
   [junit4]   2> 1174846 INFO  (TEST-CollectionsAPIDistributedZkTest.test-seed#[8E314AF9681C4366]) [    ] o.a.s.c.AbstractZkTestCase put C:\Users\JenkinsSlave\workspace\Lucene-Solr-5.5-Windows\solr\core\src\test-files\solr\collection1\conf\old_synonyms.txt to /configs/conf1/old_synonyms.txt
   [junit4]   2> 1174847 INFO  (TEST-CollectionsAPIDistributedZkTest.test-seed#[8E314AF9681C4366]) [    ] o.a.s.c.c.SolrZkClient makePath: /configs/conf1/old_synonyms.txt
   [junit4]   2> 1174848 INFO  (TEST-CollectionsAPIDistributedZkTest.test-seed#[8E314AF9681C4366]) [    ] o.a.s.c.AbstractZkTestCase put C:\Users\JenkinsSlave\workspace\Lucene-Solr-5.5-Windows\solr\core\src\test-files\solr\collection1\conf\synonyms.txt to /configs/conf1/synonyms.txt
   [junit4]   2> 1174848 INFO  (TEST-CollectionsAPIDistributedZkTest.test-seed#[8E314AF9681C4366]) [    ] o.a.s.c.c.SolrZkClient makePath: /configs/conf1/synonyms.txt
   [junit4]   2> 1174851 INFO  (TEST-CollectionsAPIDistributedZkTest.test-seed#[8E314AF9681C4366]) [    ] o.a.s.c.c.SolrZkClient Using default ZkCredentialsProvider
   [junit4]   2> 1174852 INFO  (TEST-CollectionsAPIDistributedZkTest.test-seed#[8E314AF9681C4366]) [    ] o.a.s.c.c.ConnectionManager Waiting for client to connect to ZooKeeper
   [junit4]   2> 1174853 INFO  (zkCallback-1062-thread-1) [    ] o.a.s.c.c.ConnectionManager Watcher org.apache.solr.common.cloud.ConnectionManager@39a4597f name:ZooKeeperConnection Watcher:127.0.0.1:63903 got event WatchedEvent state:SyncConnected type:None path:null path:null type:None
   [junit4]   2> 1174853 INFO  (TEST-CollectionsAPIDistributedZkTest.test-seed#[8E314AF9681C4366]) [    ] o.a.s.c.c.ConnectionManager Client is connected to ZooKeeper
   [junit4]   2> 1174853 INFO  (TEST-CollectionsAPIDistributedZkTest.test-seed#[8E314AF9681C4366]) [    ] o.a.s.c.c.SolrZkClient Using default ZkACLProvider
   [junit4]   2> 1174853 INFO  (TEST-CollectionsAPIDistributedZkTest.test-seed#[8E314AF9681C4366]) [    ] o.a.s.c.c.SolrZkClient makePath: /solr
   [junit4]   2> 1174855 INFO  (TEST-CollectionsAPIDistributedZkTest.test-seed#[8E314AF9681C4366]) [    ] o.a.s.c.c.SolrZkClient Using default ZkCredentialsProvider
   [junit4]   2> 1174855 WARN  (NIOServerCxn.Factory:0.0.0.0/0.0.0.0:0) [    ] o.a.z.s.NIOServerCnxn caught end of stream exception
   [junit4]   2> EndOfStreamException: Unable to read additional data from client sessionid 0x152dfc5f9cb0002, likely client has closed socket
   [junit4]   2> 	at org.apache.zookeeper.server.NIOServerCnxn.doIO(NIOServerCnxn.java:228)
   [junit4]   2> 	at org.apache.zookeeper.server.NIOServerCnxnFactory.run(NIOServerCnxnFactory.java:208)
   [junit4]   2> 	at java.lang.Thread.run(Thread.java:745)
   [junit4]   2> 1174856 INFO  (TEST-CollectionsAPIDistributedZkTest.test-seed#[8E314AF9681C4366]) [    ] o.a.s.c.c.ConnectionManager Waiting for client to connect to ZooKeeper
   [junit4]   2> 1174857 INFO  (zkCallback-1063-thread-1) [    ] o.a.s.c.c.ConnectionManager Watcher org.apache.solr.common.cloud.ConnectionManager@10f4ae25 name:ZooKeeperConnection Watcher:127.0.0.1:63903/solr got event WatchedEvent state:SyncConnected type:None path:null path:null type:None
   [junit4]   2> 1174857 INFO  (TEST-CollectionsAPIDistributedZkTest.test-seed#[8E314AF9681C4366]) [    ] o.a.s.c.c.ConnectionManager Client is connected to ZooKeeper
   [junit4]   2> 1174857 INFO  (TEST-CollectionsAPIDistributedZkTest.test-seed#[8E314AF9681C4366]) [    ] o.a.s.c.c.SolrZkClient Using default ZkACLProvider
   [junit4]   2> 1174859 INFO  (TEST-CollectionsAPIDistributedZkTest.test-seed#[8E314AF9681C4366]) [    ] o.a.s.c.AbstractZkTestCase put C:\Users\JenkinsSlave\workspace\Lucene-Solr-5.5-Windows\solr\core\src\test-files\solr\collection1\conf\solrconfig-tlog.xml to /configs/conf2/solrconfig.xml
   [junit4]   2> 1174859 INFO  (TEST-CollectionsAPIDistributedZkTest.test-seed#[8E314AF9681C4366]) [    ] o.a.s.c.c.SolrZkClient makePath: /configs/conf2/solrconfig.xml
   [junit4]   2> 1174861 INFO  (TEST-CollectionsAPIDistributedZkTest.test-seed#[8E314AF9681C4366]) [    ] o.a.s.c.AbstractZkTestCase put C:\Users\JenkinsSlave\workspace\Lucene-Solr-5.5-Windows\solr\core\src\test-files\solr\collection1\conf\schema.xml to /configs/conf2/schema.xml
   [junit4]   2> 1174861 INFO  (TEST-CollectionsAPIDistributedZkTest.test-seed#[8E314AF9681C4366]) [    ] o.a.s.c.c.SolrZkClient makePath: /configs/conf2/schema.xml
   [junit4]   2> 1174866 INFO  (TEST-CollectionsAPIDistributedZkTest.test-seed#[8E314AF9681C4366]) [    ] o.a.s.c.AbstractZkTestCase put C:\Users\JenkinsSlave\workspace\Lucene-Solr-5.5-Windows\solr\core\src\test-files\solr\collection1\conf\enumsConfig.xml to /configs/conf2/enumsConfig.xml
   [junit4]   2> 1174867 INFO  (TEST-CollectionsAPIDistributedZkTest.test-seed#[8E314AF9681C4366]) [    ] o.a.s.c.c.SolrZkClient makePath: /configs/conf2/enumsConfig.xml
   [junit4]   2> 1174869 INFO  (TEST-CollectionsAPIDistributedZkTest.test-seed#[8E314AF9681C4366]) [    ] o.a.s.c.AbstractZkTestCase put C:\Users\JenkinsSlave\workspace\Lucene-Solr-5.5-Windows\solr\core\src\test-files\solr\collection1\conf\solrconfig.snippet.randomindexconfig.xml to /configs/conf2/solrconfig.snippet.randomindexconfig.xml
   [junit4]   2> 1174869 INFO  (TEST-CollectionsAPIDistributedZkTest.test-seed#[8E314AF9681C4366]) [    ] o.a.s.c.c.SolrZkClient makePath: /configs/conf2/solrconfig.snippet.randomindexconfig.xml
   [junit4]   2> 1174871 INFO  (TEST-CollectionsAPIDistributedZkTest.test-seed#[8E314AF9681C4366]) [    ] o.a.s.c.AbstractZkTestCase put C:\Users\JenkinsSlave\workspace\Lucene-Solr-5.5-Windows\solr\core\src\test-files\solr\collection1\conf\stopwords.txt to /configs/conf2/stopwords.txt
   [junit4]   2> 1174872 INFO  (TEST-CollectionsAPIDistributedZkTest.test-seed#[8E314AF9681C4366]) [    ] o.a.s.c.c.SolrZkClient makePath: /configs/conf2/stopwords.txt
   [junit4]   2> 1174874 INFO  (TEST-CollectionsAPIDistributedZkTest.test-seed#[8E314AF9681C4366]) [    ] o.a.s.c.AbstractZkTestCase put C:\Users\JenkinsSlave\workspace\Lucene-Solr-5.5-Windows\solr\core\src\test-files\solr\collection1\conf\protwords.txt to /configs/conf2/protwords.txt
   [junit4]   2> 1174874 INFO  (TEST-CollectionsAPIDistributedZkTest.test-seed#[8E314AF9681C4366]) [    ] o.a.s.c.c.SolrZkClient makePath: /configs/conf2/protwords.txt
   [junit4]   2> 1174876 INFO  (TEST-CollectionsAPIDistributedZkTest.test-seed#[8E314AF9681C4366]) [    ] o.a.s.c.AbstractZkTestCase put C:\Users\JenkinsSlave\workspace\Lucene-Solr-5.5-Windows\solr\core\src\test-files\solr\collection1\conf\currency.xml to /configs/conf2/currency.xml
   [junit4]   2> 1174876 INFO  (TEST-CollectionsAPIDistributedZkTest.test-seed#[8E314AF9681C4366]) [    ] o.a.s.c.c.SolrZkClient makePath: /configs/conf2/currency.xml
   [junit4]   2> 1174878 INFO  (TEST-CollectionsAPIDistributedZkTest.test-seed#[8E314AF9681C4366]) [    ] o.a.s.c.AbstractZkTestCase put C:\Users\JenkinsSlave\workspace\Lucene-Solr-5.5-Windows\solr\core\src\test-files\solr\collection1\conf\open-exchange-rates.json to /configs/conf2/open-exchange-rates.json
   [junit4]   2> 1174878 INFO  (TEST-CollectionsAPIDistributedZkTest.test-seed#[8E314AF9681C4366]) [    ] o.a.s.c.c.SolrZkClient makePath: /configs/conf2/open-exchange-rates.json
   [junit4]   2> 1174881 INFO  (TEST-CollectionsAPIDistributedZkTest.test-seed#[8E314AF9681C4366]) [    ] o.a.s.c.AbstractZkTestCase put C:\Users\JenkinsSlave\workspace\Lucene-Solr-5.5-Windows\solr\core\src\test-files\solr\collection1\conf\mapping-ISOLatin1Accent.txt to /configs/conf2/mapping-ISOLatin1Accent.txt
   [junit4]   2> 1174881 INFO  (TEST-CollectionsAPIDistributedZkTest.test-seed#[8E314AF9681C4366]) [    ] o.a.s.c.c.SolrZkClient makePath: /configs/conf2/mapping-ISOLatin1Accent.txt
   [junit4]   2> 1174883 INFO  (TEST-CollectionsAPIDistributedZkTest.test-seed#[8E314AF9681C4366]) [    ] o.a.s.c.AbstractZkTestCase put C:\Users\JenkinsSlave\workspace\Lucene-Solr-5.5-Windows\solr\core\src\test-files\solr\collection1\conf\old_synonyms.txt to /configs/conf2/old_synonyms.txt
   [junit4]   2> 1174883 INFO  (TEST-CollectionsAPIDistributedZkTest.test-seed#[8E314AF9681C4366]) [    ] o.a.s.c.c.SolrZkClient makePath: /configs/conf2/old_synonyms.txt
   [junit4]   2> 1174885 INFO  (TEST-CollectionsAPIDistributedZkTest.test-seed#[8E314AF9681C4366]) [    ] o.a.s.c.AbstractZkTestCase put C:\Users\JenkinsSlave\workspace\Lucene-Solr-5.5-Windows\solr\core\src\test-files\solr\collection1\conf\synonyms.txt to /configs/conf2/synonyms.txt
   [junit4]   2> 1174886 INFO  (TEST-CollectionsAPIDistributedZkTest.test-seed#[8E314AF9681C4366]) [    ] o.a.s.c.c.SolrZkClient makePath: /configs/conf2/synonyms.txt
   [junit4]   2> 1174889 INFO  (TEST-CollectionsAPIDistributedZkTest.test-seed#[8E314AF9681C4366]) [    ] o.a.s.c.AbstractZkTestCase put C:\Users\JenkinsSlave\workspace\Lucene-Solr-5.5-Windows\solr\core\src\test-files\solr\collection1\conf\elevate.xml to /configs/conf2/elevate.xml
   [junit4]   2> 1174889 INFO  (TEST-CollectionsAPIDistributedZkTest.test-seed#[8E314AF9681C4366]) [    ] o.a.s.c.c.SolrZkClient makePath: /configs/conf2/elevate.xml
   [junit4]   2> 1174892 WARN  (NIOServerCxn.Factory:0.0.0.0/0.0.0.0:0) [    ] o.a.z.s.NIOServerCnxn caught end of stream exception
   [junit4]   2> EndOfStreamException: Unable to read additional data from client sessionid 0x152dfc5f9cb0003, likely client has closed socket
   [junit4]   2> 	at org.apache.zookeeper.server.NIOServerCnxn.doIO(NIOServerCnxn.java:228)
   [junit4]   2> 	at org.apache.zookeeper.server.NIOServerCnxnFactory.run(NIOServerCnxnFactory.java:208)
   [junit4]   2> 	at java.lang.Thread.run(Thread.java:745)
   [junit4]   2> 1175425 INFO  (TEST-CollectionsAPIDistributedZkTest.test-seed#[8E314AF9681C4366]) [    ] o.a.s.SolrTestCaseJ4 Writing core.properties file to C:\Users\JenkinsSlave\workspace\Lucene-Solr-5.5-Windows\solr\build\solr-core\test\J1\temp\solr.cloud.CollectionsAPIDistributedZkTest_8E314AF9681C4366-001\control-001\cores\collection1
   [junit4]   2> 1175430 INFO  (TEST-CollectionsAPIDistributedZkTest.test-seed#[8E314AF9681C4366]) [    ] o.e.j.s.Server jetty-9.2.13.v20150730
   [junit4]   2> 1175432 INFO  (TEST-CollectionsAPIDistributedZkTest.test-seed#[8E314AF9681C4366]) [    ] o.e.j.s.h.ContextHandler Started o.e.j.s.ServletContextHandler@57af3a77{/_vdb,null,AVAILABLE}
   [junit4]   2> 1175436 INFO  (TEST-CollectionsAPIDistributedZkTest.test-seed#[8E314AF9681C4366]) [    ] o.e.j.s.ServerConnector Started ServerConnector@1465af0f{HTTP/1.1}{127.0.0.1:63919}
   [junit4]   2> 1175436 INFO  (TEST-CollectionsAPIDistributedZkTest.test-seed#[8E314AF9681C4366]) [    ] o.e.j.s.Server Started @1180250ms
   [junit4]   2> 1175436 INFO  (TEST-CollectionsAPIDistributedZkTest.test-seed#[8E314AF9681C4366]) [    ] o.a.s.c.s.e.JettySolrRunner Jetty properties: {solr.data.dir=C:\Users\JenkinsSlave\workspace\Lucene-Solr-5.5-Windows\solr\build\solr-core\test\J1\temp\solr.cloud.CollectionsAPIDistributedZkTest_8E314AF9681C4366-001\tempDir-001/control/data, hostContext=/_vdb, hostPort=63919, coreRootDirectory=C:\Users\JenkinsSlave\workspace\Lucene-Solr-5.5-Windows\solr\build\solr-core\test\J1\temp\solr.cloud.CollectionsAPIDistributedZkTest_8E314AF9681C4366-001\control-001\cores}
   [junit4]   2> 1175436 INFO  (TEST-CollectionsAPIDistributedZkTest.test-seed#[8E314AF9681C4366]) [    ] o.a.s.s.SolrDispatchFilter SolrDispatchFilter.init(): sun.misc.Launcher$AppClassLoader@73d16e93
   [junit4]   2> 1175436 INFO  (TEST-CollectionsAPIDistributedZkTest.test-seed#[8E314AF9681C4366]) [    ] o.a.s.c.SolrResourceLoader new SolrResourceLoader for directory: 'C:\Users\JenkinsSlave\workspace\Lucene-Solr-5.5-Windows\solr\build\solr-core\test\J1\temp\solr.cloud.CollectionsAPIDistributedZkTest_8E314AF9681C4366-001\control-001'
   [junit4]   2> 1175436 INFO  (TEST-CollectionsAPIDistributedZkTest.test-seed#[8E314AF9681C4366]) [    ] o.a.s.c.SolrResourceLoader JNDI not configured for solr (NoInitialContextEx)
   [junit4]   2> 1175436 INFO  (TEST-CollectionsAPIDistributedZkTest.test-seed#[8E314AF9681C4366]) [    ] o.a.s.c.SolrResourceLoader solr home defaulted to 'solr/' (could not find system property or JNDI)
   [junit4]   2> 1175436 INFO  (TEST-CollectionsAPIDistributedZkTest.test-seed#[8E314AF9681C4366]) [    ] o.a.s.c.c.SolrZkClient Using default ZkCredentialsProvider
   [junit4]   2> 1175437 INFO  (TEST-CollectionsAPIDistributedZkTest.test-seed#[8E314AF9681C4366]) [    ] o.a.s.c.c.ConnectionManager Waiting for client to connect to ZooKeeper
   [junit4]   2> 1175439 INFO  (zkCallback-1064-thread-1) [    ] o.a.s.c.c.ConnectionManager Watcher org.apache.solr.common.cloud.ConnectionManager@36c27d47 name:ZooKeeperConnection Watcher:127.0.0.1:63903/solr got event WatchedEvent state:SyncConnected type:None path:null path:null type:None
   [junit4]   2> 1175440 INFO  (TEST-CollectionsAPIDistributedZkTest.test-seed#[8E314AF9681C4366]) [    ] o.a.s.c.c.ConnectionManager Client is connected to ZooKeeper
   [junit4]   2> 1175440 INFO  (TEST-CollectionsAPIDistributedZkTest.test-seed#[8E314AF9681C4366]) [    ] o.a.s.c.c.SolrZkClient Using default ZkACLProvider
   [junit4]   2> 1175442 INFO  (TEST-CollectionsAPIDistributedZkTest.test-seed#[8E314AF9681C4366]) [    ] o.a.s.s.SolrDispatchFilter Loading solr.xml from SolrHome (not found in ZooKeeper)
   [junit4]   2> 1175442 INFO  (TEST-CollectionsAPIDistributedZkTest.test-seed#[8E314AF9681C4366]) [    ] o.a.s.c.SolrXmlConfig Loading container configuration from C:\Users\JenkinsSlave\workspace\Lucene-Solr-5.5-Windows\solr\build\solr-core\test\J1\temp\solr.cloud.CollectionsAPIDistributedZkTest_8E314AF9681C4366-001\control-001\solr.xml
   [junit4]   2> 1175458 INFO  (TEST-CollectionsAPIDistributedZkTest.test-seed#[8E314AF9681C4366]) [    ] o.a.s.c.CorePropertiesLocator Config-defined core root directory: C:\Users\JenkinsSlave\workspace\Lucene-Solr-5.5-Windows\solr\build\solr-core\test\J1\temp\solr.cloud.CollectionsAPIDistributedZkTest_8E314AF9681C4366-001\control-001\cores
   [junit4]   2> 1175458 INFO  (TEST-CollectionsAPIDistributedZkTest.test-seed#[8E314AF9681C4366]) [    ] o.a.s.c.CoreContainer New CoreContainer 1954756089
   [junit4]   2> 1175458 INFO  (TEST-CollectionsAPIDistributedZkTest.test-seed#[8E314AF9681C4366]) [    ] o.a.s.c.CoreContainer Loading cores into CoreContainer [instanceDir=C:\Users\JenkinsSlave\workspace\Lucene-Solr-5.5-Windows\solr\build\solr-core\test\J1\temp\solr.cloud.CollectionsAPIDistributedZkTest_8E314AF9681C4366-001\control-001]
   [junit4]   2> 1175458 WARN  (TEST-CollectionsAPIDistributedZkTest.test-seed#[8E314AF9681C4366]) [    ] o.a.s.c.CoreContainer Couldn't add files from C:\Users\JenkinsSlave\workspace\Lucene-Solr-5.5-Windows\solr\build\solr-core\test\J1\temp\solr.cloud.CollectionsAPIDistributedZkTest_8E314AF9681C4366-001\control-001\lib to classpath: C:\Users\JenkinsSlave\workspace\Lucene-Solr-5.5-Windows\solr\build\solr-core\test\J1\temp\solr.cloud.CollectionsAPIDistributedZkTest_8E314AF9681C4366-001\control-001\lib
   [junit4]   2> 1175459 INFO  (TEST-CollectionsAPIDistributedZkTest.test-seed#[8E314AF9681C4366]) [    ] o.a.s.h.c.HttpShardHandlerFactory created with socketTimeout : 90000,urlScheme : ,connTimeout : 15000,maxConnectionsPerHost : 20,maxConnections : 10000,corePoolSize : 0,maximumPoolSize : 2147483647,maxThreadIdleTime : 5,sizeOfQueue : -1,fairnessPolicy : false,useRetries : false,
   [junit4]   2> 1175464 INFO  (TEST-CollectionsAPIDistributedZkTest.test-seed#[8E314AF9681C4366]) [    ] o.a.s.u.UpdateShardHandler Creating UpdateShardHandler HTTP client with params: socketTimeout=340000&connTimeout=45000&retry=true
   [junit4]   2> 1175465 INFO  (TEST-CollectionsAPIDistributedZkTest.test-seed#[8E314AF9681C4366]) [    ] o.a.s.l.LogWatcher SLF4J impl is org.slf4j.impl.Log4jLoggerFactory
   [junit4]   2> 1175465 INFO  (TEST-CollectionsAPIDistributedZkTest.test-seed#[8E314AF9681C4366]) [    ] o.a.s.l.LogWatcher Registering Log Listener [Log4j (org.slf4j.impl.Log4jLoggerFactory)]
   [junit4]   2> 1175466 INFO  (TEST-CollectionsAPIDistributedZkTest.test-seed#[8E314AF9681C4366]) [    ] o.a.s.c.ZkContainer Zookeeper client=127.0.0.1:63903/solr
   [junit4]   2> 1175466 INFO  (TEST-CollectionsAPIDistributedZkTest.test-seed#[8E314AF9681C4366]) [    ] o.a.s.c.ZkController zkHost includes chroot
   [junit4]   2> 1175466 INFO  (TEST-CollectionsAPIDistributedZkTest.test-seed#[8E314AF9681C4366]) [    ] o.a.s.c.c.SolrZkClient Using default ZkCredentialsProvider
   [junit4]   2> 1175467 INFO  (TEST-CollectionsAPIDistributedZkTest.test-seed#[8E314AF9681C4366]) [    ] o.a.s.c.c.ConnectionManager Waiting for client to connect to ZooKeeper
   [junit4]   2> 1175471 INFO  (zkCallback-1067-thread-1) [    ] o.a.s.c.c.ConnectionManager Watcher org.apache.solr.common.cloud.ConnectionManager@38fbd7f7 name:ZooKeeperConnection Watcher:127.0.0.1:63903 got event WatchedEvent state:SyncConnected type:None path:null path:null type:None
   [junit4]   2> 1175472 INFO  (TEST-CollectionsAPIDistributedZkTest.test-seed#[8E314AF9681C4366]) [    ] o.a.s.c.c.ConnectionManager Client is connected to ZooKeeper
   [junit4]   2> 1175472 INFO  (TEST-CollectionsAPIDistributedZkTest.test-seed#[8E314AF9681C4366]) [    ] o.a.s.c.c.SolrZkClient Using default ZkACLProvider
   [junit4]   2> 1175475 INFO  (TEST-CollectionsAPIDistributedZkTest.test-seed#[8E314AF9681C4366]) [n:127.0.0.1:63919__vdb    ] o.a.s.c.c.ConnectionManager Waiting for client to connect to ZooKeeper
   [junit4]   2> 1175478 INFO  (zkCallback-1068-thread-1-processing-n:127.0.0.1:63919__vdb) [n:127.0.0.1:63919__vdb    ] o.a.s.c.c.ConnectionManager Watcher org.apache.solr.common.cloud.ConnectionManager@7030bd62 name:ZooKeeperConnection Watcher:127.0.0.1:63903/solr got event WatchedEvent state:SyncConnected type:None path:null path:null type:None
   [junit4]   2> 1175478 INFO  (TEST-CollectionsAPIDistributedZkTest.test-seed#[8E314AF9681C4366]) [n:127.0.0.1:63919__vdb    ] o.a.s.c.c.ConnectionManager Client is connected to ZooKeeper
   [junit4]   2> 1175480 INFO  (TEST-CollectionsAPIDistributedZkTest.test-seed#[8E314AF9681C4366]) [n:127.0.0.1:63919__vdb    ] o.a.s.c.c.SolrZkClient makePath: /overseer/queue
   [junit4]   2> 1175487 INFO  (TEST-CollectionsAPIDistributedZkTest.test-seed#[8E314AF9681C4366]) [n:127.0.0.1:63919__vdb    ] o.a.s.c.c.SolrZkClient makePath: /overseer/collection-queue-work
   [junit4]   2> 1175494 INFO  (TEST-CollectionsAPIDistributedZkTest.test-seed#[8E314AF9681C4366]) [n:127.0.0.1:63919__vdb    ] o.a.s.c.c.SolrZkClient makePath: /overseer/collection-map-running
   [junit4]   2> 1175495 INFO  (TEST-CollectionsAPIDistributedZkTest.test-seed#[8E314AF9681C4366]) [n:127.0.0.1:63919__vdb    ] o.a.s.c.c.SolrZkClient makePath: /overseer/collection-map-completed
   [junit4]   2> 1175497 INFO  (TEST-CollectionsAPIDistributedZkTest.test-seed#[8E314AF9681C4366]) [n:127.0.0.1:63919__vdb    ] o.a.s.c.c.SolrZkClient makePath: /overseer/collection-map-failure
   [junit4]   2> 1175502 INFO  (TEST-CollectionsAPIDistributedZkTest.test-seed#[8E314AF9681C4366]) [n:127.0.0.1:63919__vdb    ] o.a.s.c.c.SolrZkClient makePath: /live_nodes
   [junit4]   2> 1175504 INFO  (TEST-CollectionsAPIDistributedZkTest.test-seed#[8E314AF9681C4366]) [n:127.0.0.1:63919__vdb    ] o.a.s.c.c.SolrZkClient makePath: /aliases.json
   [junit4]   2> 1175505 INFO  (TEST-CollectionsAPIDistributedZkTest.test-seed#[8E314AF9681C4366]) [n:127.0.0.1:63919__vdb    ] o.a.s.c.c.SolrZkClient makePath: /clusterstate.json
   [junit4]   2> 1175506 INFO  (TEST-CollectionsAPIDistributedZkTest.test-seed#[8E314AF9681C4366]) [n:127.0.0.1:63919__vdb    ] o.a.s.c.c.SolrZkClient makePath: /security.json
   [junit4]   2> 1175510 INFO  (TEST-CollectionsAPIDistributedZkTest.test-seed#[8E314AF9681C4366]) [n:127.0.0.1:63919__vdb    ] o.a.s.c.ZkController Register node as live in ZooKeeper:/live_nodes/127.0.0.1:63919__vdb
   [junit4]   2> 1175510 INFO  (TEST-CollectionsAPIDistributedZkTest.test-seed#[8E314AF9681C4366]) [n:127.0.0.1:63919__vdb    ] o.a.s.c.c.SolrZkClient makePath: /live_nodes/127.0.0.1:63919__vdb
   [junit4]   2> 1175512 INFO  (TEST-CollectionsAPIDistributedZkTest.test-seed#[8E314AF9681C4366]) [n:127.0.0.1:63919__vdb    ] o.a.s.c.c.SolrZkClient makePath: /overseer_elect
   [junit4]   2> 1175513 INFO  (TEST-CollectionsAPIDistributedZkTest.test-seed#[8E314AF9681C4366]) [n:127.0.0.1:63919__vdb    ] o.a.s.c.c.SolrZkClient makePath: /overseer_elect/election
   [junit4]   2> 1175515 INFO  (TEST-CollectionsAPIDistributedZkTest.test-seed#[8E314AF9681C4366]) [n:127.0.0.1:63919__vdb    ] o.a.s.c.Overseer Overseer (id=null) closing
   [junit4]   2> 1175515 INFO  (TEST-CollectionsAPIDistributedZkTest.test-seed#[8E314AF9681C4366]) [n:127.0.0.1:63919__vdb    ] o.a.s.c.LeaderElector Joined leadership election with path: /overseer_elect/election/95384583520583686-127.0.0.1:63919__vdb-n_0000000000
   [junit4]   2> 1175515 INFO  (TEST-CollectionsAPIDistributedZkTest.test-seed#[8E314AF9681C4366]) [n:127.0.0.1:63919__vdb    ] o.a.s.c.OverseerElectionContext I am going to be the leader 127.0.0.1:63919__vdb
   [junit4]   2> 1175515 INFO  (TEST-CollectionsAPIDistributedZkTest.test-seed#[8E314AF9681C4366]) [n:127.0.0.1:63919__vdb    ] o.a.s.c.c.SolrZkClient makePath: /overseer_elect/leader
   [junit4]   2> 1175518 INFO  (TEST-CollectionsAPIDistributedZkTest.test-seed#[8E314AF9681C4366]) [n:127.0.0.1:63919__vdb    ] o.a.s.c.Overseer Overseer (id=95384583520583686-127.0.0.1:63919__vdb-n_0000000000) starting
   [junit4]   2> 1175519 INFO  (TEST-CollectionsAPIDistributedZkTest.test-seed#[8E314AF9681C4366]) [n:127.0.0.1:63919__vdb    ] o.a.s.c.c.SolrZkClient makePath: /overseer/queue-work
   [junit4]   2> 1175527 INFO  (TEST-CollectionsAPIDistributedZkTest.test-seed#[8E314AF9681C4366]) [n:127.0.0.1:63919__vdb    ] o.a.s.c.OverseerAutoReplicaFailoverThread Starting OverseerAutoReplicaFailoverThread autoReplicaFailoverWorkLoopDelay=10000 autoReplicaFailoverWaitAfterExpiration=10000 autoReplicaFailoverBadNodeExpiration=60000
   [junit4]   2> 1175528 INFO  (TEST-CollectionsAPIDistributedZkTest.test-seed#[8E314AF9681C4366]) [n:127.0.0.1:63919__vdb    ] o.a.s.c.c.ZkStateReader Updating cluster state from ZooKeeper... 
   [junit4]   2> 1175528 INFO  (OverseerCollectionConfigSetProcessor-95384583520583686-127.0.0.1:63919__vdb-n_0000000000) [n:127.0.0.1:63919__vdb    ] o.a.s.c.OverseerTaskProcessor Process current queue of overseer operations
   [junit4]   2> 1175528 INFO  (OverseerStateUpdate-95384583520583686-127.0.0.1:63919__vdb-n_0000000000) [n:127.0.0.1:63919__vdb    ] o.a.s.c.Overseer Starting to work on the main queue
   [junit4]   2> 1175543 INFO  (TEST-CollectionsAPIDistributedZkTest.test-seed#[8E314AF9681C4366]) [n:127.0.0.1:63919__vdb    ] o.a.s.c.CoreContainer Security conf doesn't exist. Skipping setup for authorization module.
   [junit4]   2> 1175543 INFO  (TEST-CollectionsAPIDistributedZkTest.test-seed#[8E314AF9681C4366]) [n:127.0.0.1:63919__vdb    ] o.a.s.c.CoreContainer No authentication plugin used.
   [junit4]   2> 1175544 INFO  (TEST-CollectionsAPIDistributedZkTest.test-seed#[8E314AF9681C4366]) [n:127.0.0.1:63919__vdb    ] o.a.s.c.CorePropertiesLocator Looking for core definitions underneath C:\Users\JenkinsSlave\workspace\Lucene-Solr-5.5-Windows\solr\build\solr-core\test\J1\temp\solr.cloud.CollectionsAPIDistributedZkTest_8E314AF9681C4366-001\control-001\cores
   [junit4]   2> 1175546 INFO  (TEST-CollectionsAPIDistributedZkTest.test-seed#[8E314AF9681C4366]) [n:127.0.0.1:63919__vdb    ] o.a.s.c.CoreDescriptor Created CoreDescriptor: {name=collection1, config=solrconfig.xml, transient=false, schema=schema.xml, loadOnStartup=true, configSetProperties=configsetprops.json, collection=control_collection, coreNodeName=, dataDir=data\, shard=}
   [junit4]   2> 1175546 INFO  (TEST-CollectionsAPIDistributedZkTest.test-seed#[8E314AF9681C4366]) [n:127.0.0.1:63919__vdb    ] o.a.s.c.CorePropertiesLocator Found core collection1 in C:\Users\JenkinsSlave\workspace\Lucene-Solr-5.5-Windows\solr\build\solr-core\test\J1\temp\solr.cloud.CollectionsAPIDistributedZkTest_8E314AF9681C4366-001\control-001\cores\collection1
   [junit4]   2> 1175546 INFO  (TEST-CollectionsAPIDistributedZkTest.test-seed#[8E314AF9681C4366]) [n:127.0.0.1:63919__vdb    ] o.a.s.c.CorePropertiesLocator Found 1 core definitions
   [junit4]   2> 1175547 INFO  (TEST-CollectionsAPIDistributedZkTest.test-seed#[8E314AF9681C4366]) [n:127.0.0.1:63919__vdb    ] o.a.s.s.SolrDispatchFilter user.dir=C:\Users\JenkinsSlave\workspace\Lucene-Solr-5.5-Windows\solr\build\solr-core\test\J1
   [junit4]   2> 1175547 INFO  (TEST-CollectionsAPIDistributedZkTest.test-seed#[8E314AF9681C4366]) [n:127.0.0.1:63919__vdb    ] o.a.s.s.SolrDispatchFilter SolrDispatchFilter.init() done
   [junit4]   2> 1175547 INFO  (coreLoadExecutor-3532-thread-1-processing-n:127.0.0.1:63919__vdb) [n:127.0.0.1:63919__vdb c:control_collection   x:collection1] o.a.s.c.ZkController publishing state=down
   [junit4]   2> 1175547 INFO  (coreLoadExecutor-3532-thread-1-processing-n:127.0.0.1:63919__vdb) [n:127.0.0.1:63919__vdb c:control_collection   x:collection1] o.a.s.c.ZkController numShards not found on descriptor - reading it from system property
   [junit4]   2> 1175549 INFO  (OverseerStateUpdate-95384583520583686-127.0.0.1:63919__vdb-n_0000000000) [n:127.0.0.1:63919__vdb    ] o.a.s.c.Overseer processMessage: queueSize: 1, message = {
   [junit4]   2>   "core":"collection1",
   [junit4]   2>   "roles":null,
   [junit4]   2>   "base_url":"http://127.0.0.1:63919/_vdb",
   [junit4]   2>   "node_name":"127.0.0.1:63919__vdb",
   [junit4]   2>   "numShards":"1",
   [junit4]   2>   "state":"down",
   [junit4]   2>   "shard":null,
   [junit4]   2>   "collection":"control_collection",
   [junit4]   2>   "operation":"state"} current state version: 0
   [junit4]   2> 1175549 INFO  (coreLoadExecutor-3532-thread-1-processing-n:127.0.0.1:63919__vdb) [n:127.0.0.1:63919__vdb c:control_collection   x:collection1] o.a.s.c.ZkController look for our core node name
   [junit4]   2> 1175549 INFO  (OverseerStateUpdate-95384583520583686-127.0.0.1:63919__vdb-n_0000000000) [n:127.0.0.1:63919__vdb    ] o.a.s.c.o.ReplicaMutator Update state numShards=1 message={
   [junit4]   2>   "core":"collection1",
   [junit4]   2>   "roles":null,
   [junit4]   2>   "base_url":"http://127.0.0.1:63919/_vdb",
   [junit4]   2>   "node_name":"127.0.0.1:63919__vdb",
   [junit4]   2>   "numShards":"1",
   [junit4]   2>   "state":"down",
   [junit4]   2>   "shard":null,
   [junit4]   2>   "collection":"control_collection",
   [junit4]   2>   "operation":"state"}
   [junit4]   2> 1175549 INFO  (OverseerStateUpdate-95384583520583686-127.0.0.1:63919__vdb-n_0000000000) [n:127.0.0.1:63919__vdb    ] o.a.s.c.o.ClusterStateMutator building a new cName: control_collection
   [junit4]   2> 1175550 INFO  (OverseerStateUpdate-95384583520583686-127.0.0.1:63919__vdb-n_0000000000) [n:127.0.0.1:63919__vdb    ] o.a.s.c.o.ReplicaMutator Assigning new node to shard shard=shard1
   [junit4]   2> 1175550 INFO  (zkCallback-1068-thread-1-processing-n:127.0.0.1:63919__vdb) [n:127.0.0.1:63919__vdb    ] o.a.s.c.c.ZkStateReader A cluster state change: [WatchedEvent state:SyncConnected type:NodeDataChanged path:/clusterstate.json], has occurred - updating... (live nodes size: [1])
   [junit4]   2> 1176549 INFO  (coreLoadExecutor-3532-thread-1-processing-n:127.0.0.1:63919__vdb) [n:127.0.0.1:63919__vdb c:control_collection   x:collection1] o.a.s.c.ZkController waiting to find shard id in clusterstate for collection1
   [junit4]   2> 1176549 INFO  (coreLoadExecutor-3532-thread-1-processing-n:127.0.0.1:63919__vdb) [n:127.0.0.1:63919__vdb c:control_collection   x:collection1] o.a.s.c.ZkController Check for collection zkNode:control_collection
   [junit4]   2> 1176549 INFO  (coreLoadExecutor-3532-thread-1-processing-n:127.0.0.1:63919__vdb) [n:127.0.0.1:63919__vdb c:control_collection   x:collection1] o.a.s.c.ZkController Collection zkNode exists
   [junit4]   2> 1176549 INFO  (coreLoadExecutor-3532-thread-1-processing-n:127.0.0.1:63919__vdb) [n:127.0.0.1:63919__vdb c:control_collection   x:collection1] o.a.s.c.c.ZkStateReader Load collection config from: [/collections/control_collection]
   [junit4]   2> 1176551 INFO  (coreLoadExecutor-3532-thread-1-processing-n:127.0.0.1:63919__vdb) [n:127.0.0.1:63919__vdb c:control_collection   x:collection1] o.a.s.c.c.ZkStateReader path=[/collections/control_collection] [configName]=[conf1] specified config exists in ZooKeeper
   [junit4]   2> 1176551 INFO  (coreLoadExecutor-3532-thread-1-processing-n:127.0.0.1:63919__vdb) [n:127.0.0.1:63919__vdb c:control_collection   x:collection1] o.a.s.c.SolrResourceLoader new SolrResourceLoader for directory: 'C:\Users\JenkinsSlave\workspace\Lucene-Solr-5.5-Windows\solr\build\solr-core\test\J1\temp\solr.cloud.CollectionsAPIDistributedZkTest_8E314AF9681C4366-001\control-001\cores\collection1'
   [junit4]   2> 1176551 INFO  (coreLoadExecutor-3532-thread-1-processing-n:127.0.0.1:63919__vdb) [n:127.0.0.1:63919__vdb c:control_collection   x:collection1] o.a.s.c.SolrResourceLoader JNDI not configured for solr (NoInitialContextEx)
   [junit4]   2> 1176551 INFO  (coreLoadExecutor-3532-thread-1-processing-n:127.0.0.1:63919__vdb) [n:127.0.0.1:63919__vdb c:control_collection   x:collection1] o.a.s.c.SolrResourceLoader solr home defaulted to 'solr/' (could not find system property or JNDI)
   [junit4]   2> 1176554 INFO  (coreLoadExecutor-3532-thread-1-processing-n:127.0.0.1:63919__vdb) [n:127.0.0.1:63919__vdb c:control_collection   x:collection1] o.a.s.c.Config loaded config solrconfig.xml with version 0 
   [junit4]   2> 1176562 INFO  (coreLoadExecutor-3532-thread-1-processing-n:127.0.0.1:63919__vdb) [n:127.0.0.1:63919__vdb c:control_collection   x:collection1] o.a.s.c.SolrConfig current version of requestparams : -1
   [junit4]   2> 1176572 INFO  (coreLoadExecutor-3532-thread-1-processing-n:127.0.0.1:63919__vdb) [n:127.0.0.1:63919__vdb c:control_collection   x:collection1] o.a.s.c.SolrConfig Using Lucene MatchVersion: 5.5.0
   [junit4]   2> 1176585 INFO  (coreLoadExecutor-3532-thread-1-processing-n:127.0.0.1:63919__vdb) [n:127.0.0.1:63919__vdb c:control_collection   x:collection1] o.a.s.c.SolrConfig Loaded SolrConfig: solrconfig.xml
   [junit4]   2> 1176594 INFO  (coreLoadExecutor-3532-thread-1-processing-n:127.0.0.1:63919__vdb) [n:127.0.0.1:63919__vdb c:control_collection   x:collection1] o.a.s.s.IndexSchema [collection1] Schema name=test
   [junit4]   2> 1176707 INFO  (coreLoadExecutor-3532-thread-1-processing-n:127.0.0.1:63919__vdb) [n:127.0.0.1:63919__vdb c:control_collection   x:collection1] o.a.s.s.OpenExchangeRatesOrgProvider Initialized with rates=open-exchange-rates.json, refreshInterval=1440.
   [junit4]   2> 1176716 INFO  (coreLoadExecutor-3532-thread-1-processing-n:127.0.0.1:63919__vdb) [n:127.0.0.1:63919__vdb c:control_collection   x:collection1] o.a.s.s.IndexSchema default search field in schema is text
   [junit4]   2> 1176717 INFO  (coreLoadExecutor-3532-thread-1-processing-n:127.0.0.1:63919__vdb) [n:127.0.0.1:63919__vdb c:control_collection   x:collection1] o.a.s.s.IndexSchema unique key field: id
   [junit4]   2> 1176729 INFO  (coreLoadExecutor-3532-thread-1-processing-n:127.0.0.1:63919__vdb) [n:127.0.0.1:63919__vdb c:control_collection   x:collection1] o.a.s.s.FileExchangeRateProvider Reloading exchange rates from file currency.xml
   [junit4]   2> 1176736 INFO  (coreLoadExecutor-3532-thread-1-processing-n:127.0.0.1:63919__vdb) [n:127.0.0.1:63919__vdb c:control_collection   x:collection1] o.a.s.s.FileExchangeRateProvider Reloading exchange rates from file currency.xml
   [junit4]   2> 1176738 INFO  (coreLoadExecutor-3532-thread-1-processing-n:127.0.0.1:63919__vdb) [n:127.0.0.1:63919__vdb c:control_collection   x:collection1] o.a.s.s.OpenExchangeRatesOrgProvider Reloading exchange rates from open-exchange-rates.json
   [junit4]   2> 1176739 INFO  (coreLoadExecutor-3532-thread-1-processing-n:127.0.0.1:63919__vdb) [n:127.0.0.1:63919__vdb c:control_collection   x:collection1] o.a.s.s.OpenExchangeRatesOrgProvider Reloading exchange rates from open-exchange-rates.json
   [junit4]   2> 1176743 INFO  (coreLoadExecutor-3532-thread-1-processing-n:127.0.0.1:63919__vdb) [n:127.0.0.1:63919__vdb c:control_collection   x:collection1] o.a.s.c.ConfigSetProperties Did not find ConfigSet properties, assuming default properties: Can't find resource 'configsetprops.json' in classpath or '/configs/conf1', cwd=C:\Users\JenkinsSlave\workspace\Lucene-Solr-5.5-Windows\solr\build\solr-core\test\J1
   [junit4]   2> 1176743 INFO  (coreLoadExecutor-3532-thread-1-processing-n:127.0.0.1:63919__vdb) [n:127.0.0.1:63919__vdb c:control_collection   x:collection1] o.a.s.c.CoreContainer Creating SolrCore 'collection1' using configuration from collection control_collection
   [junit4]   2> 1176743 INFO  (coreLoadExecutor-3532-thread-1-processing-n:127.0.0.1:63919__vdb) [n:127.0.0.1:63919__vdb c:control_collection s:shard1 r:core_node1 x:collection1] o.a.s.c.SolrCore org.apache.solr.core.MockDirectoryFactory
   [junit4]   2> 1176743 INFO  (coreLoadExecutor-3532-thread-1-processing-n:127.0.0.1:63919__vdb) [n:127.0.0.1:63919__vdb c:control_collection s:shard1 r:core_node1 x:collection1] o.a.s.c.SolrCore [[collection1] ] Opening new SolrCore at [C:\Users\JenkinsSlave\workspace\Lucene-Solr-5.5-Windows\solr\build\solr-core\test\J1\temp\solr.cloud.CollectionsAPIDistributedZkTest_8E314AF9681C4366-001\control-001\cores\collection1], dataDir=[C:\Users\JenkinsSlave\workspace\Lucene-Solr-5.5-Windows\solr\build\solr-core\test\J1\temp\solr.cloud.CollectionsAPIDistributedZkTest_8E314AF9681C4366-001\control-001\cores\collection1\data\]
   [junit4]   2> 1176743 INFO  (coreLoadExecutor-3532-thread-1-processing-n:127.0.0.1:63919__vdb) [n:127.0.0.1:63919__vdb c:control_collection s:shard1 r:core_node1 x:collection1] o.a.s.c.JmxMonitoredMap JMX monitoring is enabled. Adding Solr mbeans to JMX Server: com.sun.jmx.mbeanserver.JmxMBeanServer@35027a6c
   [junit4]   2> 1176743 INFO  (coreLoadExecutor-3532-thread-1-processing-n:127.0.0.1:63919__vdb) [n:127.0.0.1:63919__vdb c:control_collection s:shard1 r:core_node1 x:collection1] o.a.s.c.CachingDirectoryFactory return new directory for C:\Users\JenkinsSlave\workspace\Lucene-Solr-5.5-Windows\solr\build\solr-core\test\J1\temp\solr.cloud.CollectionsAPIDistributedZkTest_8E314AF9681C4366-001\control-001\cores\collection1\data\
   [junit4]   2> 1176744 INFO  (coreLoadExecutor-3532-thread-1-processing-n:127.0.0.1:63919__vdb) [n:127.0.0.1:63919__vdb c:control_collection s:shard1 r:core_node1 x:collection1] o.a.s.c.SolrCore New index directory detected: old=null new=C:\Users\JenkinsSlave\workspace\Lucene-Solr-5.5-Windows\solr\build\solr-core\test\J1\temp\solr.cloud.CollectionsAPIDistributedZkTest_8E314AF9681C4366-001\control-001\cores\collection1\data\index/
   [junit4]   2> 1176744 WARN  (coreLoadExecutor-3532-thread-1-processing-n:127.0.0.1:63919__vdb) [n:127.0.0.1:63919__vdb c:control_collection s:shard1 r:core_node1 x:collection1] o.a.s.c.SolrCore [collection1] Solr index directory 'C:\Users\JenkinsSlave\workspace\Lucene-Solr-5.5-Windows\solr\build\solr-core\test\J1\temp\solr.cloud.CollectionsAPIDistributedZkTest_8E314AF9681C4366-001\control-001\cores\collection1\data\index' doesn't exist. Creating new index...
   [junit4]   2> 1176745 INFO  (coreLoadExecutor-3532-thread-1-processing-n:127.0.0.1:63919__vdb) [n:127.0.0.1:63919__vdb c:control_collection s:shard1 r:core_node1 x:collection1] o.a.s.c.CachingDirectoryFactory return new directory for C:\Users\JenkinsSlave\workspace\Lucene-Solr-5.5-Windows\solr\build\solr-core\test\J1\temp\solr.cloud.CollectionsAPIDistributedZkTest_8E314AF9681C4366-001\control-001\cores\collection1\data\index
   [junit4]   2> 1176745 INFO  (coreLoadExecutor-3532-thread-1-processing-n:127.0.0.1:63919__vdb) [n:127.0.0.1:63919__vdb c:control_collection s:shard1 r:core_node1 x:collection1] o.a.s.u.RandomMergePolicy RandomMergePolicy wrapping class org.apache.lucene.index.TieredMergePolicy: [TieredMergePolicy: maxMergeAtOnce=33, maxMergeAtOnceExplicit=47, maxMergedSegmentMB=80.0625, floorSegmentMB=1.6669921875, forceMergeDeletesPctAllowed=1.9335897878487196, segmentsPerTier=34.0, maxCFSSegmentSizeMB=8.796093022207999E12, noCFSRatio=1.0
   [junit4]   2> 1176750 INFO  (coreLoadExecutor-3532-thread-1-processing-n:127.0.0.1:63919__vdb) [n:127.0.0.1:63919__vdb c:control_collection s:shard1 r:core_node1 x:collection1] o.a.s.c.SolrDeletionPolicy SolrDeletionPolicy.onCommit: commits: num=1
   [junit4]   2> 	commit{dir=MockDirectoryWrapper(SimpleFSDirectory@C:\Users\JenkinsSlave\workspace\Lucene-Solr-5.5-Windows\solr\build\solr-core\test\J1\temp\solr.cloud.CollectionsAPIDistributedZkTest_8E314AF9681C4366-001\index-SimpleFSDirectory-001 lockFactory=org.apache.lucene.store.NativeFSLockFactory@54eed761),segFN=segments_1,generation=1}
   [junit4]   2> 1176750 INFO  (coreLoadExecutor-3532-thread-1-processing-n:127.0.0.1:63919__vdb) [n:127.0.0.1:63919__vdb c:control_collection s:shard1 r:core_node1 x:collection1] o.a.s.c.SolrDeletionPolicy newest commit generation = 1
   [junit4]   2> 1176751 INFO  (OldIndexDirectoryCleanupThreadForCore-collection1) [n:127.0.0.1:63919__vdb c:control_collection s:shard1 r:core_node1 x:collection1] o.a.s.c.SolrCore Looking for old index directories to cleanup for core collection1 in C:\Users\JenkinsSlave\workspace\Lucene-Solr-5.5-Windows\solr\build\solr-core\test\J1\temp\solr.cloud.CollectionsAPIDistributedZkTest_8E314AF9681C4366-001\control-001\cores\collection1\data\
   [junit4]   2> 1176751 WARN  (OldIndexDirectoryCleanupThreadForCore-collection1) [n:127.0.0.1:63919__vdb c:control_collection s:shard1 r:core_node1 x:collection1] o.a.s.c.DirectoryFactory C:\Users\JenkinsSlave\workspace\Lucene-Solr-5.5-Windows\solr\build\solr-core\test\J1\temp\solr.cloud.CollectionsAPIDistributedZkTest_8E314AF9681C4366-001\control-001\cores\collection1\data\ does not point to a valid data directory; skipping clean-up of old index directories.
   [junit4]   2> 1176753 INFO  (coreLoadExecutor-3532-thread-1-processing-n:127.0.0.1:63919__vdb) [n:127.0.0.1:63919__vdb c:control_collection s:shard1 r:core_node1 x:collection1] o.a.s.u.p.UpdateRequestProcessorChain creating updateRequestProcessorChain "nodistrib"
   [junit4]   2> 1176753 INFO  (coreLoadExecutor-3532-thread-1-processing-n:127.0.0.1:63919__vdb) [n:127.0.0.1:63919__vdb c:control_collection s:shard1 r:core_node1 x:collection1] o.a.s.u.p.UpdateRequestProcessorChain creating updateRequestProcessorChain "dedupe"
   [junit4]   2> 1176753 INFO  (coreLoadExecutor-3532-thread-1-processing-n:127.0.0.1:63919__vdb) [n:127.0.0.1:63919__vdb c:control_collection s:shard1 r:core_node1 x:collection1] o.a.s.u.p.UpdateRequestProcessorChain inserting DistributedUpdateProcessorFactory into updateRequestProcessorChain "dedupe"
   [junit4]   2> 1176753 INFO  (coreLoadExecutor-3532-thread-1-processing-n:127.0.0.1:63919__vdb) [n:127.0.0.1:63919__vdb c:control_collection s:shard1 r:core_node1 x:collection1] o.a.s.u.p.UpdateRequestProcessorChain creating updateRequestProcessorChain "stored_sig"
   [junit4]   2> 1176753 INFO  (coreLoadExecutor-3532-thread-1-processing-n:127.0.0.1:63919__vdb) [n:127.0.0.1:63919__vdb c:control_collection s:shard1 r:core_node1 x:collection1] o.a.s.u.p.UpdateRequestProcessorChain inserting DistributedUpdateProcessorFactory into updateRequestProcessorChain "stored_sig"
   [junit4]   2> 1176753 INFO  (coreLoadExecutor-3532-thread-1-processing-n:127.0.0.1:63919__vdb) [n:127.0.0.1:63919__vdb c:control_collection s:shard1 r:core_node1 x:collection1] o.a.s.u.p.UpdateRequestProcessorChain creating updateRequestProcessorChain "distrib-dup-test-chain-explicit"
   [junit4]   2> 1176753 INFO  (coreLoadExecutor-3532-thread-1-processing-n:127.0.0.1:63919__vdb) [n:127.0.0.1:63919__vdb c:control_collection s:shard1 r:core_node1 x:collection1] o.a.s.u.p.UpdateRequestProcessorChain creating updateRequestProcessorChain "distrib-dup-test-chain-implicit"
   [junit4]   2> 1176753 INFO  (coreLoadExecutor-3532-thread-1-processing-n:127.0.0.1:63919__vdb) [n:127.0.0.1:63919__vdb c:control_collection s:shard1 r:core_node1 x:collection1] o.a.s.u.p.UpdateRequestProcessorChain inserting DistributedUpdateProcessorFactory into updateRequestProcessorChain "distrib-dup-test-chain-implicit"
   [junit4]   2> 1176753 INFO  (coreLoadExecutor-3532-thread-1-processing-n:127.0.0.1:63919__vdb) [n:127.0.0.1:63919__vdb c:control_collection s:shard1 r:core_node1 x:collection1] o.a.s.c.SolrCore no updateRequestProcessorChain defined as default, creating implicit default
   [junit4]   2> 1176753 WARN  (coreLoadExecutor-3532-thread-1-processing-n:127.0.0.1:63919__vdb) [n:127.0.0.1:63919__vdb c:control_collection s:shard1 r:core_node1 x:collection1] o.a.s.c.RequestHandlers INVALID paramSet a in requestHandler {type = requestHandler,name = /dump,class = DumpRequestHandler,args = {defaults={a=A,b=B}}}
   [junit4]   2> 1176760 INFO  (coreLoadExecutor-3532-thread-1-processing-n:127.0.0.1:63919__vdb) [n:127.0.0.1:63919__vdb c:control_collection s:shard1 r:core_node1 x:collection1] o.a.s.h.l.XMLLoader xsltCacheLifetimeSeconds=60
   [junit4]   2> 1176761 INFO  (coreLoadExecutor-3532-thread-1-processing-n:127.0.0.1:63919__vdb) [n:127.0.0.1:63919__vdb c:control_collection s:shard1 r:core_node1 x:collection1] o.a.s.h.l.XMLLoader xsltCacheLifetimeSeconds=60
   [junit4]   2> 1176762 INFO  (coreLoadExecutor-3532-thread-1-processing-n:127.0.0.1:63919__vdb) [n:127.0.0.1:63919__vdb c:control_collection s:shard1 r:core_node1 x:collection1] o.a.s.h.l.XMLLoader xsltCacheLifetimeSeconds=60
   [junit4]   2> 1176763 INFO  (coreLoadExecutor-3532-thread-1-processing-n:127.0.0.1:63919__vdb) [n:127.0.0.1:63919__vdb c:control_collection s:shard1 r:core_node1 x:collection1] o.a.s.h.l.XMLLoader xsltCacheLifetimeSeconds=60
   [junit4]   2> 1176765 INFO  (coreLoadExecutor-3532-thread-1-processing-n:127.0.0.1:63919__vdb) [n:127.0.0.1:63919__vdb c:control_collection s:shard1 r:core_node1 x:collection1] o.a.s.c.RequestHandlers Registered paths: /admin/mbeans,standard,/dump,/update/csv,/update/json/docs,/admin/luke,/admin/segments,/get,/admin/system,/replication,/admin/properties,/config,/schema,/admin/plugins,/admin/logging,/update/json,/admin/threads,/admin/ping,/update,/admin/file
   [junit4]   2> 1176765 INFO  (coreLoadExecutor-3532-thread-1-processing-n:127.0.0.1:63919__vdb) [n:127.0.0.1:63919__vdb c:control_collection s:shard1 r:core_node1 x:collection1] o.a.s.c.SolrCore Using default statsCache cache: org.apache.solr.search.stats.LocalStatsCache
   [junit4]   2> 1176766 INFO  (coreLoadExecutor-3532-thread-1-processing-n:127.0.0.1:63919__vdb) [n:127.0.0.1:63919__vdb c:control_collection s:shard1 r:core_node1 x:collection1] o.a.s.u.UpdateHandler Using UpdateLog implementation: org.apache.solr.update.UpdateLog
   [junit4]   2> 1176766 INFO  (coreLoadExecutor-3532-thread-1-processing-n:127.0.0.1:63919__vdb) [n:127.0.0.1:63919__vdb c:control_collection s:shard1 r:core_node1 x:collection1] o.a.s.u.UpdateLog Initializing UpdateLog: dataDir= defaultSyncLevel=FLUSH numRecordsToKeep=100 maxNumLogsToKeep=10 numVersionBuckets=65536
   [junit4]   2> 1176767 INFO  (coreLoadExecutor-3532-thread-1-processing-n:127.0.0.1:63919__vdb) [n:127.0.0.1:63919__vdb c:control_collection s:shard1 r:core_node1 x:collection1] o.a.s.u.CommitTracker Hard AutoCommit: disabled
   [junit4]   2> 1176767 INFO  (coreLoadExecutor-3532-thread-1-processing-n:127.0.0.1:63919__vdb) [n:127.0.0.1:63919__vdb c:control_collection s:shard1 r:core_node1 x:collection1] o.a.s.u.CommitTracker Soft AutoCommit: disabled
   [junit4]   2> 1176767 INFO  (coreLoadExecutor-3532-thread-1-processing-n:127.0.0.1:63919__vdb) [n:127.0.0.1:63919__vdb c:control_collection s:shard1 r:core_node1 x:collection1] o.a.s.u.RandomMergePolicy RandomMergePolicy wrapping class org.apache.lucene.index.LogDocMergePolicy: [LogDocMergePolicy: minMergeSize=1000, mergeFactor=23, maxMergeSize=9223372036854775807, maxMergeSizeForForcedMerge=9223372036854775807, calibrateSizeByDeletes=true, maxMergeDocs=2147483647, maxCFSSegmentSizeMB=8.796093022207999E12, noCFSRatio=0.47028611607665394]
   [junit4]   2> 1176769 INFO  (coreLoadExecutor-3532-thread-1-processing-n:127.0.0.1:63919__vdb) [n:127.0.0.1:63919__vdb c:control_collection s:shard1 r:core_node1 x:collection1] o.a.s.c.SolrDeletionPolicy SolrDeletionPolicy.onInit: commits: num=1
   [junit4]   2> 	commit{dir=MockDirectoryWrapper(SimpleFSDirectory@C:\Users\JenkinsSlave\workspace\Lucene-Solr-5.5-Windows\solr\build\solr-core\test\J1\temp\solr.cloud.CollectionsAPIDistributedZkTest_8E314AF9681C4366-001\index-SimpleFSDirectory-001 lockFactory=org.apache.lucene.store.NativeFSLockFactory@54eed761),segFN=segments_1,generation=1}
   [junit4]   2> 1176769 INFO  (coreLoadExecutor-3532-thread-1-processing-n:127.0.0.1:63919__vdb) [n:127.0.0.1:63919__vdb c:control_collection s:shard1 r:core_node1 x:collection1] o.a.s.c.SolrDeletionPolicy newest commit generation = 1
   [junit4]   2> 1176769 INFO  (coreLoadExecutor-3532-thread-1-processing-n:127.0.0.1:63919__vdb) [n:127.0.0.1:63919__vdb c:control_collection s:shard1 r:core_node1 x:collection1] o.a.s.s.SolrIndexSearcher Opening Searcher@84500c2[collection1] main
   [junit4]   2> 1176770 INFO  (coreLoadExecutor-3532-thread-1-processing-n:127.0.0.1:63919__vdb) [n:127.0.0.1:63919__vdb c:control_collection s:shard1 r:core_node1 x:collection1] o.a.s.c.c.ZkStateReader Load collection config from: [/collections/control_collection]
   [junit4]   2> 1176770 INFO  (coreLoadExecutor-3532-thread-1-processing-n:127.0.0.1:63919__vdb) [n:127.0.0.1:63919__vdb c:control_collection s:shard1 r:core_node1 x:collection1] o.a.s.c.c.ZkStateReader path=[/collections/control_collection] [configName]=[conf1] specified config exists in ZooKeeper
   [junit4]   2> 1176770 INFO  (coreLoadExecutor-3532-thread-1-processing-n:127.0.0.1:63919__vdb) [n:127.0.0.1:63919__vdb c:control_collection s:shard1 r:core_node1 x:collection1] o.a.s.r.ManagedResourceStorage Setting up ZooKeeper-based storage for the RestManager with znodeBase: /configs/conf1
   [junit4]   2> 1176771 INFO  (coreLoadExecutor-3532-thread-1-processing-n:127.0.0.1:63919__vdb) [n:127.0.0.1:63919__vdb c:control_collection s:shard1 r:core_node1 x:collection1] o.a.s.r.ManagedResourceStorage Configured ZooKeeperStorageIO with znodeBase: /configs/conf1
   [junit4]   2> 1176771 INFO  (coreLoadExecutor-3532-thread-1-processing-n:127.0.0.1:63919__vdb) [n:127.0.0.1:63919__vdb c:control_collection s:shard1 r:core_node1 x:collection1] o.a.s.r.RestManager Initializing RestManager with initArgs: {}
   [junit4]   2> 1176771 INFO  (coreLoadExecutor-3532-thread-1-processing-n:127.0.0.1:63919__vdb) [n:127.0.0.1:63919__vdb c:control_collection s:shard1 r:core_node1 x:collection1] o.a.s.r.ManagedResourceStorage Reading _rest_managed.json using ZooKeeperStorageIO:path=/configs/conf1
   [junit4]   2> 1176771 INFO  (coreLoadExecutor-3532-thread-1-processing-n:127.0.0.1:63919__vdb) [n:127.0.0.1:63919__vdb c:control_collection s:shard1 r:core_node1 x:collection1] o.a.s.r.ManagedResourceStorage No data found for znode /configs/conf1/_rest_managed.json
   [junit4]   2> 1176771 INFO  (coreLoadExecutor-3532-thread-1-processing-n:127.0.0.1:63919__vdb) [n:127.0.0.1:63919__vdb c:control_collection s:shard1 r:core_node1 x:collection1] o.a.s.r.ManagedResourceStorage Loaded null at path _rest_managed.json using ZooKeeperStorageIO:path=/configs/conf1
   [junit4]   2> 1176771 INFO  (coreLoadExecutor-3532-thread-1-processing-n:127.0.0.1:63919__vdb) [n:127.0.0.1:63919__vdb c:control_collection s:shard1 r:core_node1 x:collection1] o.a.s.r.RestManager Initializing 0 registered ManagedResources
   [junit4]   2> 1176772 INFO  (coreLoadExecutor-3532-thread-1-processing-n:127.0.0.1:63919__vdb) [n:127.0.0.1:63919__vdb c:control_collection s:shard1 r:core_node1 x:collection1] o.a.s.h.ReplicationHandler Commits will be reserved for  10000
   [junit4]   2> 1176772 INFO  (searcherExecutor-3533-thread-1-processing-n:127.0.0.1:63919__vdb x:collection1 s:shard1 c:control_collection r:core_node1) [n:127.0.0.1:63919__vdb c:control_collection s:shard1 r:core_node1 x:collection1] o.a.s.c.SolrCore [collection1] Registered new searcher Searcher@84500c2[collection1] main{ExitableDirectoryReader(UninvertingDirectoryReader())}
   [junit4]   2> 1176772 INFO  (coreLoadExecutor-3532-thread-1-processing-n:127.0.0.1:63919__vdb) [n:127.0.0.1:63919__vdb c:control_collection s:shard1 r:core_node1 x:collection1] o.a.s.u.UpdateLog Looking up max value of version field to seed version buckets
   [junit4]   2> 1176772 INFO  (coreLoadExecutor-3532-thread-1-processing-n:127.0.0.1:63919__vdb) [n:127.0.0.1:63919__vdb c:control_collection s:shard1 r:core_node1 x:collection1] o.a.s.u.VersionInfo Refreshing highest value of _version_ for 65536 version buckets from index
   [junit4]   2> 1176772 INFO  (coreLoadExecutor-3532-thread-1-processing-n:127.0.0.1:63919__vdb) [n:127.0.0.1:63919__vdb c:control_collection s:shard1 r:core_node1 x:collection1] o.a.s.u.VersionInfo No terms found for _version_, cannot seed version bucket highest value from index
   [junit4]   2> 1176772 INFO  (coreLoadExecutor-3532-thread-1-processing-n:127.0.0.1:63919__vdb) [n:127.0.0.1:63919__vdb c:control_collection s:shard1 r:core_node1 x:collection1] o.a.s.u.UpdateLog Could not find max version in index or recent updates, using new clock 1526153338484162560
   [junit4]   2> 1176774 INFO  (coreLoadExecutor-3532-thread-1-processing-n:127.0.0.1:63919__vdb) [n:127.0.0.1:63919__vdb c:control_collection s:shard1 r:core_node1 x:collection1] o.a.s.u.UpdateLog Took 1.0ms to seed version buckets with highest version 1526153338484162560
   [junit4]   2> 1176774 INFO  (coreLoadExecutor-3532-thread-1-processing-n:127.0.0.1:63919__vdb) [n:127.0.0.1:63919__vdb c:control_collection s:shard1 r:core_node1 x:collection1] o.a.s.c.ZkController watch zkdir /configs/conf1
   [junit4]   2> 1176775 INFO  (coreLoadExecutor-3532-thread-1-processing-n:127.0.0.1:63919__vdb) [n:127.0.0.1:63919__vdb c:control_collection s:shard1 r:core_node1 x:collection1] o.a.s.c.CoreContainer registering core: collection1
   [junit4]   2> 1176775 INFO  (coreZkRegister-3526-thread-1-processing-n:127.0.0.1:63919__vdb x:collection1 s:shard1 c:control_collection r:core_node1) [n:127.0.0.1:63919__vdb c:control_collection s:shard1 r:core_node1 x:collection1] o.a.s.c.ZkController Register replica - core:collection1 address:http://127.0.0.1:63919/_vdb collection:control_collection shard:shard1
   [junit4]   2> 1176776 INFO  (coreZkRegister-3526-thread-1-processing-n:127.0.0.1:63919__vdb x:collection1 s:shard1 c:control_collection r:core_node1) [n:127.0.0.1:63919__vdb c:control_collection s:shard1 r:core_node1 x:collection1] o.a.s.c.c.SolrZkClient makePath: /collections/control_collection/leader_elect/shard1/election
   [junit4]   2> 1176779 INFO  (coreZkRegister-3526-thread-1-processing-n:127.0.0.1:63919__vdb x:collection1 s:shard1 c:control_collection r:core_node1) [n:127.0.0.1:63919__vdb c:control_collection s:shard1 r:core_node1 x:collection1] o.a.s.c.LeaderElector Joined leadership election with path: /collections/control_collection/leader_elect/shard1/election/95384583520583686-core_node1-n_0000000000
   [junit4]   2> 1176779 INFO  (coreZkRegister-3526-thread-1-processing-n:127.0.0.1:63919__vdb x:collection1 s:shard1 c:control_collection r:core_node1) [n:127.0.0.1:63919__vdb c:control_collection s:shard1 r:core_node1 x:collection1] o.a.s.c.ShardLeaderElectionContext Running the leader process for shard=shard1 and weAreReplacement=false and leaderVoteWait=180000
   [junit4]   2> 1176781 INFO  (coreZkRegister-3526-thread-1-processing-n:127.0.0.1:63919__vdb x:collection1 s:shard1 c:control_collection r:core_node1) [n:127.0.0.1:63919__vdb c:control_collection s:shard1 r:core_node1 x:collection1] o.a.s.c.ShardLeaderElectionContext Enough replicas found to continue.
   [junit4]   2> 1176781 INFO  (coreZkRegister-3526-thread-1-processing-n:127.0.0.1:63919__vdb x:collection1 s:shard1 c:control_collection r:core_node1) [n:127.0.0.1:63919__vdb c:control_collection s:shard1 r:core_node1 x:collection1] o.a.s.c.ShardLeaderElectionContext I may be the new leader - try and sync
   [junit4]   2> 1176781 INFO  (coreZkRegister-3526-thread-1-processing-n:127.0.0.1:63919__vdb x:collection1 s:shard1 c:control_collection r:core_node1) [n:127.0.0.1:63919__vdb c:control_collection s:shard1 r:core_node1 x:collection1] o.a.s.c.SyncStrategy Sync replicas to http://127.0.0.1:63919/_vdb/collection1/
   [junit4]   2> 1176781 INFO  (coreZkRegister-3526-thread-1-processing-n:127.0.0.1:63919__vdb x:collection1 s:shard1 c:control_collection r:core_node1) [n:127.0.0.1:63919__vdb c:control_collection s:shard1 r:core_node1 x:collection1] o.a.s.c.SyncStrategy Sync Success - now sync replicas to me
   [junit4]   2> 1176781 INFO  (coreZkRegister-3526-thread-1-processing-n:127.0.0.1:63919__vdb x:collection1 s:shard1 c:control_collection r:core_node1) [n:127.0.0.1:63919__vdb c:control_collection s:shard1 r:core_node1 x:collection1] o.a.s.c.SyncStrategy http://127.0.0.1:63919/_vdb/collection1/ has no replicas
   [junit4]   2> 1176782 INFO  (coreZkRegister-3526-thread-1-processing-n:127.0.0.1:63919__vdb x:collection1 s:shard1 c:control_collection r:core_node1) [n:127.0.0.1:63919__vdb c:control_collection s:shard1 r:core_node1 x:collection1] o.a.s.c.c.SolrZkClient makePath: /collections/control_collection/leaders/shard1
   [junit4]   2> 1176785 INFO  (coreZkRegister-3526-thread-1-processing-n:127.0.0.1:63919__vdb x:collection1 s:shard1 c:control_collection r:core_node1) [n:127.0.0.1:63919__vdb c:control_collection s:shard1 r:core_node1 x:collection1] o.a.s.c.ShardLeaderElectionContextBase Creating leader registration node
   [junit4]   2> 1176788 INFO  (coreZkRegister-3526-thread-1-processing-n:127.0.0.1:63919__vdb x:collection1 s:shard1 c:control_collection r:core_node1) [n:127.0.0.1:63919__vdb c:control_collection s:shard1 r:core_node1 x:collection1] o.a.s.c.ShardLeaderElectionContext I am the new leader: http://127.0.0.1:63919/_vdb/collection1/ shard1
   [junit4]   2> 1176789 INFO  (OverseerStateUpdate-95384583520583686-127.0.0.1:63919__vdb-n_0000000000) [n:127.0.0.1:63919__vdb    ] o.a.s.c.Overseer processMessage: queueSize: 2, message = {
   [junit4]   2>   "operation":"leader",
   [junit4]   2>   "shard":"shard1",
   [junit4]   2>   "collection":"control_collection"} current state version: 1
   [junit4]   2> 1176791 INFO  (OverseerStateUpdate-95384583520583686-127.0.0.1:63919__vdb-n_0000000000) [n:127.0.0.1:63919__vdb    ] o.a.s.c.Overseer processMessage: queueSize: 2, message = {
   [junit4]   2>   "operation":"leader",
   [junit4]   2>   "shard":"shard1",
   [junit4]   2>   "collection":"control_collection",
   [junit4]   2>   "base_url":"http://127.0.0.1:63919/_vdb",
   [junit4]   2>   "core":"collection1",
   [junit4]   2>   "state":"active"} current state version: 1
   [junit4]   2> 1176894 INFO  (zkCallback-1068-thread-2-processing-n:127.0.0.1:63919__vdb) [n:127.0.0.1:63919__vdb    ] o.a.s.c.c.ZkStateReader A cluster state change: [WatchedEvent state:SyncConnected type:NodeDataChanged path:/clusterstate.json], has occurred - updating... (live nodes size: [1])
   [junit4]   2> 1176941 INFO  (coreZkRegister-3526-thread-1-processing-n:127.0.0.1:63919__vdb x:collection1 s:shard1 c:control_collection r:core_node1) [n:127.0.0.1:63919__vdb c:control_collection s:shard1 r:core_node1 x:collection1] o.a.s.c.ZkController We are http://127.0.0.1:63919/_vdb/collection1/ and leader is http://127.0.0.1:63919/_vdb/collection1/
   [junit4]   2> 1176941 INFO  (coreZkRegister-3526-thread-1-processing-n:127.0.0.1:63919__vdb x:collection1 s:shard1 c:control_collection r:core_node1) [n:127.0.0.1:63919__vdb c:control_collection s:shard1 r:core_node1 x:collection1] o.a.s.c.ZkController No LogReplay needed for core=collection1 baseURL=http://127.0.0.1:63919/_vdb
   [junit4]   2> 1176941 INFO  (coreZkRegister-3526-thread-1-processing-n:127.0.0.1:63919__vdb x:collection1 s:shard1 c:control_collection r:core_node1) [n:127.0.0.1:63919__vdb c:control_collection s:shard1 r:core_node1 x:collection1] o.a.s.c.ZkController I am the leader, no recovery necessary
   [junit4]   2> 1176941 INFO  (coreZkRegister-3526-thread-1-processing-n:127.0.0.1:63919__vdb x:collection1 s:shard1 c:control_collection r:core_node1) [n:127.0.0.1:63919__vdb c:control_collection s:shard1 r:core_node1 x:collection1] o.a.s.c.ZkController publishing state=active
   [junit4]   2> 1176941 INFO  (coreZkRegister-3526-thread-1-processing-n:127.0.0.1:63919__vdb x:collection1 s:shard1 c:control_collection r:core_node1) [n:127.0.0.1:63919__vdb c:control_collection s:shard1 r:core_node1 x:collection1] o.a.s.c.ZkController numShards not found on descriptor - reading it from system property
   [junit4]   2> 1176944 INFO  (OverseerStateUpdate-95384583520583686-127.0.0.1:63919__vdb-n_0000000000) [n:127.0.0.1:63919__vdb    ] o.a.s.c.Overseer processMessage: queueSize: 1, message = {
   [junit4]   2>   "core":"collection1",
   [junit4]   2>   "core_node_name":"core_node1",
   [junit4]   2>   "roles":null,
   [junit4]   2>   "base_url":"http://127.0.0.1:63919/_vdb",
   [junit4]   2>   "node_name":"127.0.0.1:63919__vdb",
   [junit4]   2>   "numShards":"1",
   [junit4]   2>   "state":"active",
   [junit4]   2>   "shard":"shard1",
   [junit4]   2>   "collection":"control_collection",
   [junit4]   2>   "operation":"state"} current state version: 2
   [junit4]   2> 1176945 INFO  (OverseerStateUpdate-95384583520583686-127.0.0.1:63919__vdb-n_0000000000) [n:127.0.0.1:63919__vdb    ] o.a.s.c.o.ReplicaMutator Update state numShards=1 message={
   [junit4]   2>   "core":"collection1",
   [junit4]   2>   "core_node_name":"core_node1",
   [junit4]   2>   "roles":null,
   [junit4]   2>   "base_url":"http://127.0.0.1:63919/_vdb",
   [junit4]   2>   "node_name":"127.0.0.1:63919__vdb",
   [junit4]   2>   "numShards":"1",
   [junit4]   2>   "state":"active",
   [junit4]   2>   "shard":"shard1",
   [junit4]   2>   "collection":"control_collection",
   [junit4]   2>   "operation":"state"}
   [junit4]   2> 1177048 INFO  (TEST-CollectionsAPIDistributedZkTest.test-seed#[8E314AF9681C4366]) [    ] o.a.s.c.c.SolrZkClient Using default ZkCredentialsProvider
   [junit4]   2> 1177048 INFO  (zkCallback-1068-thread-2-processing-n:127.0.0.1:63919__vdb) [n:127.0.0.1:63919__vdb    ] o.a.s.c.c.ZkStateReader A cluster state change: [WatchedEvent state:SyncConnected type:NodeDataChanged path:/clusterstate.json], has occurred - updating... (live nodes size: [1])
   [junit4]   2> 1177050 INFO  (TEST-CollectionsAPIDistributedZkTest.test-seed#[8E314AF9681C4366]) [    ] o.a.s.c.c.ConnectionManager Waiting for client to connect to ZooKeeper
   [junit4]   2> 1177051 INFO  (zkCallback-1070-thread-1) [    ] o.a.s.c.c.ConnectionManager Watcher org.apache.solr.common.cloud.ConnectionManager@582be76f name:ZooKeeperConnection Watcher:127.0.0.1:63903/solr got event WatchedEvent state:SyncConnected type:None path:null path:null type:None
   [junit4]   2> 1177052 INFO  (TEST-CollectionsAPIDistributedZkTest.test-seed#[8E314AF9681C4366]) [    ] o.a.s.c.c.ConnectionManager Client is connected to ZooKeeper
   [junit4]   2> 1177052 INFO  (TEST-CollectionsAPIDistributedZkTest.test-seed#[8E314AF9681C4366]) [    ] o.a.s.c.c.SolrZkClient Using default ZkACLProvider
   [junit4]   2> 1177052 INFO  (TEST-CollectionsAPIDistributedZkTest.test-seed#[8E314AF9681C4366]) [    ] o.a.s.c.c.ZkStateReader Updating cluster state from ZooKeeper... 
   [junit4]   2> 1177058 INFO  (TEST-CollectionsAPIDistributedZkTest.test-seed#[8E314AF9681C4366]) [    ] o.a.s.c.ChaosMonkey monkey: init - expire sessions:false cause connection loss:false
   [junit4]   2> 1177962 INFO  (TEST-CollectionsAPIDistributedZkTest.test-seed#[8E314AF9681C4366]) [    ] o.a.s.SolrTestCaseJ4 Writing core.properties file to C:\Users\JenkinsSlave\workspace\Lucene-Solr-5.5-Windows\solr\build\solr-core\test\J1\temp\solr.cloud.CollectionsAPIDistributedZkTest_8E314AF9681C4366-001\shard-1-001\cores\collection1
   [junit4]   2> 1177965 INFO  (TEST-CollectionsAPIDistributedZkTest.test-seed#[8E314AF9681C4366]) [    ] o.a.s.c.AbstractFullDistribZkTestBase create jetty 1 in directory C:\Users\JenkinsSlave\workspace\Lucene-Solr-5.5-Windows\solr\build\solr-core\test\J1\temp\solr.cloud.CollectionsAPIDistributedZkTest_8E314AF9681C4366-001\shard-1-001
   [junit4]   2> 1177966 INFO  (TEST-CollectionsAPIDistributedZkTest.test-seed#[8E314AF9681C4366]) [    ] o.e.j.s.Server jetty-9.2.13.v20150730
   [junit4]   2> 1177969 INFO  (TEST-CollectionsAPIDistributedZkTest.test-seed#[8E314AF9681C4366]) [    ] o.e.j.s.h.ContextHandler Started o.e.j.s.ServletContextHandler@6f47d30b{/_vdb,null,AVAILABLE}
   [junit4]   2> 1177969 INFO  (TEST-CollectionsAPIDistributedZkTest.test-seed#[8E314AF9681C4366]) [    ] o.e.j.s.ServerConnector Started ServerConnector@763a08da{HTTP/1.1}{127.0.0.1:63937}
   [junit4]   2> 1177970 INFO  (TEST-CollectionsAPIDistributedZkTest.test-seed#[8E314AF9681C4366]) [    ] o.e.j.s.Server Started @1182784ms
   [junit4]   2> 1177970 INFO  (TEST-CollectionsAPIDistributedZkTest.test-seed#[8E314AF9681C4366]) [    ] o.a.s.c.s.e.JettySolrRunner Jetty properties: {solr.data.dir=C:\Users\JenkinsSlave\workspace\Lucene-Solr-5.5-Windows\solr\build\solr-core\test\J1\temp\solr.cloud.CollectionsAPIDistributedZkTest_8E314AF9681C4366-001\tempDir-001/jetty1, solrconfig=solrconfig.xml, hostContext=/_vdb, hostPort=63937, coreRootDirectory=C:\Users\JenkinsSlave\workspace\Lucene-Solr-5.5-Windows\solr\build\solr-core\test\J1\..\..\..\..\..\..\..\..\..\Users\JenkinsSlave\workspace\Lucene-Solr-5.5-Windows\solr\build\solr-core\test\J1\temp\solr.cloud.CollectionsAPIDistributedZkTest_8E314AF9681C4366-001\shard-1-001\cores}
   [junit4]   2> 1177970 INFO  (TEST-CollectionsAPIDistributedZkTest.test-seed#[8E314AF9681C4366]) [    ] o.a.s.s.SolrDispatchFilter SolrDispatchFilter.init(): sun.misc.Launcher$AppClassLoader@73d16e93
   [junit4]   2> 1177970 INFO  (TEST-CollectionsAPIDistributedZkTest.test-seed#[8E314AF9681C4366]) [    ] o.a.s.c.SolrResourceLoader new SolrResourceLoader for directory: 'C:\Users\JenkinsSlave\workspace\Lucene-Solr-5.5-Windows\solr\build\solr-core\test\J1\temp\solr.cloud.CollectionsAPIDistributedZkTest_8E314AF9681C4366-001\shard-1-001'
   [junit4]   2> 1177971 INFO  (TEST-CollectionsAPIDistributedZkTest.test-seed#[8E314AF9681C4366]) [    ] o.a.s.c.SolrResourceLoader JNDI not configured for solr (NoInitialContextEx)
   [junit4]   2> 1177971 INFO  (TEST-CollectionsAPIDistributedZkTest.test-seed#[8E314AF9681C4366]) [    ] o.a.s.c.SolrResourceLoader solr home defaulted to 'solr/' (could not find system property or JNDI)
   [junit4]   2> 1177972 INFO  (TEST-CollectionsAPIDistributedZkTest.test-seed#[8E314AF9681C4366]) [    ] o.a.s.c.c.SolrZkClient Using default ZkCredentialsProvider
   [junit4]   2> 1177973 INFO  (TEST-CollectionsAPIDistributedZkTest.test-seed#[8E314AF9681C4366]) [    ] o.a.s.c.c.ConnectionManager Waiting for client to connect to ZooKeeper
   [junit4]   2> 1177975 INFO  (zkCallback-1071-thread-1) [    ] o.a.s.c.c.ConnectionManager Watcher org.apache.solr.common.cloud.ConnectionManager@3fbc4c03 name:ZooKeeperConnection Watcher:127.0.0.1:63903/solr got event WatchedEvent state:SyncConnected type:None path:null path:null type:None
   [junit4]   2> 1177975 INFO  (TEST-CollectionsAPIDistributedZkTest.test-seed#[8E314AF9681C4366]) [    ] o.a.s.c.c.ConnectionManager Client is connected to ZooKeeper
   [junit4]   2> 1177976 INFO  (TEST-CollectionsAPIDistributedZkTest.test-seed#[8E314AF9681C4366]) [    ] o.a.s.c.c.SolrZkClient Using default ZkACLProvider
   [junit4]   2> 1177978 INFO  (TEST-CollectionsAPIDistributedZkTest.test-seed#[8E314AF9681C4366]) [    ] o.a.s.s.SolrDispatchFilter Loading solr.xml from SolrHome (not found in ZooKeeper)
   [junit4]   2> 1177978 INFO  (TEST-CollectionsAPIDistributedZkTest.test-seed#[8E314AF9681C4366]) [    ] o.a.s.c.SolrXmlConfig Loading container configuration from C:\Users\JenkinsSlave\workspace\Lucene-Solr-5.5-Windows\solr\build\solr-core\test\J1\temp\solr.cloud.CollectionsAPIDistributedZkTest_8E314AF9681C4366-001\shard-1-001\solr.xml
   [junit4]   2> 1177993 INFO  (TEST-CollectionsAPIDistributedZkTest.test-seed#[8E314AF9681C4366]) [    ] o.a.s.c.CorePropertiesLocator Config-defined core root directory: C:\Users\JenkinsSlave\workspace\Lucene-Solr-5.5-Windows\solr\build\solr-core\test\J1\..\..\..\..\..\..\..\..\..\Users\JenkinsSlave\workspace\Lucene-Solr-5.5-Windows\solr\build\solr-core\test\J1\temp\solr.cloud.CollectionsAPIDistributedZkTest_8E314AF9681C4366-001\shard-1-001\cores
   [junit4]   2> 1177993 INFO  (TEST-CollectionsAPIDistributedZkTest.test-seed#[8E314AF9681C4366]) [    ] o.a.s.c.CoreContainer New CoreContainer 721639646
   [junit4]   2> 1177993 INFO  (TEST-CollectionsAPIDistributedZkTest.test-seed#[8E314AF9681C4366]) [    ] o.a.s.c.CoreContainer Loading cores into CoreContainer [instanceDir=C:\Users\JenkinsSlave\workspace\Lucene-Solr-5.5-Windows\solr\build\solr-core\test\J1\temp\solr.cloud.CollectionsAPIDistributedZkTest_8E314AF9681C4366-001\shard-1-001]
   [junit4]   2> 1177993 WARN  (TEST-CollectionsAPIDistributedZkTest.test-seed#[8E314AF9681C4366]) [    ] o.a.s.c.CoreContainer Couldn't add files from C:\Users\JenkinsSlave\workspace\Lucene-Solr-5.5-Windows\solr\build\solr-core\test\J1\temp\solr.cloud.CollectionsAPIDistributedZkTest_8E314AF9681C4366-001\shard-1-001\lib to classpath: C:\Users\JenkinsSlave\workspace\Lucene-Solr-5.5-Windows\solr\build\solr-core\test\J1\temp\solr.cloud.CollectionsAPIDistributedZkTest_8E314AF9681C4366-001\shard-1-001\lib
   [junit4]   2> 1177994 INFO  (TEST-CollectionsAPIDistributedZkTest.test-seed#[8E314AF9681C4366]) [    ] o.a.s.h.c.HttpShardHandlerFactory created with socketTimeout : 90000,urlScheme : ,connTimeout : 15000,maxConnectionsPerHost : 20,maxConnections : 10000,corePoolSize : 0,maximumPoolSize : 2147483647,maxThreadIdleTime : 5,sizeOfQueue : -1,fairnessPolicy : false,useRetries : false,
   [junit4]   2> 1177999 INFO  (TEST-CollectionsAPIDistributedZkTest.test-seed#[8E314AF9681C4366]) [    ] o.a.s.u.UpdateShardHandler Creating UpdateShardHandler HTTP client with params: socketTimeout=340000&connTimeout=45000&retry=true
   [junit4]   2> 1178000 INFO  (TEST-CollectionsAPIDistributedZkTest.test-seed#[8E314AF9681C4366]) [    ] o.a.s.l.LogWatcher SLF4J impl is org.slf4j.impl.Log4jLoggerFactory
   [junit4]   2> 1178000 INFO  (TEST-CollectionsAPIDistributedZkTest.test-seed#[8E314AF9681C4366]) [    ] o.a.s.l.LogWatcher Registering Log Listener [Log4j (org.slf4j.impl.Log4jLoggerFactory)]
   [junit4]   2> 1178000 INFO  (TEST-CollectionsAPIDistributedZkTest.test-seed#[8E314AF9681C4366]) [    ] o.a.s.c.ZkContainer Zookeeper client=127.0.0.1:63903/solr
   [junit4]   2> 1178000 INFO  (TEST-CollectionsAPIDistributedZkTest.test-seed#[8E314AF9681C4366]) [    ] o.a.s.c.ZkController zkHost includes chroot
   [junit4]   2> 1178000 INFO  (TEST-CollectionsAPIDistributedZkTest.test-seed#[8E314AF9681C4366]) [    ] o.a.s.c.c.SolrZkClient Using default ZkCredentialsProvider
   [junit4]   2> 1178002 INFO  (TEST-CollectionsAPIDistributedZkTest.test-seed#[8E314AF9681C4366]) [    ] o.a.s.c.c.ConnectionManager Waiting for client to connect to ZooKeeper
   [junit4]   2> 1178004 INFO  (zkCallback-1074-thread-1) [    ] o.a.s.c.c.ConnectionManager Watcher org.apache.solr.common.cloud.ConnectionManager@26da3da6 name:ZooKeeperConnection Watcher:127.0.0.1:63903 got event WatchedEvent state:SyncConnected type:None path:null path:null type:None
   [junit4]   2> 1178005 INFO  (TEST-CollectionsAPIDistributedZkTest.test-seed#[8E314AF9681C4366]) [    ] o.a.s.c.c.ConnectionManager Client is connected to ZooKeeper
   [junit4]   2> 1178005 INFO  (TEST-CollectionsAPIDistributedZkTest.test-seed#[8E314AF9681C4366]) [    ] o.a.s.c.c.SolrZkClient Using default ZkACLProvider
   [junit4]   2> 1178008 INFO  (TEST-CollectionsAPIDistributedZkTest.test-seed#[8E314AF9681C4366]) [n:127.0.0.1:63937__vdb    ] o.a.s.c.c.ConnectionManager Waiting for client to connect to ZooKeeper
   [junit4]   2> 1178010 INFO  (zkCallback-1075-thread-1-processing-n:127.0.0.1:63937__vdb) [n:127.0.0.1:63937__vdb    ] o.a.s.c.c.ConnectionManager Watcher org.apache.solr.common.cloud.ConnectionManager@5fdfe85a name:ZooKeeperConnection Watcher:127.0.0.1:63903/solr got event WatchedEvent state:SyncConnected type:None path:null path:null type:None
   [junit4]   2> 1178010 INFO  (TEST-CollectionsAPIDistributedZkTest.test-seed#[8E314AF9681C4366]) [n:127.0.0.1:63937__vdb    ] o.a.s.c.c.ConnectionManager Client is connected to ZooKeeper
   [junit4]   2> 1178016 INFO  (TEST-CollectionsAPIDistributedZkTest.test-seed#[8E314AF9681C4366]) [n:127.0.0.1:63937__vdb    ] o.a.s.c.c.ZkStateReader Updating cluster state from ZooKeeper... 
   [junit4]   2> 1179021 INFO  (TEST-CollectionsAPIDistributedZkTest.test-seed#[8E314AF9681C4366]) [n:127.0.0.1:63937__vdb    ] o.a.s.c.ZkController Register node as live in ZooKeeper:/live_nodes/127.0.0.1:63937__vdb
   [junit4]   2> 1179022 INFO  (TEST-CollectionsAPIDistributedZkTest.test-seed#[8E314AF9681C4366]) [n:127.0.0.1:63937__vdb    ] o.a.s.c.c.SolrZkClient makePath: /live_nodes/127.0.0.1:63937__vdb
   [junit4]   2> 1179024 INFO  (zkCallback-1075-thread-1-processing-n:127.0.0.1:63937__vdb) [n:127.0.0.1:63937__vdb    ] o.a.s.c.c.ZkStateReader A live node change: [WatchedEvent state:SyncConnected type:NodeChildrenChanged path:/live_nodes], has occurred - updating... (live nodes size: [1])
   [junit4]   2> 1179024 INFO  (zkCallback-1070-thread-1) [    ] o.a.s.c.c.ZkStateReader A live node change: [WatchedEvent state:SyncConnected type:NodeChildrenChanged path:/live_nodes], has occurred - updating... (live nodes size: [1])
   [junit4]   2> 1179024 INFO  (zkCallback-1068-thread-2-processing-n:127.0.0.1:63919__vdb) [n:127.0.0.1:63919__vdb    ] o.a.s.c.c.ZkStateReader A live node change: [WatchedEvent state:SyncConnected type:NodeChildrenChanged path:/live_nodes], has occurred - updating... (live nodes size: [1])
   [junit4]   2> 1179025 INFO  (TEST-CollectionsAPIDistributedZkTest.test-seed#[8E314AF9681C4366]) [n:127.0.0.1:63937__vdb    ] o.a.s.c.Overseer Overseer (id=null) closing
   [junit4]   2> 1179025 INFO  (TEST-CollectionsAPIDistributedZkTest.test-seed#[8E314AF9681C4366]) [n:127.0.0.1:63937__vdb    ] o.a.s.c.LeaderElector Joined leadership election with path: /overseer_elect/election/95384583520583690-127.0.0.1:63937__vdb-n_0000000001
   [junit4]   2> 1179026 INFO  (TEST-CollectionsAPIDistributedZkTest.test-seed#[8E314AF9681C4366]) [n:127.0.0.1:63937__vdb    ] o.a.s.c.LeaderElector Watching path /overseer_elect/election/95384583520583686-127.0.0.1:63919__vdb-n_0000000000 to know if I could be the leader
   [junit4]   2> 1179042 INFO  (TEST-CollectionsAPIDistributedZkTest.test-seed#[8E314AF9681C4366]) [n:127.0.0.1:63937__vdb    ] o.a.s.c.CoreContainer Security conf doesn't exist. Skipping setup for authorization module.
   [junit4]   2> 1179042 INFO  (TEST-CollectionsAPIDistributedZkTest.test-seed#[8E314AF9681C4366]) [n:127.0.0.1:63937__vdb    ] o.a.s.c.CoreContainer No authentication plugin used.
   [junit4]   2> 1179043 INFO  (TEST-CollectionsAPIDistributedZkTest.test-seed#[8E314AF9681C4366]) [n:127.0.0.1:63937__vdb    ] o.a.s.c.CorePropertiesLocator Looking for core definitions underneath C:\Users\JenkinsSlave\workspace\Lucene-Solr-5.5-Windows\solr\build\solr-core\test\J1\..\..\..\..\..\..\..\..\..\Users\JenkinsSlave\workspace\Lucene-Solr-5.5-Windows\solr\build\solr-core\test\J1\temp\solr.cloud.CollectionsAPIDistributedZkTest_8E314AF9681C4366-001\shard-1-001\cores
   [junit4]   2> 1179045 INFO  (TEST-CollectionsAPIDistributedZkTest.test-seed#[8E314AF9681C4366]) [n:127.0.0.1:63937__vdb    ] o.a.s.c.CoreDescriptor Created CoreDescriptor: {name=collection1, config=solrconfig.xml, transient=false, schema=schema.xml, loadOnStartup=true, configSetProperties=configsetprops.json, collection=collection1, coreNodeName=, dataDir=data\, shard=}
   [junit4]   2> 1179045 INFO  (TEST-CollectionsAPIDistributedZkTest.test-seed#[8E314AF9681C4366]) [n:127.0.0.1:63937__vdb    ] o.a.s.c.CorePropertiesLocator Found core collection1 in C:\Users\JenkinsSlave\workspace\Lucene-Solr-5.5-Windows\solr\build\solr-core\test\J1\..\..\..\..\..\..\..\..\..\Users\JenkinsSlave\workspace\Lucene-Solr-5.5-Windows\solr\build\solr-core\test\J1\temp\solr.cloud.CollectionsAPIDistributedZkTest_8E314AF9681C4366-001\shard-1-001\cores\collection1
   [junit4]   2> 1179045 INFO  (TEST-CollectionsAPIDistributedZkTest.test-seed#[8E314AF9681C4366]) [n:127.0.0.1:63937__vdb    ] o.a.s.c.CorePropertiesLocator Found 1 core definitions
   [junit4]   2> 1179046 INFO  (TEST-CollectionsAPIDistributedZkTest.test-seed#[8E314AF9681C4366]) [n:127.0.0.1:63937__vdb    ] o.a.s.s.SolrDispatchFilter user.dir=C:\Users\JenkinsSlave\workspace\Lucene-Solr-5.5-Windows\solr\build\solr-core\test\J1
   [junit4]   2> 1179046 INFO  (TEST-CollectionsAPIDistributedZkTest.test-seed#[8E314AF9681C4366]) [n:127.0.0.1:63937__vdb    ] o.a.s.s.SolrDispatchFilter SolrDispatchFilter.init() done
   [junit4]   2> 1179046 INFO  (coreLoadExecutor-3543-thread-1-processing-n:127.0.0.1:63937__vdb) [n:127.0.0.1:63937__vdb c:collection1   x:collection1] o.a.s.c.ZkController publishing state=down
   [junit4]   2> 1179046 INFO  (coreLoadExecutor-3543-thread-1-processing-n:127.0.0.1:63937__vdb) [n:127.0.0.1:63937__vdb c:collection1   x:collection1] o.a.s.c.ZkController numShards not found on descriptor - reading it from system property
   [junit4]   2> 1179048 INFO  (OverseerStateUpdate-95384583520583686-127.0.0.1:63919__vdb-n_0000000000) [n:127.0.0.1:63919__vdb    ] o.a.s.c.Overseer processMessage: queueSize: 1, message = {
   [junit4]   2>   "core":"collection1",
   [junit4]   2>   "roles":null,
   [junit4]   2>   "base_url":"http://127.0.0.1:63937/_vdb",
   [junit4]   2>   "node_name":"127.0.0.1:63937__vdb",
   [junit4]   2>   "numShards":"2",
   [junit4]   2>   "state":"down",
   [junit4]   2>   "shard":null,
   [junit4]   2>   "collection":"collection1",
   [junit4]   2>   "operation":"state"} current state version: 3
   [junit4]   2> 1179048 INFO  (coreLoadExecutor-3543-thread-1-processing-n:127.0.0.1:63937__vdb) [n:127.0.0.1:63937__vdb c:collection1   x:collection1] o.a.s.c.ZkController look for our core node name
   [junit4]   2> 1179048 INFO  (OverseerStateUpdate-95384583520583686-127.0.0.1:63919__vdb-n_0000000000) [n:127.0.0.1:63919__vdb    ] o.a.s.c.o.ReplicaMutator Update state numShards=2 message={
   [junit4]   2>   "core":"collection1",
   [junit4]   2>   "roles":null,
   [junit4]   2>   "base_url":"http://127.0.0.1:63937/_vdb",
   [junit4]   2>   "node_name":"127.0.0.1:63937__vdb",
   [junit4]   2>   "numShards":"2",
   [junit4]   2>   "state":"down",
   [junit4]   2>   "shard":null,
   [junit4]   2>   "collection":"collection1",
   [junit4]   2>   "operation":"state"}
   [junit4]   2> 1179048 INFO  (OverseerStateUpdate-95384583520583686-127.0.0.1:63919__vdb-n_0000000000) [n:127.0.0.1:63919__vdb    ] o.a.s.c.o.ClusterStateMutator building a new cName: collection1
   [junit4]   2> 1179048 INFO  (OverseerStateUpdate-95384583520583686-127.0.0.1:63919__vdb-n_0000000000) [n:127.0.0.1:63

[...truncated too long message...]

pter.call(Executors.java:511)
   [junit4]   2> 	at java.util.concurrent.FutureTask.run(FutureTask.java:266)
   [junit4]   2> 	at org.apache.solr.common.util.ExecutorUtil$MDCAwareThreadPoolExecutor$1.run(ExecutorUtil.java:231)
   [junit4]   2> 	at java.util.concurrent.ThreadPoolExecutor.runWorker(ThreadPoolExecutor.java:1142)
   [junit4]   2> 	at java.util.concurrent.ThreadPoolExecutor$Worker.run(ThreadPoolExecutor.java:617)
   [junit4]   2> 	at java.lang.Thread.run(Thread.java:745)
   [junit4]   2> 1225589 INFO  (TEST-CollectionsAPIDistributedZkTest.test-seed#[8E314AF9681C4366]) [    ] o.e.j.s.ServerConnector Stopped ServerConnector@39aafba0{HTTP/1.1}{127.0.0.1:63997}
   [junit4]   2> 1225589 INFO  (TEST-CollectionsAPIDistributedZkTest.test-seed#[8E314AF9681C4366]) [    ] o.e.j.s.h.ContextHandler Stopped o.e.j.s.ServletContextHandler@81dbb67{/_vdb,null,UNAVAILABLE}
   [junit4]   2> 1226275 INFO  (TEST-CollectionsAPIDistributedZkTest.test-seed#[8E314AF9681C4366]) [    ] o.a.s.c.ZkTestServer connecting to 127.0.0.1:63903 63903
   [junit4]   2> 1228543 INFO  (Thread-3006) [    ] o.a.s.c.ZkTestServer connecting to 127.0.0.1:63903 63903
   [junit4]   2> 1228544 WARN  (Thread-3006) [    ] o.a.s.c.ZkTestServer Watch limit violations: 
   [junit4]   2> Maximum concurrent create/delete watches above limit:
   [junit4]   2> 
   [junit4]   2> 	9	/solr/aliases.json
   [junit4]   2> 	6	/solr/security.json
   [junit4]   2> 	6	/solr/configs/conf1
   [junit4]   2> 	4	/solr/configs/conf2
   [junit4]   2> 
   [junit4]   2> Maximum concurrent data watches above limit:
   [junit4]   2> 
   [junit4]   2> 	9	/solr/clusterstate.json
   [junit4]   2> 	4	/solr/collections/nodes_used_collection/state.json
   [junit4]   2> 	2	/solr/collections/collection1/leader_elect/shard1/election/95384583520583693-core_node2-n_0000000000
   [junit4]   2> 	2	/solr/overseer_elect/election/95384583520583696-127.0.0.1:63981__vdb-n_0000000003
   [junit4]   2> 	2	/solr/collections/awholynewcollection_0/leader_elect/shard1/election/95384583520583704-core_node2-n_0000000005
   [junit4]   2> 
   [junit4]   2> Maximum concurrent children watches above limit:
   [junit4]   2> 
   [junit4]   2> 	9	/solr/collections
   [junit4]   2> 	8	/solr/live_nodes
   [junit4]   2> 	5	/solr/overseer/queue
   [junit4]   2> 	5	/solr/overseer/collection-queue-work
   [junit4]   2> 	3	/solr/overseer/queue-work
   [junit4]   2> 
   [junit4]   2> NOTE: reproduce with: ant test  -Dtestcase=CollectionsAPIDistributedZkTest -Dtests.method=test -Dtests.seed=8E314AF9681C4366 -Dtests.slow=true -Dtests.locale=en-AU -Dtests.timezone=Pacific/Chuuk -Dtests.asserts=true -Dtests.file.encoding=ISO-8859-1
   [junit4] ERROR   53.8s J1 | CollectionsAPIDistributedZkTest.test <<<
   [junit4]    > Throwable #1: org.apache.solr.client.solrj.impl.HttpSolrClient$RemoteSolrException: Error from server at http://127.0.0.1:63969/_vdb/awholynewcollection_0: non ok status: 500, message:Server Error
   [junit4]    > 	at __randomizedtesting.SeedInfo.seed([8E314AF9681C4366:6657523C6E02E9E]:0)
   [junit4]    > 	at org.apache.solr.client.solrj.impl.HttpSolrClient.executeMethod(HttpSolrClient.java:511)
   [junit4]    > 	at org.apache.solr.client.solrj.impl.HttpSolrClient.request(HttpSolrClient.java:240)
   [junit4]    > 	at org.apache.solr.client.solrj.impl.HttpSolrClient.request(HttpSolrClient.java:229)
   [junit4]    > 	at org.apache.solr.client.solrj.SolrRequest.process(SolrRequest.java:149)
   [junit4]    > 	at org.apache.solr.client.solrj.SolrClient.query(SolrClient.java:942)
   [junit4]    > 	at org.apache.solr.client.solrj.SolrClient.query(SolrClient.java:957)
   [junit4]    > 	at org.apache.solr.cloud.AbstractFullDistribZkTestBase.waitForNon403or404or503(AbstractFullDistribZkTestBase.java:1753)
   [junit4]    > 	at org.apache.solr.cloud.CollectionsAPIDistributedZkTest.testCollectionsAPI(CollectionsAPIDistributedZkTest.java:737)
   [junit4]    > 	at org.apache.solr.cloud.CollectionsAPIDistributedZkTest.test(CollectionsAPIDistributedZkTest.java:160)
   [junit4]    > 	at org.apache.solr.BaseDistributedSearchTestCase$ShardsRepeatRule$ShardsFixedStatement.callStatement(BaseDistributedSearchTestCase.java:964)
   [junit4]    > 	at org.apache.solr.BaseDistributedSearchTestCase$ShardsRepeatRule$ShardsStatement.evaluate(BaseDistributedSearchTestCase.java:939)
   [junit4]    > 	at java.lang.Thread.run(Thread.java:745)
   [junit4]   2> 1228548 INFO  (SUITE-CollectionsAPIDistributedZkTest-seed#[8E314AF9681C4366]-worker) [    ] o.a.s.SolrTestCaseJ4 ###deleteCore
   [junit4]   2> NOTE: leaving temporary files on disk at: C:\Users\JenkinsSlave\workspace\Lucene-Solr-5.5-Windows\solr\build\solr-core\test\J1\temp\solr.cloud.CollectionsAPIDistributedZkTest_8E314AF9681C4366-001
   [junit4]   2> NOTE: test params are: codec=Asserting(Lucene54): {}, docValues:{}, sim=DefaultSimilarity, locale=en-AU, timezone=Pacific/Chuuk
   [junit4]   2> NOTE: Windows 7 6.1 amd64/Oracle Corporation 1.8.0_72 (64-bit)/cpus=3,threads=1,free=104831936,total=518979584
   [junit4]   2> NOTE: All tests run in this JVM: [TestSolrJ, ExitableDirectoryReaderTest, HighlighterConfigTest, StatsComponentTest, HdfsUnloadDistributedZkTest, CachingDirectoryFactoryTest, DistributedSuggestComponentTest, TestSuggestSpellingConverter, MigrateRouteKeyTest, RAMDirectoryFactoryTest, ConnectionReuseTest, AnalyticsQueryTest, RollingRestartTest, TestCSVResponseWriter, TestPHPSerializedResponseWriter, TestSolrConfigHandlerConcurrent, CacheHeaderTest, AliasIntegrationTest, TestInitParams, DateFieldTest, TestSimpleTrackingShardHandler, TestBulkSchemaAPI, DirectUpdateHandlerOptimizeTest, TestFieldCollectionResource, SpellPossibilityIteratorTest, HdfsChaosMonkeySafeLeaderTest, BufferStoreTest, DistanceFunctionTest, TestConfigSetsAPIExclusivity, TestIndexingPerformance, HdfsBasicDistributedZkTest, EchoParamsTest, TestSearcherReuse, CoreAdminHandlerTest, TestConfigSets, BitVectorTest, OpenExchangeRatesOrgProviderTest, HdfsLockFactoryTest, TestPKIAuthenticationPlugin, FileBasedSpellCheckerTest, DistributedFacetPivotSmallTest, ConvertedLegacyTest, TestFuzzyAnalyzedSuggestions, ConjunctionSolrSpellCheckerTest, SolrPluginUtilsTest, TestFiltering, LoggingHandlerTest, TestSortingResponseWriter, TestSmileRequest, TestRangeQuery, TestUseDocValuesAsStored2, TestRTGBase, BasicFunctionalityTest, TestDownShardTolerantSearch, TestRestoreCore, TestBlobHandler, BlockJoinFacetRandomTest, SaslZkACLProviderTest, TestReloadAndDeleteDocs, DeleteShardTest, TestTrackingShardHandlerFactory, TestSolrCLIRunExample, TestOverriddenPrefixQueryForCustomFieldType, AsyncCallRequestStatusResponseTest, TestCopyFieldCollectionResource, TestJoin, TestImplicitCoreProperties, TestSolrQueryParser, DistributedIntervalFacetingTest, QueryParsingTest, TestIndexSearcher, SpellCheckCollatorTest, VMParamsZkACLAndCredentialsProvidersTest, TestCustomDocTransformer, TestRandomRequestDistribution, TestCrossCoreJoin, ZkSolrClientTest, TestRecoveryHdfs, TestHdfsUpdateLog, TestDynamicFieldCollectionResource, TestCloudInspectUtil, UUIDUpdateProcessorFallbackTest, NumericFieldsTest, TestSerializedLuceneMatchVersion, TestRandomFaceting, TestCharFilters, SortByFunctionTest, TestFreeTextSuggestions, LeaderElectionIntegrationTest, IndexSchemaRuntimeFieldTest, TestSolrCoreProperties, DistributedTermsComponentTest, SimpleMLTQParserTest, TestComplexPhraseQParserPlugin, RecoveryAfterSoftCommitTest, CSVRequestHandlerTest, BasicZkTest, TestValueSourceCache, BigEndianAscendingWordDeserializerTest, TestMacros, TestManagedResourceStorage, DistributedFacetPivotLongTailTest, TestSolrQueryParserResource, OpenCloseCoreStressTest, HdfsNNFailoverTest, TestScoreJoinQPNoScore, TestManagedStopFilterFactory, TestTrie, HdfsRecoveryZkTest, TestMissingGroups, TestBinaryResponseWriter, TestFoldingMultitermQuery, TestSolrIndexConfig, BadIndexSchemaTest, LeaderInitiatedRecoveryOnCommitTest, ConfigSetsAPITest, TestSystemIdResolver, TestSchemaManager, SortSpecParsingTest, TestLMJelinekMercerSimilarityFactory, BinaryUpdateRequestHandlerTest, TestReversedWildcardFilterFactory, TestBulkSchemaConcurrent, DistributedVersionInfoTest, AddSchemaFieldsUpdateProcessorFactoryTest, SuggesterTSTTest, TestBlendedInfixSuggestions, PluginInfoTest, TestQueryUtils, SpellCheckComponentTest, TestDistributedMissingSort, TestConfigSetImmutable, ZkNodePropsTest, ResponseLogComponentTest, TestQuerySenderListener, UpdateRequestProcessorFactoryTest, MergeStrategyTest, ChaosMonkeySafeLeaderTest, BasicDistributedZk2Test, CollectionsAPIDistributedZkTest]
   [junit4] Completed [256/566 (1!)] on J1 in 53.86s, 1 test, 1 error <<< FAILURES!

[...truncated 1003 lines...]
BUILD FAILED
C:\Users\JenkinsSlave\workspace\Lucene-Solr-5.5-Windows\build.xml:750: The following error occurred while executing this line:
C:\Users\JenkinsSlave\workspace\Lucene-Solr-5.5-Windows\build.xml:694: The following error occurred while executing this line:
C:\Users\JenkinsSlave\workspace\Lucene-Solr-5.5-Windows\build.xml:59: The following error occurred while executing this line:
C:\Users\JenkinsSlave\workspace\Lucene-Solr-5.5-Windows\solr\build.xml:233: The following error occurred while executing this line:
C:\Users\JenkinsSlave\workspace\Lucene-Solr-5.5-Windows\solr\common-build.xml:534: The following error occurred while executing this line:
C:\Users\JenkinsSlave\workspace\Lucene-Solr-5.5-Windows\lucene\common-build.xml:1477: The following error occurred while executing this line:
C:\Users\JenkinsSlave\workspace\Lucene-Solr-5.5-Windows\lucene\common-build.xml:1033: There were test failures: 566 suites (7 ignored), 2275 tests, 1 error, 94 ignored (49 assumptions) [seed: 8E314AF9681C4366]

Total time: 71 minutes 58 seconds
Build step 'Invoke Ant' marked build as failure
Archiving artifacts
[WARNINGS] Skipping publisher since build result is FAILURE
Recording test results
Email was triggered for: Failure - Any
Sending email for trigger: Failure - Any



Mime
View raw message