lucene-dev mailing list archives

Site index · List index
Message view « Date » · « Thread »
Top « Date » · « Thread »
From Policeman Jenkins Server <jenk...@thetaphi.de>
Subject [JENKINS-EA] Lucene-Solr-trunk-Linux (64bit/jdk-9-ea+105) - Build # 15951 - Still Failing!
Date Sun, 21 Feb 2016 23:57:57 GMT
Build: http://jenkins.thetaphi.de/job/Lucene-Solr-trunk-Linux/15951/
Java: 64bit/jdk-9-ea+105 -XX:-UseCompressedOops -XX:+UseParallelGC -XX:-UseSuperWord

1 tests failed.
FAILED:  org.apache.lucene.util.automaton.TestRegExp.testSerializeTooManyStatesToDeterminizeExc

Error Message:
Unexpected exception type, expected TooComplexToDeterminizeException

Stack Trace:
junit.framework.AssertionFailedError: Unexpected exception type, expected TooComplexToDeterminizeException
	at __randomizedtesting.SeedInfo.seed([8B9F51918DE04AA9:62F50307AFF70589]:0)
	at org.apache.lucene.util.LuceneTestCase.expectThrows(LuceneTestCase.java:2649)
	at org.apache.lucene.util.automaton.TestRegExp.testSerializeTooManyStatesToDeterminizeExc(TestRegExp.java:61)
	at sun.reflect.NativeMethodAccessorImpl.invoke0(Native Method)
	at sun.reflect.NativeMethodAccessorImpl.invoke(NativeMethodAccessorImpl.java:62)
	at sun.reflect.DelegatingMethodAccessorImpl.invoke(DelegatingMethodAccessorImpl.java:43)
	at java.lang.reflect.Method.invoke(Method.java:520)
	at com.carrotsearch.randomizedtesting.RandomizedRunner.invoke(RandomizedRunner.java:1764)
	at com.carrotsearch.randomizedtesting.RandomizedRunner$8.evaluate(RandomizedRunner.java:871)
	at com.carrotsearch.randomizedtesting.RandomizedRunner$9.evaluate(RandomizedRunner.java:907)
	at com.carrotsearch.randomizedtesting.RandomizedRunner$10.evaluate(RandomizedRunner.java:921)
	at org.apache.lucene.util.TestRuleSetupTeardownChained$1.evaluate(TestRuleSetupTeardownChained.java:49)
	at org.apache.lucene.util.AbstractBeforeAfterRule$1.evaluate(AbstractBeforeAfterRule.java:45)
	at org.apache.lucene.util.TestRuleThreadAndTestName$1.evaluate(TestRuleThreadAndTestName.java:48)
	at org.apache.lucene.util.TestRuleIgnoreAfterMaxFailures$1.evaluate(TestRuleIgnoreAfterMaxFailures.java:64)
	at org.apache.lucene.util.TestRuleMarkFailure$1.evaluate(TestRuleMarkFailure.java:47)
	at com.carrotsearch.randomizedtesting.rules.StatementAdapter.evaluate(StatementAdapter.java:36)
	at com.carrotsearch.randomizedtesting.ThreadLeakControl$StatementRunner.run(ThreadLeakControl.java:367)
	at com.carrotsearch.randomizedtesting.ThreadLeakControl.forkTimeoutingTask(ThreadLeakControl.java:809)
	at com.carrotsearch.randomizedtesting.ThreadLeakControl$3.evaluate(ThreadLeakControl.java:460)
	at com.carrotsearch.randomizedtesting.RandomizedRunner.runSingleTest(RandomizedRunner.java:880)
	at com.carrotsearch.randomizedtesting.RandomizedRunner$5.evaluate(RandomizedRunner.java:781)
	at com.carrotsearch.randomizedtesting.RandomizedRunner$6.evaluate(RandomizedRunner.java:816)
	at com.carrotsearch.randomizedtesting.RandomizedRunner$7.evaluate(RandomizedRunner.java:827)
	at org.apache.lucene.util.AbstractBeforeAfterRule$1.evaluate(AbstractBeforeAfterRule.java:45)
	at com.carrotsearch.randomizedtesting.rules.StatementAdapter.evaluate(StatementAdapter.java:36)
	at org.apache.lucene.util.TestRuleStoreClassName$1.evaluate(TestRuleStoreClassName.java:41)
	at com.carrotsearch.randomizedtesting.rules.NoShadowingOrOverridesOnMethodsRule$1.evaluate(NoShadowingOrOverridesOnMethodsRule.java:40)
	at com.carrotsearch.randomizedtesting.rules.NoShadowingOrOverridesOnMethodsRule$1.evaluate(NoShadowingOrOverridesOnMethodsRule.java:40)
	at com.carrotsearch.randomizedtesting.rules.StatementAdapter.evaluate(StatementAdapter.java:36)
	at com.carrotsearch.randomizedtesting.rules.StatementAdapter.evaluate(StatementAdapter.java:36)
	at com.carrotsearch.randomizedtesting.rules.StatementAdapter.evaluate(StatementAdapter.java:36)
	at org.apache.lucene.util.TestRuleAssertionsRequired$1.evaluate(TestRuleAssertionsRequired.java:53)
	at org.apache.lucene.util.TestRuleMarkFailure$1.evaluate(TestRuleMarkFailure.java:47)
	at org.apache.lucene.util.TestRuleIgnoreAfterMaxFailures$1.evaluate(TestRuleIgnoreAfterMaxFailures.java:64)
	at org.apache.lucene.util.TestRuleIgnoreTestSuites$1.evaluate(TestRuleIgnoreTestSuites.java:54)
	at com.carrotsearch.randomizedtesting.rules.StatementAdapter.evaluate(StatementAdapter.java:36)
	at com.carrotsearch.randomizedtesting.ThreadLeakControl$StatementRunner.run(ThreadLeakControl.java:367)
	at java.lang.Thread.run(Thread.java:804)
Caused by: java.lang.ArrayIndexOutOfBoundsException: 352
	at org.apache.lucene.util.automaton.MinimizationOperations.minimize(MinimizationOperations.java:235)
	at org.apache.lucene.util.automaton.RegExp.toAutomatonInternal(RegExp.java:557)
	at org.apache.lucene.util.automaton.RegExp.findLeaves(RegExp.java:617)
	at org.apache.lucene.util.automaton.RegExp.findLeaves(RegExp.java:614)
	at org.apache.lucene.util.automaton.RegExp.toAutomatonInternal(RegExp.java:521)
	at org.apache.lucene.util.automaton.RegExp.toAutomaton(RegExp.java:495)
	at org.apache.lucene.util.automaton.RegExp.toAutomaton(RegExp.java:426)
	at org.apache.lucene.util.automaton.TestRegExp.lambda$testSerializeTooManyStatesToDeterminizeExc$1(TestRegExp.java:62)
	at org.apache.lucene.util.LuceneTestCase.expectThrows(LuceneTestCase.java:2644)
	... 37 more




Build Log:
[...truncated 1546 lines...]
   [junit4] Suite: org.apache.lucene.util.automaton.TestRegExp
   [junit4]   2> NOTE: reproduce with: ant test  -Dtestcase=TestRegExp -Dtests.method=testSerializeTooManyStatesToDeterminizeExc
-Dtests.seed=8B9F51918DE04AA9 -Dtests.multiplier=3 -Dtests.slow=true -Dtests.locale=sv -Dtests.timezone=Asia/Khandyga
-Dtests.asserts=true -Dtests.file.encoding=ISO-8859-1
   [junit4] FAILURE 0.01s J2 | TestRegExp.testSerializeTooManyStatesToDeterminizeExc <<<
   [junit4]    > Throwable #1: junit.framework.AssertionFailedError: Unexpected exception
type, expected TooComplexToDeterminizeException
   [junit4]    > 	at __randomizedtesting.SeedInfo.seed([8B9F51918DE04AA9:62F50307AFF70589]:0)
   [junit4]    > 	at org.apache.lucene.util.LuceneTestCase.expectThrows(LuceneTestCase.java:2649)
   [junit4]    > 	at org.apache.lucene.util.automaton.TestRegExp.testSerializeTooManyStatesToDeterminizeExc(TestRegExp.java:61)
   [junit4]    > 	at java.lang.Thread.run(Thread.java:804)
   [junit4]    > Caused by: java.lang.ArrayIndexOutOfBoundsException: 352
   [junit4]    > 	at org.apache.lucene.util.automaton.MinimizationOperations.minimize(MinimizationOperations.java:235)
   [junit4]    > 	at org.apache.lucene.util.automaton.RegExp.toAutomatonInternal(RegExp.java:557)
   [junit4]    > 	at org.apache.lucene.util.automaton.RegExp.findLeaves(RegExp.java:617)
   [junit4]    > 	at org.apache.lucene.util.automaton.RegExp.findLeaves(RegExp.java:614)
   [junit4]    > 	at org.apache.lucene.util.automaton.RegExp.toAutomatonInternal(RegExp.java:521)
   [junit4]    > 	at org.apache.lucene.util.automaton.RegExp.toAutomaton(RegExp.java:495)
   [junit4]    > 	at org.apache.lucene.util.automaton.RegExp.toAutomaton(RegExp.java:426)
   [junit4]    > 	at org.apache.lucene.util.automaton.TestRegExp.lambda$testSerializeTooManyStatesToDeterminizeExc$1(TestRegExp.java:62)
   [junit4]    > 	at org.apache.lucene.util.LuceneTestCase.expectThrows(LuceneTestCase.java:2644)
   [junit4]    > 	... 37 more
   [junit4]   2> NOTE: test params are: codec=Asserting(Lucene60): {}, docValues:{}, sim=ClassicSimilarity,
locale=sv, timezone=Asia/Khandyga
   [junit4]   2> NOTE: Linux 3.19.0-47-generic amd64/Oracle Corporation 9-ea (64-bit)/cpus=12,threads=1,free=67252192,total=525860864
   [junit4]   2> NOTE: All tests run in this JVM: [TestMergeRateLimiter, TestSearchForDuplicates,
TestDemoParallelLeafReader, TestNRTReaderCleanup, TestNIOFSDirectory, TestNot, TestLucene50TermVectorsFormat,
TestAtomicUpdate, TestSPIClassIterator, TestStressIndexing2, TestPointQueries, TestBytesRefHash,
TestLucene60PointFormat, TestTryDelete, TestElevationComparator, TestBKD, TestNearSpansOrdered,
TestDirectPacked, TestIntsRef, TestSpans, TestTermVectors, TestSearchWithThreads, TestIndexWriterDeleteByQuery,
TestManyFields, TestPhrasePrefixQuery, TestComplexExplanations, TestBlockPostingsFormat, TestSpanContainQuery,
TestIndexCommit, TestAutomaton, TestTopDocsCollector, TestLazyProxSkipping, TestPrefixQuery,
TestMaxTermFrequency, TestPrefixCodedTerms, TestMultiThreadTermVectors, TestFieldReuse, TestFrequencyTrackingRingBuffer,
TestMatchNoDocsQuery, Test2BPagedBytes, TestSloppyPhraseQuery, TestIndexWriterMaxDocs, TestSimpleFSDirectory,
TestConcurrentMergeScheduler, TestTransactions, TestSparseFixedBitSet, TestNRTThreads, TestComplexExplanationsOfNonMatches,
TestTwoPhaseCommitTool, TestCachingCollector, TestBufferedChecksum, Test2BNumericDocValues,
TestNoMergeScheduler, TestDirectory, TestDateTools, TestForUtil, TestTieredMergePolicy, TestConsistentFieldNumbers,
TestFastCompressionMode, TestLucene50SegmentInfoFormat, TestBufferedIndexInput, TestIntroSorter,
TestMixedCodecs, TestSort, TestPointValues, TestUsageTrackingFilterCachingPolicy, TestIOUtils,
TestSearch, TestIndexWriterThreadsToSegments, TestField, TestIndexWriter, TestIndexWriterMerging,
TestAddIndexes, TestIndexWriterExceptions, TestDeletionPolicy, TestIndexWriterDelete, TestNorms,
TestSearchAfter, TestDocumentsWriterStallControl, TestTermsEnum, Test2BSortedDocValuesFixedSorted,
Test2BSortedDocValuesOrds, TestAllFilesHaveChecksumFooter, TestBinaryDocValuesUpdates, TestCodecUtil,
TestDuelingCodecsAtNight, TestExceedMaxTermLength, TestIndexReaderClose, TestIndexWriterOnVMError,
TestIndexWriterOutOfFileDescriptors, TestInfoStream, TestLogMergePolicy, TestMaxPosition,
TestMergePolicyWrapper, TestMultiTermsEnum, TestNumericDocValuesUpdates, TestOrdinalMap, TestReadOnlyIndex,
TestSegmentInfos, TestStressDeletes, TestSwappedIndexFiles, TestTragicIndexWriterDeadlock,
TestApproximationSearchEquivalence, TestBlendedTermQuery, TestBooleanRewrites, TestConjunctionDISI,
TestControlledRealTimeReopenThread, TestEarlyTermination, TestFieldValueQuery, TestSortedSetSelector,
TestSynonymQuery, TestSpanBoostQuery, TestSpanNearQuery, TestSpanTermQuery, TestSingleInstanceLockFactory,
TestSleepingLockWrapper, TestLSBRadixSorter, TestLongBitSet, TestOfflineSorter, TestRegExp]
   [junit4] Completed [408/411 (1!)] on J2 in 0.03s, 5 tests, 1 failure <<< FAILURES!

[...truncated 26 lines...]
BUILD FAILED
/home/jenkins/workspace/Lucene-Solr-trunk-Linux/build.xml:740: The following error occurred
while executing this line:
/home/jenkins/workspace/Lucene-Solr-trunk-Linux/build.xml:684: The following error occurred
while executing this line:
/home/jenkins/workspace/Lucene-Solr-trunk-Linux/build.xml:59: The following error occurred
while executing this line:
/home/jenkins/workspace/Lucene-Solr-trunk-Linux/lucene/build.xml:50: The following error occurred
while executing this line:
/home/jenkins/workspace/Lucene-Solr-trunk-Linux/lucene/common-build.xml:1457: The following
error occurred while executing this line:
/home/jenkins/workspace/Lucene-Solr-trunk-Linux/lucene/common-build.xml:1014: There were test
failures: 411 suites (1 ignored), 3395 tests, 1 failure, 62 ignored (58 assumptions) [seed:
8B9F51918DE04AA9]

Total time: 5 minutes 49 seconds
Build step 'Invoke Ant' marked build as failure
Archiving artifacts
[WARNINGS] Skipping publisher since build result is FAILURE
Recording test results
Email was triggered for: Failure - Any
Sending email for trigger: Failure - Any



Mime
View raw message