lucene-dev mailing list archives

Site index · List index
Message view « Date » · « Thread »
Top « Date » · « Thread »
From Policeman Jenkins Server <jenk...@thetaphi.de>
Subject [JENKINS] Lucene-Solr-5.x-Solaris (multiarch/jdk1.7.0) - Build # 403 - Failure!
Date Fri, 19 Feb 2016 20:16:30 GMT
Build: http://jenkins.thetaphi.de/job/Lucene-Solr-5.x-Solaris/403/
Java: multiarch/jdk1.7.0 -d64 -XX:+UseCompressedOops -XX:+UseSerialGC

1 tests failed.
FAILED:  junit.framework.TestSuite.org.apache.solr.handler.TestSolrConfigHandlerCloud

Error Message:
ObjectTracker found 3 object(s) that were not released!!! [MockDirectoryWrapper, MDCAwareThreadPoolExecutor, MockDirectoryWrapper]

Stack Trace:
java.lang.AssertionError: ObjectTracker found 3 object(s) that were not released!!! [MockDirectoryWrapper, MDCAwareThreadPoolExecutor, MockDirectoryWrapper]
	at __randomizedtesting.SeedInfo.seed([DB131CB3D78F284A]:0)
	at org.junit.Assert.fail(Assert.java:93)
	at org.junit.Assert.assertTrue(Assert.java:43)
	at org.junit.Assert.assertNull(Assert.java:551)
	at org.apache.solr.SolrTestCaseJ4.afterClass(SolrTestCaseJ4.java:228)
	at sun.reflect.GeneratedMethodAccessor18.invoke(Unknown Source)
	at sun.reflect.DelegatingMethodAccessorImpl.invoke(DelegatingMethodAccessorImpl.java:43)
	at java.lang.reflect.Method.invoke(Method.java:606)
	at com.carrotsearch.randomizedtesting.RandomizedRunner.invoke(RandomizedRunner.java:1764)
	at com.carrotsearch.randomizedtesting.RandomizedRunner$7.evaluate(RandomizedRunner.java:834)
	at com.carrotsearch.randomizedtesting.rules.StatementAdapter.evaluate(StatementAdapter.java:36)
	at com.carrotsearch.randomizedtesting.rules.SystemPropertiesRestoreRule$1.evaluate(SystemPropertiesRestoreRule.java:57)
	at org.apache.lucene.util.AbstractBeforeAfterRule$1.evaluate(AbstractBeforeAfterRule.java:45)
	at com.carrotsearch.randomizedtesting.rules.StatementAdapter.evaluate(StatementAdapter.java:36)
	at org.apache.lucene.util.TestRuleStoreClassName$1.evaluate(TestRuleStoreClassName.java:41)
	at com.carrotsearch.randomizedtesting.rules.NoShadowingOrOverridesOnMethodsRule$1.evaluate(NoShadowingOrOverridesOnMethodsRule.java:40)
	at com.carrotsearch.randomizedtesting.rules.NoShadowingOrOverridesOnMethodsRule$1.evaluate(NoShadowingOrOverridesOnMethodsRule.java:40)
	at com.carrotsearch.randomizedtesting.rules.StatementAdapter.evaluate(StatementAdapter.java:36)
	at com.carrotsearch.randomizedtesting.rules.StatementAdapter.evaluate(StatementAdapter.java:36)
	at com.carrotsearch.randomizedtesting.rules.StatementAdapter.evaluate(StatementAdapter.java:36)
	at org.apache.lucene.util.TestRuleAssertionsRequired$1.evaluate(TestRuleAssertionsRequired.java:53)
	at org.apache.lucene.util.TestRuleMarkFailure$1.evaluate(TestRuleMarkFailure.java:47)
	at org.apache.lucene.util.TestRuleIgnoreAfterMaxFailures$1.evaluate(TestRuleIgnoreAfterMaxFailures.java:64)
	at org.apache.lucene.util.TestRuleIgnoreTestSuites$1.evaluate(TestRuleIgnoreTestSuites.java:54)
	at com.carrotsearch.randomizedtesting.rules.StatementAdapter.evaluate(StatementAdapter.java:36)
	at com.carrotsearch.randomizedtesting.ThreadLeakControl$StatementRunner.run(ThreadLeakControl.java:367)
	at java.lang.Thread.run(Thread.java:745)




Build Log:
[...truncated 12043 lines...]
   [junit4] Suite: org.apache.solr.handler.TestSolrConfigHandlerCloud
   [junit4]   2> Creating dataDir: /export/home/jenkins/workspace/Lucene-Solr-5.x-Solaris/solr/build/solr-core/test/J0/temp/solr.handler.TestSolrConfigHandlerCloud_DB131CB3D78F284A-001/init-core-data-001
   [junit4]   2> 3090084 INFO  (SUITE-TestSolrConfigHandlerCloud-seed#[DB131CB3D78F284A]-worker) [    ] o.a.s.SolrTestCaseJ4 Randomized ssl (true) and clientAuth (false)
   [junit4]   2> 3090084 INFO  (SUITE-TestSolrConfigHandlerCloud-seed#[DB131CB3D78F284A]-worker) [    ] o.a.s.BaseDistributedSearchTestCase Setting hostContext system property: /
   [junit4]   2> 3090087 INFO  (TEST-TestSolrConfigHandlerCloud.test-seed#[DB131CB3D78F284A]) [    ] o.a.s.c.ZkTestServer STARTING ZK TEST SERVER
   [junit4]   2> 3090087 INFO  (Thread-8684) [    ] o.a.s.c.ZkTestServer client port:0.0.0.0/0.0.0.0:0
   [junit4]   2> 3090087 INFO  (Thread-8684) [    ] o.a.s.c.ZkTestServer Starting server
   [junit4]   2> 3090187 INFO  (TEST-TestSolrConfigHandlerCloud.test-seed#[DB131CB3D78F284A]) [    ] o.a.s.c.ZkTestServer start zk server on port:58745
   [junit4]   2> 3090187 INFO  (TEST-TestSolrConfigHandlerCloud.test-seed#[DB131CB3D78F284A]) [    ] o.a.s.c.c.SolrZkClient Using default ZkCredentialsProvider
   [junit4]   2> 3090188 INFO  (TEST-TestSolrConfigHandlerCloud.test-seed#[DB131CB3D78F284A]) [    ] o.a.s.c.c.ConnectionManager Waiting for client to connect to ZooKeeper
   [junit4]   2> 3090190 INFO  (zkCallback-3041-thread-1) [    ] o.a.s.c.c.ConnectionManager Watcher org.apache.solr.common.cloud.ConnectionManager@28a664df name:ZooKeeperConnection Watcher:127.0.0.1:58745 got event WatchedEvent state:SyncConnected type:None path:null path:null type:None
   [junit4]   2> 3090190 INFO  (TEST-TestSolrConfigHandlerCloud.test-seed#[DB131CB3D78F284A]) [    ] o.a.s.c.c.ConnectionManager Client is connected to ZooKeeper
   [junit4]   2> 3090191 INFO  (TEST-TestSolrConfigHandlerCloud.test-seed#[DB131CB3D78F284A]) [    ] o.a.s.c.c.SolrZkClient Using default ZkACLProvider
   [junit4]   2> 3090191 INFO  (TEST-TestSolrConfigHandlerCloud.test-seed#[DB131CB3D78F284A]) [    ] o.a.s.c.c.SolrZkClient makePath: /solr
   [junit4]   2> 3090194 INFO  (TEST-TestSolrConfigHandlerCloud.test-seed#[DB131CB3D78F284A]) [    ] o.a.s.c.c.SolrZkClient Using default ZkCredentialsProvider
   [junit4]   2> 3090194 INFO  (TEST-TestSolrConfigHandlerCloud.test-seed#[DB131CB3D78F284A]) [    ] o.a.s.c.c.ConnectionManager Waiting for client to connect to ZooKeeper
   [junit4]   2> 3090196 INFO  (zkCallback-3042-thread-1) [    ] o.a.s.c.c.ConnectionManager Watcher org.apache.solr.common.cloud.ConnectionManager@3eed27b1 name:ZooKeeperConnection Watcher:127.0.0.1:58745/solr got event WatchedEvent state:SyncConnected type:None path:null path:null type:None
   [junit4]   2> 3090196 INFO  (TEST-TestSolrConfigHandlerCloud.test-seed#[DB131CB3D78F284A]) [    ] o.a.s.c.c.ConnectionManager Client is connected to ZooKeeper
   [junit4]   2> 3090196 INFO  (TEST-TestSolrConfigHandlerCloud.test-seed#[DB131CB3D78F284A]) [    ] o.a.s.c.c.SolrZkClient Using default ZkACLProvider
   [junit4]   2> 3090196 INFO  (TEST-TestSolrConfigHandlerCloud.test-seed#[DB131CB3D78F284A]) [    ] o.a.s.c.c.SolrZkClient makePath: /collections/collection1
   [junit4]   2> 3090200 INFO  (TEST-TestSolrConfigHandlerCloud.test-seed#[DB131CB3D78F284A]) [    ] o.a.s.c.c.SolrZkClient makePath: /collections/collection1/shards
   [junit4]   2> 3090203 INFO  (TEST-TestSolrConfigHandlerCloud.test-seed#[DB131CB3D78F284A]) [    ] o.a.s.c.c.SolrZkClient makePath: /collections/control_collection
   [junit4]   2> 3090205 INFO  (TEST-TestSolrConfigHandlerCloud.test-seed#[DB131CB3D78F284A]) [    ] o.a.s.c.c.SolrZkClient makePath: /collections/control_collection/shards
   [junit4]   2> 3090207 INFO  (TEST-TestSolrConfigHandlerCloud.test-seed#[DB131CB3D78F284A]) [    ] o.a.s.c.AbstractZkTestCase put /export/home/jenkins/workspace/Lucene-Solr-5.x-Solaris/solr/core/src/test-files/solr/collection1/conf/solrconfig-tlog.xml to /configs/conf1/solrconfig.xml
   [junit4]   2> 3090207 INFO  (TEST-TestSolrConfigHandlerCloud.test-seed#[DB131CB3D78F284A]) [    ] o.a.s.c.c.SolrZkClient makePath: /configs/conf1/solrconfig.xml
   [junit4]   2> 3090211 INFO  (TEST-TestSolrConfigHandlerCloud.test-seed#[DB131CB3D78F284A]) [    ] o.a.s.c.AbstractZkTestCase put /export/home/jenkins/workspace/Lucene-Solr-5.x-Solaris/solr/core/src/test-files/solr/collection1/conf/schema.xml to /configs/conf1/schema.xml
   [junit4]   2> 3090211 INFO  (TEST-TestSolrConfigHandlerCloud.test-seed#[DB131CB3D78F284A]) [    ] o.a.s.c.c.SolrZkClient makePath: /configs/conf1/schema.xml
   [junit4]   2> 3090214 INFO  (TEST-TestSolrConfigHandlerCloud.test-seed#[DB131CB3D78F284A]) [    ] o.a.s.c.AbstractZkTestCase put /export/home/jenkins/workspace/Lucene-Solr-5.x-Solaris/solr/core/src/test-files/solr/collection1/conf/solrconfig.snippet.randomindexconfig.xml to /configs/conf1/solrconfig.snippet.randomindexconfig.xml
   [junit4]   2> 3090214 INFO  (TEST-TestSolrConfigHandlerCloud.test-seed#[DB131CB3D78F284A]) [    ] o.a.s.c.c.SolrZkClient makePath: /configs/conf1/solrconfig.snippet.randomindexconfig.xml
   [junit4]   2> 3090216 INFO  (TEST-TestSolrConfigHandlerCloud.test-seed#[DB131CB3D78F284A]) [    ] o.a.s.c.AbstractZkTestCase put /export/home/jenkins/workspace/Lucene-Solr-5.x-Solaris/solr/core/src/test-files/solr/collection1/conf/stopwords.txt to /configs/conf1/stopwords.txt
   [junit4]   2> 3090217 INFO  (TEST-TestSolrConfigHandlerCloud.test-seed#[DB131CB3D78F284A]) [    ] o.a.s.c.c.SolrZkClient makePath: /configs/conf1/stopwords.txt
   [junit4]   2> 3090219 INFO  (TEST-TestSolrConfigHandlerCloud.test-seed#[DB131CB3D78F284A]) [    ] o.a.s.c.AbstractZkTestCase put /export/home/jenkins/workspace/Lucene-Solr-5.x-Solaris/solr/core/src/test-files/solr/collection1/conf/protwords.txt to /configs/conf1/protwords.txt
   [junit4]   2> 3090219 INFO  (TEST-TestSolrConfigHandlerCloud.test-seed#[DB131CB3D78F284A]) [    ] o.a.s.c.c.SolrZkClient makePath: /configs/conf1/protwords.txt
   [junit4]   2> 3090222 INFO  (TEST-TestSolrConfigHandlerCloud.test-seed#[DB131CB3D78F284A]) [    ] o.a.s.c.AbstractZkTestCase put /export/home/jenkins/workspace/Lucene-Solr-5.x-Solaris/solr/core/src/test-files/solr/collection1/conf/currency.xml to /configs/conf1/currency.xml
   [junit4]   2> 3090222 INFO  (TEST-TestSolrConfigHandlerCloud.test-seed#[DB131CB3D78F284A]) [    ] o.a.s.c.c.SolrZkClient makePath: /configs/conf1/currency.xml
   [junit4]   2> 3090224 INFO  (TEST-TestSolrConfigHandlerCloud.test-seed#[DB131CB3D78F284A]) [    ] o.a.s.c.AbstractZkTestCase put /export/home/jenkins/workspace/Lucene-Solr-5.x-Solaris/solr/core/src/test-files/solr/collection1/conf/enumsConfig.xml to /configs/conf1/enumsConfig.xml
   [junit4]   2> 3090225 INFO  (TEST-TestSolrConfigHandlerCloud.test-seed#[DB131CB3D78F284A]) [    ] o.a.s.c.c.SolrZkClient makePath: /configs/conf1/enumsConfig.xml
   [junit4]   2> 3090227 INFO  (TEST-TestSolrConfigHandlerCloud.test-seed#[DB131CB3D78F284A]) [    ] o.a.s.c.AbstractZkTestCase put /export/home/jenkins/workspace/Lucene-Solr-5.x-Solaris/solr/core/src/test-files/solr/collection1/conf/open-exchange-rates.json to /configs/conf1/open-exchange-rates.json
   [junit4]   2> 3090227 INFO  (TEST-TestSolrConfigHandlerCloud.test-seed#[DB131CB3D78F284A]) [    ] o.a.s.c.c.SolrZkClient makePath: /configs/conf1/open-exchange-rates.json
   [junit4]   2> 3090230 INFO  (TEST-TestSolrConfigHandlerCloud.test-seed#[DB131CB3D78F284A]) [    ] o.a.s.c.AbstractZkTestCase put /export/home/jenkins/workspace/Lucene-Solr-5.x-Solaris/solr/core/src/test-files/solr/collection1/conf/mapping-ISOLatin1Accent.txt to /configs/conf1/mapping-ISOLatin1Accent.txt
   [junit4]   2> 3090230 INFO  (TEST-TestSolrConfigHandlerCloud.test-seed#[DB131CB3D78F284A]) [    ] o.a.s.c.c.SolrZkClient makePath: /configs/conf1/mapping-ISOLatin1Accent.txt
   [junit4]   2> 3090232 INFO  (TEST-TestSolrConfigHandlerCloud.test-seed#[DB131CB3D78F284A]) [    ] o.a.s.c.AbstractZkTestCase put /export/home/jenkins/workspace/Lucene-Solr-5.x-Solaris/solr/core/src/test-files/solr/collection1/conf/old_synonyms.txt to /configs/conf1/old_synonyms.txt
   [junit4]   2> 3090232 INFO  (TEST-TestSolrConfigHandlerCloud.test-seed#[DB131CB3D78F284A]) [    ] o.a.s.c.c.SolrZkClient makePath: /configs/conf1/old_synonyms.txt
   [junit4]   2> 3090234 INFO  (TEST-TestSolrConfigHandlerCloud.test-seed#[DB131CB3D78F284A]) [    ] o.a.s.c.AbstractZkTestCase put /export/home/jenkins/workspace/Lucene-Solr-5.x-Solaris/solr/core/src/test-files/solr/collection1/conf/synonyms.txt to /configs/conf1/synonyms.txt
   [junit4]   2> 3090235 INFO  (TEST-TestSolrConfigHandlerCloud.test-seed#[DB131CB3D78F284A]) [    ] o.a.s.c.c.SolrZkClient makePath: /configs/conf1/synonyms.txt
   [junit4]   2> 3090238 INFO  (TEST-TestSolrConfigHandlerCloud.test-seed#[DB131CB3D78F284A]) [    ] o.a.s.c.c.SolrZkClient Using default ZkCredentialsProvider
   [junit4]   2> 3090238 INFO  (TEST-TestSolrConfigHandlerCloud.test-seed#[DB131CB3D78F284A]) [    ] o.a.s.c.c.ConnectionManager Waiting for client to connect to ZooKeeper
   [junit4]   2> 3090240 INFO  (zkCallback-3043-thread-1) [    ] o.a.s.c.c.ConnectionManager Watcher org.apache.solr.common.cloud.ConnectionManager@134d18 name:ZooKeeperConnection Watcher:127.0.0.1:58745/solr got event WatchedEvent state:SyncConnected type:None path:null path:null type:None
   [junit4]   2> 3090240 INFO  (TEST-TestSolrConfigHandlerCloud.test-seed#[DB131CB3D78F284A]) [    ] o.a.s.c.c.ConnectionManager Client is connected to ZooKeeper
   [junit4]   2> 3090240 INFO  (TEST-TestSolrConfigHandlerCloud.test-seed#[DB131CB3D78F284A]) [    ] o.a.s.c.c.SolrZkClient Using default ZkACLProvider
   [junit4]   2> 3090363 INFO  (TEST-TestSolrConfigHandlerCloud.test-seed#[DB131CB3D78F284A]) [    ] o.a.s.SolrTestCaseJ4 Writing core.properties file to /export/home/jenkins/workspace/Lucene-Solr-5.x-Solaris/solr/build/solr-core/test/J0/temp/solr.handler.TestSolrConfigHandlerCloud_DB131CB3D78F284A-001/control-001/cores/collection1
   [junit4]   2> 3090364 INFO  (TEST-TestSolrConfigHandlerCloud.test-seed#[DB131CB3D78F284A]) [    ] o.e.j.s.Server jetty-9.2.13.v20150730
   [junit4]   2> 3090366 INFO  (TEST-TestSolrConfigHandlerCloud.test-seed#[DB131CB3D78F284A]) [    ] o.e.j.s.h.ContextHandler Started o.e.j.s.ServletContextHandler@5fea8392{/,null,AVAILABLE}
   [junit4]   2> 3090373 INFO  (TEST-TestSolrConfigHandlerCloud.test-seed#[DB131CB3D78F284A]) [    ] o.e.j.s.ServerConnector Started ServerConnector@3300553{SSL-http/1.1}{127.0.0.1:38776}
   [junit4]   2> 3090373 INFO  (TEST-TestSolrConfigHandlerCloud.test-seed#[DB131CB3D78F284A]) [    ] o.e.j.s.Server Started @3092861ms
   [junit4]   2> 3090373 INFO  (TEST-TestSolrConfigHandlerCloud.test-seed#[DB131CB3D78F284A]) [    ] o.a.s.c.s.e.JettySolrRunner Jetty properties: {hostContext=/, hostPort=38776, solr.data.dir=/export/home/jenkins/workspace/Lucene-Solr-5.x-Solaris/solr/build/solr-core/test/J0/temp/solr.handler.TestSolrConfigHandlerCloud_DB131CB3D78F284A-001/tempDir-001/control/data, coreRootDirectory=/export/home/jenkins/workspace/Lucene-Solr-5.x-Solaris/solr/build/solr-core/test/J0/../../../../../../../../../../export/home/jenkins/workspace/Lucene-Solr-5.x-Solaris/solr/build/solr-core/test/J0/temp/solr.handler.TestSolrConfigHandlerCloud_DB131CB3D78F284A-001/control-001/cores}
   [junit4]   2> 3090373 INFO  (TEST-TestSolrConfigHandlerCloud.test-seed#[DB131CB3D78F284A]) [    ] o.a.s.s.SolrDispatchFilter SolrDispatchFilter.init(): sun.misc.Launcher$AppClassLoader@2c154024
   [junit4]   2> 3090373 INFO  (TEST-TestSolrConfigHandlerCloud.test-seed#[DB131CB3D78F284A]) [    ] o.a.s.c.SolrResourceLoader new SolrResourceLoader for directory: '/export/home/jenkins/workspace/Lucene-Solr-5.x-Solaris/solr/build/solr-core/test/J0/temp/solr.handler.TestSolrConfigHandlerCloud_DB131CB3D78F284A-001/control-001'
   [junit4]   2> 3090373 INFO  (TEST-TestSolrConfigHandlerCloud.test-seed#[DB131CB3D78F284A]) [    ] o.a.s.c.SolrResourceLoader JNDI not configured for solr (NoInitialContextEx)
   [junit4]   2> 3090373 INFO  (TEST-TestSolrConfigHandlerCloud.test-seed#[DB131CB3D78F284A]) [    ] o.a.s.c.SolrResourceLoader solr home defaulted to 'solr/' (could not find system property or JNDI)
   [junit4]   2> 3090374 INFO  (TEST-TestSolrConfigHandlerCloud.test-seed#[DB131CB3D78F284A]) [    ] o.a.s.c.c.SolrZkClient Using default ZkCredentialsProvider
   [junit4]   2> 3090374 INFO  (TEST-TestSolrConfigHandlerCloud.test-seed#[DB131CB3D78F284A]) [    ] o.a.s.c.c.ConnectionManager Waiting for client to connect to ZooKeeper
   [junit4]   2> 3090377 INFO  (zkCallback-3044-thread-1) [    ] o.a.s.c.c.ConnectionManager Watcher org.apache.solr.common.cloud.ConnectionManager@69dd153d name:ZooKeeperConnection Watcher:127.0.0.1:58745/solr got event WatchedEvent state:SyncConnected type:None path:null path:null type:None
   [junit4]   2> 3090377 INFO  (TEST-TestSolrConfigHandlerCloud.test-seed#[DB131CB3D78F284A]) [    ] o.a.s.c.c.ConnectionManager Client is connected to ZooKeeper
   [junit4]   2> 3090377 INFO  (TEST-TestSolrConfigHandlerCloud.test-seed#[DB131CB3D78F284A]) [    ] o.a.s.c.c.SolrZkClient Using default ZkACLProvider
   [junit4]   2> 3090378 INFO  (TEST-TestSolrConfigHandlerCloud.test-seed#[DB131CB3D78F284A]) [    ] o.a.s.s.SolrDispatchFilter Loading solr.xml from SolrHome (not found in ZooKeeper)
   [junit4]   2> 3090379 INFO  (TEST-TestSolrConfigHandlerCloud.test-seed#[DB131CB3D78F284A]) [    ] o.a.s.c.SolrXmlConfig Loading container configuration from /export/home/jenkins/workspace/Lucene-Solr-5.x-Solaris/solr/build/solr-core/test/J0/temp/solr.handler.TestSolrConfigHandlerCloud_DB131CB3D78F284A-001/control-001/solr.xml
   [junit4]   2> 3090391 INFO  (TEST-TestSolrConfigHandlerCloud.test-seed#[DB131CB3D78F284A]) [    ] o.a.s.c.CorePropertiesLocator Config-defined core root directory: /export/home/jenkins/workspace/Lucene-Solr-5.x-Solaris/solr/build/solr-core/test/J0/../../../../../../../../../../export/home/jenkins/workspace/Lucene-Solr-5.x-Solaris/solr/build/solr-core/test/J0/temp/solr.handler.TestSolrConfigHandlerCloud_DB131CB3D78F284A-001/control-001/cores
   [junit4]   2> 3090391 INFO  (TEST-TestSolrConfigHandlerCloud.test-seed#[DB131CB3D78F284A]) [    ] o.a.s.c.CoreContainer New CoreContainer 837490759
   [junit4]   2> 3090391 INFO  (TEST-TestSolrConfigHandlerCloud.test-seed#[DB131CB3D78F284A]) [    ] o.a.s.c.CoreContainer Loading cores into CoreContainer [instanceDir=/export/home/jenkins/workspace/Lucene-Solr-5.x-Solaris/solr/build/solr-core/test/J0/temp/solr.handler.TestSolrConfigHandlerCloud_DB131CB3D78F284A-001/control-001]
   [junit4]   2> 3090391 WARN  (TEST-TestSolrConfigHandlerCloud.test-seed#[DB131CB3D78F284A]) [    ] o.a.s.c.CoreContainer Couldn't add files from /export/home/jenkins/workspace/Lucene-Solr-5.x-Solaris/solr/build/solr-core/test/J0/temp/solr.handler.TestSolrConfigHandlerCloud_DB131CB3D78F284A-001/control-001/lib to classpath: /export/home/jenkins/workspace/Lucene-Solr-5.x-Solaris/solr/build/solr-core/test/J0/temp/solr.handler.TestSolrConfigHandlerCloud_DB131CB3D78F284A-001/control-001/lib
   [junit4]   2> 3090391 INFO  (TEST-TestSolrConfigHandlerCloud.test-seed#[DB131CB3D78F284A]) [    ] o.a.s.h.c.HttpShardHandlerFactory created with socketTimeout : 90000,urlScheme : ,connTimeout : 15000,maxConnectionsPerHost : 20,maxConnections : 10000,corePoolSize : 0,maximumPoolSize : 2147483647,maxThreadIdleTime : 5,sizeOfQueue : -1,fairnessPolicy : false,useRetries : false,
   [junit4]   2> 3090394 INFO  (TEST-TestSolrConfigHandlerCloud.test-seed#[DB131CB3D78F284A]) [    ] o.a.s.u.UpdateShardHandler Creating UpdateShardHandler HTTP client with params: socketTimeout=340000&connTimeout=45000&retry=true
   [junit4]   2> 3090397 INFO  (TEST-TestSolrConfigHandlerCloud.test-seed#[DB131CB3D78F284A]) [    ] o.a.s.l.LogWatcher SLF4J impl is org.slf4j.impl.Log4jLoggerFactory
   [junit4]   2> 3090397 INFO  (TEST-TestSolrConfigHandlerCloud.test-seed#[DB131CB3D78F284A]) [    ] o.a.s.l.LogWatcher Registering Log Listener [Log4j (org.slf4j.impl.Log4jLoggerFactory)]
   [junit4]   2> 3090397 INFO  (TEST-TestSolrConfigHandlerCloud.test-seed#[DB131CB3D78F284A]) [    ] o.a.s.c.ZkContainer Zookeeper client=127.0.0.1:58745/solr
   [junit4]   2> 3090397 INFO  (TEST-TestSolrConfigHandlerCloud.test-seed#[DB131CB3D78F284A]) [    ] o.a.s.c.ZkController zkHost includes chroot
   [junit4]   2> 3090397 INFO  (TEST-TestSolrConfigHandlerCloud.test-seed#[DB131CB3D78F284A]) [    ] o.a.s.c.c.SolrZkClient Using default ZkCredentialsProvider
   [junit4]   2> 3090397 INFO  (TEST-TestSolrConfigHandlerCloud.test-seed#[DB131CB3D78F284A]) [    ] o.a.s.c.c.ConnectionManager Waiting for client to connect to ZooKeeper
   [junit4]   2> 3090399 INFO  (zkCallback-3047-thread-1) [    ] o.a.s.c.c.ConnectionManager Watcher org.apache.solr.common.cloud.ConnectionManager@1dc86538 name:ZooKeeperConnection Watcher:127.0.0.1:58745 got event WatchedEvent state:SyncConnected type:None path:null path:null type:None
   [junit4]   2> 3090399 INFO  (TEST-TestSolrConfigHandlerCloud.test-seed#[DB131CB3D78F284A]) [    ] o.a.s.c.c.ConnectionManager Client is connected to ZooKeeper
   [junit4]   2> 3090400 INFO  (TEST-TestSolrConfigHandlerCloud.test-seed#[DB131CB3D78F284A]) [    ] o.a.s.c.c.SolrZkClient Using default ZkACLProvider
   [junit4]   2> 3090401 INFO  (TEST-TestSolrConfigHandlerCloud.test-seed#[DB131CB3D78F284A]) [n:127.0.0.1:38776_    ] o.a.s.c.c.ConnectionManager Waiting for client to connect to ZooKeeper
   [junit4]   2> 3090403 INFO  (zkCallback-3048-thread-1-processing-n:127.0.0.1:38776_) [n:127.0.0.1:38776_    ] o.a.s.c.c.ConnectionManager Watcher org.apache.solr.common.cloud.ConnectionManager@6ecce65c name:ZooKeeperConnection Watcher:127.0.0.1:58745/solr got event WatchedEvent state:SyncConnected type:None path:null path:null type:None
   [junit4]   2> 3090403 INFO  (TEST-TestSolrConfigHandlerCloud.test-seed#[DB131CB3D78F284A]) [n:127.0.0.1:38776_    ] o.a.s.c.c.ConnectionManager Client is connected to ZooKeeper
   [junit4]   2> 3090404 INFO  (TEST-TestSolrConfigHandlerCloud.test-seed#[DB131CB3D78F284A]) [n:127.0.0.1:38776_    ] o.a.s.c.c.SolrZkClient makePath: /overseer/queue
   [junit4]   2> 3090407 INFO  (TEST-TestSolrConfigHandlerCloud.test-seed#[DB131CB3D78F284A]) [n:127.0.0.1:38776_    ] o.a.s.c.c.SolrZkClient makePath: /overseer/collection-queue-work
   [junit4]   2> 3090411 INFO  (TEST-TestSolrConfigHandlerCloud.test-seed#[DB131CB3D78F284A]) [n:127.0.0.1:38776_    ] o.a.s.c.c.SolrZkClient makePath: /overseer/collection-map-running
   [junit4]   2> 3090415 INFO  (TEST-TestSolrConfigHandlerCloud.test-seed#[DB131CB3D78F284A]) [n:127.0.0.1:38776_    ] o.a.s.c.c.SolrZkClient makePath: /overseer/collection-map-completed
   [junit4]   2> 3090421 INFO  (TEST-TestSolrConfigHandlerCloud.test-seed#[DB131CB3D78F284A]) [n:127.0.0.1:38776_    ] o.a.s.c.c.SolrZkClient makePath: /overseer/collection-map-failure
   [junit4]   2> 3090425 INFO  (TEST-TestSolrConfigHandlerCloud.test-seed#[DB131CB3D78F284A]) [n:127.0.0.1:38776_    ] o.a.s.c.c.SolrZkClient makePath: /live_nodes
   [junit4]   2> 3090428 INFO  (TEST-TestSolrConfigHandlerCloud.test-seed#[DB131CB3D78F284A]) [n:127.0.0.1:38776_    ] o.a.s.c.c.SolrZkClient makePath: /aliases.json
   [junit4]   2> 3090430 INFO  (TEST-TestSolrConfigHandlerCloud.test-seed#[DB131CB3D78F284A]) [n:127.0.0.1:38776_    ] o.a.s.c.c.SolrZkClient makePath: /clusterstate.json
   [junit4]   2> 3090432 INFO  (TEST-TestSolrConfigHandlerCloud.test-seed#[DB131CB3D78F284A]) [n:127.0.0.1:38776_    ] o.a.s.c.c.SolrZkClient makePath: /security.json
   [junit4]   2> 3090434 INFO  (TEST-TestSolrConfigHandlerCloud.test-seed#[DB131CB3D78F284A]) [n:127.0.0.1:38776_    ] o.a.s.c.ZkController Register node as live in ZooKeeper:/live_nodes/127.0.0.1:38776_
   [junit4]   2> 3090435 INFO  (TEST-TestSolrConfigHandlerCloud.test-seed#[DB131CB3D78F284A]) [n:127.0.0.1:38776_    ] o.a.s.c.c.SolrZkClient makePath: /live_nodes/127.0.0.1:38776_
   [junit4]   2> 3090437 INFO  (TEST-TestSolrConfigHandlerCloud.test-seed#[DB131CB3D78F284A]) [n:127.0.0.1:38776_    ] o.a.s.c.c.SolrZkClient makePath: /overseer_elect
   [junit4]   2> 3090439 INFO  (TEST-TestSolrConfigHandlerCloud.test-seed#[DB131CB3D78F284A]) [n:127.0.0.1:38776_    ] o.a.s.c.c.SolrZkClient makePath: /overseer_elect/election
   [junit4]   2> 3090441 INFO  (TEST-TestSolrConfigHandlerCloud.test-seed#[DB131CB3D78F284A]) [n:127.0.0.1:38776_    ] o.a.s.c.Overseer Overseer (id=null) closing
   [junit4]   2> 3090442 INFO  (TEST-TestSolrConfigHandlerCloud.test-seed#[DB131CB3D78F284A]) [n:127.0.0.1:38776_    ] o.a.s.c.LeaderElector Joined leadership election with path: /overseer_elect/election/95414682096697349-127.0.0.1:38776_-n_0000000000
   [junit4]   2> 3090442 INFO  (TEST-TestSolrConfigHandlerCloud.test-seed#[DB131CB3D78F284A]) [n:127.0.0.1:38776_    ] o.a.s.c.OverseerElectionContext I am going to be the leader 127.0.0.1:38776_
   [junit4]   2> 3090442 INFO  (TEST-TestSolrConfigHandlerCloud.test-seed#[DB131CB3D78F284A]) [n:127.0.0.1:38776_    ] o.a.s.c.c.SolrZkClient makePath: /overseer_elect/leader
   [junit4]   2> 3090444 INFO  (TEST-TestSolrConfigHandlerCloud.test-seed#[DB131CB3D78F284A]) [n:127.0.0.1:38776_    ] o.a.s.c.Overseer Overseer (id=95414682096697349-127.0.0.1:38776_-n_0000000000) starting
   [junit4]   2> 3090446 INFO  (TEST-TestSolrConfigHandlerCloud.test-seed#[DB131CB3D78F284A]) [n:127.0.0.1:38776_    ] o.a.s.c.c.SolrZkClient makePath: /overseer/queue-work
   [junit4]   2> 3090456 INFO  (TEST-TestSolrConfigHandlerCloud.test-seed#[DB131CB3D78F284A]) [n:127.0.0.1:38776_    ] o.a.s.c.OverseerAutoReplicaFailoverThread Starting OverseerAutoReplicaFailoverThread autoReplicaFailoverWorkLoopDelay=10000 autoReplicaFailoverWaitAfterExpiration=30000 autoReplicaFailoverBadNodeExpiration=60000
   [junit4]   2> 3090456 INFO  (TEST-TestSolrConfigHandlerCloud.test-seed#[DB131CB3D78F284A]) [n:127.0.0.1:38776_    ] o.a.s.c.c.ZkStateReader Updating cluster state from ZooKeeper... 
   [junit4]   2> 3090457 INFO  (OverseerCollectionConfigSetProcessor-95414682096697349-127.0.0.1:38776_-n_0000000000) [n:127.0.0.1:38776_    ] o.a.s.c.OverseerTaskProcessor Process current queue of overseer operations
   [junit4]   2> 3090458 INFO  (OverseerStateUpdate-95414682096697349-127.0.0.1:38776_-n_0000000000) [n:127.0.0.1:38776_    ] o.a.s.c.Overseer Starting to work on the main queue
   [junit4]   2> 3090487 INFO  (TEST-TestSolrConfigHandlerCloud.test-seed#[DB131CB3D78F284A]) [n:127.0.0.1:38776_    ] o.a.s.c.CoreContainer Security conf doesn't exist. Skipping setup for authorization module.
   [junit4]   2> 3090488 INFO  (TEST-TestSolrConfigHandlerCloud.test-seed#[DB131CB3D78F284A]) [n:127.0.0.1:38776_    ] o.a.s.c.CoreContainer No authentication plugin used.
   [junit4]   2> 3090489 INFO  (TEST-TestSolrConfigHandlerCloud.test-seed#[DB131CB3D78F284A]) [n:127.0.0.1:38776_    ] o.a.s.c.CorePropertiesLocator Looking for core definitions underneath /export/home/jenkins/workspace/Lucene-Solr-5.x-Solaris/solr/build/solr-core/test/J0/../../../../../../../../../../export/home/jenkins/workspace/Lucene-Solr-5.x-Solaris/solr/build/solr-core/test/J0/temp/solr.handler.TestSolrConfigHandlerCloud_DB131CB3D78F284A-001/control-001/cores
   [junit4]   2> 3090490 INFO  (TEST-TestSolrConfigHandlerCloud.test-seed#[DB131CB3D78F284A]) [n:127.0.0.1:38776_    ] o.a.s.c.CoreDescriptor Created CoreDescriptor: {shard=, coreNodeName=, transient=false, name=collection1, configSetProperties=configsetprops.json, schema=schema.xml, loadOnStartup=true, collection=control_collection, dataDir=data/, config=solrconfig.xml}
   [junit4]   2> 3090490 INFO  (TEST-TestSolrConfigHandlerCloud.test-seed#[DB131CB3D78F284A]) [n:127.0.0.1:38776_    ] o.a.s.c.CorePropertiesLocator Found core collection1 in /export/home/jenkins/workspace/Lucene-Solr-5.x-Solaris/solr/build/solr-core/test/J0/../../../../../../../../../../export/home/jenkins/workspace/Lucene-Solr-5.x-Solaris/solr/build/solr-core/test/J0/temp/solr.handler.TestSolrConfigHandlerCloud_DB131CB3D78F284A-001/control-001/cores/collection1
   [junit4]   2> 3090490 INFO  (TEST-TestSolrConfigHandlerCloud.test-seed#[DB131CB3D78F284A]) [n:127.0.0.1:38776_    ] o.a.s.c.CorePropertiesLocator Found 1 core definitions
   [junit4]   2> 3090491 INFO  (TEST-TestSolrConfigHandlerCloud.test-seed#[DB131CB3D78F284A]) [n:127.0.0.1:38776_    ] o.a.s.s.SolrDispatchFilter user.dir=/export/home/jenkins/workspace/Lucene-Solr-5.x-Solaris/solr/build/solr-core/test/J0
   [junit4]   2> 3090491 INFO  (TEST-TestSolrConfigHandlerCloud.test-seed#[DB131CB3D78F284A]) [n:127.0.0.1:38776_    ] o.a.s.s.SolrDispatchFilter SolrDispatchFilter.init() done
   [junit4]   2> 3090492 INFO  (coreLoadExecutor-7653-thread-1-processing-n:127.0.0.1:38776_) [n:127.0.0.1:38776_ c:control_collection   x:collection1] o.a.s.c.ZkController publishing state=down
   [junit4]   2> 3090492 INFO  (coreLoadExecutor-7653-thread-1-processing-n:127.0.0.1:38776_) [n:127.0.0.1:38776_ c:control_collection   x:collection1] o.a.s.c.ZkController numShards not found on descriptor - reading it from system property
   [junit4]   2> 3090495 INFO  (OverseerStateUpdate-95414682096697349-127.0.0.1:38776_-n_0000000000) [n:127.0.0.1:38776_    ] o.a.s.c.Overseer processMessage: queueSize: 1, message = {
   [junit4]   2>   "core":"collection1",
   [junit4]   2>   "collection":"control_collection",
   [junit4]   2>   "base_url":"https://127.0.0.1:38776",
   [junit4]   2>   "numShards":"1",
   [junit4]   2>   "roles":null,
   [junit4]   2>   "operation":"state",
   [junit4]   2>   "node_name":"127.0.0.1:38776_",
   [junit4]   2>   "shard":null,
   [junit4]   2>   "state":"down"} current state version: 0
   [junit4]   2> 3090495 INFO  (coreLoadExecutor-7653-thread-1-processing-n:127.0.0.1:38776_) [n:127.0.0.1:38776_ c:control_collection   x:collection1] o.a.s.c.ZkController look for our core node name
   [junit4]   2> 3090496 INFO  (OverseerStateUpdate-95414682096697349-127.0.0.1:38776_-n_0000000000) [n:127.0.0.1:38776_    ] o.a.s.c.o.ReplicaMutator Update state numShards=1 message={
   [junit4]   2>   "core":"collection1",
   [junit4]   2>   "collection":"control_collection",
   [junit4]   2>   "base_url":"https://127.0.0.1:38776",
   [junit4]   2>   "numShards":"1",
   [junit4]   2>   "roles":null,
   [junit4]   2>   "operation":"state",
   [junit4]   2>   "node_name":"127.0.0.1:38776_",
   [junit4]   2>   "shard":null,
   [junit4]   2>   "state":"down"}
   [junit4]   2> 3090497 INFO  (OverseerStateUpdate-95414682096697349-127.0.0.1:38776_-n_0000000000) [n:127.0.0.1:38776_    ] o.a.s.c.o.ClusterStateMutator building a new cName: control_collection
   [junit4]   2> 3090497 INFO  (OverseerStateUpdate-95414682096697349-127.0.0.1:38776_-n_0000000000) [n:127.0.0.1:38776_    ] o.a.s.c.o.ReplicaMutator Assigning new node to shard shard=shard1
   [junit4]   2> 3090499 INFO  (zkCallback-3048-thread-1-processing-n:127.0.0.1:38776_) [n:127.0.0.1:38776_    ] o.a.s.c.c.ZkStateReader A cluster state change: [WatchedEvent state:SyncConnected type:NodeDataChanged path:/clusterstate.json], has occurred - updating... (live nodes size: [1])
   [junit4]   2> 3091497 INFO  (coreLoadExecutor-7653-thread-1-processing-n:127.0.0.1:38776_) [n:127.0.0.1:38776_ c:control_collection   x:collection1] o.a.s.c.ZkController waiting to find shard id in clusterstate for collection1
   [junit4]   2> 3091497 INFO  (coreLoadExecutor-7653-thread-1-processing-n:127.0.0.1:38776_) [n:127.0.0.1:38776_ c:control_collection   x:collection1] o.a.s.c.ZkController Check for collection zkNode:control_collection
   [junit4]   2> 3091497 INFO  (coreLoadExecutor-7653-thread-1-processing-n:127.0.0.1:38776_) [n:127.0.0.1:38776_ c:control_collection   x:collection1] o.a.s.c.ZkController Collection zkNode exists
   [junit4]   2> 3091497 INFO  (coreLoadExecutor-7653-thread-1-processing-n:127.0.0.1:38776_) [n:127.0.0.1:38776_ c:control_collection   x:collection1] o.a.s.c.c.ZkStateReader Load collection config from: [/collections/control_collection]
   [junit4]   2> 3091499 INFO  (coreLoadExecutor-7653-thread-1-processing-n:127.0.0.1:38776_) [n:127.0.0.1:38776_ c:control_collection   x:collection1] o.a.s.c.c.ZkStateReader path=[/collections/control_collection] [configName]=[conf1] specified config exists in ZooKeeper
   [junit4]   2> 3091499 INFO  (coreLoadExecutor-7653-thread-1-processing-n:127.0.0.1:38776_) [n:127.0.0.1:38776_ c:control_collection   x:collection1] o.a.s.c.SolrResourceLoader new SolrResourceLoader for directory: '/export/home/jenkins/workspace/Lucene-Solr-5.x-Solaris/solr/build/solr-core/test/J0/temp/solr.handler.TestSolrConfigHandlerCloud_DB131CB3D78F284A-001/control-001/cores/collection1'
   [junit4]   2> 3091499 INFO  (coreLoadExecutor-7653-thread-1-processing-n:127.0.0.1:38776_) [n:127.0.0.1:38776_ c:control_collection   x:collection1] o.a.s.c.SolrResourceLoader JNDI not configured for solr (NoInitialContextEx)
   [junit4]   2> 3091499 INFO  (coreLoadExecutor-7653-thread-1-processing-n:127.0.0.1:38776_) [n:127.0.0.1:38776_ c:control_collection   x:collection1] o.a.s.c.SolrResourceLoader solr home defaulted to 'solr/' (could not find system property or JNDI)
   [junit4]   2> 3091501 INFO  (coreLoadExecutor-7653-thread-1-processing-n:127.0.0.1:38776_) [n:127.0.0.1:38776_ c:control_collection   x:collection1] o.a.s.c.Config loaded config solrconfig.xml with version 0 
   [junit4]   2> 3091507 INFO  (coreLoadExecutor-7653-thread-1-processing-n:127.0.0.1:38776_) [n:127.0.0.1:38776_ c:control_collection   x:collection1] o.a.s.c.SolrConfig current version of requestparams : -1
   [junit4]   2> 3091521 INFO  (coreLoadExecutor-7653-thread-1-processing-n:127.0.0.1:38776_) [n:127.0.0.1:38776_ c:control_collection   x:collection1] o.a.s.c.SolrConfig Using Lucene MatchVersion: 5.5.0
   [junit4]   2> 3091565 INFO  (coreLoadExecutor-7653-thread-1-processing-n:127.0.0.1:38776_) [n:127.0.0.1:38776_ c:control_collection   x:collection1] o.a.s.c.SolrConfig Loaded SolrConfig: solrconfig.xml
   [junit4]   2> 3091574 INFO  (coreLoadExecutor-7653-thread-1-processing-n:127.0.0.1:38776_) [n:127.0.0.1:38776_ c:control_collection   x:collection1] o.a.s.s.IndexSchema [collection1] Schema name=test
   [junit4]   2> 3091804 INFO  (coreLoadExecutor-7653-thread-1-processing-n:127.0.0.1:38776_) [n:127.0.0.1:38776_ c:control_collection   x:collection1] o.a.s.s.OpenExchangeRatesOrgProvider Initialized with rates=open-exchange-rates.json, refreshInterval=1440.
   [junit4]   2> 3091811 INFO  (coreLoadExecutor-7653-thread-1-processing-n:127.0.0.1:38776_) [n:127.0.0.1:38776_ c:control_collection   x:collection1] o.a.s.s.IndexSchema default search field in schema is text
   [junit4]   2> 3091813 INFO  (coreLoadExecutor-7653-thread-1-processing-n:127.0.0.1:38776_) [n:127.0.0.1:38776_ c:control_collection   x:collection1] o.a.s.s.IndexSchema unique key field: id
   [junit4]   2> 3091825 INFO  (coreLoadExecutor-7653-thread-1-processing-n:127.0.0.1:38776_) [n:127.0.0.1:38776_ c:control_collection   x:collection1] o.a.s.s.FileExchangeRateProvider Reloading exchange rates from file currency.xml
   [junit4]   2> 3091828 INFO  (coreLoadExecutor-7653-thread-1-processing-n:127.0.0.1:38776_) [n:127.0.0.1:38776_ c:control_collection   x:collection1] o.a.s.s.FileExchangeRateProvider Reloading exchange rates from file currency.xml
   [junit4]   2> 3091832 INFO  (coreLoadExecutor-7653-thread-1-processing-n:127.0.0.1:38776_) [n:127.0.0.1:38776_ c:control_collection   x:collection1] o.a.s.s.OpenExchangeRatesOrgProvider Reloading exchange rates from open-exchange-rates.json
   [junit4]   2> 3091833 INFO  (coreLoadExecutor-7653-thread-1-processing-n:127.0.0.1:38776_) [n:127.0.0.1:38776_ c:control_collection   x:collection1] o.a.s.s.OpenExchangeRatesOrgProvider Reloading exchange rates from open-exchange-rates.json
   [junit4]   2> 3091835 INFO  (coreLoadExecutor-7653-thread-1-processing-n:127.0.0.1:38776_) [n:127.0.0.1:38776_ c:control_collection   x:collection1] o.a.s.c.ConfigSetProperties Did not find ConfigSet properties, assuming default properties: Can't find resource 'configsetprops.json' in classpath or '/configs/conf1', cwd=/export/home/jenkins/workspace/Lucene-Solr-5.x-Solaris/solr/build/solr-core/test/J0
   [junit4]   2> 3091835 INFO  (coreLoadExecutor-7653-thread-1-processing-n:127.0.0.1:38776_) [n:127.0.0.1:38776_ c:control_collection   x:collection1] o.a.s.c.CoreContainer Creating SolrCore 'collection1' using configuration from collection control_collection
   [junit4]   2> 3091835 INFO  (coreLoadExecutor-7653-thread-1-processing-n:127.0.0.1:38776_) [n:127.0.0.1:38776_ c:control_collection s:shard1 r:core_node1 x:collection1] o.a.s.c.SolrCore org.apache.solr.core.MockDirectoryFactory
   [junit4]   2> 3091835 INFO  (coreLoadExecutor-7653-thread-1-processing-n:127.0.0.1:38776_) [n:127.0.0.1:38776_ c:control_collection s:shard1 r:core_node1 x:collection1] o.a.s.c.SolrCore [[collection1] ] Opening new SolrCore at [/export/home/jenkins/workspace/Lucene-Solr-5.x-Solaris/solr/build/solr-core/test/J0/temp/solr.handler.TestSolrConfigHandlerCloud_DB131CB3D78F284A-001/control-001/cores/collection1], dataDir=[/export/home/jenkins/workspace/Lucene-Solr-5.x-Solaris/solr/build/solr-core/test/J0/../../../../../../../../../../export/home/jenkins/workspace/Lucene-Solr-5.x-Solaris/solr/build/solr-core/test/J0/temp/solr.handler.TestSolrConfigHandlerCloud_DB131CB3D78F284A-001/control-001/cores/collection1/data/]
   [junit4]   2> 3091835 INFO  (coreLoadExecutor-7653-thread-1-processing-n:127.0.0.1:38776_) [n:127.0.0.1:38776_ c:control_collection s:shard1 r:core_node1 x:collection1] o.a.s.c.JmxMonitoredMap JMX monitoring is enabled. Adding Solr mbeans to JMX Server: com.sun.jmx.mbeanserver.JmxMBeanServer@6bfe8c5b
   [junit4]   2> 3091836 INFO  (coreLoadExecutor-7653-thread-1-processing-n:127.0.0.1:38776_) [n:127.0.0.1:38776_ c:control_collection s:shard1 r:core_node1 x:collection1] o.a.s.c.CachingDirectoryFactory return new directory for /export/home/jenkins/workspace/Lucene-Solr-5.x-Solaris/solr/build/solr-core/test/J0/../../../../../../../../../../export/home/jenkins/workspace/Lucene-Solr-5.x-Solaris/solr/build/solr-core/test/J0/temp/solr.handler.TestSolrConfigHandlerCloud_DB131CB3D78F284A-001/control-001/cores/collection1/data
   [junit4]   2> 3091836 INFO  (coreLoadExecutor-7653-thread-1-processing-n:127.0.0.1:38776_) [n:127.0.0.1:38776_ c:control_collection s:shard1 r:core_node1 x:collection1] o.a.s.c.SolrCore New index directory detected: old=null new=/export/home/jenkins/workspace/Lucene-Solr-5.x-Solaris/solr/build/solr-core/test/J0/../../../../../../../../../../export/home/jenkins/workspace/Lucene-Solr-5.x-Solaris/solr/build/solr-core/test/J0/temp/solr.handler.TestSolrConfigHandlerCloud_DB131CB3D78F284A-001/control-001/cores/collection1/data/index/
   [junit4]   2> 3091836 WARN  (coreLoadExecutor-7653-thread-1-processing-n:127.0.0.1:38776_) [n:127.0.0.1:38776_ c:control_collection s:shard1 r:core_node1 x:collection1] o.a.s.c.SolrCore [collection1] Solr index directory '/export/home/jenkins/workspace/Lucene-Solr-5.x-Solaris/solr/build/solr-core/test/J0/../../../../../../../../../../export/home/jenkins/workspace/Lucene-Solr-5.x-Solaris/solr/build/solr-core/test/J0/temp/solr.handler.TestSolrConfigHandlerCloud_DB131CB3D78F284A-001/control-001/cores/collection1/data/index' doesn't exist. Creating new index...
   [junit4]   2> 3091836 INFO  (coreLoadExecutor-7653-thread-1-processing-n:127.0.0.1:38776_) [n:127.0.0.1:38776_ c:control_collection s:shard1 r:core_node1 x:collection1] o.a.s.c.CachingDirectoryFactory return new directory for /export/home/jenkins/workspace/Lucene-Solr-5.x-Solaris/solr/build/solr-core/test/J0/../../../../../../../../../../export/home/jenkins/workspace/Lucene-Solr-5.x-Solaris/solr/build/solr-core/test/J0/temp/solr.handler.TestSolrConfigHandlerCloud_DB131CB3D78F284A-001/control-001/cores/collection1/data/index
   [junit4]   2> 3091836 INFO  (coreLoadExecutor-7653-thread-1-processing-n:127.0.0.1:38776_) [n:127.0.0.1:38776_ c:control_collection s:shard1 r:core_node1 x:collection1] o.a.s.u.RandomMergePolicy RandomMergePolicy wrapping class org.apache.lucene.index.LogDocMergePolicy: [LogDocMergePolicy: minMergeSize=1000, mergeFactor=17, maxMergeSize=9223372036854775807, maxMergeSizeForForcedMerge=9223372036854775807, calibrateSizeByDeletes=true, maxMergeDocs=2147483647, maxCFSSegmentSizeMB=8.796093022207999E12, noCFSRatio=1.0]
   [junit4]   2> 3091837 INFO  (coreLoadExecutor-7653-thread-1-processing-n:127.0.0.1:38776_) [n:127.0.0.1:38776_ c:control_collection s:shard1 r:core_node1 x:collection1] o.a.s.c.SolrDeletionPolicy SolrDeletionPolicy.onCommit: commits: num=1
   [junit4]   2> 	commit{dir=MockDirectoryWrapper(RAMDirectory@1d3af3c4 lockFactory=org.apache.lucene.store.SingleInstanceLockFactory@959d7da),segFN=segments_1,generation=1}
   [junit4]   2> 3091837 INFO  (coreLoadExecutor-7653-thread-1-processing-n:127.0.0.1:38776_) [n:127.0.0.1:38776_ c:control_collection s:shard1 r:core_node1 x:collection1] o.a.s.c.SolrDeletionPolicy newest commit generation = 1
   [junit4]   2> 3091837 INFO  (OldIndexDirectoryCleanupThreadForCore-collection1) [n:127.0.0.1:38776_ c:control_collection s:shard1 r:core_node1 x:collection1] o.a.s.c.SolrCore Looking for old index directories to cleanup for core collection1 in /export/home/jenkins/workspace/Lucene-Solr-5.x-Solaris/solr/build/solr-core/test/J0/../../../../../../../../../../export/home/jenkins/workspace/Lucene-Solr-5.x-Solaris/solr/build/solr-core/test/J0/temp/solr.handler.TestSolrConfigHandlerCloud_DB131CB3D78F284A-001/control-001/cores/collection1/data/
   [junit4]   2> 3091837 WARN  (OldIndexDirectoryCleanupThreadForCore-collection1) [n:127.0.0.1:38776_ c:control_collection s:shard1 r:core_node1 x:collection1] o.a.s.c.DirectoryFactory /export/home/jenkins/workspace/Lucene-Solr-5.x-Solaris/solr/build/solr-core/test/J0/../../../../../../../../../../export/home/jenkins/workspace/Lucene-Solr-5.x-Solaris/solr/build/solr-core/test/J0/temp/solr.handler.TestSolrConfigHandlerCloud_DB131CB3D78F284A-001/control-001/cores/collection1/data/ does not point to a valid data directory; skipping clean-up of old index directories.
   [junit4]   2> 3091840 INFO  (coreLoadExecutor-7653-thread-1-processing-n:127.0.0.1:38776_) [n:127.0.0.1:38776_ c:control_collection s:shard1 r:core_node1 x:collection1] o.a.s.u.p.UpdateRequestProcessorChain creating updateRequestProcessorChain "nodistrib"
   [junit4]   2> 3091840 INFO  (coreLoadExecutor-7653-thread-1-processing-n:127.0.0.1:38776_) [n:127.0.0.1:38776_ c:control_collection s:shard1 r:core_node1 x:collection1] o.a.s.u.p.UpdateRequestProcessorChain creating updateRequestProcessorChain "dedupe"
   [junit4]   2> 3091840 INFO  (coreLoadExecutor-7653-thread-1-processing-n:127.0.0.1:38776_) [n:127.0.0.1:38776_ c:control_collection s:shard1 r:core_node1 x:collection1] o.a.s.u.p.UpdateRequestProcessorChain inserting DistributedUpdateProcessorFactory into updateRequestProcessorChain "dedupe"
   [junit4]   2> 3091840 INFO  (coreLoadExecutor-7653-thread-1-processing-n:127.0.0.1:38776_) [n:127.0.0.1:38776_ c:control_collection s:shard1 r:core_node1 x:collection1] o.a.s.u.p.UpdateRequestProcessorChain creating updateRequestProcessorChain "stored_sig"
   [junit4]   2> 3091840 INFO  (coreLoadExecutor-7653-thread-1-processing-n:127.0.0.1:38776_) [n:127.0.0.1:38776_ c:control_collection s:shard1 r:core_node1 x:collection1] o.a.s.u.p.UpdateRequestProcessorChain inserting DistributedUpdateProcessorFactory into updateRequestProcessorChain "stored_sig"
   [junit4]   2> 3091840 INFO  (coreLoadExecutor-7653-thread-1-processing-n:127.0.0.1:38776_) [n:127.0.0.1:38776_ c:control_collection s:shard1 r:core_node1 x:collection1] o.a.s.u.p.UpdateRequestProcessorChain creating updateRequestProcessorChain "distrib-dup-test-chain-explicit"
   [junit4]   2> 3091841 INFO  (coreLoadExecutor-7653-thread-1-processing-n:127.0.0.1:38776_) [n:127.0.0.1:38776_ c:control_collection s:shard1 r:core_node1 x:collection1] o.a.s.u.p.UpdateRequestProcessorChain creating updateRequestProcessorChain "distrib-dup-test-chain-implicit"
   [junit4]   2> 3091841 INFO  (coreLoadExecutor-7653-thread-1-processing-n:127.0.0.1:38776_) [n:127.0.0.1:38776_ c:control_collection s:shard1 r:core_node1 x:collection1] o.a.s.u.p.UpdateRequestProcessorChain inserting DistributedUpdateProcessorFactory into updateRequestProcessorChain "distrib-dup-test-chain-implicit"
   [junit4]   2> 3091841 INFO  (coreLoadExecutor-7653-thread-1-processing-n:127.0.0.1:38776_) [n:127.0.0.1:38776_ c:control_collection s:shard1 r:core_node1 x:collection1] o.a.s.c.SolrCore no updateRequestProcessorChain defined as default, creating implicit default
   [junit4]   2> 3091841 WARN  (coreLoadExecutor-7653-thread-1-processing-n:127.0.0.1:38776_) [n:127.0.0.1:38776_ c:control_collection s:shard1 r:core_node1 x:collection1] o.a.s.c.RequestHandlers INVALID paramSet a in requestHandler {type = requestHandler,name = /dump,class = DumpRequestHandler,args = {defaults={a=A,b=B}}}
   [junit4]   2> 3091843 INFO  (coreLoadExecutor-7653-thread-1-processing-n:127.0.0.1:38776_) [n:127.0.0.1:38776_ c:control_collection s:shard1 r:core_node1 x:collection1] o.a.s.h.l.XMLLoader xsltCacheLifetimeSeconds=60
   [junit4]   2> 3091845 INFO  (coreLoadExecutor-7653-thread-1-processing-n:127.0.0.1:38776_) [n:127.0.0.1:38776_ c:control_collection s:shard1 r:core_node1 x:collection1] o.a.s.h.l.XMLLoader xsltCacheLifetimeSeconds=60
   [junit4]   2> 3091846 INFO  (coreLoadExecutor-7653-thread-1-processing-n:127.0.0.1:38776_) [n:127.0.0.1:38776_ c:control_collection s:shard1 r:core_node1 x:collection1] o.a.s.h.l.XMLLoader xsltCacheLifetimeSeconds=60
   [junit4]   2> 3091847 INFO  (coreLoadExecutor-7653-thread-1-processing-n:127.0.0.1:38776_) [n:127.0.0.1:38776_ c:control_collection s:shard1 r:core_node1 x:collection1] o.a.s.h.l.XMLLoader xsltCacheLifetimeSeconds=60
   [junit4]   2> 3091851 INFO  (coreLoadExecutor-7653-thread-1-processing-n:127.0.0.1:38776_) [n:127.0.0.1:38776_ c:control_collection s:shard1 r:core_node1 x:collection1] o.a.s.c.RequestHandlers Registered paths: /admin/logging,/update/json,/get,/update/csv,/admin/threads,/schema,/admin/segments,/admin/file,/admin/plugins,/config,/update,/admin/system,standard,/replication,/admin/properties,/update/json/docs,/admin/mbeans,/admin/luke,/admin/ping,/dump
   [junit4]   2> 3091852 INFO  (coreLoadExecutor-7653-thread-1-processing-n:127.0.0.1:38776_) [n:127.0.0.1:38776_ c:control_collection s:shard1 r:core_node1 x:collection1] o.a.s.c.SolrCore Using default statsCache cache: org.apache.solr.search.stats.LocalStatsCache
   [junit4]   2> 3091853 INFO  (coreLoadExecutor-7653-thread-1-processing-n:127.0.0.1:38776_) [n:127.0.0.1:38776_ c:control_collection s:shard1 r:core_node1 x:collection1] o.a.s.u.UpdateHandler Using UpdateLog implementation: org.apache.solr.update.UpdateLog
   [junit4]   2> 3091853 INFO  (coreLoadExecutor-7653-thread-1-processing-n:127.0.0.1:38776_) [n:127.0.0.1:38776_ c:control_collection s:shard1 r:core_node1 x:collection1] o.a.s.u.UpdateLog Initializing UpdateLog: dataDir= defaultSyncLevel=FLUSH numRecordsToKeep=100 maxNumLogsToKeep=10 numVersionBuckets=65536
   [junit4]   2> 3091854 INFO  (coreLoadExecutor-7653-thread-1-processing-n:127.0.0.1:38776_) [n:127.0.0.1:38776_ c:control_collection s:shard1 r:core_node1 x:collection1] o.a.s.u.CommitTracker Hard AutoCommit: disabled
   [junit4]   2> 3091854 INFO  (coreLoadExecutor-7653-thread-1-processing-n:127.0.0.1:38776_) [n:127.0.0.1:38776_ c:control_collection s:shard1 r:core_node1 x:collection1] o.a.s.u.CommitTracker Soft AutoCommit: disabled
   [junit4]   2> 3091854 INFO  (coreLoadExecutor-7653-thread-1-processing-n:127.0.0.1:38776_) [n:127.0.0.1:38776_ c:control_collection s:shard1 r:core_node1 x:collection1] o.a.s.u.RandomMergePolicy RandomMergePolicy wrapping class org.apache.lucene.index.TieredMergePolicy: [TieredMergePolicy: maxMergeAtOnce=47, maxMergeAtOnceExplicit=41, maxMergedSegmentMB=69.5546875, floorSegmentMB=2.138671875, forceMergeDeletesPctAllowed=24.961170675296707, segmentsPerTier=27.0, maxCFSSegmentSizeMB=8.796093022207999E12, noCFSRatio=0.617940913382769
   [junit4]   2> 3091854 INFO  (coreLoadExecutor-7653-thread-1-processing-n:127.0.0.1:38776_) [n:127.0.0.1:38776_ c:control_collection s:shard1 r:core_node1 x:collection1] o.a.s.c.SolrDeletionPolicy SolrDeletionPolicy.onInit: commits: num=1
   [junit4]   2> 	commit{dir=MockDirectoryWrapper(RAMDirectory@1d3af3c4 lockFactory=org.apache.lucene.store.SingleInstanceLockFactory@959d7da),segFN=segments_1,generation=1}
   [junit4]   2> 3091854 INFO  (coreLoadExecutor-7653-thread-1-processing-n:127.0.0.1:38776_) [n:127.0.0.1:38776_ c:control_collection s:shard1 r:core_node1 x:collection1] o.a.s.c.SolrDeletionPolicy newest commit generation = 1
   [junit4]   2> 3091855 INFO  (coreLoadExecutor-7653-thread-1-processing-n:127.0.0.1:38776_) [n:127.0.0.1:38776_ c:control_collection s:shard1 r:core_node1 x:collection1] o.a.s.s.SolrIndexSearcher Opening Searcher@3b94000c[collection1] main
   [junit4]   2> 3091855 INFO  (coreLoadExecutor-7653-thread-1-processing-n:127.0.0.1:38776_) [n:127.0.0.1:38776_ c:control_collection s:shard1 r:core_node1 x:collection1] o.a.s.c.c.ZkStateReader Load collection config from: [/collections/control_collection]
   [junit4]   2> 3091856 INFO  (coreLoadExecutor-7653-thread-1-processing-n:127.0.0.1:38776_) [n:127.0.0.1:38776_ c:control_collection s:shard1 r:core_node1 x:collection1] o.a.s.c.c.ZkStateReader path=[/collections/control_collection] [configName]=[conf1] specified config exists in ZooKeeper
   [junit4]   2> 3091856 INFO  (coreLoadExecutor-7653-thread-1-processing-n:127.0.0.1:38776_) [n:127.0.0.1:38776_ c:control_collection s:shard1 r:core_node1 x:collection1] o.a.s.r.ManagedResourceStorage Setting up ZooKeeper-based storage for the RestManager with znodeBase: /configs/conf1
   [junit4]   2> 3091857 INFO  (coreLoadExecutor-7653-thread-1-processing-n:127.0.0.1:38776_) [n:127.0.0.1:38776_ c:control_collection s:shard1 r:core_node1 x:collection1] o.a.s.r.ManagedResourceStorage Configured ZooKeeperStorageIO with znodeBase: /configs/conf1
   [junit4]   2> 3091857 INFO  (coreLoadExecutor-7653-thread-1-processing-n:127.0.0.1:38776_) [n:127.0.0.1:38776_ c:control_collection s:shard1 r:core_node1 x:collection1] o.a.s.r.RestManager Initializing RestManager with initArgs: {}
   [junit4]   2> 3091857 INFO  (coreLoadExecutor-7653-thread-1-processing-n:127.0.0.1:38776_) [n:127.0.0.1:38776_ c:control_collection s:shard1 r:core_node1 x:collection1] o.a.s.r.ManagedResourceStorage Reading _rest_managed.json using ZooKeeperStorageIO:path=/configs/conf1
   [junit4]   2> 3091857 INFO  (coreLoadExecutor-7653-thread-1-processing-n:127.0.0.1:38776_) [n:127.0.0.1:38776_ c:control_collection s:shard1 r:core_node1 x:collection1] o.a.s.r.ManagedResourceStorage No data found for znode /configs/conf1/_rest_managed.json
   [junit4]   2> 3091857 INFO  (coreLoadExecutor-7653-thread-1-processing-n:127.0.0.1:38776_) [n:127.0.0.1:38776_ c:control_collection s:shard1 r:core_node1 x:collection1] o.a.s.r.ManagedResourceStorage Loaded null at path _rest_managed.json using ZooKeeperStorageIO:path=/configs/conf1
   [junit4]   2> 3091857 INFO  (coreLoadExecutor-7653-thread-1-processing-n:127.0.0.1:38776_) [n:127.0.0.1:38776_ c:control_collection s:shard1 r:core_node1 x:collection1] o.a.s.r.RestManager Initializing 0 registered ManagedResources
   [junit4]   2> 3091857 INFO  (coreLoadExecutor-7653-thread-1-processing-n:127.0.0.1:38776_) [n:127.0.0.1:38776_ c:control_collection s:shard1 r:core_node1 x:collection1] o.a.s.h.ReplicationHandler Commits will be reserved for  10000
   [junit4]   2> 3091858 INFO  (searcherExecutor-7654-thread-1-processing-x:collection1 c:control_collection r:core_node1 n:127.0.0.1:38776_ s:shard1) [n:127.0.0.1:38776_ c:control_collection s:shard1 r:core_node1 x:collection1] o.a.s.c.SolrCore [collection1] Registered new searcher Searcher@3b94000c[collection1] main{ExitableDirectoryReader(UninvertingDirectoryReader())}
   [junit4]   2> 3091858 INFO  (coreLoadExecutor-7653-thread-1-processing-n:127.0.0.1:38776_) [n:127.0.0.1:38776_ c:control_collection s:shard1 r:core_node1 x:collection1] o.a.s.u.UpdateLog Looking up max value of version field to seed version buckets
   [junit4]   2> 3091858 INFO  (coreLoadExecutor-7653-thread-1-processing-n:127.0.0.1:38776_) [n:127.0.0.1:38776_ c:control_collection s:shard1 r:core_node1 x:collection1] o.a.s.u.VersionInfo Refreshing highest value of _version_ for 65536 version buckets from index
   [junit4]   2> 3091858 INFO  (coreLoadExecutor-7653-thread-1-processing-n:127.0.0.1:38776_) [n:127.0.0.1:38776_ c:control_collection s:shard1 r:core_node1 x:collection1] o.a.s.u.VersionInfo No terms found for _version_, cannot seed version bucket highest value from index
   [junit4]   2> 3091858 INFO  (coreLoadExecutor-7653-thread-1-processing-n:127.0.0.1:38776_) [n:127.0.0.1:38776_ c:control_collection s:shard1 r:core_node1 x:collection1] o.a.s.u.UpdateLog Could not find max version in index or recent updates, using new clock 1526634915403137024
   [junit4]   2> 3091860 INFO  (coreLoadExecutor-7653-thread-1-processing-n:127.0.0.1:38776_) [n:127.0.0.1:38776_ c:control_collection s:shard1 r:core_node1 x:collection1] o.a.s.u.UpdateLog Took 1.0ms to seed version buckets with highest version 1526634915403137024
   [junit4]   2> 3091861 INFO  (coreLoadExecutor-7653-thread-1-processing-n:127.0.0.1:38776_) [n:127.0.0.1:38776_ c:control_collection s:shard1 r:core_node1 x:collection1] o.a.s.c.ZkController watch zkdir /configs/conf1
   [junit4]   2> 3091862 INFO  (coreLoadExecutor-7653-thread-1-processing-n:127.0.0.1:38776_) [n:127.0.0.1:38776_ c:control_collection s:shard1 r:core_node1 x:collection1] o.a.s.c.CoreContainer registering core: collection1
   [junit4]   2> 3091862 INFO  (coreZkRegister-7647-thread-1-processing-x:collection1 c:control_collection r:core_node1 n:127.0.0.1:38776_ s:shard1) [n:127.0.0.1:38776_ c:control_collection s:shard1 r:core_node1 x:collection1] o.a.s.c.ZkController Register replica - core:collection1 address:https://127.0.0.1:38776 collection:control_collection shard:shard1
   [junit4]   2> 3091863 INFO  (coreZkRegister-7647-thread-1-processing-x:collection1 c:control_collection r:core_node1 n:127.0.0.1:38776_ s:shard1) [n:127.0.0.1:38776_ c:control_collection s:shard1 r:core_node1 x:collection1] o.a.s.c.c.SolrZkClient makePath: /collections/control_collection/leader_elect/shard1/election
   [junit4]   2> 3091868 INFO  (coreZkRegister-7647-thread-1-processing-x:collection1 c:control_collection r:core_node1 n:127.0.0.1:38776_ s:shard1) [n:127.0.0.1:38776_ c:control_collection s:shard1 r:core_node1 x:collection1] o.a.s.c.LeaderElector Joined leadership election with path: /collections/control_collection/leader_elect/shard1/election/95414682096697349-core_node1-n_0000000000
   [junit4]   2> 3091869 INFO  (coreZkRegister-7647-thread-1-processing-x:collection1 c:control_collection r:core_node1 n:127.0.0.1:38776_ s:shard1) [n:127.0.0.1:38776_ c:control_collection s:shard1 r:core_node1 x:collection1] o.a.s.c.ShardLeaderElectionContext Running the leader process for shard=shard1 and weAreReplacement=false and leaderVoteWait=10000
   [junit4]   2> 3091871 INFO  (coreZkRegister-7647-thread-1-processing-x:collection1 c:control_collection r:core_node1 n:127.0.0.1:38776_ s:shard1) [n:127.0.0.1:38776_ c:control_collection s:shard1 r:core_node1 x:collection1] o.a.s.c.ShardLeaderElectionContext Enough replicas found to continue.
   [junit4]   2> 3091871 INFO  (coreZkRegister-7647-thread-1-processing-x:collection1 c:control_collection r:core_node1 n:127.0.0.1:38776_ s:shard1) [n:127.0.0.1:38776_ c:control_collection s:shard1 r:core_node1 x:collection1] o.a.s.c.ShardLeaderElectionContext I may be the new leader - try and sync
   [junit4]   2> 3091871 INFO  (coreZkRegister-7647-thread-1-processing-x:collection1 c:control_collection r:core_node1 n:127.0.0.1:38776_ s:shard1) [n:127.0.0.1:38776_ c:control_collection s:shard1 r:core_node1 x:collection1] o.a.s.c.SyncStrategy Sync replicas to https://127.0.0.1:38776/collection1/
   [junit4]   2> 3091871 INFO  (coreZkRegister-7647-thread-1-processing-x:collection1 c:control_collection r:core_node1 n:127.0.0.1:38776_ s:shard1) [n:127.0.0.1:38776_ c:control_collection s:shard1 r:core_node1 x:collection1] o.a.s.c.SyncStrategy Sync Success - now sync replicas to me
   [junit4]   2> 3091871 INFO  (OverseerStateUpdate-95414682096697349-127.0.0.1:38776_-n_0000000000) [n:127.0.0.1:38776_    ] o.a.s.c.Overseer processMessage: queueSize: 1, message = {
   [junit4]   2>   "operation":"leader",
   [junit4]   2>   "shard":"shard1",
   [junit4]   2>   "collection":"control_collection"} current state version: 1
   [junit4]   2> 3091871 INFO  (coreZkRegister-7647-thread-1-processing-x:collection1 c:control_collection r:core_node1 n:127.0.0.1:38776_ s:shard1) [n:127.0.0.1:38776_ c:control_collection s:shard1 r:core_node1 x:collection1] o.a.s.c.SyncStrategy https://127.0.0.1:38776/collection1/ has no replicas
   [junit4]   2> 3091873 INFO  (coreZkRegister-7647-thread-1-processing-x:collection1 c:control_collection r:core_node1 n:127.0.0.1:38776_ s:shard1) [n:127.0.0.1:38776_ c:control_collection s:shard1 r:core_node1 x:collection1] o.a.s.c.c.SolrZkClient makePath: /collections/control_collection/leaders/shard1
   [junit4]   2> 3091877 INFO  (coreZkRegister-7647-thread-1-processing-x:collection1 c:control_collection r:core_node1 n:127.0.0.1:38776_ s:shard1) [n:127.0.0.1:38776_ c:control_collection s:shard1 r:core_node1 x:collection1] o.a.s.c.ShardLeaderElectionContextBase Creating leader registration node
   [junit4]   2> 3091879 INFO  (coreZkRegister-7647-thread-1-processing-x:collection1 c:control_collection r:core_node1 n:127.0.0.1:38776_ s:shard1) [n:127.0.0.1:38776_ c:control_collection s:shard1 r:core_node1 x:collection1] o.a.s.c.ShardLeaderElectionContext I am the new leader: https://127.0.0.1:38776/collection1/ shard1
   [junit4]   2> 3091880 INFO  (OverseerStateUpdate-95414682096697349-127.0.0.1:38776_-n_0000000000) [n:127.0.0.1:38776_    ] o.a.s.c.Overseer processMessage: queueSize: 1, message = {
   [junit4]   2>   "operation":"leader",
   [junit4]   2>   "shard":"shard1",
   [junit4]   2>   "collection":"control_collection",
   [junit4]   2>   "base_url":"https://127.0.0.1:38776",
   [junit4]   2>   "core":"collection1",
   [junit4]   2>   "state":"active"} current state version: 1
   [junit4]   2> 3091988 INFO  (zkCallback-3048-thread-1-processing-n:127.0.0.1:38776_) [n:127.0.0.1:38776_    ] o.a.s.c.c.ZkStateReader A cluster state change: [WatchedEvent state:SyncConnected type:NodeDataChanged path:/clusterstate.json], has occurred - updating... (live nodes size: [1])
   [junit4]   2> 3091999 INFO  (TEST-TestSolrConfigHandlerCloud.test-seed#[DB131CB3D78F284A]) [    ] o.a.s.c.c.SolrZkClient Using default ZkCredentialsProvider
   [junit4]   2> 3091999 INFO  (TEST-TestSolrConfigHandlerCloud.test-seed#[DB131CB3D78F284A]) [    ] o.a.s.c.c.ConnectionManager Waiting for client to connect to ZooKeeper
   [junit4]   2> 3092002 INFO  (zkCallback-3050-thread-1) [    ] o.a.s.c.c.ConnectionManager Watcher org.apache.solr.common.cloud.ConnectionManager@1063a640 name:ZooKeeperConnection Watcher:127.0.0.1:58745/solr got event WatchedEvent state:SyncConnected type:None path:null path:null type:None
   [junit4]   2> 3092002 INFO  (TEST-TestSolrConfigHandlerCloud.test-seed#[DB131CB3D78F284A]) [    ] o.a.s.c.c.ConnectionManager Client is connected to ZooKeeper
   [junit4]   2> 3092002 INFO  (TEST-TestSolrConfigHandlerCloud.test-seed#[DB131CB3D78F284A]) [    ] o.a.s.c.c.SolrZkClient Using default ZkACLProvider
   [junit4]   2> 3092002 INFO  (TEST-TestSolrConfigHandlerCloud.test-seed#[DB131CB3D78F284A]) [    ] o.a.s.c.c.ZkStateReader Updating cluster state from ZooKeeper... 
   [junit4]   2> 3092006 INFO  (TEST-TestSolrConfigHandlerCloud.test-seed#[DB131CB3D78F284A]) [    ] o.a.s.c.ChaosMonkey monkey: init - expire sessions:false cause connection loss:false
   [junit4]   2> 3092006 INFO  (TEST-TestSolrConfigHandlerCloud.test-seed#[DB131CB3D78F284A]) [    ] o.a.s.c.AbstractFullDistribZkTestBase Creating collection1 with stateFormat=2
   [junit4]   2> 3092006 INFO  (TEST-TestSolrConfigHandlerCloud.test-seed#[DB131CB3D78F284A]) [    ] o.a.s.c.c.SolrZkClient Using default ZkCredentialsProvider
   [junit4]   2> 3092006 INFO  (TEST-TestSolrConfigHandlerCloud.test-seed#[DB131CB3D78F284A]) [    ] o.a.s.c.c.ConnectionManager Waiting for client to connect to ZooKeeper
   [junit4]   2> 3092009 INFO  (zkCallback-3051-thread-1) [    ] o.a.s.c.c.ConnectionManager Watcher org.apache.solr.common.cloud.ConnectionManager@1df81813 name:ZooKeeperConnection Watcher:127.0.0.1:58745/solr got event WatchedEvent state:SyncConnected type:None path:null path:null type:None
   [junit4]   2> 3092009 INFO  (TEST-TestSolrConfigHandlerCloud.test-seed#[DB131CB3D78F284A]) [    ] o.a.s.c.c.ConnectionManager Client is connected to ZooKeeper
   [junit4]   2> 3092009 INFO  (TEST-TestSolrConfigHandlerCloud.test-seed#[DB131CB3D78F284A]) [    ] o.a.s.c.c.SolrZkClient Using default ZkACLProvider
   [junit4]   2> 3092012 WARN  (NIOServerCxn.Factory:0.0.0.0/0.0.0.0:0) [    ] o.a.z.s.NIOServerCnxn caught end of stream exception
   [junit4]   2> EndOfStreamException: Unable to read additional data from client sessionid 0x152fb25d8bb0007, likely client has closed socket
   [junit4]   2> 	at org.apache.zookeeper.server.NIOServerCnxn.doIO(NIOServerCnxn.java:228)
   [junit4]   2> 	at org.apache.zookeeper.server.NIOServerCnxnFactory.run(NIOServerCnxnFactory.java:208)
   [junit4]   2> 	at java.lang.Thread.run(Thread.java:745)
   [junit4]   2> 3092013 INFO  (OverseerStateUpdate-95414682096697349-127.0.0.1:38776_-n_0000000000) [n:127.0.0.1:38776_    ] o.a.s.c.Overseer processMessage: queueSize: 1, message = {
   [junit4]   2>   "operation":"create",
   [junit4]   2>   "name":"collection1",
   [junit4]   2>   "numShards":"2",
   [junit4]   2>   "stateFormat":"2"} current state version: 2
   [junit4]   2> 3092013 INFO  (OverseerStateUpdate-95414682096697349-127.0.0.1:38776_-n_0000000000) [n:127.0.0.1:38776_    ] o.a.s.c.o.ClusterStateMutator building a new cName: collection1
   [junit4]   2> 3092038 INFO  (coreZkRegister-7647-thread-1-processing-x:collection1 c:control_collection r:core_node1 n:127.0.0.1:38776_ s:shard1) [n:127.0.0.1:38776_ c:control_collection s:shard1 r:core_node1 x:collection1] o.a.s.c.ZkController We are https://127.0.0.1:38776/collection1/ and leader is https://127.0.0.1:38776/collection1/
   [junit4]   2> 3092038 INFO  (coreZkRegister-7647-thread-1-processing-x:collection1 c:control_collection r:core_node1 n:127.0.0.1:38776_ s:shard1) [n:127.0.0.1:38776_ c:control_collection s:shard1 r:core_node1 x:collection1] o.a.s.c.ZkController No LogReplay needed for core=collection1 baseURL=https://127.0.0.1:38776
   [junit4]   2> 3092038 INFO  (coreZkRegister-7647-thread-1-processing-x:collection1 c:control_collection r:core_node1 n:127.0.0.1:38776_ s:shard1) [n:127.0.0.1:38776_ c:control_collection s:shard1 r:core_node1 x:collection1] o.a.s.c.ZkController I am the leader, no recovery necessary
   [junit4]   2> 3092038 INFO  (coreZkRegister-7647-thread-1-processing-x:collection1 c:control_collection r:core_node1 n:127.0.0.1:38776_ s:shard1) [n:127.0.0.1:38776_ c:control_collection s:shard1 r:core_node1 x:collection1] o.a.s.c.ZkController publishing state=active
   [junit4]   2> 3092038 INFO  (coreZkRegister-7647-thread-1-processing-x:collection1 c:control_collection r:core_node1 n:127.0.0.1:38776_ s:shard1) [n:127.0.0.1:38776_ c:control_collection s:shard1 r:core_node1 x:collection1] o.a.s.c.ZkController numShards not found on descriptor - reading it from system property
   [junit4]   2> 3092041 INFO  (OverseerStateUpdate-95414682096697349-127.0.0.1:38776_-n_0000000000) [n:127.0.0.1:38776_    ] o.a.s.c.Overseer processMessage: queueSize: 1, message = {
   [junit4]   2>   "core":"collection1",
   [junit4]   2>   "collection":"control_collection",
   [junit4]   2>   "base_url":"https://127.0.0.1:38776",
   [junit4]   2>   "numShards":"2",
   [junit4]   2>   "roles":null,
   [junit4]   2>   "operation":"state",
   [junit4]   2>   "core_node_name":"core_node1",
   [junit4]   2>   "node_name":"127.0.0.1:38776_",
   [junit4]   2>   "shard":"shard1",
   [junit4]   2>   "state":"active"} current state version: 2
   [junit4]   2> 3092042 INFO  (OverseerStateUpdate-95414682096697349-127.0.0.1:38776_-n_0000000000) [n:127.0.0.1:38776_    ] o.a.s.c.o.ReplicaMutator Update state numShards=2 message={
   [junit4]   2>   "core":"collection1",
   [junit4]   2>   "collection":"control_collection",
   [junit4]   2>   "base_url":"https://127.0.0.1:38776",
   [junit4]   2>   "numShards":"2",
   [junit4]   2>   "roles":null,
   [junit4]   2>   "operation":"state",
   [junit4]   2>   "core_node_name":"core_node1",
   [junit4]   2>   "node_name":"127.0.0.1:38776_",
   [junit4]   2>   "shard":"shard1",
   [junit4]   2>   "state":"active"}
   [junit4]   2> 3092043 INFO  (OverseerStateUpdate-95414682096697349-127.0.0.1:38776_-n_0000000000) [n:127.0.0.1:38776_    ] o.a.s.c.o.ZkStateWriter going to create_collection /collections/collection1/state.json
   [junit4]   2> 3092143 INFO  (TEST-TestSolrConfigHandlerCloud.test-seed#[DB131CB3D78F284A]) [    ] o.a.s.SolrTestCaseJ4 Writing core.properties file to /export/home/jenkins/workspace/Lucene-Solr-5.x-Solaris/solr/build/solr-core/test/J0/temp/solr.handler.TestSolrConfigHandlerCloud_DB131CB3D78F284A-001/shard-1-001/cores/collection1
   [junit4]   2> 3092144 INFO  (TEST-TestSolrConfigHandlerCloud.test-seed#[DB131CB3D78F284A]) [    ] o.a.s.c.AbstractFullDistribZkTestBase create jetty 1 in directory /export/home/jenkins/workspace/Lucene-Solr-5.x-Solaris/solr/build/solr-core/test/J0/temp/solr.handler.TestSolrConfigHandlerCloud_DB131CB3D78F284A-001/shard-1-001
   [junit4]   2> 3092145 INFO  (TEST-TestSolrConfigHandlerCloud.test-seed#[DB131CB3D78F284A]) [    ] o.e.j.s.Server jetty-9.2.13.v20150730
   [junit4]   2> 3092147 INFO  (TEST-TestSolrConfigHandlerCloud.test-seed#[DB131CB3D78F284A]) [    ] o.e.j.s.h.ContextHandler Started o.e.j.s.ServletContextHandler@3d5572bd{/,null,AVAILABLE}
   [junit4]   2> 3092149 INFO  (zkCallback-3048-thread-1-processing-n:127.0.0.1:38776_) [n:127.0.0.1:38776_    ] o.a.s.c.c.ZkStateReader A cluster state change: [WatchedEvent state:SyncConnected type:NodeDataChanged path:/clusterstate.json], has occurred - updating... (live nodes size: [1])
   [junit4]   2> 3092149 INFO  (zkCallback-3050-thread-1) [    ] o.a.s.c.c.ZkStateReader A cluster state change: [WatchedEvent state:SyncConnected type:NodeDataChanged path:/clusterstate.json], has occurred - updating... (live nodes size: [1])
   [junit4]   2> 3092156 INFO  (TEST-TestSolrConfigHandlerCloud.test-seed#[DB131CB3D78F284A]) [    ] o.e.j.s.ServerConnector Started ServerConnector@2684a546{SSL-http/1.1}{127.0.0.1:47524}
   [junit4]   2> 3092156 INFO  (TEST-TestSolrConfigHandlerCloud.test-seed#[DB131CB3D78F284A]) [    ] o.e.j.s.Server Started @3094644ms
   [junit4]   2> 3092156 INFO  (TEST-TestSolrConfigHandlerCloud.test-seed#[DB131CB3D78F284A]) [    ] o.a.s.c.s.e.JettySolrRunner Jetty properties: {hostContext=/, coreRootDirectory=/export/home/jenkins/workspace/Lucene-Solr-5.x-Solaris/solr/build/solr-core/test/J0/temp/solr.handler.TestSolrConfigHandlerCloud_DB131CB3D78F284A-001/shard-1-001/cores, hostPort=47524, solr.data.dir=/export/home/jenkins/workspace/Lucene-Solr-5.x-Solaris/solr/build/solr-core/test/J0/temp/solr.handler.TestSolrConfigHandlerCloud_DB131CB3D78F284A-001/tempDir-001/jetty1, solrconfig=solrconfig.xml}
   [junit4]   2> 3092156 INFO  (TEST-TestSolrConfigHandlerCloud.test-seed#[DB131CB3D78F284A]) [    ] o.a.s.s.SolrDispatchFilter SolrDispatchFilter.init(): sun.misc.Launcher$AppClassLoader@2c154024
   [junit4]   2> 3092156 INFO  (TEST-TestSolrConfigHandlerCloud.test-seed#[DB131CB3D78F284A]) [    ] o.a.s.c.SolrResourceLoader new SolrResourceLoader for directory: '/export/home/jenkins/workspace/Lucene-Solr-5.x-Solaris/solr/build/solr-core/test/J0/temp/solr.handler.TestSolrConfigHandlerCloud_DB131CB3D78F284A-001/shard-1-001'
   [junit4]   2> 3092156 INFO  (TEST-TestSolrConfigHandlerCloud.test-seed#[DB131CB3D78F284A]) [    ] o.a.s.c.SolrResourceLoader JNDI not configured for solr (NoInitialContextEx)
   [junit4]   2> 3092156 INFO  (TEST-TestSolrConfigHandlerCloud.test-seed#[DB131CB3D78F284A]) [    ] o.a.s.c.SolrResourceLoader solr home defaulted to 'solr/' (could not find system property or JNDI)
   [junit4]   2> 3092157 INFO  (TEST-TestSolrConfigHandlerCloud.test-seed#[DB131CB3D78F284A]) [    ] o.a.s.c.c.SolrZkClient Using default ZkCredentialsProvider
   [junit4]   2> 3092157 INFO  (TEST-TestSolrConfigHandlerCloud.test-seed#[DB131CB3D78F284A]) [    ] o.a.s.c.c.ConnectionManager Waiting for client to connect to ZooKeeper
   [junit4]   2> 3092160 INFO  (zkCallback-3052-thread-1) [    ] o.a.s.c.c.ConnectionManager Watcher org.apache.solr.common.cloud.ConnectionManager@3b76b280 name:ZooKeeperConnection Watcher:127.0.0.1:58745/solr got event WatchedEvent state:SyncConnected type:None path:null path:null type:None
   [junit4]   2> 3092160 INFO  (TEST-TestSolrConfigHandlerCloud.test-seed#[DB131CB3D78F284A]) [    ] o.a.s.c.c.ConnectionManager Client is connected to ZooKeeper
   [junit4]   2> 3092160 INFO  (TEST-TestSolrConfigHandlerCloud.test-seed#[DB131CB3D78F284A]) [    ] o.a.s.c.c.SolrZkClient Using default ZkACLProvider
   [junit4]   2> 3092162 INFO  (TEST-TestSolrConfigHandlerCloud.test-seed#[DB131CB3D78F284A]) [    ] o.a.s.s.SolrDispatchFilter Loading solr.xml from SolrHome (not found in ZooKeeper)
   [junit4]   2> 3092162 INFO  (TEST-TestSolrConfigHandlerCloud.test-seed#[DB131CB3D78F284A]) [    ] o.a.s.c.SolrXmlConfig Loading container configuration from /export/home/jenkins/workspace/Lucene-Solr-5.x-Solaris/solr/build/solr-core/test/J0/temp/solr.handler.TestSolrConfigHandlerCloud_DB131CB3D78F284A-001/shard-1-001/solr.xml
   [junit4]   2> 3092175 INFO  (TEST-TestSolrConfigHandlerCloud.test-seed#[DB131CB3D78F284A]) [    ] o.a.s.c.CorePropertiesLocator Config-defined core root directory: /export/home/jenkins/workspace/Lucene-Solr-5.x-Solaris/solr/build/solr-core/test/J0/temp/solr.handler.TestSolrConfigHandlerCloud_DB131CB3D78F284A-001/shard-1-001/cores
   [junit4]   2> 3092175 INFO  (TEST-TestSolrConfigHandlerCloud.test-seed#[DB131CB3D78F284A]) [    ] o.a.s.c.CoreContainer New CoreContainer 622997390
   [junit4]   2> 3092175 INFO  (TEST-TestSolrConfigHandlerCloud.test-seed#[DB131CB3D78F284A]) [    ] o.a.s.c.CoreContainer Loading cores into CoreContainer [instanceDir=/export/home/jenkins/workspace/Lucene-Solr-5.x-Solaris/solr/build/solr-core/test/J0/temp/solr.handler.TestSolrConfigHandlerCloud_DB131CB3D78F284A-001/shard-1-001]
   [junit4]   2> 3092175 WARN  (TEST-TestSolrConfigHandlerCloud.test-seed#[DB131CB3D78F284A]) [    ] o.a.s.c.CoreContainer Couldn't add files from /export/home/jenkins/workspace/Lucene-Solr-5.x-Solaris/solr/build/solr-core/test/J0/temp/solr.handler.TestSolrConfigHandlerCloud_DB131CB3D78F284A-001/shard-1-001/lib to classpath: /export/home/jenkins/workspace/Lucene-Solr-5.x-Solaris/solr/build/solr-core/test/J0/temp/solr.handler.TestSolrConfigHandlerCloud_DB131CB3D78F284A-001/shard-1-001/lib
   [junit4]   2> 3092176 INFO  (TEST-TestSolrConfigHandlerCloud.test-seed#[DB131CB3D78F284A]) [    ] o.a.s.h.c.HttpShardHandlerFactory created with socketTimeout : 90000,urlScheme : ,connTimeout : 15000,maxConnectionsPerHost : 20,maxConnections : 10000,corePoolSize : 0,maximumPoolSize : 2147483647,maxThreadIdleTime : 5,sizeOfQueue : -1,fairnessPolicy : false,useRetries : false,
   [junit4]   2> 3092179 INFO  (TEST-TestSolrConfigHandlerCloud.test-seed#[DB131CB3D78F284A]) [    ] o.a.s.u.UpdateShardHandler Creating UpdateShardHandler HTTP client with params: socketTimeout=340000&connTimeout=45000&retry=true
   [junit4]   2> 3092182 INFO  (TEST-TestSolrConfigHandlerCloud.test-seed#[DB131CB3D78F284A]) [    ] o.a.s.l.LogWatcher SLF4J impl is org.slf4j.impl.Log4jLoggerFactory
   [junit4]   2> 3092182 INFO  (TEST-TestSolrConfigHandlerCloud.test-seed#[DB131CB3D78F284A]) [    ] o.a.s.l.LogWatcher Registering Log Listener [Log4j (org.slf4j.impl.Log4jLoggerFactory)]
   [junit4]   2> 3092182 INFO  (TEST-TestSolrConfigHandlerCloud.test-seed#[DB131CB3D78F284A]) [    ] o.a.s.c.ZkContainer Zookeeper client=127.0.0.1:58745/solr
   [junit4]   2> 3092182 INFO  (TEST-TestSolrConfigHandlerCloud.test-seed#[DB131CB3D78F284A]) [    ] o.a.s.c.ZkController zkHost includes chroot
   [junit4]   2> 3092182 INFO  (TEST-TestSolrConfigHandlerCloud.test-seed#[DB131CB3D78F284A]) [    ] o.a.s.c.c.SolrZkClient Using default ZkCredentialsProvider
   [junit4]   2> 3092182 INFO  (TEST-TestSolrConfigHandlerCloud.test-seed#[DB131CB3D78F284A]) [    ] o.a.s.c.c.ConnectionManager Waiting for client to connect to ZooKeeper
   [junit4]   2> 3092184 INFO  (zkCallback-3055-thread-1) [    ] o.a.s.c.c.ConnectionManager Watcher org.apache.solr.common.cloud.ConnectionManager@6359eeb9 name:ZooKeeperConnection Watcher:127.0.0.1:58745 got event WatchedEvent state:SyncConnected type:None path:null path:null type:None
   [junit4]   2> 3092184 INFO  (TEST-TestSolrConfigHandlerCloud.test-seed#[DB131CB3D78F284A]) [    ] o.a.s.c.c.ConnectionManager Client is connected to ZooKeeper
   [junit4]   2> 3092185 INFO  (TEST-TestSolrConfigHandlerCloud.test-seed#[DB131CB3D78F284A]) [    ] o.a.s.c.c.SolrZkClient Using default ZkACLProvider
   [junit4]   2> 3092186 INFO  (TEST-TestSolrConfigHandlerCloud.test-seed#[DB131CB3D78F284A]) [n:127.0.0.1:47524_    ] o.a.s.c.c.ConnectionManager Waiting for client to connect to ZooKeeper
   [junit4]   2> 3092189 INFO  (zkCallback-3056-thread-1-processing-n:127.0.0.1:47524_) [n:127.0.0.1:47524_    ] o.a.s.c.c.ConnectionManager Watcher org.apache.solr.common.cloud.ConnectionManager@4dbb469a name:ZooKeeperConnection Watcher:127.0.0.1:58745/solr got event WatchedEvent state:SyncConnected type:None path:null path:null type:None
   [junit4]   2> 3092189 INFO  (TEST-TestSolrConfigHandlerCloud.test-seed#[DB131CB3D78F284A]) [n:127.0.0.1:47524_    ] o.a.s.c.c.ConnectionManager Client is connected to ZooKeeper
   [junit4]   2> 3092223 INFO  (TEST-TestSolrConfigHandlerCloud.test-seed#[DB131CB3D78F284A]) [n:127.0.0.1:47524_    ] o.a.s.c.c.ZkStateReader Updating cluster state from ZooKeeper... 
   [junit4]   2> 3093236 INFO  (TEST-TestSolrConfigHandlerCloud.test-seed#[DB131CB3D78F284A]) [n:127.0.0.1:47524_    ] o.a.s.c.ZkController Register node as live in ZooKeeper:/live_nodes/127.0.0.1:47524_
   [junit4]   2> 3093237 INFO  (TEST-TestSolrConfigHandlerCloud.test-seed#[DB131CB3D78F284A]) [n:127.0.0.1:47524_    ] o.a.s.c.c.SolrZkClient makePath: /live_nodes/127.0.0.1:47524_
   [junit4]   2> 3093239 INFO  (zkCallback-3050-thread-1) [    ] o.a.s.c.c.ZkStateReader A live node change: [WatchedEvent state:SyncConnected type:NodeChildrenChanged path:/live_nodes], has occurred - updating... (live nodes size: [1])
   [junit4]   2> 3093239 INFO  (zkCallback-3048-thread-1-processing-n:127.0.0.1:38776_) [n:127.0.0.1:38776_    ] o.a.s.c.c.ZkStateReader A live node change: [WatchedEvent state:SyncConnected type:NodeChildrenChanged path:/live_nodes], has occurred - updating... (live nodes size: [1])
   [junit4]   2> 3093239 INFO  (zkCallback-3056-thread-1-processing-n:127.0.0.1:47524_) [n:127.0.0.1:47524_    ] o.a.s.c.c.ZkStateReader A live node change: [WatchedEvent state:SyncConnected type:NodeChildrenChanged path:/live_nodes], has occurred - updating... (live nodes size: [1])
   [junit4]   2> 3093240 INFO  (TEST-TestSolrConfigHandlerCloud.test-seed#[DB131CB3D78F284A]) [n:127.0.0.1:47524_    ] o.a.s.c.Overseer Overseer (id=null) closing
   [junit4]   2> 3093241 INFO  (TEST-TestSolrConfigHandlerCloud.test-seed#[DB131CB3D78F284A]) [n:127.0.0.1:47524_    ] o.a.s.c.LeaderElector Joined leadership election with path: /overseer_elect/election/95414682096697354-127.0.0.1:47524_-n_0000000001
   [junit4]   2> 3093242 INFO  (TEST-TestSolrConfigHandlerCloud.test-seed#[DB131CB3D78F284A]) [n:127.0.0.1:47524_    ] o.a.s.c.LeaderElector Watching path /overseer_elect/election/95414682096697349-127.0.0.1:38776_-n_0000000000 to know if I could be the leader
   [junit4]   2> 3093262 INFO  (TEST-TestSolrConfigHandlerCloud.test-seed#[DB131CB3D78F284A]) [n:127.0.0.1:47524_    ] o.a.s.c.CoreContainer Security conf doesn't exist. Skipping setup for authorization module.
   [junit4]   2> 3093262 INFO  (TEST-TestSolrConfigHandlerCloud.test-seed#[DB131CB3D78F284A]) [n:127.0.0.1:47524_    ] o.a.s.c.CoreContainer No authentication plugin used.
   [junit4]   2> 3093263 INFO  (TEST-TestSolrConfigHandlerCloud.test-seed#[DB131CB3D78F284A]) [n:127.0.0.1:47524_    ] o.a.s.c.CorePropertiesLocator Looking for core definitions underneath /export/home/jenkins/workspace/Lucene-Solr-5.x-Solaris/solr/build/solr-core/test/J0/temp/solr.handler.TestSolrConfigHandlerCloud_DB131CB3D78F284A-001/shard-1-001/cores
   [junit4]   2> 3093263 INFO  (TEST-TestSolrConfigHandlerCloud.test-seed#[DB131CB3D78F284A]) [n:127.0.0.1:47524_    ] o.a.s.c.CoreDescriptor Created CoreDescriptor: {loadOnStartup=true, shard=, schema=schema.xml, configSetProperties=configsetprops.json, config=solrconfig.xml, dataDir=data/, collection=collection1, transient=false, name=collection1, coreNodeName=}
   [junit4]   2> 3093263 INFO  (TEST-TestSolrConfigHandlerCloud.test-seed#[DB131CB3D78F284A]) [n:127.0.0.1:47524_    ] o.a.s.c.CorePropertiesLocator Found core collection1 in /export/home/jenkins/workspace/Lucene-Solr-5.x-Solaris/solr/build/solr-core/test/J0/temp/solr.handler.TestSolrConfigHandlerCloud_DB131CB3D78F284A-001/shard-1-001/cores/collection1
   [junit4]   2> 3093263 INFO  (TEST-TestSolrConfigHandlerCloud.test-seed#[DB131CB3D78F284A]) [n:127.0.0.1:47524_    ] o.a.s.c.CorePropertiesLocator Found 1 core definitions
   [junit4]   2> 3093265 INFO  (TEST-TestSolrConfigHandlerCloud.test-seed#[DB131CB3D78F284A]) [n:127.0.0.1:47524_    ] o.a.s.s.SolrDispatchFilter user.dir=/export/home/jenkins/workspace/Lucene-Solr-5.x-Solaris/solr/build/solr-core/test/J0
   [junit4]   2> 3093265 INFO  (TEST-TestSolrConfigHandlerCloud.test-seed#[DB131CB3D78F284A]) [n:127.0.0.1:47524_    ] o.a.s.s.SolrDispatchFilter SolrDispatchFilter.init() done
   [junit4]   2> 3093266 INFO  (coreLoadExecutor-7664-thread-1-processing-n:127.0.0.1:47524_) [n:127.0.0.1:47524_ c:collection1   x:collection1] o.a.s.c.ZkController publishing state=down
   [junit4]   2> 3093266 INFO  (coreLoadExecutor-7664-thread-1-processing-n:127.0.0.1:47524_) [n:127.0.0.1:47524_ c:collection1   x:collection1] o.a.s.c.ZkController numShards not found on descriptor - reading it from system property
   [junit4]   2> 3093268 INFO  (coreLoadExecutor-7664-thread-1-processing-n:127.0.0.1:47524_) [n:127.0.0.1:47524_ c:collection1   x:collection1] o.a.s.c.ZkController Registering watch for collection collection1
   [junit4]   2> 3093268 INFO  (coreLoadExecutor-7664-thread-1-processing-n:127.0.0.1:47524_) [n:127.0.0.1:47524_ c:collection1   x:collection1] o.a.s.c.c.ZkStateReader addZkWatch [collection1]
   [junit4]   2> 3093269 INFO  (OverseerStateUpdate-95414682096697349-127.0.0.1:38776_-n_0000000000) [n:127.0.0.1:38776_    ] o.a.s.c.Overseer processMessage: queueSize: 1, message = {
   [junit4]   2>   "core":"collection1",
   [junit4]   2>   "collection":"collection1",
   [junit4]   2>   "base_url":"https://127.0.0.1:47524",
   [junit4]   2>   "numShards":"2",
   [junit4]   2>   "roles":null,
   [junit4]   2>   "operation":"state",
   [junit4]   2>   "node_name":"127.0.0.1:47524_",
   [junit4]   2>   "shard":null,
   [junit4]   2>   "state":"down"} current state version: 3
   [junit4]   2> 3093269 INFO  (coreLoadExecutor-7664-thread-1-processing-n:127.0.0.1:47524_) [n:127.0.0.1:47524_ c:collection1   x:collection1] o.a.s.c.c.ZkStateReader Add data for [collection1] ver [0]
   [junit4]   2> 3093269 INFO  (coreLoadExecutor-7664-thread-1-processing-n:127.0.0.1:47524_) [n:127.0.0.1:47524_ c:collection1   x:collection1] o.a.s.c.ZkController look for our core node name
   [junit4]   2> 3093270 INFO  (OverseerStateUpdate-95414682096697349-127.0.0.1:38776_-n_0000000000) [n:127.0.0.1:38776_    ] o.a.s.c.o.ReplicaMutator Update state numShards=2 message={
   [junit4]   2>   "core":"collection1",
   [junit4]   2>   "collection":"collection1",
   [junit4]   2>   "base_url":"https://127.0.0.1:47524",
   [junit4]   2>   "numShards":"2",
   [junit4]   2>   "roles":null,
   [junit4]   2>   "operation":"state",
   [junit4]   2>   "node_name":"127.0.0.1:47524_",
   [junit4]   2>   "shard":null,
   [junit4]   2>   "state":"down"}
   [junit4]   2> 3093270 INFO  (OverseerStateUpdate-95414682096697349-127.0.0.1:38776_-n_0000000000) [n:127.0.0.1:38776_    ] o.a.s.c.o.ReplicaMutator Collection already exists with numShards=2
   [junit4]   2> 3093270 INFO  (OverseerStateUpdate-95414682096697349-127.0.0.1:38776_-n_0000000000) [n:127.0.0.1:38776_    ] o.a.s.c.o.ReplicaMutator Assigning new node to shard shard=shard2
   [junit4]   2> 3093373 INFO  (OverseerStateUpdate-95414682096697349-127.0.0.1:38776_-n_0000000000) [n:127.0.0.1:38776_    ] o.a.s.c.o.ZkStateWriter going to update_collection /collections/collection1/state.json version: 0
   [junit4]   2> 3093374 INFO  (zkCallback-3056-thread-1-processing-n:127.0.0.1:47524_) [n:127.0.0.1:47524_    ] o.a.s.c.c.ZkStateReader A cluster state change: [WatchedEvent state:SyncConnected type:NodeDataChanged path:/collections/collection1/state.json] for collection [collection1] has occurred - updating... (live nodes size: [2])
   [junit4]   2> 3093375 INFO  (zkCallback-3056-thread-1-processing-n:127.0.0.1:47524_) [n:127.0.0.1:47524_    ] o.a.s.c.c.ZkStateReader Updating data for [collection1] from [0] to [1]
   [junit4]   2> 3094270 INFO  (coreLoadExecutor-7664-thread-1-processing-n:127.0.0.1:47524_) [n:127.0.0.1:47524_ c:collection1   x:collection1] o.a.s.c.ZkController waiting to find shard id in clusterstate for collection1
   [junit4]   2> 3094270 INFO  (coreLoadExecutor-7664-thread-1-processing-n:127.0.0.1:47524_) [n:127.0.0.1:47524_ c:collection1   x:collection1] o.a.s.c.ZkController Check for collection zkNode:collection1
   [junit4]   2> 3094271 INFO  (coreLoadExecutor-7664-thread-1-processing-n:127.0.0.1:47524_) [n:127.0.0.1:47524_ c:collection1   x:collection1] o.a.s.c.ZkController Collection zkNode exists
   [junit4]   2> 3094271 INFO  (coreLoadExecutor-7664-thread-1-processing-n:127.0.0.1:47524_) [n:127.0.0.1:47524_ c:collection1   x:collection1] o.a.s.c.c.ZkStateReader Load collection config from: [/collections/collection1]
   [junit4]   2> 3094272 INFO  (coreLoadExecutor-7664-thread-1-processing-n:127.0.0.1:47524_) [n:127.0.0.1:47524_ c:collection1   x:collection1] o.a.s.c.c.ZkStateReader path=[/collections/collection1] [configName]=[conf1] specified config exists in ZooKeeper
   [junit4]   2> 3094272 INFO  (coreLoadExecutor-7664-thread-1-processing-n:127.0.0.1:47524_) [n:127.0.0.1:47524_ c:collection1   x:collection1] o.a.s.c.SolrResourceLoader new SolrResourceLoader for directory: '/export/home/jenkins/workspace/Lucene-Solr-5.x-Solaris/solr/build/solr-core/test/J0/temp/solr.handler.TestSolrConfigHandlerCloud_DB131CB3D78F284A-001/shard-1-001/cores/collection1'
   [junit4]   2> 3094273 INFO  (coreLoadExecutor-7664-thread-1-processing-n:127.0.0.1:47524_) [n:127.0.0.1:47524_ c:collection1   x:collection1] o.a.s.c.SolrResourceLoader JNDI not configured for solr (NoInitialContextEx)
   [junit4]   2> 3094273 INFO  (coreLoadExecutor-7664-thread-1-processing-n:127.0.0.1:47524_) [n:127.0.0.1:47524_ c:collection1   x:collection1] o.a.s.c.SolrResourceLoader solr home defaulted to 'solr/' (could not find system property or JNDI)
   [junit4]   2> 3094275 INFO  (coreLoadExecutor-7664-thread-1-processing-n:127.0.0.1:47524_) [n:127.0.0.1:47524_ c:collection1   x:collection1] o.a.s.c.Config loaded config solrconfig.xml with version 0 
   [junit4]   2> 3094284 INFO  (coreLoadExecutor-7664-thread-1-processing-n:127.0.0.1:47524_) [n:127.0.0.1:47524_ c:collection1   x:collection1] o.a.s.c.SolrConfig current version of requestparams : -1
   [junit4]   2> 3094302 INFO  (coreLoadExecutor-7664-thread-1-processing-n:127.0.0.1:47524_) [n:127.0.0.1:47524_ c:collection1   x:collection1] o.a.s.c.SolrConfig Using Lucene MatchVersion: 5.5.0
   [junit4]   2> 3094341 INFO  (coreLoadExecutor-7664-thread-1-processing-n:127.0.0.1:47524_) [n:127.0.0.1:47524_ c:collection1   x:collection1] o.a.s.c.SolrConfig Loaded SolrConfig: solrconfig.xml
   [junit4]   2> 3094347 INFO  (coreLoadExecutor-7664-thread-1-processing-n:127.0.0.1:47524_) [n:127.0.0.1:47524_ c:collection1   x:collection1] o.a.s.s.IndexSchema [collection1] Schema name=test
   [junit4]   2> 3094616 INFO  (coreLoadExecutor-7664-thread-1-processing-n:127.0.0.1:47524_) [n:127.0.0.1:47524_ c:collection1   x:collection1] o.a.s.s.OpenExchangeRatesOrgProvider Initialized with rates=open-exchange-rates.json, refreshInterval=1440.
   [junit4]   2> 3094624 INFO  (coreLoadExecutor-7664-thread-1-processing-n:127.0.0.1:47524_) [n:127.0.0.1:47524_ c:collection1   x:collection1] o.a.s.s.IndexSchema default search field in schema is text
   [junit4]   2> 3094626 INFO  (coreLoadExecutor-7664-thread-1-processing-n:127.0.0.1:47524_) [n:127.0.0.1:47524_ c:collection1   x:collection1] o.a.s.s.IndexSchema unique key field: id
   [junit4]   2> 3094638 INFO  (coreLoadExecutor-7664-thread-1-processing-n:127.0.0.1:47524_) [n:127.0.0.1:47524_ c:collection1   x:collection1] o.a.s.s.FileExchangeRateProvider Reloading exchange rates from file currency.xml
   [junit4]   2> 3094641 INFO  (coreLoadExecutor-7664-thread-1-processing-n:127.0.0.1:47524_) [n:127.0.0.1:47524_ c:collection1   x:collection1] o.a.s.s.FileExchangeRateProvider Reloading exchange rates from file currency.xml
   [junit4]   2> 3094643 INFO  (coreLoadExecutor-7664-thread-1-processing-n:127.0.0.1:47524_) [n:127.0.0.1:47524_ c:collection1   x:collection1] o.a.s.s.OpenExchangeRatesOrgProvider Reloading exchange rates from open-exchange-rates.json
   [junit4]   2> 3094645 INFO  (coreLoadExecutor-7664-thread-1-processing-n:127.0.0.1:47524_) [n:127.0.0.1:47524_ c:collection1   x:collection1] o.a.s.s.OpenExchangeRatesOrgProvider Reloading exchange rates from open-exchange-rates.json
   [junit4]   2> 3094647 INFO  (coreLoadExecutor-7664-thread-1-processing-n:127.0.0.1:47524_) [n:127.0.0.1:47524_ c:collection1   x:collection1] o.a.s.c.ConfigSetProperties Did not find ConfigSet properties, assuming default properties: Can't find resource 'configsetprops.json' in classpath or '/configs/conf1', cwd=/export/home/jenkins/workspace/Lucene-Solr-5.x-Solaris/solr/build/solr-core/test/J0
   [junit4]   2> 3094647 INFO  (coreLoadExecutor-7664-thread-1-processing-n:127.0.0.1:47524_) [n:127.0.0.1:47524_ c:collection1   x:collection1] o.a.s.c.CoreContainer Creating SolrCore 'collection1' using configuration from collection collection1
   [junit4]   2> 3094647 INFO  (coreLoadExecutor-7664-thread-1-processing-n:127.0.0.1:47524_) [n:127.0.0.1:47524_ c:collection1 s:shard2 r:core_node1 x:collection1] o.a.s.c.SolrCore org.apache.solr.core.MockDirectoryFactory
   [junit4]   2> 3094647 INFO  (coreLoadExecutor-7664-thread-1-processing-n:127.0.0.1:47524_) [n:127.0.0.1:47524_ c:collection1 s:shard2 r:core_node1 x:collection1] o.a.s.c.SolrCore [[collection1] ] Opening new SolrCore at [/export/home/jenkins/workspace/Lucene-Solr-5.x-Solaris/solr/build/solr-core/test/J0/temp/solr.handler.TestSolrConfigHandlerCloud_DB131CB3D78F284A-001/shard-1-001/cores/collection1], dataDir=[/export/home/jenkins/workspace/Lucene-Solr-5.x-Solaris/solr/build/solr-core/test/J0/temp/solr.handler.TestSolrConfigHandlerCloud_DB131CB3D78F284A-001/shard-1-001/cores/collection1/data/]
   [junit4]   2> 3094647 INFO  (coreLoadExecutor-7664-thread-1-processing-n:127.0.0.1:47524_) [n:127.0.0.1:47524_ c:collection1 s:shard2 r:core_node1 x:collection1] o.a.s.c.JmxMonitoredMap JMX monitoring is enabled. Adding Solr mbeans to JMX Server: com.sun.jmx.mbeanserver.JmxMBeanServer@6bfe8c5b
   [junit4]   2> 3094648 INFO  (coreLoadExecutor-7664-thread-1-processing-n:127.0.0.1:47524_) [n:127.0.0.1:47524_ c:collection1 s:shard2 r:core_node1 x:collection1] o.a.s.c.CachingDirectoryFactory return new directory for /export/home/jenkins/workspace/Lucene-Solr-5.x-Solaris/solr/build/solr-core/test/J0/temp/solr.handler.TestSolrConfigHandlerCloud_DB131CB3D78F284A-001/shard-1-001/cores/collection1/data
   [junit4]   2> 3094648 INFO  (coreLoadExecutor-7664-thread-1-processing-n:127.0.0.1:47524_) [n:127.0.0.1:47524_ c:collection1 s:shard2 r:core_node1 x:collection1] o.a.s.c.SolrCore New index directory detected: old=null new=/export/home/jenkins/workspace/Lucene-Solr-5.x-Solaris/solr/build/solr-core/test/J0/temp/solr.handler.TestSolrConfigHandlerCloud_DB131CB3D78F284A-001/shard-1-001/cores/collection1/data/index/
   [junit4]   2> 3094648 WARN  (coreLoadExecutor-7664-thread-1-processing-n:127.0.0.1:47524_) [n:127.0.0.1:47524_ c:collection1 s:shard2 r:core_node1 x:collection1] o.a.s.c.SolrCore [collection1] Solr index directory '/export/home/jenkins/workspace/Lucene-Solr-5.x-Solaris/solr/build/solr-core/test/J0/temp/solr.handler.TestSolrConfigHandlerCloud_DB131CB3D78F284A-001/shard-1-001/cores/collection1/data/index' doesn't exist. Creating new index...
   [junit4]   2> 3094648 INFO  (coreLoadExecutor-7664-thread-1-processing-n:127.0.0.1:47524_) [n:127.0.0.1:47524_ c:collection1 s:shard2 r:core_node1 x:collection1] o.a.s.c.CachingDirectoryFactory return new directory for /export/home/jenkins/workspace/Lucene-Solr-5.x-Solaris/solr/build/solr-core/test/J0/temp/solr.handler.TestSolrConfigHandlerCloud_DB131CB3D78F284A-001/shard-1-001/cores/collection1/data/index
   [junit4]   2> 3094648 INFO  (coreLoadExecutor-7664-thread-1-processing-n:127.0.0.1:47524_) [n:127.0.0.1:47524_ c:collection1 s:shard2 r:core_node1 x:collection1] o.a.s.u.RandomMergePolicy RandomMergePolicy wrapping class org.apache.lucene.index.LogDocMergePolicy: [LogDocMergePolicy: minMergeSize=1000, mergeFactor=17, maxMergeSize=9223372036854775807, maxMergeSizeForForcedMerge=9223372036854775807, calibrateSizeByDeletes=true, maxMergeDocs=2147483647, maxCFSSegmentSizeMB=8.796093022207999E12, noCFSRatio=1.0]
   [junit4]   2> 3094649 INFO  (coreLoadExecutor-7664-thread-1-processing-n:127.0.0.1:47524_) [n:127.0.0.1:47524_ c:collection1 s:shard2 r:core_node1 x:collection1] o.a.s.c.SolrDeletionPolicy SolrDeletionPolicy.onCommit: commits: num=1
   [junit4]   2> 	commit{dir=MockDirectoryWrapper(RAMDirectory@50c5a129 lockFactory=org.apache.lucene.store.SingleInstanceLockFactory@5ed7b42c),segFN=segments_1,generat

[...truncated too long message...]

y.create(IndexSchemaFactory.java:56)
   [junit4]   2> 	at org.apache.solr.schema.IndexSchemaFactory.buildIndexSchema(IndexSchemaFactory.java:70)
   [junit4]   2> 	at org.apache.solr.core.ConfigSetService.createIndexSchema(ConfigSetService.java:108)
   [junit4]   2> 	at org.apache.solr.core.ConfigSetService.getConfig(ConfigSetService.java:79)
   [junit4]   2> 	... 3 more
   [junit4]   2> Caused by: org.apache.solr.common.SolrException: Plugin Initializing failure for [schema.xml] fieldType
   [junit4]   2> 	at org.apache.solr.util.plugin.AbstractPluginLoader.load(AbstractPluginLoader.java:194)
   [junit4]   2> 	at org.apache.solr.schema.IndexSchema.readSchema(IndexSchema.java:470)
   [junit4]   2> 	... 8 more
   [junit4]   2> Caused by: org.apache.solr.common.SolrException: Error while opening enums config.
   [junit4]   2> 	at org.apache.solr.schema.EnumField.init(EnumField.java:141)
   [junit4]   2> 	at org.apache.solr.schema.FieldType.setArgs(FieldType.java:174)
   [junit4]   2> 	at org.apache.solr.schema.FieldTypePluginLoader.init(FieldTypePluginLoader.java:150)
   [junit4]   2> 	at org.apache.solr.schema.FieldTypePluginLoader.init(FieldTypePluginLoader.java:53)
   [junit4]   2> 	at org.apache.solr.util.plugin.AbstractPluginLoader.load(AbstractPluginLoader.java:191)
   [junit4]   2> 	... 9 more
   [junit4]   2> Caused by: java.io.IOException: Error opening /configs/conf1/enumsConfig.xml
   [junit4]   2> 	at org.apache.solr.cloud.ZkSolrResourceLoader.openResource(ZkSolrResourceLoader.java:92)
   [junit4]   2> 	at org.apache.solr.schema.EnumField.init(EnumField.java:99)
   [junit4]   2> 	... 13 more
   [junit4]   2> Caused by: org.apache.zookeeper.KeeperException$SessionExpiredException: KeeperErrorCode = Session expired for /configs/conf1/enumsConfig.xml
   [junit4]   2> 	at org.apache.zookeeper.KeeperException.create(KeeperException.java:127)
   [junit4]   2> 	at org.apache.zookeeper.KeeperException.create(KeeperException.java:51)
   [junit4]   2> 	at org.apache.zookeeper.ZooKeeper.exists(ZooKeeper.java:1045)
   [junit4]   2> 	at org.apache.solr.common.cloud.SolrZkClient$5.execute(SolrZkClient.java:311)
   [junit4]   2> 	at org.apache.solr.common.cloud.SolrZkClient$5.execute(SolrZkClient.java:308)
   [junit4]   2> 	at org.apache.solr.common.cloud.ZkCmdExecutor.retryOperation(ZkCmdExecutor.java:60)
   [junit4]   2> 	at org.apache.solr.common.cloud.SolrZkClient.exists(SolrZkClient.java:308)
   [junit4]   2> 	at org.apache.solr.cloud.ZkController.pathExists(ZkController.java:816)
   [junit4]   2> 	at org.apache.solr.cloud.ZkSolrResourceLoader.openResource(ZkSolrResourceLoader.java:86)
   [junit4]   2> 	... 14 more
   [junit4]   2> Feb 19, 2016 8:09:35 PM com.carrotsearch.randomizedtesting.ThreadLeakControl checkThreadLeaks
   [junit4]   2> WARNING: Will linger awaiting termination of 1 leaked thread(s).
   [junit4]   2> NOTE: test params are: codec=Lucene54, sim=DefaultSimilarity, locale=es-ES, timezone=America/Argentina/San_Luis
   [junit4]   2> NOTE: SunOS 5.11 amd64/Oracle Corporation 1.7.0_95 (64-bit)/cpus=3,threads=1,free=97612720,total=343646208
   [junit4]   2> NOTE: All tests run in this JVM: [TestPartialUpdateDeduplication, TestConfigSetsAPIZkFailure, DistributedSpellCheckComponentTest, PingRequestHandlerTest, SolrIndexConfigTest, DeleteReplicaTest, ZkStateWriterTest, HdfsWriteToMultipleCollectionsTest, TestReloadDeadlock, DocValuesTest, TestShardHandlerFactory, TestXIncludeConfig, TestRemoveLastDynamicCopyField, RequestLoggingTest, AssignTest, TestQuerySenderNoQuery, DeleteInactiveReplicaTest, UpdateParamsTest, TestSolrDeletionPolicy1, TestLRUCache, UnloadDistributedZkTest, TestRTimerTree, TestFieldTypeResource, TestManagedSchemaFieldResource, CursorPagingTest, TestAddFieldRealTimeGet, ChaosMonkeyNothingIsSafeTest, SolrCoreTest, TestNRTOpen, TestGroupingSearch, DistributedFacetPivotWhiteBoxTest, DisMaxRequestHandlerTest, XsltUpdateRequestHandlerTest, TestRequestForwarding, OverseerTest, TestReplicationHandler, TriLevelCompositeIdRoutingTest, CloudMLTQParserTest, SoftAutoCommitTest, DataDrivenBlockJoinTest, QueryElevationComponentTest, TestDistributedStatsComponentCardinality, TestFileDictionaryLookup, JSONWriterTest, TestExceedMaxTermLength, TestDocSet, BigEndianAscendingWordSerializerTest, VersionInfoTest, TestCollapseQParserPlugin, TestMergePolicyConfig, TestSchemaVersionResource, RestartWhileUpdatingTest, LeaderFailoverAfterPartitionTest, AsyncMigrateRouteKeyTest, TestRuleBasedAuthorizationPlugin, TestSweetSpotSimilarityFactory, HdfsRestartWhileUpdatingTest, TestMiniSolrCloudClusterSSL, TestTolerantSearch, TestSolrQueryParserDefaultOperatorResource, AtomicUpdatesTest, JavabinLoaderTest, TestLMDirichletSimilarityFactory, TestManagedSchema, RemoteQueryErrorTest, TestSortByMinMaxFunction, TestReRankQParserPlugin, MBeansHandlerTest, FacetPivotSmallTest, TestPivotHelperCode, TermsComponentTest, PolyFieldTest, SystemInfoHandlerTest, HdfsDirectoryFactoryTest, TestChildDocTransformer, DocValuesMultiTest, HdfsRecoverLeaseTest, TestHashPartitioner, ConnectionManagerTest, DistributedQueryElevationComponentTest, CursorMarkTest, SharedFSAutoReplicaFailoverUtilsTest, TestSimpleQParserPlugin, CollectionReloadTest, DirectUpdateHandlerTest, TestExclusionRuleCollectionAccess, TestConfigOverlay, ShardRoutingTest, TestCodecSupport, TestHighFrequencyDictionaryFactory, DistributedDebugComponentTest, TestMinMaxOnMultiValuedField, TestRandomDVFaceting, TestConfigSetsAPI, TestExactStatsCache, TestSchemaResource, DistributedQueueTest, BasicDistributedZkTest, ReturnFieldsTest, DistributedFacetPivotSmallAdvancedTest, TestDistribDocBasedVersion, TestNonDefinedSimilarityFactory, DocValuesMissingTest, ResponseHeaderTest, TestXmlQParser, TestNamedUpdateProcessors, TestSearchPerf, TestConfig, HardAutoCommitTest, TestJmxMonitoredMap, DeleteStatusTest, PathHierarchyTokenizerFactoryTest, TestStressReorder, TestFunctionQuery, SpatialRPTFieldTypeTest, AlternateDirectoryTest, ForceLeaderTest, DistributedFacetPivotLargeTest, JsonLoaderTest, DirectoryFactoryTest, ZkCLITest, ParsingFieldUpdateProcessorsTest, TestClassNameShortening, TestInfoStreamLogging, XmlUpdateRequestHandlerTest, TestTestInjection, TestCloudPivotFacet, TestDefaultSearchFieldResource, StatelessScriptUpdateProcessorFactoryTest, DistanceUnitsTest, CoreAdminCreateDiscoverTest, DocumentBuilderTest, SyncSliceTest, TestSolr4Spatial2, TestDistribIDF, SolrCloudExampleTest, SparseHLLTest, DocExpirationUpdateProcessorFactoryTest, ChaosMonkeySafeLeaderTest, BasicDistributedZk2Test, LeaderElectionIntegrationTest, BasicZkTest, RecoveryZkTest, ClusterStateUpdateTest, LeaderElectionTest, TestZkChroot, TestDistributedSearch, SortByFunctionTest, SolrInfoMBeanTest, CacheHeaderTest, TestSurroundQueryParser, LukeRequestHandlerTest, TestReversedWildcardFilterFactory, TestQueryTypes, TestOmitPositions, TestIndexingPerformance, RequiredFieldsTest, TestArbitraryIndexDir, LoggingHandlerTest, IndexSchemaTest, TestCollationField, TestAnalyzedSuggestions, TestComponentsName, TestLFUCache, TestIBSimilarityFactory, ResourceLoaderTest, ScriptEngineTest, TestFastLRUCache, PreAnalyzedFieldTest, SpellingQueryConverterTest, RAMDirectoryFactoryTest, TestSolrJ, TestDocumentBuilder, FileUtilsTest, SolrTestCaseJ4Test, TestCrossCoreJoin, TestCursorMarkWithoutUniqueKey, TestDistributedMissingSort, CleanupOldIndexTest, CollectionTooManyReplicasTest, DistribJoinFromCollectionTest, HttpPartitionTest, OverriddenZkACLAndCredentialsProvidersTest, OverseerCollectionConfigSetProcessorTest, OverseerRolesTest, SharedFSAutoReplicaFailoverTest, TestAuthenticationFramework, TestRequestStatusCollectionAPI, HdfsRecoveryZkTest, HdfsThreadLeakTest, StressHdfsTest, ExitableDirectoryReaderTest, TestConfigSetProperties, TestConfigSets, TestDynamicLoading, TestReplicationHandlerBackup, TestReqParamsAPI, TestSolrConfigHandlerCloud]
   [junit4]   2> NOTE: reproduce with: ant test  -Dtestcase=TestSolrConfigHandlerCloud -Dtests.seed=DB131CB3D78F284A -Dtests.slow=true -Dtests.locale=es-ES -Dtests.timezone=America/Argentina/San_Luis -Dtests.asserts=true -Dtests.file.encoding=ISO-8859-1
   [junit4] ERROR   0.00s J0 | TestSolrConfigHandlerCloud (suite) <<<
   [junit4]    > Throwable #1: java.lang.AssertionError: ObjectTracker found 3 object(s) that were not released!!! [MockDirectoryWrapper, MDCAwareThreadPoolExecutor, MockDirectoryWrapper]
   [junit4]    > 	at __randomizedtesting.SeedInfo.seed([DB131CB3D78F284A]:0)
   [junit4]    > 	at org.apache.solr.SolrTestCaseJ4.afterClass(SolrTestCaseJ4.java:228)
   [junit4]    > 	at java.lang.Thread.run(Thread.java:745)
   [junit4] Completed [485/566 (1!)] on J0 in 68.52s, 1 test, 1 failure <<< FAILURES!

[...truncated 257 lines...]
BUILD FAILED
/export/home/jenkins/workspace/Lucene-Solr-5.x-Solaris/build.xml:750: The following error occurred while executing this line:
/export/home/jenkins/workspace/Lucene-Solr-5.x-Solaris/build.xml:694: The following error occurred while executing this line:
/export/home/jenkins/workspace/Lucene-Solr-5.x-Solaris/build.xml:59: The following error occurred while executing this line:
/export/home/jenkins/workspace/Lucene-Solr-5.x-Solaris/solr/build.xml:233: The following error occurred while executing this line:
/export/home/jenkins/workspace/Lucene-Solr-5.x-Solaris/solr/common-build.xml:534: The following error occurred while executing this line:
/export/home/jenkins/workspace/Lucene-Solr-5.x-Solaris/lucene/common-build.xml:1477: The following error occurred while executing this line:
/export/home/jenkins/workspace/Lucene-Solr-5.x-Solaris/lucene/common-build.xml:1033: There were test failures: 566 suites (7 ignored), 2279 tests, 1 suite-level error, 55 ignored (39 assumptions) [seed: DB131CB3D78F284A]

Total time: 80 minutes 26 seconds
Build step 'Invoke Ant' marked build as failure
Archiving artifacts
[WARNINGS] Skipping publisher since build result is FAILURE
Recording test results
Email was triggered for: Failure - Any
Sending email for trigger: Failure - Any



Mime
View raw message