lucene-dev mailing list archives

Site index · List index
Message view « Date » · « Thread »
Top « Date » · « Thread »
From Apache Jenkins Server <jenk...@builds.apache.org>
Subject [JENKINS] Lucene-Solr-Tests-5.5-Java7 - Build # 18 - Failure
Date Sun, 21 Feb 2016 11:36:46 GMT
Build: https://builds.apache.org/job/Lucene-Solr-Tests-5.5-Java7/18/

1 tests failed.
FAILED:  org.apache.solr.handler.TestReplicationHandler.doTestStressReplication

Error Message:
timed out waiting for collection1 startAt time to exceed: Sun Feb 21 21:00:00 VLAT 2016

Stack Trace:
java.lang.AssertionError: timed out waiting for collection1 startAt time to exceed: Sun Feb 21 21:00:00 VLAT 2016
	at __randomizedtesting.SeedInfo.seed([DDD47F54EA702C0:D67647334B8F6B73]:0)
	at org.junit.Assert.fail(Assert.java:93)
	at org.apache.solr.handler.TestReplicationHandler.watchCoreStartAt(TestReplicationHandler.java:1419)
	at org.apache.solr.handler.TestReplicationHandler.doTestStressReplication(TestReplicationHandler.java:771)
	at sun.reflect.NativeMethodAccessorImpl.invoke0(Native Method)
	at sun.reflect.NativeMethodAccessorImpl.invoke(NativeMethodAccessorImpl.java:57)
	at sun.reflect.DelegatingMethodAccessorImpl.invoke(DelegatingMethodAccessorImpl.java:43)
	at java.lang.reflect.Method.invoke(Method.java:606)
	at com.carrotsearch.randomizedtesting.RandomizedRunner.invoke(RandomizedRunner.java:1764)
	at com.carrotsearch.randomizedtesting.RandomizedRunner$8.evaluate(RandomizedRunner.java:871)
	at com.carrotsearch.randomizedtesting.RandomizedRunner$9.evaluate(RandomizedRunner.java:907)
	at com.carrotsearch.randomizedtesting.RandomizedRunner$10.evaluate(RandomizedRunner.java:921)
	at com.carrotsearch.randomizedtesting.rules.SystemPropertiesRestoreRule$1.evaluate(SystemPropertiesRestoreRule.java:57)
	at org.apache.lucene.util.TestRuleSetupTeardownChained$1.evaluate(TestRuleSetupTeardownChained.java:49)
	at org.apache.lucene.util.AbstractBeforeAfterRule$1.evaluate(AbstractBeforeAfterRule.java:45)
	at org.apache.lucene.util.TestRuleThreadAndTestName$1.evaluate(TestRuleThreadAndTestName.java:48)
	at org.apache.lucene.util.TestRuleIgnoreAfterMaxFailures$1.evaluate(TestRuleIgnoreAfterMaxFailures.java:64)
	at org.apache.lucene.util.TestRuleMarkFailure$1.evaluate(TestRuleMarkFailure.java:47)
	at com.carrotsearch.randomizedtesting.rules.StatementAdapter.evaluate(StatementAdapter.java:36)
	at com.carrotsearch.randomizedtesting.ThreadLeakControl$StatementRunner.run(ThreadLeakControl.java:367)
	at com.carrotsearch.randomizedtesting.ThreadLeakControl.forkTimeoutingTask(ThreadLeakControl.java:809)
	at com.carrotsearch.randomizedtesting.ThreadLeakControl$3.evaluate(ThreadLeakControl.java:460)
	at com.carrotsearch.randomizedtesting.RandomizedRunner.runSingleTest(RandomizedRunner.java:880)
	at com.carrotsearch.randomizedtesting.RandomizedRunner$5.evaluate(RandomizedRunner.java:781)
	at com.carrotsearch.randomizedtesting.RandomizedRunner$6.evaluate(RandomizedRunner.java:816)
	at com.carrotsearch.randomizedtesting.RandomizedRunner$7.evaluate(RandomizedRunner.java:827)
	at com.carrotsearch.randomizedtesting.rules.StatementAdapter.evaluate(StatementAdapter.java:36)
	at com.carrotsearch.randomizedtesting.rules.SystemPropertiesRestoreRule$1.evaluate(SystemPropertiesRestoreRule.java:57)
	at org.apache.lucene.util.AbstractBeforeAfterRule$1.evaluate(AbstractBeforeAfterRule.java:45)
	at com.carrotsearch.randomizedtesting.rules.StatementAdapter.evaluate(StatementAdapter.java:36)
	at org.apache.lucene.util.TestRuleStoreClassName$1.evaluate(TestRuleStoreClassName.java:41)
	at com.carrotsearch.randomizedtesting.rules.NoShadowingOrOverridesOnMethodsRule$1.evaluate(NoShadowingOrOverridesOnMethodsRule.java:40)
	at com.carrotsearch.randomizedtesting.rules.NoShadowingOrOverridesOnMethodsRule$1.evaluate(NoShadowingOrOverridesOnMethodsRule.java:40)
	at com.carrotsearch.randomizedtesting.rules.StatementAdapter.evaluate(StatementAdapter.java:36)
	at com.carrotsearch.randomizedtesting.rules.StatementAdapter.evaluate(StatementAdapter.java:36)
	at com.carrotsearch.randomizedtesting.rules.StatementAdapter.evaluate(StatementAdapter.java:36)
	at org.apache.lucene.util.TestRuleAssertionsRequired$1.evaluate(TestRuleAssertionsRequired.java:53)
	at org.apache.lucene.util.TestRuleMarkFailure$1.evaluate(TestRuleMarkFailure.java:47)
	at org.apache.lucene.util.TestRuleIgnoreAfterMaxFailures$1.evaluate(TestRuleIgnoreAfterMaxFailures.java:64)
	at org.apache.lucene.util.TestRuleIgnoreTestSuites$1.evaluate(TestRuleIgnoreTestSuites.java:54)
	at com.carrotsearch.randomizedtesting.rules.StatementAdapter.evaluate(StatementAdapter.java:36)
	at com.carrotsearch.randomizedtesting.ThreadLeakControl$StatementRunner.run(ThreadLeakControl.java:367)
	at java.lang.Thread.run(Thread.java:745)




Build Log:
[...truncated 10661 lines...]
   [junit4] Suite: org.apache.solr.handler.TestReplicationHandler
   [junit4]   2> Creating dataDir: /x1/jenkins/jenkins-slave/workspace/Lucene-Solr-Tests-5.5-Java7/solr/build/solr-core/test/J0/temp/solr.handler.TestReplicationHandler_DDD47F54EA702C0-001/init-core-data-001
   [junit4]   2> 0    INFO  (TEST-TestReplicationHandler.doTestReplicateAfterStartupWithNoActivity-seed#[DDD47F54EA702C0]) [    ] o.a.s.SolrTestCaseJ4 ###Starting doTestReplicateAfterStartupWithNoActivity
   [junit4]   2> 8    INFO  (TEST-TestReplicationHandler.doTestReplicateAfterStartupWithNoActivity-seed#[DDD47F54EA702C0]) [    ] o.a.s.SolrTestCaseJ4 Writing core.properties file to /x1/jenkins/jenkins-slave/workspace/Lucene-Solr-Tests-5.5-Java7/solr/build/solr-core/test/J0/temp/solr.handler.TestReplicationHandler_DDD47F54EA702C0-001/solr-instance-001/collection1
   [junit4]   2> 97   INFO  (TEST-TestReplicationHandler.doTestReplicateAfterStartupWithNoActivity-seed#[DDD47F54EA702C0]) [    ] o.e.j.u.log Logging initialized @3186ms
   [junit4]   2> 442  INFO  (TEST-TestReplicationHandler.doTestReplicateAfterStartupWithNoActivity-seed#[DDD47F54EA702C0]) [    ] o.e.j.s.Server jetty-9.2.13.v20150730
   [junit4]   2> 545  INFO  (TEST-TestReplicationHandler.doTestReplicateAfterStartupWithNoActivity-seed#[DDD47F54EA702C0]) [    ] o.e.j.s.h.ContextHandler Started o.e.j.s.ServletContextHandler@2ab64063{/solr,null,AVAILABLE}
   [junit4]   2> 603  INFO  (TEST-TestReplicationHandler.doTestReplicateAfterStartupWithNoActivity-seed#[DDD47F54EA702C0]) [    ] o.e.j.s.ServerConnector Started ServerConnector@289a651e{HTTP/1.1}{127.0.0.1:50186}
   [junit4]   2> 604  INFO  (TEST-TestReplicationHandler.doTestReplicateAfterStartupWithNoActivity-seed#[DDD47F54EA702C0]) [    ] o.e.j.s.Server Started @3693ms
   [junit4]   2> 608  INFO  (TEST-TestReplicationHandler.doTestReplicateAfterStartupWithNoActivity-seed#[DDD47F54EA702C0]) [    ] o.a.s.c.s.e.JettySolrRunner Jetty properties: {solr.data.dir=/x1/jenkins/jenkins-slave/workspace/Lucene-Solr-Tests-5.5-Java7/solr/build/solr-core/test/J0/temp/solr.handler.TestReplicationHandler_DDD47F54EA702C0-001/solr-instance-001/collection1/data, hostPort=50186, hostContext=/solr}
   [junit4]   2> 626  INFO  (TEST-TestReplicationHandler.doTestReplicateAfterStartupWithNoActivity-seed#[DDD47F54EA702C0]) [    ] o.a.s.s.SolrDispatchFilter SolrDispatchFilter.init(): sun.misc.Launcher$AppClassLoader@3827de24
   [junit4]   2> 673  INFO  (TEST-TestReplicationHandler.doTestReplicateAfterStartupWithNoActivity-seed#[DDD47F54EA702C0]) [    ] o.a.s.c.SolrResourceLoader new SolrResourceLoader for directory: '/x1/jenkins/jenkins-slave/workspace/Lucene-Solr-Tests-5.5-Java7/solr/build/solr-core/test/J0/temp/solr.handler.TestReplicationHandler_DDD47F54EA702C0-001/solr-instance-001'
   [junit4]   2> 679  INFO  (TEST-TestReplicationHandler.doTestReplicateAfterStartupWithNoActivity-seed#[DDD47F54EA702C0]) [    ] o.a.s.c.SolrResourceLoader JNDI not configured for solr (NoInitialContextEx)
   [junit4]   2> 679  INFO  (TEST-TestReplicationHandler.doTestReplicateAfterStartupWithNoActivity-seed#[DDD47F54EA702C0]) [    ] o.a.s.c.SolrResourceLoader solr home defaulted to 'solr/' (could not find system property or JNDI)
   [junit4]   2> 688  INFO  (TEST-TestReplicationHandler.doTestReplicateAfterStartupWithNoActivity-seed#[DDD47F54EA702C0]) [    ] o.a.s.c.SolrXmlConfig Loading container configuration from /x1/jenkins/jenkins-slave/workspace/Lucene-Solr-Tests-5.5-Java7/solr/build/solr-core/test/J0/temp/solr.handler.TestReplicationHandler_DDD47F54EA702C0-001/solr-instance-001/solr.xml
   [junit4]   2> 840  INFO  (TEST-TestReplicationHandler.doTestReplicateAfterStartupWithNoActivity-seed#[DDD47F54EA702C0]) [    ] o.a.s.c.CorePropertiesLocator Config-defined core root directory: /x1/jenkins/jenkins-slave/workspace/Lucene-Solr-Tests-5.5-Java7/solr/build/solr-core/test/J0/temp/solr.handler.TestReplicationHandler_DDD47F54EA702C0-001/solr-instance-001/.
   [junit4]   2> 917  INFO  (TEST-TestReplicationHandler.doTestReplicateAfterStartupWithNoActivity-seed#[DDD47F54EA702C0]) [    ] o.a.s.c.CoreContainer New CoreContainer 428562760
   [junit4]   2> 917  INFO  (TEST-TestReplicationHandler.doTestReplicateAfterStartupWithNoActivity-seed#[DDD47F54EA702C0]) [    ] o.a.s.c.CoreContainer Loading cores into CoreContainer [instanceDir=/x1/jenkins/jenkins-slave/workspace/Lucene-Solr-Tests-5.5-Java7/solr/build/solr-core/test/J0/temp/solr.handler.TestReplicationHandler_DDD47F54EA702C0-001/solr-instance-001]
   [junit4]   2> 919  WARN  (TEST-TestReplicationHandler.doTestReplicateAfterStartupWithNoActivity-seed#[DDD47F54EA702C0]) [    ] o.a.s.c.CoreContainer Couldn't add files from /x1/jenkins/jenkins-slave/workspace/Lucene-Solr-Tests-5.5-Java7/solr/build/solr-core/test/J0/temp/solr.handler.TestReplicationHandler_DDD47F54EA702C0-001/solr-instance-001/lib to classpath: /x1/jenkins/jenkins-slave/workspace/Lucene-Solr-Tests-5.5-Java7/solr/build/solr-core/test/J0/temp/solr.handler.TestReplicationHandler_DDD47F54EA702C0-001/solr-instance-001/lib
   [junit4]   2> 952  INFO  (TEST-TestReplicationHandler.doTestReplicateAfterStartupWithNoActivity-seed#[DDD47F54EA702C0]) [    ] o.a.s.h.c.HttpShardHandlerFactory created with socketTimeout : 90000,urlScheme : ,connTimeout : 15000,maxConnectionsPerHost : 20,maxConnections : 10000,corePoolSize : 0,maximumPoolSize : 2147483647,maxThreadIdleTime : 5,sizeOfQueue : -1,fairnessPolicy : false,useRetries : false,
   [junit4]   2> 1352 INFO  (TEST-TestReplicationHandler.doTestReplicateAfterStartupWithNoActivity-seed#[DDD47F54EA702C0]) [    ] o.a.s.u.UpdateShardHandler Creating UpdateShardHandler HTTP client with params: socketTimeout=340000&connTimeout=45000&retry=true
   [junit4]   2> 1358 INFO  (TEST-TestReplicationHandler.doTestReplicateAfterStartupWithNoActivity-seed#[DDD47F54EA702C0]) [    ] o.a.s.l.LogWatcher SLF4J impl is org.slf4j.impl.Log4jLoggerFactory
   [junit4]   2> 1359 INFO  (TEST-TestReplicationHandler.doTestReplicateAfterStartupWithNoActivity-seed#[DDD47F54EA702C0]) [    ] o.a.s.l.LogWatcher Registering Log Listener [Log4j (org.slf4j.impl.Log4jLoggerFactory)]
   [junit4]   2> 1364 INFO  (TEST-TestReplicationHandler.doTestReplicateAfterStartupWithNoActivity-seed#[DDD47F54EA702C0]) [    ] o.a.s.c.CoreContainer Security conf doesn't exist. Skipping setup for authorization module.
   [junit4]   2> 1365 INFO  (TEST-TestReplicationHandler.doTestReplicateAfterStartupWithNoActivity-seed#[DDD47F54EA702C0]) [    ] o.a.s.c.CoreContainer No authentication plugin used.
   [junit4]   2> 1463 INFO  (TEST-TestReplicationHandler.doTestReplicateAfterStartupWithNoActivity-seed#[DDD47F54EA702C0]) [    ] o.a.s.c.CorePropertiesLocator Looking for core definitions underneath /x1/jenkins/jenkins-slave/workspace/Lucene-Solr-Tests-5.5-Java7/solr/build/solr-core/test/J0/temp/solr.handler.TestReplicationHandler_DDD47F54EA702C0-001/solr-instance-001/.
   [junit4]   2> 1475 INFO  (TEST-TestReplicationHandler.doTestReplicateAfterStartupWithNoActivity-seed#[DDD47F54EA702C0]) [    ] o.a.s.c.CoreDescriptor Created CoreDescriptor: {configSetProperties=configsetprops.json, dataDir=data/, config=solrconfig.xml, name=collection1, transient=false, loadOnStartup=true, schema=schema.xml}
   [junit4]   2> 1475 INFO  (TEST-TestReplicationHandler.doTestReplicateAfterStartupWithNoActivity-seed#[DDD47F54EA702C0]) [    ] o.a.s.c.CorePropertiesLocator Found core collection1 in /x1/jenkins/jenkins-slave/workspace/Lucene-Solr-Tests-5.5-Java7/solr/build/solr-core/test/J0/temp/solr.handler.TestReplicationHandler_DDD47F54EA702C0-001/solr-instance-001/./collection1
   [junit4]   2> 1476 INFO  (TEST-TestReplicationHandler.doTestReplicateAfterStartupWithNoActivity-seed#[DDD47F54EA702C0]) [    ] o.a.s.c.CorePropertiesLocator Found 1 core definitions
   [junit4]   2> 1492 INFO  (TEST-TestReplicationHandler.doTestReplicateAfterStartupWithNoActivity-seed#[DDD47F54EA702C0]) [    ] o.a.s.s.SolrDispatchFilter user.dir=/x1/jenkins/jenkins-slave/workspace/Lucene-Solr-Tests-5.5-Java7/solr/build/solr-core/test/J0
   [junit4]   2> 1492 INFO  (TEST-TestReplicationHandler.doTestReplicateAfterStartupWithNoActivity-seed#[DDD47F54EA702C0]) [    ] o.a.s.s.SolrDispatchFilter SolrDispatchFilter.init() done
   [junit4]   2> 1494 INFO  (coreLoadExecutor-6-thread-1) [    ] o.a.s.c.SolrResourceLoader new SolrResourceLoader for directory: '/x1/jenkins/jenkins-slave/workspace/Lucene-Solr-Tests-5.5-Java7/solr/build/solr-core/test/J0/temp/solr.handler.TestReplicationHandler_DDD47F54EA702C0-001/solr-instance-001/collection1'
   [junit4]   2> 1496 INFO  (coreLoadExecutor-6-thread-1) [    ] o.a.s.c.SolrResourceLoader JNDI not configured for solr (NoInitialContextEx)
   [junit4]   2> 1500 INFO  (coreLoadExecutor-6-thread-1) [    ] o.a.s.c.SolrResourceLoader solr home defaulted to 'solr/' (could not find system property or JNDI)
   [junit4]   2> 1562 INFO  (coreLoadExecutor-6-thread-1) [    ] o.a.s.c.SolrConfig current version of requestparams : -1
   [junit4]   2> 1669 INFO  (coreLoadExecutor-6-thread-1) [    ] o.a.s.c.SolrConfig Using Lucene MatchVersion: 5.5.0
   [junit4]   2> 1901 INFO  (coreLoadExecutor-6-thread-1) [    ] o.a.s.c.SolrConfig Loaded SolrConfig: solrconfig.xml
   [junit4]   2> 1924 INFO  (coreLoadExecutor-6-thread-1) [    ] o.a.s.s.IndexSchema [collection1] Schema name=test
   [junit4]   2> 2034 INFO  (coreLoadExecutor-6-thread-1) [    ] o.a.s.s.IndexSchema unique key field: id
   [junit4]   2> 2042 INFO  (coreLoadExecutor-6-thread-1) [    ] o.a.s.c.ConfigSetProperties Did not find ConfigSet properties, assuming default properties: Can't find resource 'configsetprops.json' in classpath or '/x1/jenkins/jenkins-slave/workspace/Lucene-Solr-Tests-5.5-Java7/solr/build/solr-core/test/J0/temp/solr.handler.TestReplicationHandler_DDD47F54EA702C0-001/solr-instance-001/collection1'
   [junit4]   2> 2044 INFO  (coreLoadExecutor-6-thread-1) [    ] o.a.s.c.CoreContainer Creating SolrCore 'collection1' using configuration from instancedir /x1/jenkins/jenkins-slave/workspace/Lucene-Solr-Tests-5.5-Java7/solr/build/solr-core/test/J0/temp/solr.handler.TestReplicationHandler_DDD47F54EA702C0-001/solr-instance-001/./collection1
   [junit4]   2> 2125 INFO  (coreLoadExecutor-6-thread-1) [    x:collection1] o.a.s.c.SolrCore org.apache.solr.core.MockDirectoryFactory
   [junit4]   2> 2155 INFO  (coreLoadExecutor-6-thread-1) [    x:collection1] o.a.s.c.SolrCore [[collection1] ] Opening new SolrCore at [/x1/jenkins/jenkins-slave/workspace/Lucene-Solr-Tests-5.5-Java7/solr/build/solr-core/test/J0/temp/solr.handler.TestReplicationHandler_DDD47F54EA702C0-001/solr-instance-001/collection1], dataDir=[/x1/jenkins/jenkins-slave/workspace/Lucene-Solr-Tests-5.5-Java7/solr/build/solr-core/test/J0/temp/solr.handler.TestReplicationHandler_DDD47F54EA702C0-001/solr-instance-001/./collection1/data/]
   [junit4]   2> 2156 INFO  (coreLoadExecutor-6-thread-1) [    x:collection1] o.a.s.c.SolrCore JMX monitoring not detected for core: collection1
   [junit4]   2> 2200 INFO  (coreLoadExecutor-6-thread-1) [    x:collection1] o.a.s.c.CachingDirectoryFactory return new directory for /x1/jenkins/jenkins-slave/workspace/Lucene-Solr-Tests-5.5-Java7/solr/build/solr-core/test/J0/temp/solr.handler.TestReplicationHandler_DDD47F54EA702C0-001/solr-instance-001/./collection1/data
   [junit4]   2> 2200 INFO  (coreLoadExecutor-6-thread-1) [    x:collection1] o.a.s.c.SolrCore New index directory detected: old=null new=/x1/jenkins/jenkins-slave/workspace/Lucene-Solr-Tests-5.5-Java7/solr/build/solr-core/test/J0/temp/solr.handler.TestReplicationHandler_DDD47F54EA702C0-001/solr-instance-001/./collection1/data/index/
   [junit4]   2> 2201 WARN  (coreLoadExecutor-6-thread-1) [    x:collection1] o.a.s.c.SolrCore [collection1] Solr index directory '/x1/jenkins/jenkins-slave/workspace/Lucene-Solr-Tests-5.5-Java7/solr/build/solr-core/test/J0/temp/solr.handler.TestReplicationHandler_DDD47F54EA702C0-001/solr-instance-001/./collection1/data/index' doesn't exist. Creating new index...
   [junit4]   2> 2216 INFO  (coreLoadExecutor-6-thread-1) [    x:collection1] o.a.s.c.CachingDirectoryFactory return new directory for /x1/jenkins/jenkins-slave/workspace/Lucene-Solr-Tests-5.5-Java7/solr/build/solr-core/test/J0/temp/solr.handler.TestReplicationHandler_DDD47F54EA702C0-001/solr-instance-001/./collection1/data/index
   [junit4]   2> 2224 INFO  (coreLoadExecutor-6-thread-1) [    x:collection1] o.a.s.u.RandomMergePolicy RandomMergePolicy wrapping class org.apache.lucene.index.AlcoholicMergePolicy: [AlcoholicMergePolicy: minMergeSize=0, mergeFactor=10, maxMergeSize=458547295, maxMergeSizeForForcedMerge=9223372036854775807, calibrateSizeByDeletes=true, maxMergeDocs=2147483647, maxCFSSegmentSizeMB=8.796093022207999E12, noCFSRatio=0.1]
   [junit4]   2> 2286 INFO  (coreLoadExecutor-6-thread-1) [    x:collection1] o.a.s.c.SolrDeletionPolicy SolrDeletionPolicy.onCommit: commits: num=1
   [junit4]   2> 	commit{dir=MockDirectoryWrapper(RAMDirectory@26e3c0e3 lockFactory=org.apache.lucene.store.SingleInstanceLockFactory@328c8b07),segFN=segments_1,generation=1}
   [junit4]   2> 2287 INFO  (coreLoadExecutor-6-thread-1) [    x:collection1] o.a.s.c.SolrDeletionPolicy newest commit generation = 1
   [junit4]   2> 2301 INFO  (OldIndexDirectoryCleanupThreadForCore-collection1) [    x:collection1] o.a.s.c.SolrCore Looking for old index directories to cleanup for core collection1 in /x1/jenkins/jenkins-slave/workspace/Lucene-Solr-Tests-5.5-Java7/solr/build/solr-core/test/J0/temp/solr.handler.TestReplicationHandler_DDD47F54EA702C0-001/solr-instance-001/./collection1/data/
   [junit4]   2> 2554 INFO  (coreLoadExecutor-6-thread-1) [    x:collection1] o.a.s.c.SolrCore no updateRequestProcessorChain defined as default, creating implicit default
   [junit4]   2> 2623 INFO  (coreLoadExecutor-6-thread-1) [    x:collection1] o.a.s.h.l.XMLLoader xsltCacheLifetimeSeconds=60
   [junit4]   2> 2630 INFO  (coreLoadExecutor-6-thread-1) [    x:collection1] o.a.s.h.l.XMLLoader xsltCacheLifetimeSeconds=60
   [junit4]   2> 2632 INFO  (coreLoadExecutor-6-thread-1) [    x:collection1] o.a.s.h.l.XMLLoader xsltCacheLifetimeSeconds=60
   [junit4]   2> 2634 INFO  (coreLoadExecutor-6-thread-1) [    x:collection1] o.a.s.h.l.XMLLoader xsltCacheLifetimeSeconds=60
   [junit4]   2> 2660 INFO  (coreLoadExecutor-6-thread-1) [    x:collection1] o.a.s.c.PluginBag requestHandler : 'lazy' created with startup=lazy 
   [junit4]   2> 2661 INFO  (coreLoadExecutor-6-thread-1) [    x:collection1] o.a.s.c.RequestHandlers Registered paths: /update,/admin/file,lazy,/admin/properties,/config,/admin/mbeans,/update/json,/get,/admin/system,/replication,/update/json/docs,defaults,/admin/plugins,/admin/ping,standard,/update/csv,/admin/luke,/admin/segments,/admin/threads,/admin/logging,/schema
   [junit4]   2> 2665 INFO  (coreLoadExecutor-6-thread-1) [    x:collection1] o.a.s.c.SolrCore Using default statsCache cache: org.apache.solr.search.stats.LocalStatsCache
   [junit4]   2> 2683 INFO  (coreLoadExecutor-6-thread-1) [    x:collection1] o.a.s.u.CommitTracker Hard AutoCommit: disabled
   [junit4]   2> 2684 INFO  (coreLoadExecutor-6-thread-1) [    x:collection1] o.a.s.u.CommitTracker Soft AutoCommit: disabled
   [junit4]   2> 2684 INFO  (coreLoadExecutor-6-thread-1) [    x:collection1] o.a.s.u.RandomMergePolicy RandomMergePolicy wrapping class org.apache.lucene.index.LogByteSizeMergePolicy: [LogByteSizeMergePolicy: minMergeSize=1677721, mergeFactor=23, maxMergeSize=2147483648, maxMergeSizeForForcedMerge=9223372036854775807, calibrateSizeByDeletes=true, maxMergeDocs=2147483647, maxCFSSegmentSizeMB=8.796093022207999E12, noCFSRatio=0.0]
   [junit4]   2> 2688 INFO  (coreLoadExecutor-6-thread-1) [    x:collection1] o.a.s.c.SolrDeletionPolicy SolrDeletionPolicy.onInit: commits: num=1
   [junit4]   2> 	commit{dir=MockDirectoryWrapper(RAMDirectory@26e3c0e3 lockFactory=org.apache.lucene.store.SingleInstanceLockFactory@328c8b07),segFN=segments_1,generation=1}
   [junit4]   2> 2689 INFO  (coreLoadExecutor-6-thread-1) [    x:collection1] o.a.s.c.SolrDeletionPolicy newest commit generation = 1
   [junit4]   2> 2718 INFO  (coreLoadExecutor-6-thread-1) [    x:collection1] o.a.s.s.SolrIndexSearcher Opening Searcher@5b33e8d6[collection1] main
   [junit4]   2> 2732 INFO  (coreLoadExecutor-6-thread-1) [    x:collection1] o.a.s.r.ManagedResourceStorage File-based storage initialized to use dir: /x1/jenkins/jenkins-slave/workspace/Lucene-Solr-Tests-5.5-Java7/solr/build/solr-core/test/J0/temp/solr.handler.TestReplicationHandler_DDD47F54EA702C0-001/solr-instance-001/collection1/conf
   [junit4]   2> 2732 INFO  (coreLoadExecutor-6-thread-1) [    x:collection1] o.a.s.r.RestManager Initializing RestManager with initArgs: {storageDir=/x1/jenkins/jenkins-slave/workspace/Lucene-Solr-Tests-5.5-Java7/solr/build/solr-core/test/J0/temp/solr.handler.TestReplicationHandler_DDD47F54EA702C0-001/solr-instance-001/collection1/conf}
   [junit4]   2> 2755 INFO  (coreLoadExecutor-6-thread-1) [    x:collection1] o.a.s.r.ManagedResourceStorage Reading _rest_managed.json using file:dir=/x1/jenkins/jenkins-slave/workspace/Lucene-Solr-Tests-5.5-Java7/solr/build/solr-core/test/J0/temp/solr.handler.TestReplicationHandler_DDD47F54EA702C0-001/solr-instance-001/collection1/conf
   [junit4]   2> 2756 INFO  (coreLoadExecutor-6-thread-1) [    x:collection1] o.a.s.r.RestManager Initializing 0 registered ManagedResources
   [junit4]   2> 2780 INFO  (coreLoadExecutor-6-thread-1) [    x:collection1] o.a.s.h.ReplicationHandler Replication enabled for following config files: schema.xml,xslt/dummy.xsl
   [junit4]   2> 2781 INFO  (coreLoadExecutor-6-thread-1) [    x:collection1] o.a.s.h.ReplicationHandler Commits will be reserved for  10000
   [junit4]   2> 2783 INFO  (searcherExecutor-7-thread-1-processing-x:collection1) [    x:collection1] o.a.s.c.SolrCore [collection1] Registered new searcher Searcher@5b33e8d6[collection1] main{ExitableDirectoryReader(UninvertingDirectoryReader())}
   [junit4]   2> 2785 INFO  (coreLoadExecutor-6-thread-1) [    x:collection1] o.a.s.c.CoreContainer registering core: collection1
   [junit4]   2> 3032 INFO  (TEST-TestReplicationHandler.doTestReplicateAfterStartupWithNoActivity-seed#[DDD47F54EA702C0]) [    ] o.a.s.SolrTestCaseJ4 Writing core.properties file to /x1/jenkins/jenkins-slave/workspace/Lucene-Solr-Tests-5.5-Java7/solr/build/solr-core/test/J0/temp/solr.handler.TestReplicationHandler_DDD47F54EA702C0-001/solr-instance-002/collection1
   [junit4]   2> 3068 INFO  (TEST-TestReplicationHandler.doTestReplicateAfterStartupWithNoActivity-seed#[DDD47F54EA702C0]) [    ] o.e.j.s.Server jetty-9.2.13.v20150730
   [junit4]   2> 3118 INFO  (TEST-TestReplicationHandler.doTestReplicateAfterStartupWithNoActivity-seed#[DDD47F54EA702C0]) [    ] o.e.j.s.h.ContextHandler Started o.e.j.s.ServletContextHandler@72bf74f2{/solr,null,AVAILABLE}
   [junit4]   2> 3119 INFO  (TEST-TestReplicationHandler.doTestReplicateAfterStartupWithNoActivity-seed#[DDD47F54EA702C0]) [    ] o.e.j.s.ServerConnector Started ServerConnector@581fe75e{HTTP/1.1}{127.0.0.1:52156}
   [junit4]   2> 3119 INFO  (TEST-TestReplicationHandler.doTestReplicateAfterStartupWithNoActivity-seed#[DDD47F54EA702C0]) [    ] o.e.j.s.Server Started @6209ms
   [junit4]   2> 3120 INFO  (TEST-TestReplicationHandler.doTestReplicateAfterStartupWithNoActivity-seed#[DDD47F54EA702C0]) [    ] o.a.s.c.s.e.JettySolrRunner Jetty properties: {hostContext=/solr, hostPort=52156, solr.data.dir=/x1/jenkins/jenkins-slave/workspace/Lucene-Solr-Tests-5.5-Java7/solr/build/solr-core/test/J0/temp/solr.handler.TestReplicationHandler_DDD47F54EA702C0-001/solr-instance-002/collection1/data}
   [junit4]   2> 3121 INFO  (TEST-TestReplicationHandler.doTestReplicateAfterStartupWithNoActivity-seed#[DDD47F54EA702C0]) [    ] o.a.s.s.SolrDispatchFilter SolrDispatchFilter.init(): sun.misc.Launcher$AppClassLoader@3827de24
   [junit4]   2> 3122 INFO  (TEST-TestReplicationHandler.doTestReplicateAfterStartupWithNoActivity-seed#[DDD47F54EA702C0]) [    ] o.a.s.c.SolrResourceLoader new SolrResourceLoader for directory: '/x1/jenkins/jenkins-slave/workspace/Lucene-Solr-Tests-5.5-Java7/solr/build/solr-core/test/J0/temp/solr.handler.TestReplicationHandler_DDD47F54EA702C0-001/solr-instance-002'
   [junit4]   2> 3122 INFO  (TEST-TestReplicationHandler.doTestReplicateAfterStartupWithNoActivity-seed#[DDD47F54EA702C0]) [    ] o.a.s.c.SolrResourceLoader JNDI not configured for solr (NoInitialContextEx)
   [junit4]   2> 3122 INFO  (TEST-TestReplicationHandler.doTestReplicateAfterStartupWithNoActivity-seed#[DDD47F54EA702C0]) [    ] o.a.s.c.SolrResourceLoader solr home defaulted to 'solr/' (could not find system property or JNDI)
   [junit4]   2> 3123 INFO  (TEST-TestReplicationHandler.doTestReplicateAfterStartupWithNoActivity-seed#[DDD47F54EA702C0]) [    ] o.a.s.c.SolrXmlConfig Loading container configuration from /x1/jenkins/jenkins-slave/workspace/Lucene-Solr-Tests-5.5-Java7/solr/build/solr-core/test/J0/temp/solr.handler.TestReplicationHandler_DDD47F54EA702C0-001/solr-instance-002/solr.xml
   [junit4]   2> 3159 INFO  (TEST-TestReplicationHandler.doTestReplicateAfterStartupWithNoActivity-seed#[DDD47F54EA702C0]) [    ] o.a.s.c.CorePropertiesLocator Config-defined core root directory: /x1/jenkins/jenkins-slave/workspace/Lucene-Solr-Tests-5.5-Java7/solr/build/solr-core/test/J0/temp/solr.handler.TestReplicationHandler_DDD47F54EA702C0-001/solr-instance-002/.
   [junit4]   2> 3159 INFO  (TEST-TestReplicationHandler.doTestReplicateAfterStartupWithNoActivity-seed#[DDD47F54EA702C0]) [    ] o.a.s.c.CoreContainer New CoreContainer 768318596
   [junit4]   2> 3159 INFO  (TEST-TestReplicationHandler.doTestReplicateAfterStartupWithNoActivity-seed#[DDD47F54EA702C0]) [    ] o.a.s.c.CoreContainer Loading cores into CoreContainer [instanceDir=/x1/jenkins/jenkins-slave/workspace/Lucene-Solr-Tests-5.5-Java7/solr/build/solr-core/test/J0/temp/solr.handler.TestReplicationHandler_DDD47F54EA702C0-001/solr-instance-002]
   [junit4]   2> 3160 WARN  (TEST-TestReplicationHandler.doTestReplicateAfterStartupWithNoActivity-seed#[DDD47F54EA702C0]) [    ] o.a.s.c.CoreContainer Couldn't add files from /x1/jenkins/jenkins-slave/workspace/Lucene-Solr-Tests-5.5-Java7/solr/build/solr-core/test/J0/temp/solr.handler.TestReplicationHandler_DDD47F54EA702C0-001/solr-instance-002/lib to classpath: /x1/jenkins/jenkins-slave/workspace/Lucene-Solr-Tests-5.5-Java7/solr/build/solr-core/test/J0/temp/solr.handler.TestReplicationHandler_DDD47F54EA702C0-001/solr-instance-002/lib
   [junit4]   2> 3160 INFO  (TEST-TestReplicationHandler.doTestReplicateAfterStartupWithNoActivity-seed#[DDD47F54EA702C0]) [    ] o.a.s.h.c.HttpShardHandlerFactory created with socketTimeout : 90000,urlScheme : ,connTimeout : 15000,maxConnectionsPerHost : 20,maxConnections : 10000,corePoolSize : 0,maximumPoolSize : 2147483647,maxThreadIdleTime : 5,sizeOfQueue : -1,fairnessPolicy : false,useRetries : false,
   [junit4]   2> 3162 INFO  (TEST-TestReplicationHandler.doTestReplicateAfterStartupWithNoActivity-seed#[DDD47F54EA702C0]) [    ] o.a.s.u.UpdateShardHandler Creating UpdateShardHandler HTTP client with params: socketTimeout=340000&connTimeout=45000&retry=true
   [junit4]   2> 3163 INFO  (TEST-TestReplicationHandler.doTestReplicateAfterStartupWithNoActivity-seed#[DDD47F54EA702C0]) [    ] o.a.s.l.LogWatcher SLF4J impl is org.slf4j.impl.Log4jLoggerFactory
   [junit4]   2> 3163 INFO  (TEST-TestReplicationHandler.doTestReplicateAfterStartupWithNoActivity-seed#[DDD47F54EA702C0]) [    ] o.a.s.l.LogWatcher Registering Log Listener [Log4j (org.slf4j.impl.Log4jLoggerFactory)]
   [junit4]   2> 3164 INFO  (TEST-TestReplicationHandler.doTestReplicateAfterStartupWithNoActivity-seed#[DDD47F54EA702C0]) [    ] o.a.s.c.CoreContainer Security conf doesn't exist. Skipping setup for authorization module.
   [junit4]   2> 3164 INFO  (TEST-TestReplicationHandler.doTestReplicateAfterStartupWithNoActivity-seed#[DDD47F54EA702C0]) [    ] o.a.s.c.CoreContainer No authentication plugin used.
   [junit4]   2> 3165 INFO  (TEST-TestReplicationHandler.doTestReplicateAfterStartupWithNoActivity-seed#[DDD47F54EA702C0]) [    ] o.a.s.c.CorePropertiesLocator Looking for core definitions underneath /x1/jenkins/jenkins-slave/workspace/Lucene-Solr-Tests-5.5-Java7/solr/build/solr-core/test/J0/temp/solr.handler.TestReplicationHandler_DDD47F54EA702C0-001/solr-instance-002/.
   [junit4]   2> 3168 INFO  (TEST-TestReplicationHandler.doTestReplicateAfterStartupWithNoActivity-seed#[DDD47F54EA702C0]) [    ] o.a.s.c.CoreDescriptor Created CoreDescriptor: {transient=false, schema=schema.xml, config=solrconfig.xml, name=collection1, loadOnStartup=true, configSetProperties=configsetprops.json, dataDir=data/}
   [junit4]   2> 3168 INFO  (TEST-TestReplicationHandler.doTestReplicateAfterStartupWithNoActivity-seed#[DDD47F54EA702C0]) [    ] o.a.s.c.CorePropertiesLocator Found core collection1 in /x1/jenkins/jenkins-slave/workspace/Lucene-Solr-Tests-5.5-Java7/solr/build/solr-core/test/J0/temp/solr.handler.TestReplicationHandler_DDD47F54EA702C0-001/solr-instance-002/./collection1
   [junit4]   2> 3169 INFO  (TEST-TestReplicationHandler.doTestReplicateAfterStartupWithNoActivity-seed#[DDD47F54EA702C0]) [    ] o.a.s.c.CorePropertiesLocator Found 1 core definitions
   [junit4]   2> 3180 INFO  (TEST-TestReplicationHandler.doTestReplicateAfterStartupWithNoActivity-seed#[DDD47F54EA702C0]) [    ] o.a.s.s.SolrDispatchFilter user.dir=/x1/jenkins/jenkins-slave/workspace/Lucene-Solr-Tests-5.5-Java7/solr/build/solr-core/test/J0
   [junit4]   2> 3180 INFO  (TEST-TestReplicationHandler.doTestReplicateAfterStartupWithNoActivity-seed#[DDD47F54EA702C0]) [    ] o.a.s.s.SolrDispatchFilter SolrDispatchFilter.init() done
   [junit4]   2> 3184 INFO  (coreLoadExecutor-16-thread-1) [    ] o.a.s.c.SolrResourceLoader new SolrResourceLoader for directory: '/x1/jenkins/jenkins-slave/workspace/Lucene-Solr-Tests-5.5-Java7/solr/build/solr-core/test/J0/temp/solr.handler.TestReplicationHandler_DDD47F54EA702C0-001/solr-instance-002/collection1'
   [junit4]   2> 3185 INFO  (coreLoadExecutor-16-thread-1) [    ] o.a.s.c.SolrResourceLoader JNDI not configured for solr (NoInitialContextEx)
   [junit4]   2> 3185 INFO  (coreLoadExecutor-16-thread-1) [    ] o.a.s.c.SolrResourceLoader solr home defaulted to 'solr/' (could not find system property or JNDI)
   [junit4]   2> 3205 INFO  (coreLoadExecutor-16-thread-1) [    ] o.a.s.c.SolrConfig current version of requestparams : -1
   [junit4]   2> 3250 INFO  (coreLoadExecutor-16-thread-1) [    ] o.a.s.c.SolrConfig Using Lucene MatchVersion: 5.5.0
   [junit4]   2> 3390 INFO  (coreLoadExecutor-16-thread-1) [    ] o.a.s.c.SolrConfig Loaded SolrConfig: solrconfig.xml
   [junit4]   2> 3412 INFO  (coreLoadExecutor-16-thread-1) [    ] o.a.s.s.IndexSchema [collection1] Schema name=test
   [junit4]   2> 3439 INFO  (coreLoadExecutor-16-thread-1) [    ] o.a.s.s.IndexSchema unique key field: id
   [junit4]   2> 3442 INFO  (coreLoadExecutor-16-thread-1) [    ] o.a.s.c.ConfigSetProperties Did not find ConfigSet properties, assuming default properties: Can't find resource 'configsetprops.json' in classpath or '/x1/jenkins/jenkins-slave/workspace/Lucene-Solr-Tests-5.5-Java7/solr/build/solr-core/test/J0/temp/solr.handler.TestReplicationHandler_DDD47F54EA702C0-001/solr-instance-002/collection1'
   [junit4]   2> 3443 INFO  (coreLoadExecutor-16-thread-1) [    ] o.a.s.c.CoreContainer Creating SolrCore 'collection1' using configuration from instancedir /x1/jenkins/jenkins-slave/workspace/Lucene-Solr-Tests-5.5-Java7/solr/build/solr-core/test/J0/temp/solr.handler.TestReplicationHandler_DDD47F54EA702C0-001/solr-instance-002/./collection1
   [junit4]   2> 3443 INFO  (coreLoadExecutor-16-thread-1) [    x:collection1] o.a.s.c.SolrCore org.apache.solr.core.MockDirectoryFactory
   [junit4]   2> 3444 INFO  (coreLoadExecutor-16-thread-1) [    x:collection1] o.a.s.c.SolrCore [[collection1] ] Opening new SolrCore at [/x1/jenkins/jenkins-slave/workspace/Lucene-Solr-Tests-5.5-Java7/solr/build/solr-core/test/J0/temp/solr.handler.TestReplicationHandler_DDD47F54EA702C0-001/solr-instance-002/collection1], dataDir=[/x1/jenkins/jenkins-slave/workspace/Lucene-Solr-Tests-5.5-Java7/solr/build/solr-core/test/J0/temp/solr.handler.TestReplicationHandler_DDD47F54EA702C0-001/solr-instance-002/./collection1/data/]
   [junit4]   2> 3444 INFO  (coreLoadExecutor-16-thread-1) [    x:collection1] o.a.s.c.SolrCore JMX monitoring not detected for core: collection1
   [junit4]   2> 3445 INFO  (coreLoadExecutor-16-thread-1) [    x:collection1] o.a.s.c.CachingDirectoryFactory return new directory for /x1/jenkins/jenkins-slave/workspace/Lucene-Solr-Tests-5.5-Java7/solr/build/solr-core/test/J0/temp/solr.handler.TestReplicationHandler_DDD47F54EA702C0-001/solr-instance-002/./collection1/data
   [junit4]   2> 3445 INFO  (coreLoadExecutor-16-thread-1) [    x:collection1] o.a.s.c.SolrCore New index directory detected: old=null new=/x1/jenkins/jenkins-slave/workspace/Lucene-Solr-Tests-5.5-Java7/solr/build/solr-core/test/J0/temp/solr.handler.TestReplicationHandler_DDD47F54EA702C0-001/solr-instance-002/./collection1/data/index/
   [junit4]   2> 3446 WARN  (coreLoadExecutor-16-thread-1) [    x:collection1] o.a.s.c.SolrCore [collection1] Solr index directory '/x1/jenkins/jenkins-slave/workspace/Lucene-Solr-Tests-5.5-Java7/solr/build/solr-core/test/J0/temp/solr.handler.TestReplicationHandler_DDD47F54EA702C0-001/solr-instance-002/./collection1/data/index' doesn't exist. Creating new index...
   [junit4]   2> 3446 INFO  (coreLoadExecutor-16-thread-1) [    x:collection1] o.a.s.c.CachingDirectoryFactory return new directory for /x1/jenkins/jenkins-slave/workspace/Lucene-Solr-Tests-5.5-Java7/solr/build/solr-core/test/J0/temp/solr.handler.TestReplicationHandler_DDD47F54EA702C0-001/solr-instance-002/./collection1/data/index
   [junit4]   2> 3447 INFO  (coreLoadExecutor-16-thread-1) [    x:collection1] o.a.s.u.RandomMergePolicy RandomMergePolicy wrapping class org.apache.lucene.index.AlcoholicMergePolicy: [AlcoholicMergePolicy: minMergeSize=0, mergeFactor=10, maxMergeSize=458547295, maxMergeSizeForForcedMerge=9223372036854775807, calibrateSizeByDeletes=true, maxMergeDocs=2147483647, maxCFSSegmentSizeMB=8.796093022207999E12, noCFSRatio=0.1]
   [junit4]   2> 3448 INFO  (coreLoadExecutor-16-thread-1) [    x:collection1] o.a.s.c.SolrDeletionPolicy SolrDeletionPolicy.onCommit: commits: num=1
   [junit4]   2> 	commit{dir=MockDirectoryWrapper(RAMDirectory@4738c0c2 lockFactory=org.apache.lucene.store.SingleInstanceLockFactory@5ef72515),segFN=segments_1,generation=1}
   [junit4]   2> 3449 INFO  (coreLoadExecutor-16-thread-1) [    x:collection1] o.a.s.c.SolrDeletionPolicy newest commit generation = 1
   [junit4]   2> 3454 INFO  (OldIndexDirectoryCleanupThreadForCore-collection1) [    x:collection1] o.a.s.c.SolrCore Looking for old index directories to cleanup for core collection1 in /x1/jenkins/jenkins-slave/workspace/Lucene-Solr-Tests-5.5-Java7/solr/build/solr-core/test/J0/temp/solr.handler.TestReplicationHandler_DDD47F54EA702C0-001/solr-instance-002/./collection1/data/
   [junit4]   2> 3471 INFO  (coreLoadExecutor-16-thread-1) [    x:collection1] o.a.s.c.SolrCore no updateRequestProcessorChain defined as default, creating implicit default
   [junit4]   2> 3476 INFO  (coreLoadExecutor-16-thread-1) [    x:collection1] o.a.s.h.l.XMLLoader xsltCacheLifetimeSeconds=60
   [junit4]   2> 3478 INFO  (coreLoadExecutor-16-thread-1) [    x:collection1] o.a.s.h.l.XMLLoader xsltCacheLifetimeSeconds=60
   [junit4]   2> 3480 INFO  (coreLoadExecutor-16-thread-1) [    x:collection1] o.a.s.h.l.XMLLoader xsltCacheLifetimeSeconds=60
   [junit4]   2> 3482 INFO  (coreLoadExecutor-16-thread-1) [    x:collection1] o.a.s.h.l.XMLLoader xsltCacheLifetimeSeconds=60
   [junit4]   2> 3487 INFO  (coreLoadExecutor-16-thread-1) [    x:collection1] o.a.s.c.PluginBag requestHandler : 'lazy' created with startup=lazy 
   [junit4]   2> 3487 INFO  (coreLoadExecutor-16-thread-1) [    x:collection1] o.a.s.c.RequestHandlers Registered paths: /update,/admin/file,lazy,/admin/properties,/config,/admin/mbeans,/update/json,/get,/admin/system,/replication,/update/json/docs,defaults,/admin/plugins,/admin/ping,standard,/update/csv,/admin/luke,/admin/segments,/admin/threads,/admin/logging,/schema
   [junit4]   2> 3490 INFO  (coreLoadExecutor-16-thread-1) [    x:collection1] o.a.s.c.SolrCore Using default statsCache cache: org.apache.solr.search.stats.LocalStatsCache
   [junit4]   2> 3496 INFO  (coreLoadExecutor-16-thread-1) [    x:collection1] o.a.s.u.CommitTracker Hard AutoCommit: disabled
   [junit4]   2> 3498 INFO  (coreLoadExecutor-16-thread-1) [    x:collection1] o.a.s.u.CommitTracker Soft AutoCommit: disabled
   [junit4]   2> 3499 INFO  (coreLoadExecutor-16-thread-1) [    x:collection1] o.a.s.u.RandomMergePolicy RandomMergePolicy wrapping class org.apache.lucene.index.LogByteSizeMergePolicy: [LogByteSizeMergePolicy: minMergeSize=1677721, mergeFactor=23, maxMergeSize=2147483648, maxMergeSizeForForcedMerge=9223372036854775807, calibrateSizeByDeletes=true, maxMergeDocs=2147483647, maxCFSSegmentSizeMB=8.796093022207999E12, noCFSRatio=0.0]
   [junit4]   2> 3499 INFO  (coreLoadExecutor-16-thread-1) [    x:collection1] o.a.s.c.SolrDeletionPolicy SolrDeletionPolicy.onInit: commits: num=1
   [junit4]   2> 	commit{dir=MockDirectoryWrapper(RAMDirectory@4738c0c2 lockFactory=org.apache.lucene.store.SingleInstanceLockFactory@5ef72515),segFN=segments_1,generation=1}
   [junit4]   2> 3500 INFO  (coreLoadExecutor-16-thread-1) [    x:collection1] o.a.s.c.SolrDeletionPolicy newest commit generation = 1
   [junit4]   2> 3500 INFO  (coreLoadExecutor-16-thread-1) [    x:collection1] o.a.s.s.SolrIndexSearcher Opening Searcher@8aea957[collection1] main
   [junit4]   2> 3501 INFO  (coreLoadExecutor-16-thread-1) [    x:collection1] o.a.s.r.ManagedResourceStorage File-based storage initialized to use dir: /x1/jenkins/jenkins-slave/workspace/Lucene-Solr-Tests-5.5-Java7/solr/build/solr-core/test/J0/temp/solr.handler.TestReplicationHandler_DDD47F54EA702C0-001/solr-instance-002/collection1/conf
   [junit4]   2> 3501 INFO  (coreLoadExecutor-16-thread-1) [    x:collection1] o.a.s.r.RestManager Initializing RestManager with initArgs: {storageDir=/x1/jenkins/jenkins-slave/workspace/Lucene-Solr-Tests-5.5-Java7/solr/build/solr-core/test/J0/temp/solr.handler.TestReplicationHandler_DDD47F54EA702C0-001/solr-instance-002/collection1/conf}
   [junit4]   2> 3501 INFO  (coreLoadExecutor-16-thread-1) [    x:collection1] o.a.s.r.ManagedResourceStorage Reading _rest_managed.json using file:dir=/x1/jenkins/jenkins-slave/workspace/Lucene-Solr-Tests-5.5-Java7/solr/build/solr-core/test/J0/temp/solr.handler.TestReplicationHandler_DDD47F54EA702C0-001/solr-instance-002/collection1/conf
   [junit4]   2> 3502 INFO  (coreLoadExecutor-16-thread-1) [    x:collection1] o.a.s.r.RestManager Initializing 0 registered ManagedResources
   [junit4]   2> 3537 INFO  (coreLoadExecutor-16-thread-1) [    x:collection1] o.a.s.h.ReplicationHandler Poll scheduled at an interval of 1000ms
   [junit4]   2> 3544 INFO  (searcherExecutor-17-thread-1-processing-x:collection1) [    x:collection1] o.a.s.c.SolrCore [collection1] Registered new searcher Searcher@8aea957[collection1] main{ExitableDirectoryReader(UninvertingDirectoryReader())}
   [junit4]   2> 3545 INFO  (coreLoadExecutor-16-thread-1) [    x:collection1] o.a.s.c.CoreContainer registering core: collection1
   [junit4]   2> 3705 INFO  (TEST-TestReplicationHandler.doTestReplicateAfterStartupWithNoActivity-seed#[DDD47F54EA702C0]) [    ] o.e.j.s.ServerConnector Stopped ServerConnector@581fe75e{HTTP/1.1}{127.0.0.1:0}
   [junit4]   2> 3705 INFO  (TEST-TestReplicationHandler.doTestReplicateAfterStartupWithNoActivity-seed#[DDD47F54EA702C0]) [    ] o.a.s.c.CoreContainer Shutting down CoreContainer instance=768318596
   [junit4]   2> 3748 INFO  (coreCloseExecutor-22-thread-1) [    x:collection1] o.a.s.c.SolrCore [collection1]  CLOSING SolrCore org.apache.solr.core.SolrCore@3ae24197
   [junit4]   2> 3750 INFO  (coreCloseExecutor-22-thread-1) [    x:collection1] o.a.s.u.DirectUpdateHandler2 closing DirectUpdateHandler2{commits=0,autocommits=0,soft autocommits=0,optimizes=0,rollbacks=0,expungeDeletes=0,docsPending=0,adds=0,deletesById=0,deletesByQuery=0,errors=0,cumulative_adds=0,cumulative_deletesById=0,cumulative_deletesByQuery=0,cumulative_errors=0}
   [junit4]   2> 3757 INFO  (coreCloseExecutor-22-thread-1) [    x:collection1] o.a.s.u.SolrCoreState Closing SolrCoreState
   [junit4]   2> 3758 INFO  (coreCloseExecutor-22-thread-1) [    x:collection1] o.a.s.u.DefaultSolrCoreState SolrCoreState ref count has reached 0 - closing IndexWriter
   [junit4]   2> 3758 INFO  (coreCloseExecutor-22-thread-1) [    x:collection1] o.a.s.u.DefaultSolrCoreState closing IndexWriter with IndexWriterCloser
   [junit4]   2> 3766 INFO  (coreCloseExecutor-22-thread-1) [    x:collection1] o.a.s.c.SolrCore [collection1] Closing main searcher on request.
   [junit4]   2> 3767 INFO  (coreCloseExecutor-22-thread-1) [    x:collection1] o.a.s.c.CachingDirectoryFactory Closing MockDirectoryFactory - 2 directories currently being tracked
   [junit4]   2> 3768 INFO  (coreCloseExecutor-22-thread-1) [    x:collection1] o.a.s.c.CachingDirectoryFactory looking to close /x1/jenkins/jenkins-slave/workspace/Lucene-Solr-Tests-5.5-Java7/solr/build/solr-core/test/J0/temp/solr.handler.TestReplicationHandler_DDD47F54EA702C0-001/solr-instance-002/./collection1/data [CachedDir<<refCount=0;path=/x1/jenkins/jenkins-slave/workspace/Lucene-Solr-Tests-5.5-Java7/solr/build/solr-core/test/J0/temp/solr.handler.TestReplicationHandler_DDD47F54EA702C0-001/solr-instance-002/./collection1/data;done=false>>]
   [junit4]   2> 3768 INFO  (coreCloseExecutor-22-thread-1) [    x:collection1] o.a.s.c.CachingDirectoryFactory Closing directory: /x1/jenkins/jenkins-slave/workspace/Lucene-Solr-Tests-5.5-Java7/solr/build/solr-core/test/J0/temp/solr.handler.TestReplicationHandler_DDD47F54EA702C0-001/solr-instance-002/./collection1/data
   [junit4]   2> 3768 INFO  (coreCloseExecutor-22-thread-1) [    x:collection1] o.a.s.c.CachingDirectoryFactory looking to close /x1/jenkins/jenkins-slave/workspace/Lucene-Solr-Tests-5.5-Java7/solr/build/solr-core/test/J0/temp/solr.handler.TestReplicationHandler_DDD47F54EA702C0-001/solr-instance-002/./collection1/data/index [CachedDir<<refCount=0;path=/x1/jenkins/jenkins-slave/workspace/Lucene-Solr-Tests-5.5-Java7/solr/build/solr-core/test/J0/temp/solr.handler.TestReplicationHandler_DDD47F54EA702C0-001/solr-instance-002/./collection1/data/index;done=false>>]
   [junit4]   2> 3769 INFO  (coreCloseExecutor-22-thread-1) [    x:collection1] o.a.s.c.CachingDirectoryFactory Closing directory: /x1/jenkins/jenkins-slave/workspace/Lucene-Solr-Tests-5.5-Java7/solr/build/solr-core/test/J0/temp/solr.handler.TestReplicationHandler_DDD47F54EA702C0-001/solr-instance-002/./collection1/data/index
   [junit4]   2> 3772 INFO  (TEST-TestReplicationHandler.doTestReplicateAfterStartupWithNoActivity-seed#[DDD47F54EA702C0]) [    ] o.e.j.s.h.ContextHandler Stopped o.e.j.s.ServletContextHandler@72bf74f2{/solr,null,UNAVAILABLE}
   [junit4]   2> 3969 INFO  (qtp1211514218-17) [    x:collection1] o.a.s.c.S.Request [collection1]  webapp=/solr path=/replication params={qt=/replication&version=2&command=indexversion&wt=javabin} status=0 QTime=19
   [junit4]   2> 4056 INFO  (qtp1211514218-18) [    x:collection1] o.a.s.u.DirectUpdateHandler2 [collection1] REMOVING ALL DOCUMENTS FROM INDEX
   [junit4]   2> 4063 INFO  (qtp1211514218-18) [    x:collection1] o.a.s.u.p.LogUpdateProcessorFactory [collection1]  webapp=/solr path=/update params={version=2&wt=javabin}{deleteByQuery=*:*} 0 113
   [junit4]   2> 4072 INFO  (qtp1211514218-19) [    x:collection1] o.a.s.u.DirectUpdateHandler2 start commit{,optimize=false,openSearcher=true,waitSearcher=true,expungeDeletes=false,softCommit=false,prepareCommit=false}
   [junit4]   2> 4073 INFO  (qtp1211514218-19) [    x:collection1] o.a.s.c.SolrDeletionPolicy SolrDeletionPolicy.onCommit: commits: num=2
   [junit4]   2> 	commit{dir=MockDirectoryWrapper(RAMDirectory@26e3c0e3 lockFactory=org.apache.lucene.store.SingleInstanceLockFactory@328c8b07),segFN=segments_1,generation=1}
   [junit4]   2> 	commit{dir=MockDirectoryWrapper(RAMDirectory@26e3c0e3 lockFactory=org.apache.lucene.store.SingleInstanceLockFactory@328c8b07),segFN=segments_2,generation=2}
   [junit4]   2> 4073 INFO  (qtp1211514218-19) [    x:collection1] o.a.s.c.SolrDeletionPolicy newest commit generation = 2
   [junit4]   2> 4074 INFO  (qtp1211514218-19) [    x:collection1] o.a.s.s.SolrIndexSearcher Opening Searcher@14b986c[collection1] main
   [junit4]   2> 4077 INFO  (qtp1211514218-19) [    x:collection1] o.a.s.u.DirectUpdateHandler2 end_commit_flush
   [junit4]   2> 4077 INFO  (searcherExecutor-7-thread-1-processing-x:collection1) [    x:collection1] o.a.s.c.SolrCore [collection1] Registered new searcher Searcher@14b986c[collection1] main{ExitableDirectoryReader(UninvertingDirectoryReader())}
   [junit4]   2> 4078 INFO  (qtp1211514218-19) [    x:collection1] o.a.s.u.p.LogUpdateProcessorFactory [collection1]  webapp=/solr path=/update params={waitSearcher=true&version=2&wt=javabin&softCommit=false&commit=true}{commit=} 0 6
   [junit4]   2> 4093 INFO  (TEST-TestReplicationHandler.doTestReplicateAfterStartupWithNoActivity-seed#[DDD47F54EA702C0]) [    ] o.e.j.s.ServerConnector Stopped ServerConnector@289a651e{HTTP/1.1}{127.0.0.1:0}
   [junit4]   2> 4093 INFO  (TEST-TestReplicationHandler.doTestReplicateAfterStartupWithNoActivity-seed#[DDD47F54EA702C0]) [    ] o.a.s.c.CoreContainer Shutting down CoreContainer instance=428562760
   [junit4]   2> 4095 INFO  (coreCloseExecutor-23-thread-1) [    x:collection1] o.a.s.c.SolrCore [collection1]  CLOSING SolrCore org.apache.solr.core.SolrCore@bc7559f
   [junit4]   2> 4095 INFO  (coreCloseExecutor-23-thread-1) [    x:collection1] o.a.s.u.DirectUpdateHandler2 closing DirectUpdateHandler2{commits=1,autocommits=0,soft autocommits=0,optimizes=0,rollbacks=0,expungeDeletes=0,docsPending=0,adds=0,deletesById=0,deletesByQuery=0,errors=0,cumulative_adds=0,cumulative_deletesById=0,cumulative_deletesByQuery=1,cumulative_errors=0}
   [junit4]   2> 4096 INFO  (coreCloseExecutor-23-thread-1) [    x:collection1] o.a.s.u.SolrCoreState Closing SolrCoreState
   [junit4]   2> 4096 INFO  (coreCloseExecutor-23-thread-1) [    x:collection1] o.a.s.u.DefaultSolrCoreState SolrCoreState ref count has reached 0 - closing IndexWriter
   [junit4]   2> 4096 INFO  (coreCloseExecutor-23-thread-1) [    x:collection1] o.a.s.u.DefaultSolrCoreState closing IndexWriter with IndexWriterCloser
   [junit4]   2> 4097 INFO  (coreCloseExecutor-23-thread-1) [    x:collection1] o.a.s.c.SolrCore [collection1] Closing main searcher on request.
   [junit4]   2> 4098 INFO  (coreCloseExecutor-23-thread-1) [    x:collection1] o.a.s.c.CachingDirectoryFactory Closing MockDirectoryFactory - 2 directories currently being tracked
   [junit4]   2> 4098 INFO  (coreCloseExecutor-23-thread-1) [    x:collection1] o.a.s.c.CachingDirectoryFactory looking to close /x1/jenkins/jenkins-slave/workspace/Lucene-Solr-Tests-5.5-Java7/solr/build/solr-core/test/J0/temp/solr.handler.TestReplicationHandler_DDD47F54EA702C0-001/solr-instance-001/./collection1/data [CachedDir<<refCount=0;path=/x1/jenkins/jenkins-slave/workspace/Lucene-Solr-Tests-5.5-Java7/solr/build/solr-core/test/J0/temp/solr.handler.TestReplicationHandler_DDD47F54EA702C0-001/solr-instance-001/./collection1/data;done=false>>]
   [junit4]   2> 4098 INFO  (coreCloseExecutor-23-thread-1) [    x:collection1] o.a.s.c.CachingDirectoryFactory Closing directory: /x1/jenkins/jenkins-slave/workspace/Lucene-Solr-Tests-5.5-Java7/solr/build/solr-core/test/J0/temp/solr.handler.TestReplicationHandler_DDD47F54EA702C0-001/solr-instance-001/./collection1/data
   [junit4]   2> 4098 INFO  (coreCloseExecutor-23-thread-1) [    x:collection1] o.a.s.c.CachingDirectoryFactory looking to close /x1/jenkins/jenkins-slave/workspace/Lucene-Solr-Tests-5.5-Java7/solr/build/solr-core/test/J0/temp/solr.handler.TestReplicationHandler_DDD47F54EA702C0-001/solr-instance-001/./collection1/data/index [CachedDir<<refCount=0;path=/x1/jenkins/jenkins-slave/workspace/Lucene-Solr-Tests-5.5-Java7/solr/build/solr-core/test/J0/temp/solr.handler.TestReplicationHandler_DDD47F54EA702C0-001/solr-instance-001/./collection1/data/index;done=false>>]
   [junit4]   2> 4099 INFO  (coreCloseExecutor-23-thread-1) [    x:collection1] o.a.s.c.CachingDirectoryFactory Closing directory: /x1/jenkins/jenkins-slave/workspace/Lucene-Solr-Tests-5.5-Java7/solr/build/solr-core/test/J0/temp/solr.handler.TestReplicationHandler_DDD47F54EA702C0-001/solr-instance-001/./collection1/data/index
   [junit4]   2> 4100 INFO  (TEST-TestReplicationHandler.doTestReplicateAfterStartupWithNoActivity-seed#[DDD47F54EA702C0]) [    ] o.e.j.s.h.ContextHandler Stopped o.e.j.s.ServletContextHandler@2ab64063{/solr,null,UNAVAILABLE}
   [junit4]   2> 4110 INFO  (TEST-TestReplicationHandler.doTestReplicateAfterStartupWithNoActivity-seed#[DDD47F54EA702C0]) [    ] o.e.j.s.Server jetty-9.2.13.v20150730
   [junit4]   2> 4115 INFO  (TEST-TestReplicationHandler.doTestReplicateAfterStartupWithNoActivity-seed#[DDD47F54EA702C0]) [    ] o.e.j.s.h.ContextHandler Started o.e.j.s.ServletContextHandler@440ab4a2{/solr,null,AVAILABLE}
   [junit4]   2> 4116 INFO  (TEST-TestReplicationHandler.doTestReplicateAfterStartupWithNoActivity-seed#[DDD47F54EA702C0]) [    ] o.e.j.s.ServerConnector Started ServerConnector@235ff851{HTTP/1.1}{127.0.0.1:50182}
   [junit4]   2> 4116 INFO  (TEST-TestReplicationHandler.doTestReplicateAfterStartupWithNoActivity-seed#[DDD47F54EA702C0]) [    ] o.e.j.s.Server Started @7206ms
   [junit4]   2> 4117 INFO  (TEST-TestReplicationHandler.doTestReplicateAfterStartupWithNoActivity-seed#[DDD47F54EA702C0]) [    ] o.a.s.c.s.e.JettySolrRunner Jetty properties: {hostContext=/solr, solr.data.dir=/x1/jenkins/jenkins-slave/workspace/Lucene-Solr-Tests-5.5-Java7/solr/build/solr-core/test/J0/temp/solr.handler.TestReplicationHandler_DDD47F54EA702C0-001/solr-instance-001/collection1/data, hostPort=50182}
   [junit4]   2> 4118 INFO  (TEST-TestReplicationHandler.doTestReplicateAfterStartupWithNoActivity-seed#[DDD47F54EA702C0]) [    ] o.a.s.s.SolrDispatchFilter SolrDispatchFilter.init(): sun.misc.Launcher$AppClassLoader@3827de24
   [junit4]   2> 4118 INFO  (TEST-TestReplicationHandler.doTestReplicateAfterStartupWithNoActivity-seed#[DDD47F54EA702C0]) [    ] o.a.s.c.SolrResourceLoader new SolrResourceLoader for directory: '/x1/jenkins/jenkins-slave/workspace/Lucene-Solr-Tests-5.5-Java7/solr/build/solr-core/test/J0/temp/solr.handler.TestReplicationHandler_DDD47F54EA702C0-001/solr-instance-001'
   [junit4]   2> 4119 INFO  (TEST-TestReplicationHandler.doTestReplicateAfterStartupWithNoActivity-seed#[DDD47F54EA702C0]) [    ] o.a.s.c.SolrResourceLoader JNDI not configured for solr (NoInitialContextEx)
   [junit4]   2> 4125 INFO  (TEST-TestReplicationHandler.doTestReplicateAfterStartupWithNoActivity-seed#[DDD47F54EA702C0]) [    ] o.a.s.c.SolrResourceLoader solr home defaulted to 'solr/' (could not find system property or JNDI)
   [junit4]   2> 4125 INFO  (TEST-TestReplicationHandler.doTestReplicateAfterStartupWithNoActivity-seed#[DDD47F54EA702C0]) [    ] o.a.s.c.SolrXmlConfig Loading container configuration from /x1/jenkins/jenkins-slave/workspace/Lucene-Solr-Tests-5.5-Java7/solr/build/solr-core/test/J0/temp/solr.handler.TestReplicationHandler_DDD47F54EA702C0-001/solr-instance-001/solr.xml
   [junit4]   2> 4176 INFO  (TEST-TestReplicationHandler.doTestReplicateAfterStartupWithNoActivity-seed#[DDD47F54EA702C0]) [    ] o.a.s.c.CorePropertiesLocator Config-defined core root directory: /x1/jenkins/jenkins-slave/workspace/Lucene-Solr-Tests-5.5-Java7/solr/build/solr-core/test/J0/temp/solr.handler.TestReplicationHandler_DDD47F54EA702C0-001/solr-instance-001/.
   [junit4]   2> 4176 INFO  (TEST-TestReplicationHandler.doTestReplicateAfterStartupWithNoActivity-seed#[DDD47F54EA702C0]) [    ] o.a.s.c.CoreContainer New CoreContainer 210843756
   [junit4]   2> 4177 INFO  (TEST-TestReplicationHandler.doTestReplicateAfterStartupWithNoActivity-seed#[DDD47F54EA702C0]) [    ] o.a.s.c.CoreContainer Loading cores into CoreContainer [instanceDir=/x1/jenkins/jenkins-slave/workspace/Lucene-Solr-Tests-5.5-Java7/solr/build/solr-core/test/J0/temp/solr.handler.TestReplicationHandler_DDD47F54EA702C0-001/solr-instance-001]
   [junit4]   2> 4177 WARN  (TEST-TestReplicationHandler.doTestReplicateAfterStartupWithNoActivity-seed#[DDD47F54EA702C0]) [    ] o.a.s.c.CoreContainer Couldn't add files from /x1/jenkins/jenkins-slave/workspace/Lucene-Solr-Tests-5.5-Java7/solr/build/solr-core/test/J0/temp/solr.handler.TestReplicationHandler_DDD47F54EA702C0-001/solr-instance-001/lib to classpath: /x1/jenkins/jenkins-slave/workspace/Lucene-Solr-Tests-5.5-Java7/solr/build/solr-core/test/J0/temp/solr.handler.TestReplicationHandler_DDD47F54EA702C0-001/solr-instance-001/lib
   [junit4]   2> 4177 INFO  (TEST-TestReplicationHandler.doTestReplicateAfterStartupWithNoActivity-seed#[DDD47F54EA702C0]) [    ] o.a.s.h.c.HttpShardHandlerFactory created with socketTimeout : 90000,urlScheme : ,connTimeout : 15000,maxConnectionsPerHost : 20,maxConnections : 10000,corePoolSize : 0,maximumPoolSize : 2147483647,maxThreadIdleTime : 5,sizeOfQueue : -1,fairnessPolicy : false,useRetries : false,
   [junit4]   2> 4180 INFO  (TEST-TestReplicationHandler.doTestReplicateAfterStartupWithNoActivity-seed#[DDD47F54EA702C0]) [    ] o.a.s.u.UpdateShardHandler Creating UpdateShardHandler HTTP client with params: socketTimeout=340000&connTimeout=45000&retry=true
   [junit4]   2> 4181 INFO  (TEST-TestReplicationHandler.doTestReplicateAfterStartupWithNoActivity-seed#[DDD47F54EA702C0]) [    ] o.a.s.l.LogWatcher SLF4J impl is org.slf4j.impl.Log4jLoggerFactory
   [junit4]   2> 4181 INFO  (TEST-TestReplicationHandler.doTestReplicateAfterStartupWithNoActivity-seed#[DDD47F54EA702C0]) [    ] o.a.s.l.LogWatcher Registering Log Listener [Log4j (org.slf4j.impl.Log4jLoggerFactory)]
   [junit4]   2> 4181 INFO  (TEST-TestReplicationHandler.doTestReplicateAfterStartupWithNoActivity-seed#[DDD47F54EA702C0]) [    ] o.a.s.c.CoreContainer Security conf doesn't exist. Skipping setup for authorization module.
   [junit4]   2> 4182 INFO  (TEST-TestReplicationHandler.doTestReplicateAfterStartupWithNoActivity-seed#[DDD47F54EA702C0]) [    ] o.a.s.c.CoreContainer No authentication plugin used.
   [junit4]   2> 4183 INFO  (TEST-TestReplicationHandler.doTestReplicateAfterStartupWithNoActivity-seed#[DDD47F54EA702C0]) [    ] o.a.s.c.CorePropertiesLocator Looking for core definitions underneath /x1/jenkins/jenkins-slave/workspace/Lucene-Solr-Tests-5.5-Java7/solr/build/solr-core/test/J0/temp/solr.handler.TestReplicationHandler_DDD47F54EA702C0-001/solr-instance-001/.
   [junit4]   2> 4195 INFO  (TEST-TestReplicationHandler.doTestReplicateAfterStartupWithNoActivity-seed#[DDD47F54EA702C0]) [    ] o.a.s.c.CoreDescriptor Created CoreDescriptor: {loadOnStartup=true, transient=false, configSetProperties=configsetprops.json, schema=schema.xml, name=collection1, dataDir=data/, config=solrconfig.xml}
   [junit4]   2> 4195 INFO  (TEST-TestReplicationHandler.doTestReplicateAfterStartupWithNoActivity-seed#[DDD47F54EA702C0]) [    ] o.a.s.c.CorePropertiesLocator Found core collection1 in /x1/jenkins/jenkins-slave/workspace/Lucene-Solr-Tests-5.5-Java7/solr/build/solr-core/test/J0/temp/solr.handler.TestReplicationHandler_DDD47F54EA702C0-001/solr-instance-001/./collection1
   [junit4]   2> 4195 INFO  (TEST-TestReplicationHandler.doTestReplicateAfterStartupWithNoActivity-seed#[DDD47F54EA702C0]) [    ] o.a.s.c.CorePropertiesLocator Found 1 core definitions
   [junit4]   2> 4196 INFO  (coreLoadExecutor-29-thread-1) [    ] o.a.s.c.SolrResourceLoader new SolrResourceLoader for directory: '/x1/jenkins/jenkins-slave/workspace/Lucene-Solr-Tests-5.5-Java7/solr/build/solr-core/test/J0/temp/solr.handler.TestReplicationHandler_DDD47F54EA702C0-001/solr-instance-001/collection1'
   [junit4]   2> 4196 INFO  (TEST-TestReplicationHandler.doTestReplicateAfterStartupWithNoActivity-seed#[DDD47F54EA702C0]) [    ] o.a.s.s.SolrDispatchFilter user.dir=/x1/jenkins/jenkins-slave/workspace/Lucene-Solr-Tests-5.5-Java7/solr/build/solr-core/test/J0
   [junit4]   2> 4197 INFO  (TEST-TestReplicationHandler.doTestReplicateAfterStartupWithNoActivity-seed#[DDD47F54EA702C0]) [    ] o.a.s.s.SolrDispatchFilter SolrDispatchFilter.init() done
   [junit4]   2> 4197 INFO  (coreLoadExecutor-29-thread-1) [    ] o.a.s.c.SolrResourceLoader JNDI not configured for solr (NoInitialContextEx)
   [junit4]   2> 4197 INFO  (coreLoadExecutor-29-thread-1) [    ] o.a.s.c.SolrResourceLoader solr home defaulted to 'solr/' (could not find system property or JNDI)
   [junit4]   2> 4220 INFO  (coreLoadExecutor-29-thread-1) [    ] o.a.s.c.SolrConfig current version of requestparams : -1
   [junit4]   2> 4258 INFO  (coreLoadExecutor-29-thread-1) [    ] o.a.s.c.SolrConfig Using Lucene MatchVersion: 5.5.0
   [junit4]   2> 4316 INFO  (coreLoadExecutor-29-thread-1) [    ] o.a.s.c.SolrConfig Loaded SolrConfig: solrconfig.xml
   [junit4]   2> 4325 INFO  (coreLoadExecutor-29-thread-1) [    ] o.a.s.s.IndexSchema [collection1] Schema name=test
   [junit4]   2> 4348 INFO  (coreLoadExecutor-29-thread-1) [    ] o.a.s.s.IndexSchema unique key field: id
   [junit4]   2> 4351 INFO  (coreLoadExecutor-29-thread-1) [    ] o.a.s.c.ConfigSetProperties Did not find ConfigSet properties, assuming default properties: Can't find resource 'configsetprops.json' in classpath or '/x1/jenkins/jenkins-slave/workspace/Lucene-Solr-Tests-5.5-Java7/solr/build/solr-core/test/J0/temp/solr.handler.TestReplicationHandler_DDD47F54EA702C0-001/solr-instance-001/collection1'
   [junit4]   2> 4352 INFO  (coreLoadExecutor-29-thread-1) [    ] o.a.s.c.CoreContainer Creating SolrCore 'collection1' using configuration from instancedir /x1/jenkins/jenkins-slave/workspace/Lucene-Solr-Tests-5.5-Java7/solr/build/solr-core/test/J0/temp/solr.handler.TestReplicationHandler_DDD47F54EA702C0-001/solr-instance-001/./collection1
   [junit4]   2> 4352 INFO  (coreLoadExecutor-29-thread-1) [    x:collection1] o.a.s.c.SolrCore solr.NRTCachingDirectoryFactory
   [junit4]   2> 4361 INFO  (coreLoadExecutor-29-thread-1) [    x:collection1] o.a.s.c.SolrCore [[collection1] ] Opening new SolrCore at [/x1/jenkins/jenkins-slave/workspace/Lucene-Solr-Tests-5.5-Java7/solr/build/solr-core/test/J0/temp/solr.handler.TestReplicationHandler_DDD47F54EA702C0-001/solr-instance-001/collection1], dataDir=[/x1/jenkins/jenkins-slave/workspace/Lucene-Solr-Tests-5.5-Java7/solr/build/solr-core/test/J0/temp/solr.handler.TestReplicationHandler_DDD47F54EA702C0-001/solr-instance-001/./collection1/data/]
   [junit4]   2> 4361 INFO  (coreLoadExecutor-29-thread-1) [    x:collection1] o.a.s.c.SolrCore JMX monitoring not detected for core: collection1
   [junit4]   2> 4372 INFO  (coreLoadExecutor-29-thread-1) [    x:collection1] o.a.s.c.CachingDirectoryFactory return new directory for /x1/jenkins/jenkins-slave/workspace/Lucene-Solr-Tests-5.5-Java7/solr/build/solr-core/test/J0/temp/solr.handler.TestReplicationHandler_DDD47F54EA702C0-001/solr-instance-001/collection1/data
   [junit4]   2> 4373 INFO  (coreLoadExecutor-29-thread-1) [    x:collection1] o.a.s.c.SolrCore New index directory detected: old=null new=/x1/jenkins/jenkins-slave/workspace/Lucene-Solr-Tests-5.5-Java7/solr/build/solr-core/test/J0/temp/solr.handler.TestReplicationHandler_DDD47F54EA702C0-001/solr-instance-001/./collection1/data/index/
   [junit4]   2> 4373 WARN  (coreLoadExecutor-29-thread-1) [    x:collection1] o.a.s.c.SolrCore [collection1] Solr index directory '/x1/jenkins/jenkins-slave/workspace/Lucene-Solr-Tests-5.5-Java7/solr/build/solr-core/test/J0/temp/solr.handler.TestReplicationHandler_DDD47F54EA702C0-001/solr-instance-001/./collection1/data/index' doesn't exist. Creating new index...
   [junit4]   2> 4374 INFO  (coreLoadExecutor-29-thread-1) [    x:collection1] o.a.s.c.CachingDirectoryFactory return new directory for /x1/jenkins/jenkins-slave/workspace/Lucene-Solr-Tests-5.5-Java7/solr/build/solr-core/test/J0/temp/solr.handler.TestReplicationHandler_DDD47F54EA702C0-001/solr-instance-001/collection1/data/index
   [junit4]   2> 4375 INFO  (coreLoadExecutor-29-thread-1) [    x:collection1] o.a.s.u.RandomMergePolicy RandomMergePolicy wrapping class org.apache.lucene.index.LogByteSizeMergePolicy: [LogByteSizeMergePolicy: minMergeSize=1677721, mergeFactor=10, maxMergeSize=2147483648, maxMergeSizeForForcedMerge=9223372036854775807, calibrateSizeByDeletes=true, maxMergeDocs=2147483647, maxCFSSegmentSizeMB=8.796093022207999E12, noCFSRatio=0.4089429739486866]
   [junit4]   2> 4384 INFO  (coreLoadExecutor-29-thread-1) [    x:collection1] o.a.s.c.SolrDeletionPolicy SolrDeletionPolicy.onCommit: commits: num=1
   [junit4]   2> 	commit{dir=NRTCachingDirectory(MMapDirectory@/x1/jenkins/jenkins-slave/workspace/Lucene-Solr-Tests-5.5-Java7/solr/build/solr-core/test/J0/temp/solr.handler.TestReplicationHandler_DDD47F54EA702C0-001/solr-instance-001/collection1/data/index lockFactory=org.apache.lucene.store.SingleInstanceLockFactory@3dc4baf4; maxCacheMB=48.0 maxMergeSizeMB=4.0),segFN=segments_1,generation=1}
   [junit4]   2> 4384 INFO  (coreLoadExecutor-29-thread-1) [    x:collection1] o.a.s.c.SolrDeletionPolicy newest commit generation = 1
   [junit4]   2> 4397 INFO  (OldIndexDirectoryCleanupThreadForCore-collection1) [    x:collection1] o.a.s.c.SolrCore Looking for old index directories to cleanup for core collection1 in /x1/jenkins/jenkins-slave/workspace/Lucene-Solr-Tests-5.5-Java7/solr/build/solr-core/test/J0/temp/solr.handler.TestReplicationHandler_DDD47F54EA702C0-001/solr-instance-001/./collection1/data/
   [junit4]   2> 4397 INFO  (coreLoadExecutor-29-thread-1) [    x:collection1] o.a.s.c.SolrCore no updateRequestProcessorChain defined as default, creating implicit default
   [junit4]   2> 4401 INFO  (coreLoadExecutor-29-thread-1) [    x:collection1] o.a.s.h.l.XMLLoader xsltCacheLifetimeSeconds=60
   [junit4]   2> 4403 INFO  (coreLoadExecutor-29-thread-1) [    x:collection1] o.a.s.h.l.XMLLoader xsltCacheLifetimeSeconds=60
   [junit4]   2> 4406 INFO  (coreLoadExecutor-29-thread-1) [    x:collection1] o.a.s.h.l.XMLLoader xsltCacheLifetimeSeconds=60
   [junit4]   2> 4408 INFO  (coreLoadExecutor-29-thread-1) [    x:collection1] o.a.s.h.l.XMLLoader xsltCacheLifetimeSeconds=60
   [junit4]   2> 4413 INFO  (coreLoadExecutor-29-thread-1) [    x:collection1] o.a.s.c.PluginBag requestHandler : 'lazy' created with startup=lazy 
   [junit4]   2> 4413 INFO  (coreLoadExecutor-29-thread-1) [    x:collection1] o.a.s.c.RequestHandlers Registered paths: /update,/admin/file,lazy,/admin/properties,/config,/admin/mbeans,/update/json,/get,/admin/system,/replication,/update/json/docs,defaults,/admin/plugins,/admin/ping,standard,/update/csv,/admin/luke,/admin/segments,/admin/threads,/admin/logging,/schema
   [junit4]   2> 4416 INFO  (coreLoadExecutor-29-thread-1) [    x:collection1] o.a.s.c.SolrCore Using default statsCache cache: org.apache.solr.search.stats.LocalStatsCache
   [junit4]   2> 4417 INFO  (coreLoadExecutor-29-thread-1) [    x:collection1] o.a.s.u.CommitTracker Hard AutoCommit: disabled
   [junit4]   2> 4417 INFO  (coreLoadExecutor-29-thread-1) [    x:collection1] o.a.s.u.CommitTracker Soft AutoCommit: disabled
   [junit4]   2> 4418 INFO  (coreLoadExecutor-29-thread-1) [    x:collection1] o.a.s.u.RandomMergePolicy RandomMergePolicy wrapping class org.apache.lucene.index.TieredMergePolicy: [TieredMergePolicy: maxMergeAtOnce=19, maxMergeAtOnceExplicit=35, maxMergedSegmentMB=86.1083984375, floorSegmentMB=0.2314453125, forceMergeDeletesPctAllowed=2.8513630465400897, segmentsPerTier=12.0, maxCFSSegmentSizeMB=8.796093022207999E12, noCFSRatio=0.5139488053784077
   [junit4]   2> 4426 INFO  (coreLoadExecutor-29-thread-1) [    x:collection1] o.a.s.c.SolrDeletionPolicy SolrDeletionPolicy.onInit: commits: num=1
   [junit4]   2> 	commit{dir=NRTCachingDirectory(MMapDirectory@/x1/jenkins/jenkins-slave/workspace/Lucene-Solr-Tests-5.5-Java7/solr/build/solr-core/test/J0/temp/solr.handler.TestReplicationHandler_DDD47F54EA702C0-001/solr-instance-001/collection1/data/index lockFactory=org.apache.lucene.store.SingleInstanceLockFactory@3dc4baf4; maxCacheMB=48.0 maxMergeSizeMB=4.0),segFN=segments_1,generation=1}
   [junit4]   2> 4426 INFO  (coreLoadExecutor-29-thread-1) [    x:collection1] o.a.s.c.SolrDeletionPolicy newest commit generation = 1
   [junit4]   2> 4427 INFO  (coreLoadExecutor-29-thread-1) [    x:collection1] o.a.s.s.SolrIndexSearcher Opening Searcher@36184f8[collection1] main
   [junit4]   2> 4427 INFO  (coreLoadExecutor-29-thread-1) [    x:collection1] o.a.s.r.ManagedResourceStorage File-based storage initialized to use dir: /x1/jenkins/jenkins-slave/workspace/Lucene-Solr-Tests-5.5-Java7/solr/build/solr-core/test/J0/temp/solr.handler.TestReplicationHandler_DDD47F54EA702C0-001/solr-instance-001/collection1/conf
   [junit4]   2> 4428 INFO  (coreLoadExecutor-29-thread-1) [    x:collection1] o.a.s.r.RestManager Initializing RestManager with initArgs: {storageDir=/x1/jenkins/jenkins-slave/workspace/Lucene-Solr-Tests-5.5-Java7/solr/build/solr-core/test/J0/temp/solr.handler.TestReplicationHandler_DDD47F54EA702C0-001/solr-instance-001/collection1/conf}
   [junit4]   2> 4428 INFO  (coreLoadExecutor-29-thread-1) [    x:collection1] o.a.s.r.ManagedResourceStorage Reading _rest_managed.json using file:dir=/x1/jenkins/jenkins-slave/workspace/Lucene-Solr-Tests-5.5-Java7/solr/build/solr-core/test/J0/temp/solr.handler.TestReplicationHandler_DDD47F54EA702C0-001/solr-instance-001/collection1/conf
   [junit4]   2> 4428 INFO  (coreLoadExecutor-29-thread-1) [    x:collection1] o.a.s.r.RestManager Initializing 0 registered ManagedResources
   [junit4]   2> 4429 INFO  (coreLoadExecutor-29-thread-1) [    x:collection1] o.a.s.h.ReplicationHandler Replication enabled for following config files: schema.xml
   [junit4]   2> 4429 INFO  (coreLoadExecutor-29-thread-1) [    x:collection1] o.a.s.h.ReplicationHandler Commits will be reserved for  10000
   [junit4]   2> 4430 INFO  (coreLoadExecutor-29-thread-1) [    x:collection1] o.a.s.c.CoreContainer registering core: collection1
   [junit4]   2> 4432 INFO  (searcherExecutor-30-thread-1-processing-x:collection1) [    x:collection1] o.a.s.c.SolrCore [collection1] Registered new searcher Searcher@36184f8[collection1] main{ExitableDirectoryReader(UninvertingDirectoryReader())}
   [junit4]   2> 4860 INFO  (qtp1345196773-58) [    x:collection1] o.a.s.u.p.LogUpdateProcessorFactory [collection1]  webapp=/solr path=/update params={version=2&wt=javabin}{add=[0]} 0 146
   [junit4]   2> 4865 INFO  (qtp1345196773-58) [    x:collection1] o.a.s.u.p.LogUpdateProcessorFactory [collection1]  webapp=/solr path=/update params={version=2&wt=javabin}{add=[1]} 0 0
   [junit4]   2> 4870 INFO  (qtp1345196773-59) [    x:collection1] o.a.s.u.p.LogUpdateProcessorFactory [collection1]  webapp=/solr path=/update params={version=2&wt=javabin}{add=[2]} 0 0
   [junit4]   2> 4875 INFO  (qtp1345196773-60) [    x:collection1] o.a.s.u.p.LogUpdateProcessorFactory [collection1]  webapp=/solr path=/update params={version=2&wt=javabin}{add=[3]} 0 0
   [junit4]   2> 4880 INFO  (qtp1345196773-62) [    x:collection1] o.a.s.u.p.LogUpdateProcessorFactory [collection1]  webapp=/solr path=/update params={version=2&wt=javabin}{add=[4]} 0 0
   [junit4]   2> 4885 INFO  (qtp1345196773-61) [    x:collection1] o.a.s.u.p.LogUpdateProcessorFactory [collection1]  webapp=/solr path=/update params={version=2&wt=javabin}{add=[5]} 0 0
   [junit4]   2> 4889 INFO  (qtp1345196773-58) [    x:collection1] o.a.s.u.p.LogUpdateProcessorFactory [collection1]  webapp=/solr path=/update params={version=2&wt=javabin}{add=[6]} 0 0
   [junit4]   2> 4894 INFO  (qtp1345196773-59) [    x:collection1] o.a.s.u.p.LogUpdateProcessorFactory [collection1]  webapp=/solr path=/update params={version=2&wt=javabin}{add=[7]} 0 0
   [junit4]   2> 4901 INFO  (qtp1345196773-60) [    x:collection1] o.a.s.u.p.LogUpdateProcessorFactory [collection1]  webapp=/solr path=/update params={version=2&wt=javabin}{add=[8]} 0 0
   [junit4]   2> 4906 INFO  (qtp1345196773-62) [    x:collection1] o.a.s.u.p.LogUpdateProcessorFactory [collection1]  webapp=/solr path=/update params={version=2&wt=javabin}{add=[9]} 0 0
   [junit4]   2> 4910 INFO  (qtp1345196773-61) [    x:collection1] o.a.s.u.p.LogUpdateProcessorFactory [collection1]  webapp=/solr path=/update params={version=2&wt=javabin}{add=[10]} 0 0
   [junit4]   2> 4915 INFO  (qtp1345196773-58) [    x:collection1] o.a.s.u.p.LogUpdateProcessorFactory [collection1]  webapp=/solr path=/update params={version=2&wt=javabin}{add=[11]} 0 0
   [junit4]   2> 4919 INFO  (qtp1345196773-59) [    x:collection1] o.a.s.u.p.LogUpdateProcessorFactory [collection1]  webapp=/solr path=/update params={version=2&wt=javabin}{add=[12]} 0 0
   [junit4]   2> 4930 INFO  (qtp1345196773-60) [    x:collection1] o.a.s.u.p.LogUpdateProcessorFactory [collection1]  webapp=/solr path=/update params={version=2&wt=javabin}{add=[13]} 0 0
   [junit4]   2> 4936 INFO  (qtp1345196773-62) [    x:collection1] o.a.s.u.p.LogUpdateProcessorFactory [collection1]  webapp=/solr path=/update params={version=2&wt=javabin}{add=[14]} 0 0
   [junit4]   2> 4941 INFO  (qtp1345196773-61) [    x:collection1] o.a.s.u.p.LogUpdateProcessorFactory [collection1]  webapp=/solr path=/update params={version=2&wt=javabin}{add=[15]} 0 0
   [junit4]   2> 4945 INFO  (qtp1345196773-58) [    x:collection1] o.a.s.u.p.LogUpdateProcessorFactory [collection1]  webapp=/solr path=/update params={version=2&wt=javabin}{add=[16]} 0 0
   [junit4]   2> 4949 INFO  (qtp1345196773-59) [    x:collection1] o.a.s.u.p.LogUpdateProcessorFactory [collection1]  webapp=/solr path=/update params={version=2&wt=javabin}{add=[17]} 0 0
   [junit4]   2> 4959 INFO  (qtp1345196773-60) [    x:collection1] o.a.s.u.p.LogUpdateProcessorFactory [collection1]  webapp=/solr path=/update params={version=2&wt=javabin}{add=[18]} 0 0
   [junit4]   2> 4969 INFO  (qtp1345196773-62) [    x:collection1] o.a.s.u.p.LogUpdateProcessorFactory [collection1]  webapp=/solr path=/update params={version=2&wt=javabin}{add=[19]} 0 0
   [junit4]   2> 4974 INFO  (qtp1345196773-61) [    x:collection1] o.a.s.u.p.LogUpdateProcessorFactory [collection1]  webapp=/solr path=/update params={version=2&wt=javabin}{add=[20]} 0 0
   [junit4]   2> 4987 INFO  (qtp1345196773-58) [    x:collection1] o.a.s.u.p.LogUpdateProcessorFactory [collection1]  webapp=/solr path=/update params={version=2&wt=javabin}{add=[21]} 0 0
   [junit4]   2> 4992 INFO  (qtp1345196773-59) [    x:collection1] o.a.s.u.p.LogUpdateProcessorFactory [collection1]  webapp=/solr path=/update params={version=2&wt=javabin}{add=[22]} 0 0
   [junit4]   2> 5002 INFO  (qtp1345196773-60) [    x:collection1] o.a.s.u.p.LogUpdateProcessorFactory [collection1]  webapp=/solr path=/update params={version=2&wt=javabin}{add=[23]} 0 0
   [junit4]   2> 5007 INFO  (qtp1345196773-62) [    x:collection1] o.a.s.u.p.LogUpdateProcessorFactory [collection1]  webapp=/solr path=/update params={version=2&wt=javabin}{add=[24]} 0 0
   [junit4]   2> 5013 INFO  (qtp1345196773-61) [    x:collection1] o.a.s.u.p.LogUpdateProcessorFactory [collection1]  webapp=/solr path=/update params={version=2&wt=javabin}{add=[25]} 0 0
   [junit4]   2> 5017 INFO  (qtp1345196773-58) [    x:collection1] o.a.s.u.p.LogUpdateProcessorFactory [collection1]  webapp=/solr path=/update params={version=2&wt=javabin}{add=[26]} 0 0
   [junit4]   2> 5021 INFO  (qtp1345196773-59) [    x:collection1] o.a.s.u.p.LogUpdateProcessorFactory [collection1]  webapp=/solr path=/update params={version=2&wt=javabin}{add=[27]} 0 0
   [junit4]   2> 5026 INFO  (qtp1345196773-60) [    x:collection1] o.a.s.u.p.LogUpdateProcessorFactory [collection1]  webapp=/solr path=/update params={version=2&wt=javabin}{add=[28]} 0 0
   [junit4]   2> 5030 INFO  (qtp1345196773-62) [    x:collection1] o.a.s.u.p.LogUpdateProcessorFactory [collection1]  webapp=/solr path=/update params={version=2&wt=javabin}{add=[29]} 0 0
   [junit4]   2> 5034 INFO  (qtp1345196773-61) [    x:collection1] o.a.s.u.p.LogUpdateProcessorFactory [collection1]  webapp=/solr path=/update params={version=2&wt=javabin}{add=[30]} 0 0
   [junit4]   2> 5038 INFO  (qtp1345196773-58) [    x:collection1] o.a.s.u.p.LogUpdateProcessorFactory [collection1]  webapp=/solr path=/update params={version=2&wt=javabin}{add=[31]} 0 0
   [junit4]   2> 5042 INFO  (qtp1345196773-59) [    x:collection1] o.a.s.u.p.LogUpdateProcessorFactory [collection1]  webapp=/solr path=/update params={version=2&wt=javabin}{add=[32]} 0 0
   [junit4]   2> 5046 INFO  (qtp1345196773-60) [    x:collection1] o.a.s.u.p.LogUpdateProcessorFactory [collection1]  webapp=/solr path=/update params={version=2&wt=javabin}{add=[33]} 0 0
   [junit4]   2> 5050 INFO  (qtp1345196773-62) [    x:collection1] o.a.s.u.p.LogUpdateProcessorFactory [collection1]  webapp=/solr path=/update params={version=2&wt=javabin}{add=[34]} 0 0
   [junit4]   2> 5054 INFO  (qtp1345196773-61) [    x:collection1] o.a.s.u.p.LogUpdateProcessorFactory [collection1]  webapp=/solr path=/update params={version=2&wt=javabin}{add=[35]} 0 0
   [junit4]   2> 5059 INFO  (qtp1345196773-58) [    x:collection1] o.a.s.u.p.LogUpdateProcessorFactory [collection1]  webapp=/solr path=/update params={version=2&wt=javabin}{add=[36]} 0 0
   [junit4]   2> 5063 INFO  (qtp1345196773-59) [    x:collection1] o.a.s.u.p.LogUpdateProcessorFactory [collection1]  webapp=/solr path=/update params={version=2&wt=javabin}{add=[37]} 0 0
   [junit4]   2> 5067 INFO  (qtp1345196773-60) [    x:collection1] o.a.s.u.p.LogUpdateProcessorFactory [collection1]  webapp=/solr path=/update params={version=2&wt=javabin}{add=[38]} 0 0
   [junit4]   2> 5072 INFO  (qtp1345196773-62) [    x:collection1] o.a.s.u.p.LogUpdateProcessorFactory [collection1]  webapp=/solr path=/update params={version=2&wt=javabin}{add=[39]} 0 0
   [junit4]   2> 5077 INFO  (qtp1345196773-61) [    x:collection1] o.a.s.u.p.LogUpdateProcessorFactory [collection1]  webapp=/solr path=/update params={version=2&wt=javabin}{add=[40]} 0 0
   [junit4]   2> 5081 INFO  (qtp1345196773-58) [    x:collection1] o.a.s.u.p.LogUpdateProcessorFactory [collection1]  webapp=/solr path=/update params={version=2&wt=javabin}{add=[41]} 0 0
   [junit4]   2> 5085 INFO  (qtp1345196773-59) [    x:collection1] o.a.s.u.p.LogUpdateProcessorFactory [collection1]  webapp=/solr path=/update params={version=2&wt=javabin}{add=[42]} 0 0
   [junit4]   2> 5089 INFO  (qtp1345196773-60) [    x:collection1] o.a.s.u.p.LogUpdateProcessorFactory [collection1]  webapp=/solr path=/update params={version=2&wt=javabin}{add=[43]} 0 0
   [junit4]   2> 5094 INFO  (qtp1345196773-62) [    x:collection1] o.a.s.u.p.LogUpdateProcessorFactory [collection1]  webapp=/solr path=/update params={version=2&wt=javabin}{add=[44]} 0 0
   [junit4]   2> 5098 INFO  (qtp1345196773-61) [    x:collection1] o.a.s.u.p.LogUpdateProcessorFactory [collection1]  webapp=/solr path=/update params={version=2&wt=javabin}{add=[45]} 0 0
   [junit4]   2> 5102 INFO  (qtp1345196773-58) [    x:collection1] o.a.s.u.p.LogUpdateProcessorFactory [collection1]  webapp=/solr path=/update params={version=2&wt=javabin}{add=[46]} 0 0
   [junit4]   2> 5106 INFO  (qtp1345196773-59) [    x:collection1] o.a.s.u.p.LogUpdateProcessorFactory [collection1]  webapp=/solr path=/update params={version=2&wt=javabin}{add=[47]} 0 0
   [junit4]   2> 5110 INFO  (qtp1345196773-60) [    x:collection1] o.a.s.u.p.LogUpdateProcessorFactory [collection1]  webapp=/solr path=/update params={version=2&wt=javabin}{add=[48]} 0 0
   [junit4]   2> 5114 INFO  (qtp1345196773-62) [    x:collection1] o.a.s.u.p.LogUpdateProcessorFactory [collection1]  webapp=/solr path=/update params={version=2&wt=javabin}{add=[49]} 0 0
   [junit4]   2> 5118 INFO  (qtp1345196773-61) [    x:collection1] o.a.s.u.p.LogUpdateProcessorFactory [collection1]  webapp=/solr path=/update params={version=2&wt=javabin}{add=[50]} 0 0
   [junit4]   2> 5122 INFO  (qtp1345196773-58) [    x:collection1] o.a.s.u.p.LogUpdateProcessorFactory [collection1]  webapp=/solr path=/update params={version=2&wt=javabin}{add=[51]} 0 0
   [junit4]   2> 5128 INFO  (qtp1345196773-59) [    x:collection1] o.a.s.u.p.LogUpdateProcessorFactory [collection1]  webapp=/solr path=/update params={version=2&wt=javabin}{add=[52]} 0 0
   [junit4]   2> 5132 INFO  (qtp1345196773-60) [    x:collection1] o.a.s.u.p.LogUpdateProcessorFactory [collection1]  webapp=/solr path=/update params={version=2&wt=javabin}{add=[53]} 0 0
   [junit4]   2> 5136 INFO  (qtp1345196773-62) [    x:collection1] o.a.s.u.p.LogUpdateProcessorFactory [collection1]  webapp=/solr path=/update params={version=2&wt=javabin}{add=[54]} 0 0
   [junit4]   2> 5141 INFO  (qtp1345196773-61) [    x:collection1] o.a.s.u.p.LogUpdateProcessorFactory [collection1]  webapp=/solr path=/update params={version=2&wt=javabin}{add=[55]} 0 0
   [junit4]   2> 5154 INFO  (qtp1345196773-58) [    x:collection1] o.a.s.u.p.LogUpdateProcessorFactory [collection1]  webapp=/solr path=/update params={version=2&wt=javabin}{add=[56]} 0 0
   [junit4]   2> 5158 INFO  (qtp1345196773-59) [    x:collection1] o.a.s.u.p.LogUpdateProcessorFactory [collection1]  webapp=/solr path=/update params={version=2&wt=javabin}{add=[57]} 0 0
   [junit4]   2> 5163 INFO  (qtp1345196773-60) [    x:collection1] o.a.s.u.p.LogUpdateProcessorFactory [collection1]  webapp=/solr path=/update params={version=2&wt=javabin}{add=[58]} 0 0
   [junit4]   2> 5167 INFO  (qtp1345196773-62) [    x:collection1] o.a.s.u.p.LogUpdateProcessorFactory [collection1]  webapp=/solr path=/update params={version=2&wt=javabin}{add=[59]} 0 0
   [junit4]   2> 5171 INFO  (qtp1345196773-61) [    x:collection1] o.a.s.u.p.LogUpdateProcessorFactory [collection1]  webapp=/solr path=/update params={version=2&wt=javabin}{add=[60]} 0 0
   [junit4]   2> 5182 INFO  (qtp1345196773-58) [    x:collection1] o.a.s.u.p.LogUpdateProcessorFactory [collection1]  webapp=/solr path=/update params={version=2&wt=javabin}{add=[61]} 0 0
   [junit4]   2> 5186 INFO  (qtp1345196773-59) [    x:collection1] o.a.s.u.p.LogUpdateProcessorFactory [collection1]  webapp=/solr path=/update params={version=2&wt=javabin}{add=[62]} 0 0
   [junit4]   2> 5191 INFO  (qtp1345196773-60) [    x:collection1] o.a.s.u.p.LogUpdateProcessorFactory [collection1]  webapp=/solr path=/update params={version=2&wt=javabin}{add=[63]} 0 0
   [junit4]   2> 5195 INFO  (qtp1345196773-62) [    x:collection1] o.a.s.u.p.LogUpdateProcessorFactory [collection1]  webapp=/solr path=/update params={version=2&wt=javabin}{add=[64]} 0 0
   [junit4]   2> 5199 INFO  (qtp1345196773-61) [    x:collection1] o.a.s.u.p.LogUpdateProcessorFactory [collection1]  webapp=/solr path=/update params={version=2&wt=javabin}{add=[65]} 0 0
   [junit4]   2> 5206 INFO  (qtp1345196773-58) [    x:collection1] o.a.s.u.p.LogUpdateProcessorFactory [collection1]  webapp=/solr path=/update params={version=2&wt=javabin}{add=[66]} 0 0
   [junit4]   2> 5210 INFO  (qtp1345196773-59) [    x:collection1] o.a.s.u.p.LogUpdateProcessorFactory [collection1]  webapp=/solr path=/update params={version=2&wt=javabin}{add=[67]} 0 0
   [junit4]   2> 5214 INFO  (qtp1345196773-60) [    x:collection1] o.a.s.u.p.LogUpdateProcessorFactory [collection1]  webapp=/solr path=/update params={version=2&wt=javabin}{add=[68]} 0 0
   [junit4]   2> 5218 INFO  (qtp1345196773-62) [    x:collection1] o.a.s.u.p.LogUpdateProcessorFactory [collection1]  webapp=/solr path=/update params={version=2&wt=javabin}{add=[69]} 0 0
   [junit4]   2> 5222 INFO  (qtp1345196773-61) [    x:collection1] o.a.s.u.p.LogUpdateProcessorFactory [collection1]  webapp=/solr path=/update params={version=2&wt=javabin}{add=[70]} 0 0
   [junit4]   2> 5240 INFO  (qtp1345196773-58) [    x:collection1] o.a.s.u.p.LogUpdateProcessorFactory [collection1]  webapp=/solr path=/update params={version=2&wt=javabin}{add=[71]} 0 0
   [junit4]   2> 5245 INFO  (qtp1345196773-59) [    x:collection1] o.a.s.u.p.LogUpdateProcessorFactory [collection1]  webapp=/solr path=/update params={version=2&wt=javabin}{add=[72]} 0 0
   [junit4]   2> 5249 INFO  (qtp1345196773-60) [    x:collection1] o.a.s.u.p.LogUpdateProcessorFactory [collection1]  webapp=/solr path=/update params={version=2&wt=javabin}{add=[73]} 0 0
   [junit4]   2> 5253 INFO  (qtp1345196773-62) [    x:collection1] o.a.s.u.p.LogUpdateProcessorFactory [collection1]  webapp=/solr path=/update params={version=2&wt=javabin}{add=[74]} 0 0
   [junit4]   2> 5262 INFO  (qtp1345196773-61) [    x:collection1] o.a.s.u.p.LogUpdateProcessorFactory [collection1]  webapp=/solr path=/update params={version=2&wt=javabin}{add=[75]} 0 0
   [junit4]   2> 5266 INFO  (qtp1345196773-58) [    x:collection1] o.a.s.u.p.LogUpdateProcessorFactory [collection1]  webapp=/solr path=/update params={version=2&wt=javabin}{add=[76]} 0 0
   [junit4]   2> 5270 INFO  (qtp1345196773-59) [    x:collection1] o.a.s.u.p.LogUpdateProcessorFactory [collection1]  webapp=/solr path=/update params={version=2&wt=javabin}{add=[77]} 0 0
   [junit4]   2> 5274 INFO  (qtp1345196773-60) [    x:collection1] o.a.s.u.p.LogUpdateProcessorFactory [collection1]  webapp=/solr path=/update params={version=2&wt=javabin}{add=[78]} 0 0
   [junit4]   2> 5278 INFO  (qtp1345196773-62) [    x:collection1] o.a.s.u.p.LogUpdateProcessorFactory [collection1]  webapp=/solr path=/update params={version=2&wt=javabin}{add=[79]} 0 0
   [junit4]   2> 5282 INFO  (qtp1345196773-61) [    x:collection1] o.a.s.u.p.LogUpdateProcessorFactory [collection1]  webapp=/solr path=/update params={version=2&wt=javabin}{add=[80]} 0 0
   [junit4]   2> 5290 INFO  (qtp1345196773-58) [    x:collection1] o.a.s.u.p.LogUpdateProcessorFactory [collection1]  webapp=/solr path=/update params={version=2&wt=javabin}{add=[81]} 0 0
   [junit4]   2> 5294 INFO  (qtp1345196773-59) [    x:collection1] o.a.s.u.p.LogUpdateProcessorFactory [collection1]  webapp=/solr path=/update params={version=2&wt=javabin}{add=[82]} 0 0
   [junit4]   2> 5298 INFO  (qtp1345196773-60) [    x:collection1] o.a.s.u.p.LogUpdateProcessorFactory [collection1]  webapp=/solr path=/update params={version=2&wt=javabin}{add=[83]} 0 0
   [junit4]   2> 5302 INFO  (qtp1345196773-62) [    x:collection1] o.a.s.u.p.LogUpdateProcessorFactory [collection1]  webapp=/solr path=/update params={version=2&wt=javabin}{add=[84]} 0 0
   [junit4]   2> 5306 INFO  (qtp1345196773-61) [    x:collection1] o.a.s.u.p.LogUpdateProcessorFactory [collection1]  webapp=/solr path=/update params={version=2&wt=javabin}{add=[85]} 0 0
   [junit4]   2> 5310 INFO  (qtp1345196773-58) [    x:collection1] o.a.s.u.p.LogUpdateProcessorFactory [collection1]  webapp=/solr path=/update params={version=2&wt=javabin}{add=[86]} 0 0
   [junit4]   2> 5314 INFO  (qtp1345196773-59) [    x:collection1] o.a.s.u.p.LogUpdateProcessorFactory [collection1]  webapp=/solr path=/update params={version=2&wt=javabin}{add=[87]} 0 0
   [junit4]   2> 5318 INFO  (qtp1345196773-60) [    x:collection1] o.a.s.u.p.LogUpdateProcessorFactory [collection1]  webapp=/solr path=/update params={version=2&wt=javabin}{add=[88]} 0 0
   [junit4]   2> 5322 INFO  (qtp1345196773-62) [    x:collection1] o.a.s.u.p.LogUpdateProcessorFactory [collection1]  webapp=/solr path=/update params={version=2&wt=javabin}{add=[89]} 0 0
   [junit4]   2> 5326 INFO  (qtp1345196773-61) [    x:collection1] o.a.s.u.p.LogUpdateProcessorFactory [collection1]  webapp=/solr path=/update params={version=2&wt=javabin}{add=[90]} 0 0
   [junit4]   2> 5330 INFO  (qtp1345196773-58) [    x:collection1] o.a.s.u.p.LogUpdateProcessorFactory [collection1]  webapp=/solr path=/update params={version=2&wt=javabin}{add=[91]} 0 0
   [junit4]   2> 5334 INFO  (qtp1345196773-59) [    x:collection1] o.a.s.u.p.LogUpdateProcessorFactory [collection1]  webapp=/solr path=/update params={version=2&wt=javabin}{add=[92]} 0 0
   [junit4]   2> 5337 INFO  (qtp1345196773-60) [    x:collection1] o.a.s.u.p.LogUpdateProcessorFactory [collection1]  webapp=/solr path=/update params={version=2&wt=javabin}{add=[93]} 0 0
   [junit4]   2> 5342 INFO  (qtp1345196773-62) [    x:collection1] o.a.s.u.p.LogUpdateProcessorFactory [collection1]  webapp=/solr path=/update params={version=2&wt=javabin}{add=[94]} 0 0
   [junit4]   2> 5348 INFO  (qtp1345196773-61) [    x:collection1] o.a.s.u.p.LogUpdateProcessorFactory [collection1]  webapp=/solr path=/update params={version=2&wt=javabin}{add=[95]} 0 0
   [junit4]   2> 5358 INFO  (qtp1345196773-58) [    x:collection1] o.a.s.u.p.LogUpdateProcessorFactory [collection1]  webapp=/solr path=/update params={version=2&wt=javabin}{add=[96]} 0 0
   [junit4]   2> 5362 INFO  (qtp1345196773-59) [    x:collection1] o.a.s.u.p.LogUpdateProcessorFactory [collection1]  webapp=/solr path=/update params={version=2&wt=javabin}{add=[97]} 0 0
   [junit4]   2> 5366 INFO  (qtp1345196773-60) [    x:collection1] o.a.s.u.p.LogUpdateProcessorFactory [collection1]  webapp=/solr path=/update params={version=2&wt=javabin}{add=[98]} 0 0
   [junit4]   2> 5370 INFO  (qtp1345196773-62) [    x:collection1] o.a.s.u.p.LogUpdateProcessorFactory [collection1]  webapp=/solr path=/update params={version=2&wt=javabin}{add=[99]} 0 0
   [junit4]   2> 5378 INFO  (qtp1345196773-61) [    x:collection1] o.a.s.u.p.LogUpdateProcessorFactory [collection1]  webapp=/solr path=/update params={version=2&wt=javabin}{add=[100]} 0 0
   [junit4]   2> 5382 INFO  (qtp1345196773-58) [    x:collection1] o.a.s.u.p.LogUpdateProcessorFactory [collection1]  webapp=/solr path=/update params={version=2&wt=javabin}{add=[101]} 0 0
   [junit4]   2> 5386 INFO  (qtp1345196773-59) [    x:collection1] o.a.s.u.p.LogUpdateProcessorFactory [collection1]  webapp=/solr path=/update params={version=2&wt=javabin}{add=[102]} 0 0
   [junit4]   2> 5390 INFO  (qtp1345196773-60) [    x:collection1] o.a.s.u.p.LogUpdateProcessorFactory [collection1]  webapp=/solr path=/update params={version=2&wt=javabin}{add=[103]} 0 0
   [junit4]   2> 5393 INFO  (qtp1345196773-62) [    x:collection1] o.a.s.u.p.LogUpdateProcessorFactory [collection1]  webapp=/solr path=/update params={version=2&wt=javabin}{add=[104]} 0 0
   [junit4]   2> 5397 INFO  (qtp1345196773-61) [    x:collection1] o.a.s.u.p.LogUpdateProcessorFactory [collection1]  webapp=/solr path=/update params={version=2&wt=javabin}{add=[105]} 0 0
   [junit4]   2> 5401 INFO  (qtp1345196773-58) [    x:collection1] o.a.s.u.p.LogUpdateProcessorFactory [collection1]  webapp=/solr path=/update params={version=2&wt=javabin}{add=[106]} 0 0
   [junit4]   2> 5405 INFO  (qtp1345196773-59) [    x:collection1] o.a.s.u.p.LogUpdateProcessorFactory [collection1]  webapp=/solr path=/update params={version=2&wt=javabin}{add=[107]} 0 0
   [junit4]   2> 5408 INFO  (qtp1345196773-60) [    x:collection1] o.a.s.u.p.LogUpdateProcessorFactory [collection1]  webapp=/solr path=/update params={version=2&wt=javabin}{add=[108]} 0 0
   [junit4]   2> 5412 INFO  (qtp1345196773-62) [    x:collection1] o.a.s.u.p.LogUpdateProcessorFactory [collection1]  webapp=/solr path=/update params={version=2&wt=javabin}{add=[109]} 0 0
   [junit4]   2> 5416 INFO  (qtp1345196773-61) [    x:collection1] o.a.s.u.p.LogUpdateProcessorFactory [collection1]  webapp=/solr path=/update params={version=2&wt=javabin}{add=[110]} 0 0
   [junit4]   2> 5420 INFO  (qtp1345196773-58) [    x:collection1] o.a.s.u.p.LogUpdateProcessorFactory [collection1]  webapp=/solr path=/update params={version=2&wt=javabin}{add=[111]} 0 0
   [junit4]   2> 5423 INFO  (qtp1345196773-59) [    x:collection1] o.a.s.u.p.LogUpdateProcessorFactory [collection1]  webapp=/solr path=/update params={version=2&wt=javabin}{add=[112]} 0 0
   [junit4]   2> 5427 INFO  (qtp1345196773-60) [    x:collection1] o.a.s.u.p.LogUpdateProcessorFactory [collection1]  webapp=/solr path=/update params={version=2&wt=javabin}{add=[113]} 0 0
   [junit4]   2> 5437 INFO  (qtp1345196773-62) [    x:collection1] o.a.s.u.p.LogUpdateProcessorFactory [collection1]  webapp=/solr path=/update params={version=2&wt=javabin}{add=[114]} 0 0
   [junit4]   2> 5445 INFO  (qtp1345196773-61) [    x:collection1] o.a.s.u.p.LogUpdateProcessorFactory [collection1]  webapp=/solr path=/update params={version=2&wt=javabin}{add=[115]} 0 0
   [junit4]   2> 5453 INFO  (qtp1345196773-58) [    x:collection1] o.a.s.u.p.LogUpdateProcessorFactory [collection1]  webapp=/solr path=/update params={version=2&wt=javabin}{add=[116]} 0 0
   [junit4]   2> 5457 INFO  (qtp1345196773-59) [    x:collection1] o.a.s.u.p.LogUpdateProcessorFactory [collection1]  webapp=/solr path=/update params={version=2&wt=javabin}{add=[117]} 0 0
   [junit4]   2> 5461 INFO  (qtp1345196773-60) [    x:collection1] o.a.s.u.p.LogUpdateProcessorFactory [collection1]  webapp=/solr path=/update params={version=2&wt=javabin}{add=[118]} 0 0
   [junit4]   2> 5465 INFO  (qtp1345196773-62) [    x:collection1] o.a.s.u.p.LogUpdateProcessorFactory [collection1]  webapp=/solr path=/update params={version=2&wt=javabin}{add=[119]} 0 0
   [junit4]   2> 5469 INFO  (qtp1345196773-61) [    x:collection1] o.a.s.u.p.LogUpdateProcessorFactory [collection1]  webapp=/solr path=/update params={version=2&wt=javabin}{add=[120]} 0 0
   [junit

[...truncated too long message...]

##Ending doTestReplicateAfterWrite2Slave
   [junit4]   2> 103189 ERROR (explicit-fetchindex-cmd) [    x:collection1] o.a.s.h.IndexFetcher Master at: http://127.0.0.1:55985/solr/collection1 is not available. Index fetch failed. Exception: Server refused connection at: http://127.0.0.1:55985/solr/collection1
   [junit4]   2> 103217 INFO  (TEST-TestReplicationHandler.doTestReplicateAfterWrite2Slave-seed#[DDD47F54EA702C0]) [    ] o.e.j.s.ServerConnector Stopped ServerConnector@34c1cab5{HTTP/1.1}{127.0.0.1:0}
   [junit4]   2> 103217 INFO  (TEST-TestReplicationHandler.doTestReplicateAfterWrite2Slave-seed#[DDD47F54EA702C0]) [    ] o.a.s.c.CoreContainer Shutting down CoreContainer instance=900511555
   [junit4]   2> 103230 INFO  (coreCloseExecutor-580-thread-1) [    x:collection1] o.a.s.c.SolrCore [collection1]  CLOSING SolrCore org.apache.solr.core.SolrCore@1e0e6472
   [junit4]   2> 103230 INFO  (coreCloseExecutor-580-thread-1) [    x:collection1] o.a.s.u.DirectUpdateHandler2 closing DirectUpdateHandler2{commits=1,autocommits=0,soft autocommits=0,optimizes=0,rollbacks=0,expungeDeletes=0,docsPending=0,adds=0,deletesById=0,deletesByQuery=0,errors=0,cumulative_adds=493,cumulative_deletesById=0,cumulative_deletesByQuery=0,cumulative_errors=0}
   [junit4]   2> 103230 INFO  (coreCloseExecutor-580-thread-1) [    x:collection1] o.a.s.u.SolrCoreState Closing SolrCoreState
   [junit4]   2> 103230 INFO  (coreCloseExecutor-580-thread-1) [    x:collection1] o.a.s.u.DefaultSolrCoreState SolrCoreState ref count has reached 0 - closing IndexWriter
   [junit4]   2> 103231 INFO  (coreCloseExecutor-580-thread-1) [    x:collection1] o.a.s.u.DefaultSolrCoreState closing IndexWriter with IndexWriterCloser
   [junit4]   2> 103235 INFO  (coreCloseExecutor-580-thread-1) [    x:collection1] o.a.s.c.SolrCore [collection1] Closing main searcher on request.
   [junit4]   2> 103236 INFO  (coreCloseExecutor-580-thread-1) [    x:collection1] o.a.s.c.CachingDirectoryFactory Closing MockDirectoryFactory - 2 directories currently being tracked
   [junit4]   2> 103236 INFO  (coreCloseExecutor-580-thread-1) [    x:collection1] o.a.s.c.CachingDirectoryFactory looking to close /x1/jenkins/jenkins-slave/workspace/Lucene-Solr-Tests-5.5-Java7/solr/build/solr-core/test/J0/temp/solr.handler.TestReplicationHandler_DDD47F54EA702C0-001/solr-instance-027/./collection1/data [CachedDir<<refCount=0;path=/x1/jenkins/jenkins-slave/workspace/Lucene-Solr-Tests-5.5-Java7/solr/build/solr-core/test/J0/temp/solr.handler.TestReplicationHandler_DDD47F54EA702C0-001/solr-instance-027/./collection1/data;done=false>>]
   [junit4]   2> 103236 INFO  (coreCloseExecutor-580-thread-1) [    x:collection1] o.a.s.c.CachingDirectoryFactory Closing directory: /x1/jenkins/jenkins-slave/workspace/Lucene-Solr-Tests-5.5-Java7/solr/build/solr-core/test/J0/temp/solr.handler.TestReplicationHandler_DDD47F54EA702C0-001/solr-instance-027/./collection1/data
   [junit4]   2> 103240 INFO  (coreCloseExecutor-580-thread-1) [    x:collection1] o.a.s.c.CachingDirectoryFactory looking to close /x1/jenkins/jenkins-slave/workspace/Lucene-Solr-Tests-5.5-Java7/solr/build/solr-core/test/J0/temp/solr.handler.TestReplicationHandler_DDD47F54EA702C0-001/solr-instance-027/./collection1/data/index [CachedDir<<refCount=0;path=/x1/jenkins/jenkins-slave/workspace/Lucene-Solr-Tests-5.5-Java7/solr/build/solr-core/test/J0/temp/solr.handler.TestReplicationHandler_DDD47F54EA702C0-001/solr-instance-027/./collection1/data/index;done=false>>]
   [junit4]   2> 103240 INFO  (coreCloseExecutor-580-thread-1) [    x:collection1] o.a.s.c.CachingDirectoryFactory Closing directory: /x1/jenkins/jenkins-slave/workspace/Lucene-Solr-Tests-5.5-Java7/solr/build/solr-core/test/J0/temp/solr.handler.TestReplicationHandler_DDD47F54EA702C0-001/solr-instance-027/./collection1/data/index
   [junit4]   2> 103241 INFO  (TEST-TestReplicationHandler.doTestReplicateAfterWrite2Slave-seed#[DDD47F54EA702C0]) [    ] o.e.j.s.h.ContextHandler Stopped o.e.j.s.ServletContextHandler@20e41347{/solr,null,UNAVAILABLE}
   [junit4]   2> 103259 INFO  (TEST-TestReplicationHandler.doTestReplicateAfterWrite2Slave-seed#[DDD47F54EA702C0]) [    ] o.e.j.s.ServerConnector Stopped ServerConnector@51f0ad2{HTTP/1.1}{127.0.0.1:0}
   [junit4]   2> 103260 INFO  (TEST-TestReplicationHandler.doTestReplicateAfterWrite2Slave-seed#[DDD47F54EA702C0]) [    ] o.a.s.c.CoreContainer Shutting down CoreContainer instance=969905109
   [junit4]   2> 103262 INFO  (coreCloseExecutor-581-thread-1) [    x:collection1] o.a.s.c.SolrCore [collection1]  CLOSING SolrCore org.apache.solr.core.SolrCore@2f234042
   [junit4]   2> 103262 INFO  (coreCloseExecutor-581-thread-1) [    x:collection1] o.a.s.u.DirectUpdateHandler2 closing DirectUpdateHandler2{commits=5,autocommits=0,soft autocommits=0,optimizes=0,rollbacks=0,expungeDeletes=0,docsPending=0,adds=0,deletesById=0,deletesByQuery=0,errors=0,cumulative_adds=5,cumulative_deletesById=0,cumulative_deletesByQuery=0,cumulative_errors=0}
   [junit4]   2> 103262 INFO  (coreCloseExecutor-581-thread-1) [    x:collection1] o.a.s.u.SolrCoreState Closing SolrCoreState
   [junit4]   2> 103262 INFO  (coreCloseExecutor-581-thread-1) [    x:collection1] o.a.s.u.DefaultSolrCoreState SolrCoreState ref count has reached 0 - closing IndexWriter
   [junit4]   2> 103262 INFO  (coreCloseExecutor-581-thread-1) [    x:collection1] o.a.s.u.DefaultSolrCoreState closing IndexWriter with IndexWriterCloser
   [junit4]   2> 103273 INFO  (coreCloseExecutor-581-thread-1) [    x:collection1] o.a.s.c.SolrCore [collection1] Closing main searcher on request.
   [junit4]   2> 103274 INFO  (coreCloseExecutor-581-thread-1) [    x:collection1] o.a.s.c.CachingDirectoryFactory Closing MockDirectoryFactory - 2 directories currently being tracked
   [junit4]   2> 103274 INFO  (coreCloseExecutor-581-thread-1) [    x:collection1] o.a.s.c.CachingDirectoryFactory looking to close /x1/jenkins/jenkins-slave/workspace/Lucene-Solr-Tests-5.5-Java7/solr/build/solr-core/test/J0/temp/solr.handler.TestReplicationHandler_DDD47F54EA702C0-001/solr-instance-028/./collection1/data [CachedDir<<refCount=0;path=/x1/jenkins/jenkins-slave/workspace/Lucene-Solr-Tests-5.5-Java7/solr/build/solr-core/test/J0/temp/solr.handler.TestReplicationHandler_DDD47F54EA702C0-001/solr-instance-028/./collection1/data;done=false>>]
   [junit4]   2> 103274 INFO  (coreCloseExecutor-581-thread-1) [    x:collection1] o.a.s.c.CachingDirectoryFactory Closing directory: /x1/jenkins/jenkins-slave/workspace/Lucene-Solr-Tests-5.5-Java7/solr/build/solr-core/test/J0/temp/solr.handler.TestReplicationHandler_DDD47F54EA702C0-001/solr-instance-028/./collection1/data
   [junit4]   2> 103274 INFO  (coreCloseExecutor-581-thread-1) [    x:collection1] o.a.s.c.CachingDirectoryFactory looking to close /x1/jenkins/jenkins-slave/workspace/Lucene-Solr-Tests-5.5-Java7/solr/build/solr-core/test/J0/temp/solr.handler.TestReplicationHandler_DDD47F54EA702C0-001/solr-instance-028/./collection1/data/index [CachedDir<<refCount=0;path=/x1/jenkins/jenkins-slave/workspace/Lucene-Solr-Tests-5.5-Java7/solr/build/solr-core/test/J0/temp/solr.handler.TestReplicationHandler_DDD47F54EA702C0-001/solr-instance-028/./collection1/data/index;done=false>>]
   [junit4]   2> 103274 INFO  (coreCloseExecutor-581-thread-1) [    x:collection1] o.a.s.c.CachingDirectoryFactory Closing directory: /x1/jenkins/jenkins-slave/workspace/Lucene-Solr-Tests-5.5-Java7/solr/build/solr-core/test/J0/temp/solr.handler.TestReplicationHandler_DDD47F54EA702C0-001/solr-instance-028/./collection1/data/index
   [junit4]   2> 103291 INFO  (TEST-TestReplicationHandler.doTestReplicateAfterWrite2Slave-seed#[DDD47F54EA702C0]) [    ] o.e.j.s.h.ContextHandler Stopped o.e.j.s.ServletContextHandler@2065f2ac{/solr,null,UNAVAILABLE}
   [junit4]   2> 103294 INFO  (SUITE-TestReplicationHandler-seed#[DDD47F54EA702C0]-worker) [    ] o.a.s.SolrTestCaseJ4 ###deleteCore
   [junit4]   2> NOTE: leaving temporary files on disk at: /x1/jenkins/jenkins-slave/workspace/Lucene-Solr-Tests-5.5-Java7/solr/build/solr-core/test/J0/temp/solr.handler.TestReplicationHandler_DDD47F54EA702C0-001
   [junit4]   2> NOTE: test params are: codec=Asserting(Lucene54): {id=PostingsFormat(name=MockRandom), newname=PostingsFormat(name=MockRandom), name=PostingsFormat(name=MockRandom)}, docValues:{}, sim=RandomSimilarity(queryNorm=true,coord=no): {}, locale=ms, timezone=Asia/Ust-Nera
   [junit4]   2> NOTE: Linux 3.13.0-52-generic amd64/Oracle Corporation 1.7.0_80 (64-bit)/cpus=4,threads=1,free=159437416,total=248512512
   [junit4]   2> NOTE: All tests run in this JVM: [TestReplicationHandler]
   [junit4] Completed [19/566 (1!)] on J0 in 105.29s, 13 tests, 1 failure <<< FAILURES!

[...truncated 1730 lines...]
BUILD FAILED
/x1/jenkins/jenkins-slave/workspace/Lucene-Solr-Tests-5.5-Java7/build.xml:750: The following error occurred while executing this line:
/x1/jenkins/jenkins-slave/workspace/Lucene-Solr-Tests-5.5-Java7/build.xml:694: The following error occurred while executing this line:
/x1/jenkins/jenkins-slave/workspace/Lucene-Solr-Tests-5.5-Java7/build.xml:59: The following error occurred while executing this line:
/x1/jenkins/jenkins-slave/workspace/Lucene-Solr-Tests-5.5-Java7/solr/build.xml:233: The following error occurred while executing this line:
/x1/jenkins/jenkins-slave/workspace/Lucene-Solr-Tests-5.5-Java7/solr/common-build.xml:534: The following error occurred while executing this line:
/x1/jenkins/jenkins-slave/workspace/Lucene-Solr-Tests-5.5-Java7/lucene/common-build.xml:1477: The following error occurred while executing this line:
/x1/jenkins/jenkins-slave/workspace/Lucene-Solr-Tests-5.5-Java7/lucene/common-build.xml:1033: There were test failures: 566 suites (7 ignored), 2275 tests, 1 failure, 55 ignored (39 assumptions) [seed: DDD47F54EA702C0]

Total time: 62 minutes 2 seconds
Build step 'Invoke Ant' marked build as failure
Archiving artifacts
Recording test results
Email was triggered for: Failure - Any
Sending email for trigger: Failure - Any



Mime
View raw message