lucene-dev mailing list archives

Site index · List index
Message view « Date » · « Thread »
Top « Date » · « Thread »
From Policeman Jenkins Server <jenk...@thetaphi.de>
Subject [JENKINS] Lucene-Solr-5.x-Linux (64bit/jdk1.7.0_80) - Build # 15575 - Still Failing!
Date Sun, 14 Feb 2016 03:38:23 GMT
Build: http://jenkins.thetaphi.de/job/Lucene-Solr-5.x-Linux/15575/
Java: 64bit/jdk1.7.0_80 -XX:+UseCompressedOops -XX:+UseParallelGC

1 tests failed.
FAILED:  junit.framework.TestSuite.org.apache.solr.handler.TestReplicationHandler

Error Message:
ObjectTracker found 1 object(s) that were not released!!! [NRTCachingDirectory]

Stack Trace:
java.lang.AssertionError: ObjectTracker found 1 object(s) that were not released!!! [NRTCachingDirectory]
	at __randomizedtesting.SeedInfo.seed([EA343A2A6C38B783]:0)
	at org.junit.Assert.fail(Assert.java:93)
	at org.junit.Assert.assertTrue(Assert.java:43)
	at org.junit.Assert.assertNull(Assert.java:551)
	at org.apache.solr.SolrTestCaseJ4.afterClass(SolrTestCaseJ4.java:228)
	at sun.reflect.GeneratedMethodAccessor21.invoke(Unknown Source)
	at sun.reflect.DelegatingMethodAccessorImpl.invoke(DelegatingMethodAccessorImpl.java:43)
	at java.lang.reflect.Method.invoke(Method.java:606)
	at com.carrotsearch.randomizedtesting.RandomizedRunner.invoke(RandomizedRunner.java:1764)
	at com.carrotsearch.randomizedtesting.RandomizedRunner$7.evaluate(RandomizedRunner.java:834)
	at com.carrotsearch.randomizedtesting.rules.StatementAdapter.evaluate(StatementAdapter.java:36)
	at com.carrotsearch.randomizedtesting.rules.SystemPropertiesRestoreRule$1.evaluate(SystemPropertiesRestoreRule.java:57)
	at org.apache.lucene.util.AbstractBeforeAfterRule$1.evaluate(AbstractBeforeAfterRule.java:45)
	at com.carrotsearch.randomizedtesting.rules.StatementAdapter.evaluate(StatementAdapter.java:36)
	at org.apache.lucene.util.TestRuleStoreClassName$1.evaluate(TestRuleStoreClassName.java:41)
	at com.carrotsearch.randomizedtesting.rules.NoShadowingOrOverridesOnMethodsRule$1.evaluate(NoShadowingOrOverridesOnMethodsRule.java:40)
	at com.carrotsearch.randomizedtesting.rules.NoShadowingOrOverridesOnMethodsRule$1.evaluate(NoShadowingOrOverridesOnMethodsRule.java:40)
	at com.carrotsearch.randomizedtesting.rules.StatementAdapter.evaluate(StatementAdapter.java:36)
	at com.carrotsearch.randomizedtesting.rules.StatementAdapter.evaluate(StatementAdapter.java:36)
	at com.carrotsearch.randomizedtesting.rules.StatementAdapter.evaluate(StatementAdapter.java:36)
	at org.apache.lucene.util.TestRuleAssertionsRequired$1.evaluate(TestRuleAssertionsRequired.java:53)
	at org.apache.lucene.util.TestRuleMarkFailure$1.evaluate(TestRuleMarkFailure.java:47)
	at org.apache.lucene.util.TestRuleIgnoreAfterMaxFailures$1.evaluate(TestRuleIgnoreAfterMaxFailures.java:64)
	at org.apache.lucene.util.TestRuleIgnoreTestSuites$1.evaluate(TestRuleIgnoreTestSuites.java:54)
	at com.carrotsearch.randomizedtesting.rules.StatementAdapter.evaluate(StatementAdapter.java:36)
	at com.carrotsearch.randomizedtesting.ThreadLeakControl$StatementRunner.run(ThreadLeakControl.java:367)
	at java.lang.Thread.run(Thread.java:745)




Build Log:
[...truncated 11503 lines...]
   [junit4] Suite: org.apache.solr.handler.TestReplicationHandler
   [junit4]   2> Creating dataDir: /home/jenkins/workspace/Lucene-Solr-5.x-Linux/solr/build/solr-core/test/J1/temp/solr.handler.TestReplicationHandler_EA343A2A6C38B783-001/init-core-data-001
   [junit4]   2> 1091255 INFO  (TEST-TestReplicationHandler.doTestReplicateAfterCoreReload-seed#[EA343A2A6C38B783]) [    ] o.a.s.SolrTestCaseJ4 ###Starting doTestReplicateAfterCoreReload
   [junit4]   2> 1091255 INFO  (TEST-TestReplicationHandler.doTestReplicateAfterCoreReload-seed#[EA343A2A6C38B783]) [    ] o.a.s.SolrTestCaseJ4 Writing core.properties file to /home/jenkins/workspace/Lucene-Solr-5.x-Linux/solr/build/solr-core/test/J1/temp/solr.handler.TestReplicationHandler_EA343A2A6C38B783-001/solr-instance-001/collection1
   [junit4]   2> 1091258 INFO  (TEST-TestReplicationHandler.doTestReplicateAfterCoreReload-seed#[EA343A2A6C38B783]) [    ] o.e.j.s.Server jetty-9.2.13.v20150730
   [junit4]   2> 1091259 INFO  (TEST-TestReplicationHandler.doTestReplicateAfterCoreReload-seed#[EA343A2A6C38B783]) [    ] o.e.j.s.h.ContextHandler Started o.e.j.s.ServletContextHandler@44c2362a{/solr,null,AVAILABLE}
   [junit4]   2> 1091259 INFO  (TEST-TestReplicationHandler.doTestReplicateAfterCoreReload-seed#[EA343A2A6C38B783]) [    ] o.e.j.s.ServerConnector Started ServerConnector@2b41dcab{HTTP/1.1}{127.0.0.1:57033}
   [junit4]   2> 1091259 INFO  (TEST-TestReplicationHandler.doTestReplicateAfterCoreReload-seed#[EA343A2A6C38B783]) [    ] o.e.j.s.Server Started @1092981ms
   [junit4]   2> 1091259 INFO  (TEST-TestReplicationHandler.doTestReplicateAfterCoreReload-seed#[EA343A2A6C38B783]) [    ] o.a.s.c.s.e.JettySolrRunner Jetty properties: {hostPort=57033, hostContext=/solr, solr.data.dir=/home/jenkins/workspace/Lucene-Solr-5.x-Linux/solr/build/solr-core/test/J1/temp/solr.handler.TestReplicationHandler_EA343A2A6C38B783-001/solr-instance-001/collection1/data}
   [junit4]   2> 1091260 INFO  (TEST-TestReplicationHandler.doTestReplicateAfterCoreReload-seed#[EA343A2A6C38B783]) [    ] o.a.s.s.SolrDispatchFilter SolrDispatchFilter.init(): sun.misc.Launcher$AppClassLoader@2b49a2c8
   [junit4]   2> 1091260 INFO  (TEST-TestReplicationHandler.doTestReplicateAfterCoreReload-seed#[EA343A2A6C38B783]) [    ] o.a.s.c.SolrResourceLoader new SolrResourceLoader for directory: '/home/jenkins/workspace/Lucene-Solr-5.x-Linux/solr/build/solr-core/test/J1/temp/solr.handler.TestReplicationHandler_EA343A2A6C38B783-001/solr-instance-001'
   [junit4]   2> 1091260 INFO  (TEST-TestReplicationHandler.doTestReplicateAfterCoreReload-seed#[EA343A2A6C38B783]) [    ] o.a.s.c.SolrResourceLoader JNDI not configured for solr (NoInitialContextEx)
   [junit4]   2> 1091260 INFO  (TEST-TestReplicationHandler.doTestReplicateAfterCoreReload-seed#[EA343A2A6C38B783]) [    ] o.a.s.c.SolrResourceLoader solr home defaulted to 'solr/' (could not find system property or JNDI)
   [junit4]   2> 1091260 INFO  (TEST-TestReplicationHandler.doTestReplicateAfterCoreReload-seed#[EA343A2A6C38B783]) [    ] o.a.s.c.SolrXmlConfig Loading container configuration from /home/jenkins/workspace/Lucene-Solr-5.x-Linux/solr/build/solr-core/test/J1/temp/solr.handler.TestReplicationHandler_EA343A2A6C38B783-001/solr-instance-001/solr.xml
   [junit4]   2> 1091272 INFO  (TEST-TestReplicationHandler.doTestReplicateAfterCoreReload-seed#[EA343A2A6C38B783]) [    ] o.a.s.c.CorePropertiesLocator Config-defined core root directory: /home/jenkins/workspace/Lucene-Solr-5.x-Linux/solr/build/solr-core/test/J1/temp/solr.handler.TestReplicationHandler_EA343A2A6C38B783-001/solr-instance-001/.
   [junit4]   2> 1091272 INFO  (TEST-TestReplicationHandler.doTestReplicateAfterCoreReload-seed#[EA343A2A6C38B783]) [    ] o.a.s.c.CoreContainer New CoreContainer 1704571488
   [junit4]   2> 1091272 INFO  (TEST-TestReplicationHandler.doTestReplicateAfterCoreReload-seed#[EA343A2A6C38B783]) [    ] o.a.s.c.CoreContainer Loading cores into CoreContainer [instanceDir=/home/jenkins/workspace/Lucene-Solr-5.x-Linux/solr/build/solr-core/test/J1/temp/solr.handler.TestReplicationHandler_EA343A2A6C38B783-001/solr-instance-001]
   [junit4]   2> 1091272 WARN  (TEST-TestReplicationHandler.doTestReplicateAfterCoreReload-seed#[EA343A2A6C38B783]) [    ] o.a.s.c.CoreContainer Couldn't add files from /home/jenkins/workspace/Lucene-Solr-5.x-Linux/solr/build/solr-core/test/J1/temp/solr.handler.TestReplicationHandler_EA343A2A6C38B783-001/solr-instance-001/lib to classpath: /home/jenkins/workspace/Lucene-Solr-5.x-Linux/solr/build/solr-core/test/J1/temp/solr.handler.TestReplicationHandler_EA343A2A6C38B783-001/solr-instance-001/lib
   [junit4]   2> 1091272 INFO  (TEST-TestReplicationHandler.doTestReplicateAfterCoreReload-seed#[EA343A2A6C38B783]) [    ] o.a.s.h.c.HttpShardHandlerFactory created with socketTimeout : 90000,urlScheme : ,connTimeout : 15000,maxConnectionsPerHost : 20,maxConnections : 10000,corePoolSize : 0,maximumPoolSize : 2147483647,maxThreadIdleTime : 5,sizeOfQueue : -1,fairnessPolicy : false,useRetries : false,
   [junit4]   2> 1091273 INFO  (TEST-TestReplicationHandler.doTestReplicateAfterCoreReload-seed#[EA343A2A6C38B783]) [    ] o.a.s.u.UpdateShardHandler Creating UpdateShardHandler HTTP client with params: socketTimeout=340000&connTimeout=45000&retry=true
   [junit4]   2> 1091274 INFO  (TEST-TestReplicationHandler.doTestReplicateAfterCoreReload-seed#[EA343A2A6C38B783]) [    ] o.a.s.l.LogWatcher SLF4J impl is org.slf4j.impl.Log4jLoggerFactory
   [junit4]   2> 1091274 INFO  (TEST-TestReplicationHandler.doTestReplicateAfterCoreReload-seed#[EA343A2A6C38B783]) [    ] o.a.s.l.LogWatcher Registering Log Listener [Log4j (org.slf4j.impl.Log4jLoggerFactory)]
   [junit4]   2> 1091274 INFO  (TEST-TestReplicationHandler.doTestReplicateAfterCoreReload-seed#[EA343A2A6C38B783]) [    ] o.a.s.c.CoreContainer Security conf doesn't exist. Skipping setup for authorization module.
   [junit4]   2> 1091274 INFO  (TEST-TestReplicationHandler.doTestReplicateAfterCoreReload-seed#[EA343A2A6C38B783]) [    ] o.a.s.c.CoreContainer No authentication plugin used.
   [junit4]   2> 1091275 INFO  (TEST-TestReplicationHandler.doTestReplicateAfterCoreReload-seed#[EA343A2A6C38B783]) [    ] o.a.s.c.CorePropertiesLocator Looking for core definitions underneath /home/jenkins/workspace/Lucene-Solr-5.x-Linux/solr/build/solr-core/test/J1/temp/solr.handler.TestReplicationHandler_EA343A2A6C38B783-001/solr-instance-001/.
   [junit4]   2> 1091276 INFO  (TEST-TestReplicationHandler.doTestReplicateAfterCoreReload-seed#[EA343A2A6C38B783]) [    ] o.a.s.c.CoreDescriptor Created CoreDescriptor: {name=collection1, transient=false, configSetProperties=configsetprops.json, schema=schema.xml, loadOnStartup=true, config=solrconfig.xml, dataDir=data/}
   [junit4]   2> 1091276 INFO  (TEST-TestReplicationHandler.doTestReplicateAfterCoreReload-seed#[EA343A2A6C38B783]) [    ] o.a.s.c.CorePropertiesLocator Found core collection1 in /home/jenkins/workspace/Lucene-Solr-5.x-Linux/solr/build/solr-core/test/J1/temp/solr.handler.TestReplicationHandler_EA343A2A6C38B783-001/solr-instance-001/./collection1
   [junit4]   2> 1091276 INFO  (TEST-TestReplicationHandler.doTestReplicateAfterCoreReload-seed#[EA343A2A6C38B783]) [    ] o.a.s.c.CorePropertiesLocator Found 1 core definitions
   [junit4]   2> 1091277 INFO  (coreLoadExecutor-3686-thread-1) [    ] o.a.s.c.SolrResourceLoader new SolrResourceLoader for directory: '/home/jenkins/workspace/Lucene-Solr-5.x-Linux/solr/build/solr-core/test/J1/temp/solr.handler.TestReplicationHandler_EA343A2A6C38B783-001/solr-instance-001/collection1'
   [junit4]   2> 1091277 INFO  (TEST-TestReplicationHandler.doTestReplicateAfterCoreReload-seed#[EA343A2A6C38B783]) [    ] o.a.s.s.SolrDispatchFilter user.dir=/home/jenkins/workspace/Lucene-Solr-5.x-Linux/solr/build/solr-core/test/J1
   [junit4]   2> 1091278 INFO  (TEST-TestReplicationHandler.doTestReplicateAfterCoreReload-seed#[EA343A2A6C38B783]) [    ] o.a.s.s.SolrDispatchFilter SolrDispatchFilter.init() done
   [junit4]   2> 1091278 INFO  (coreLoadExecutor-3686-thread-1) [    ] o.a.s.c.SolrResourceLoader JNDI not configured for solr (NoInitialContextEx)
   [junit4]   2> 1091278 INFO  (coreLoadExecutor-3686-thread-1) [    ] o.a.s.c.SolrResourceLoader solr home defaulted to 'solr/' (could not find system property or JNDI)
   [junit4]   2> 1091284 INFO  (coreLoadExecutor-3686-thread-1) [    ] o.a.s.c.SolrConfig current version of requestparams : -1
   [junit4]   2> 1091311 INFO  (coreLoadExecutor-3686-thread-1) [    ] o.a.s.c.SolrConfig Using Lucene MatchVersion: 5.6.0
   [junit4]   2> 1091325 INFO  (coreLoadExecutor-3686-thread-1) [    ] o.a.s.c.SolrConfig Loaded SolrConfig: solrconfig.xml
   [junit4]   2> 1091328 INFO  (coreLoadExecutor-3686-thread-1) [    ] o.a.s.s.IndexSchema [collection1] Schema name=test
   [junit4]   2> 1091332 INFO  (coreLoadExecutor-3686-thread-1) [    ] o.a.s.s.IndexSchema unique key field: id
   [junit4]   2> 1091333 INFO  (coreLoadExecutor-3686-thread-1) [    ] o.a.s.c.ConfigSetProperties Did not find ConfigSet properties, assuming default properties: Can't find resource 'configsetprops.json' in classpath or '/home/jenkins/workspace/Lucene-Solr-5.x-Linux/solr/build/solr-core/test/J1/temp/solr.handler.TestReplicationHandler_EA343A2A6C38B783-001/solr-instance-001/collection1'
   [junit4]   2> 1091333 INFO  (coreLoadExecutor-3686-thread-1) [    ] o.a.s.c.CoreContainer Creating SolrCore 'collection1' using configuration from instancedir /home/jenkins/workspace/Lucene-Solr-5.x-Linux/solr/build/solr-core/test/J1/temp/solr.handler.TestReplicationHandler_EA343A2A6C38B783-001/solr-instance-001/./collection1
   [junit4]   2> 1091334 INFO  (coreLoadExecutor-3686-thread-1) [    x:collection1] o.a.s.c.SolrCore org.apache.solr.core.MockDirectoryFactory
   [junit4]   2> 1091334 INFO  (coreLoadExecutor-3686-thread-1) [    x:collection1] o.a.s.c.SolrCore [[collection1] ] Opening new SolrCore at [/home/jenkins/workspace/Lucene-Solr-5.x-Linux/solr/build/solr-core/test/J1/temp/solr.handler.TestReplicationHandler_EA343A2A6C38B783-001/solr-instance-001/collection1], dataDir=[/home/jenkins/workspace/Lucene-Solr-5.x-Linux/solr/build/solr-core/test/J1/temp/solr.handler.TestReplicationHandler_EA343A2A6C38B783-001/solr-instance-001/./collection1/data/]
   [junit4]   2> 1091334 INFO  (coreLoadExecutor-3686-thread-1) [    x:collection1] o.a.s.c.SolrCore JMX monitoring not detected for core: collection1
   [junit4]   2> 1091335 INFO  (coreLoadExecutor-3686-thread-1) [    x:collection1] o.a.s.c.CachingDirectoryFactory return new directory for /home/jenkins/workspace/Lucene-Solr-5.x-Linux/solr/build/solr-core/test/J1/temp/solr.handler.TestReplicationHandler_EA343A2A6C38B783-001/solr-instance-001/./collection1/data
   [junit4]   2> 1091335 INFO  (coreLoadExecutor-3686-thread-1) [    x:collection1] o.a.s.c.SolrCore New index directory detected: old=null new=/home/jenkins/workspace/Lucene-Solr-5.x-Linux/solr/build/solr-core/test/J1/temp/solr.handler.TestReplicationHandler_EA343A2A6C38B783-001/solr-instance-001/./collection1/data/index/
   [junit4]   2> 1091335 WARN  (coreLoadExecutor-3686-thread-1) [    x:collection1] o.a.s.c.SolrCore [collection1] Solr index directory '/home/jenkins/workspace/Lucene-Solr-5.x-Linux/solr/build/solr-core/test/J1/temp/solr.handler.TestReplicationHandler_EA343A2A6C38B783-001/solr-instance-001/./collection1/data/index' doesn't exist. Creating new index...
   [junit4]   2> 1091335 INFO  (coreLoadExecutor-3686-thread-1) [    x:collection1] o.a.s.c.CachingDirectoryFactory return new directory for /home/jenkins/workspace/Lucene-Solr-5.x-Linux/solr/build/solr-core/test/J1/temp/solr.handler.TestReplicationHandler_EA343A2A6C38B783-001/solr-instance-001/./collection1/data/index
   [junit4]   2> 1091335 INFO  (coreLoadExecutor-3686-thread-1) [    x:collection1] o.a.s.u.RandomMergePolicy RandomMergePolicy wrapping class org.apache.lucene.index.TieredMergePolicy: [TieredMergePolicy: maxMergeAtOnce=32, maxMergeAtOnceExplicit=46, maxMergedSegmentMB=85.423828125, floorSegmentMB=1.779296875, forceMergeDeletesPctAllowed=2.9797590945183083, segmentsPerTier=34.0, maxCFSSegmentSizeMB=8.796093022207999E12, noCFSRatio=0.7820576984321492
   [junit4]   2> 1091336 INFO  (coreLoadExecutor-3686-thread-1) [    x:collection1] o.a.s.c.SolrDeletionPolicy SolrDeletionPolicy.onCommit: commits: num=1
   [junit4]   2> 	commit{dir=RawDirectoryWrapper(RAMDirectory@3d7337da lockFactory=org.apache.lucene.store.SingleInstanceLockFactory@5757e8ba),segFN=segments_1,generation=1}
   [junit4]   2> 1091336 INFO  (coreLoadExecutor-3686-thread-1) [    x:collection1] o.a.s.c.SolrDeletionPolicy newest commit generation = 1
   [junit4]   2> 1091336 INFO  (OldIndexDirectoryCleanupThreadForCore-collection1) [    x:collection1] o.a.s.c.SolrCore Looking for old index directories to cleanup for core collection1 in /home/jenkins/workspace/Lucene-Solr-5.x-Linux/solr/build/solr-core/test/J1/temp/solr.handler.TestReplicationHandler_EA343A2A6C38B783-001/solr-instance-001/./collection1/data/
   [junit4]   2> 1091337 INFO  (coreLoadExecutor-3686-thread-1) [    x:collection1] o.a.s.c.SolrCore no updateRequestProcessorChain defined as default, creating implicit default
   [junit4]   2> 1091338 INFO  (coreLoadExecutor-3686-thread-1) [    x:collection1] o.a.s.h.l.XMLLoader xsltCacheLifetimeSeconds=60
   [junit4]   2> 1091339 INFO  (coreLoadExecutor-3686-thread-1) [    x:collection1] o.a.s.h.l.XMLLoader xsltCacheLifetimeSeconds=60
   [junit4]   2> 1091340 INFO  (coreLoadExecutor-3686-thread-1) [    x:collection1] o.a.s.h.l.XMLLoader xsltCacheLifetimeSeconds=60
   [junit4]   2> 1091340 INFO  (coreLoadExecutor-3686-thread-1) [    x:collection1] o.a.s.h.l.XMLLoader xsltCacheLifetimeSeconds=60
   [junit4]   2> 1091341 INFO  (coreLoadExecutor-3686-thread-1) [    x:collection1] o.a.s.c.PluginBag requestHandler : 'lazy' created with startup=lazy 
   [junit4]   2> 1091341 INFO  (coreLoadExecutor-3686-thread-1) [    x:collection1] o.a.s.c.RequestHandlers Registered paths: /update/json,/replication,/admin/file,/admin/luke,defaults,/admin/logging,lazy,/get,/update/json/docs,/update/csv,/admin/threads,standard,/admin/plugins,/admin/segments,/admin/ping,/config,/admin/system,/admin/properties,/admin/mbeans,/schema,/update
   [junit4]   2> 1091342 INFO  (coreLoadExecutor-3686-thread-1) [    x:collection1] o.a.s.c.SolrCore Using default statsCache cache: org.apache.solr.search.stats.LocalStatsCache
   [junit4]   2> 1091342 INFO  (coreLoadExecutor-3686-thread-1) [    x:collection1] o.a.s.u.CommitTracker Hard AutoCommit: disabled
   [junit4]   2> 1091342 INFO  (coreLoadExecutor-3686-thread-1) [    x:collection1] o.a.s.u.CommitTracker Soft AutoCommit: disabled
   [junit4]   2> 1091342 INFO  (coreLoadExecutor-3686-thread-1) [    x:collection1] o.a.s.u.RandomMergePolicy RandomMergePolicy wrapping class org.apache.lucene.index.TieredMergePolicy: [TieredMergePolicy: maxMergeAtOnce=32, maxMergeAtOnceExplicit=11, maxMergedSegmentMB=28.8291015625, floorSegmentMB=0.673828125, forceMergeDeletesPctAllowed=19.14320985655871, segmentsPerTier=22.0, maxCFSSegmentSizeMB=8.796093022207999E12, noCFSRatio=1.0
   [junit4]   2> 1091343 INFO  (coreLoadExecutor-3686-thread-1) [    x:collection1] o.a.s.c.SolrDeletionPolicy SolrDeletionPolicy.onInit: commits: num=1
   [junit4]   2> 	commit{dir=RawDirectoryWrapper(RAMDirectory@3d7337da lockFactory=org.apache.lucene.store.SingleInstanceLockFactory@5757e8ba),segFN=segments_1,generation=1}
   [junit4]   2> 1091343 INFO  (coreLoadExecutor-3686-thread-1) [    x:collection1] o.a.s.c.SolrDeletionPolicy newest commit generation = 1
   [junit4]   2> 1091343 INFO  (coreLoadExecutor-3686-thread-1) [    x:collection1] o.a.s.s.SolrIndexSearcher Opening Searcher@36b1cfd2[collection1] main
   [junit4]   2> 1091343 INFO  (coreLoadExecutor-3686-thread-1) [    x:collection1] o.a.s.r.ManagedResourceStorage File-based storage initialized to use dir: /home/jenkins/workspace/Lucene-Solr-5.x-Linux/solr/build/solr-core/test/J1/temp/solr.handler.TestReplicationHandler_EA343A2A6C38B783-001/solr-instance-001/collection1/conf
   [junit4]   2> 1091343 INFO  (coreLoadExecutor-3686-thread-1) [    x:collection1] o.a.s.r.RestManager Initializing RestManager with initArgs: {storageDir=/home/jenkins/workspace/Lucene-Solr-5.x-Linux/solr/build/solr-core/test/J1/temp/solr.handler.TestReplicationHandler_EA343A2A6C38B783-001/solr-instance-001/collection1/conf}
   [junit4]   2> 1091343 INFO  (coreLoadExecutor-3686-thread-1) [    x:collection1] o.a.s.r.ManagedResourceStorage Reading _rest_managed.json using file:dir=/home/jenkins/workspace/Lucene-Solr-5.x-Linux/solr/build/solr-core/test/J1/temp/solr.handler.TestReplicationHandler_EA343A2A6C38B783-001/solr-instance-001/collection1/conf
   [junit4]   2> 1091343 INFO  (coreLoadExecutor-3686-thread-1) [    x:collection1] o.a.s.r.RestManager Initializing 0 registered ManagedResources
   [junit4]   2> 1091343 INFO  (coreLoadExecutor-3686-thread-1) [    x:collection1] o.a.s.h.ReplicationHandler Replication enabled for following config files: schema.xml,xslt/dummy.xsl
   [junit4]   2> 1091343 INFO  (coreLoadExecutor-3686-thread-1) [    x:collection1] o.a.s.h.ReplicationHandler Commits will be reserved for  10000
   [junit4]   2> 1091343 INFO  (searcherExecutor-3687-thread-1-processing-x:collection1) [    x:collection1] o.a.s.c.SolrCore [collection1] Registered new searcher Searcher@36b1cfd2[collection1] main{ExitableDirectoryReader(UninvertingDirectoryReader())}
   [junit4]   2> 1091343 INFO  (coreLoadExecutor-3686-thread-1) [    x:collection1] o.a.s.c.CoreContainer registering core: collection1
   [junit4]   2> 1091779 INFO  (TEST-TestReplicationHandler.doTestReplicateAfterCoreReload-seed#[EA343A2A6C38B783]) [    ] o.a.s.SolrTestCaseJ4 Writing core.properties file to /home/jenkins/workspace/Lucene-Solr-5.x-Linux/solr/build/solr-core/test/J1/temp/solr.handler.TestReplicationHandler_EA343A2A6C38B783-001/solr-instance-002/collection1
   [junit4]   2> 1091781 INFO  (TEST-TestReplicationHandler.doTestReplicateAfterCoreReload-seed#[EA343A2A6C38B783]) [    ] o.e.j.s.Server jetty-9.2.13.v20150730
   [junit4]   2> 1091782 INFO  (TEST-TestReplicationHandler.doTestReplicateAfterCoreReload-seed#[EA343A2A6C38B783]) [    ] o.e.j.s.h.ContextHandler Started o.e.j.s.ServletContextHandler@4eb19068{/solr,null,AVAILABLE}
   [junit4]   2> 1091783 INFO  (TEST-TestReplicationHandler.doTestReplicateAfterCoreReload-seed#[EA343A2A6C38B783]) [    ] o.e.j.s.ServerConnector Started ServerConnector@112a690f{HTTP/1.1}{127.0.0.1:35917}
   [junit4]   2> 1091783 INFO  (TEST-TestReplicationHandler.doTestReplicateAfterCoreReload-seed#[EA343A2A6C38B783]) [    ] o.e.j.s.Server Started @1093505ms
   [junit4]   2> 1091783 INFO  (TEST-TestReplicationHandler.doTestReplicateAfterCoreReload-seed#[EA343A2A6C38B783]) [    ] o.a.s.c.s.e.JettySolrRunner Jetty properties: {hostContext=/solr, hostPort=35917, solr.data.dir=/home/jenkins/workspace/Lucene-Solr-5.x-Linux/solr/build/solr-core/test/J1/temp/solr.handler.TestReplicationHandler_EA343A2A6C38B783-001/solr-instance-002/collection1/data}
   [junit4]   2> 1091783 INFO  (TEST-TestReplicationHandler.doTestReplicateAfterCoreReload-seed#[EA343A2A6C38B783]) [    ] o.a.s.s.SolrDispatchFilter SolrDispatchFilter.init(): sun.misc.Launcher$AppClassLoader@2b49a2c8
   [junit4]   2> 1091783 INFO  (TEST-TestReplicationHandler.doTestReplicateAfterCoreReload-seed#[EA343A2A6C38B783]) [    ] o.a.s.c.SolrResourceLoader new SolrResourceLoader for directory: '/home/jenkins/workspace/Lucene-Solr-5.x-Linux/solr/build/solr-core/test/J1/temp/solr.handler.TestReplicationHandler_EA343A2A6C38B783-001/solr-instance-002'
   [junit4]   2> 1091783 INFO  (TEST-TestReplicationHandler.doTestReplicateAfterCoreReload-seed#[EA343A2A6C38B783]) [    ] o.a.s.c.SolrResourceLoader JNDI not configured for solr (NoInitialContextEx)
   [junit4]   2> 1091783 INFO  (TEST-TestReplicationHandler.doTestReplicateAfterCoreReload-seed#[EA343A2A6C38B783]) [    ] o.a.s.c.SolrResourceLoader solr home defaulted to 'solr/' (could not find system property or JNDI)
   [junit4]   2> 1091783 INFO  (TEST-TestReplicationHandler.doTestReplicateAfterCoreReload-seed#[EA343A2A6C38B783]) [    ] o.a.s.c.SolrXmlConfig Loading container configuration from /home/jenkins/workspace/Lucene-Solr-5.x-Linux/solr/build/solr-core/test/J1/temp/solr.handler.TestReplicationHandler_EA343A2A6C38B783-001/solr-instance-002/solr.xml
   [junit4]   2> 1091792 INFO  (TEST-TestReplicationHandler.doTestReplicateAfterCoreReload-seed#[EA343A2A6C38B783]) [    ] o.a.s.c.CorePropertiesLocator Config-defined core root directory: /home/jenkins/workspace/Lucene-Solr-5.x-Linux/solr/build/solr-core/test/J1/temp/solr.handler.TestReplicationHandler_EA343A2A6C38B783-001/solr-instance-002/.
   [junit4]   2> 1091792 INFO  (TEST-TestReplicationHandler.doTestReplicateAfterCoreReload-seed#[EA343A2A6C38B783]) [    ] o.a.s.c.CoreContainer New CoreContainer 1296768129
   [junit4]   2> 1091792 INFO  (TEST-TestReplicationHandler.doTestReplicateAfterCoreReload-seed#[EA343A2A6C38B783]) [    ] o.a.s.c.CoreContainer Loading cores into CoreContainer [instanceDir=/home/jenkins/workspace/Lucene-Solr-5.x-Linux/solr/build/solr-core/test/J1/temp/solr.handler.TestReplicationHandler_EA343A2A6C38B783-001/solr-instance-002]
   [junit4]   2> 1091792 WARN  (TEST-TestReplicationHandler.doTestReplicateAfterCoreReload-seed#[EA343A2A6C38B783]) [    ] o.a.s.c.CoreContainer Couldn't add files from /home/jenkins/workspace/Lucene-Solr-5.x-Linux/solr/build/solr-core/test/J1/temp/solr.handler.TestReplicationHandler_EA343A2A6C38B783-001/solr-instance-002/lib to classpath: /home/jenkins/workspace/Lucene-Solr-5.x-Linux/solr/build/solr-core/test/J1/temp/solr.handler.TestReplicationHandler_EA343A2A6C38B783-001/solr-instance-002/lib
   [junit4]   2> 1091793 INFO  (TEST-TestReplicationHandler.doTestReplicateAfterCoreReload-seed#[EA343A2A6C38B783]) [    ] o.a.s.h.c.HttpShardHandlerFactory created with socketTimeout : 90000,urlScheme : ,connTimeout : 15000,maxConnectionsPerHost : 20,maxConnections : 10000,corePoolSize : 0,maximumPoolSize : 2147483647,maxThreadIdleTime : 5,sizeOfQueue : -1,fairnessPolicy : false,useRetries : false,
   [junit4]   2> 1091793 INFO  (TEST-TestReplicationHandler.doTestReplicateAfterCoreReload-seed#[EA343A2A6C38B783]) [    ] o.a.s.u.UpdateShardHandler Creating UpdateShardHandler HTTP client with params: socketTimeout=340000&connTimeout=45000&retry=true
   [junit4]   2> 1091794 INFO  (TEST-TestReplicationHandler.doTestReplicateAfterCoreReload-seed#[EA343A2A6C38B783]) [    ] o.a.s.l.LogWatcher SLF4J impl is org.slf4j.impl.Log4jLoggerFactory
   [junit4]   2> 1091794 INFO  (TEST-TestReplicationHandler.doTestReplicateAfterCoreReload-seed#[EA343A2A6C38B783]) [    ] o.a.s.l.LogWatcher Registering Log Listener [Log4j (org.slf4j.impl.Log4jLoggerFactory)]
   [junit4]   2> 1091794 INFO  (TEST-TestReplicationHandler.doTestReplicateAfterCoreReload-seed#[EA343A2A6C38B783]) [    ] o.a.s.c.CoreContainer Security conf doesn't exist. Skipping setup for authorization module.
   [junit4]   2> 1091794 INFO  (TEST-TestReplicationHandler.doTestReplicateAfterCoreReload-seed#[EA343A2A6C38B783]) [    ] o.a.s.c.CoreContainer No authentication plugin used.
   [junit4]   2> 1091794 INFO  (TEST-TestReplicationHandler.doTestReplicateAfterCoreReload-seed#[EA343A2A6C38B783]) [    ] o.a.s.c.CorePropertiesLocator Looking for core definitions underneath /home/jenkins/workspace/Lucene-Solr-5.x-Linux/solr/build/solr-core/test/J1/temp/solr.handler.TestReplicationHandler_EA343A2A6C38B783-001/solr-instance-002/.
   [junit4]   2> 1091795 INFO  (TEST-TestReplicationHandler.doTestReplicateAfterCoreReload-seed#[EA343A2A6C38B783]) [    ] o.a.s.c.CoreDescriptor Created CoreDescriptor: {schema=schema.xml, name=collection1, loadOnStartup=true, transient=false, configSetProperties=configsetprops.json, dataDir=data/, config=solrconfig.xml}
   [junit4]   2> 1091795 INFO  (TEST-TestReplicationHandler.doTestReplicateAfterCoreReload-seed#[EA343A2A6C38B783]) [    ] o.a.s.c.CorePropertiesLocator Found core collection1 in /home/jenkins/workspace/Lucene-Solr-5.x-Linux/solr/build/solr-core/test/J1/temp/solr.handler.TestReplicationHandler_EA343A2A6C38B783-001/solr-instance-002/./collection1
   [junit4]   2> 1091795 INFO  (TEST-TestReplicationHandler.doTestReplicateAfterCoreReload-seed#[EA343A2A6C38B783]) [    ] o.a.s.c.CorePropertiesLocator Found 1 core definitions
   [junit4]   2> 1091795 INFO  (coreLoadExecutor-3696-thread-1) [    ] o.a.s.c.SolrResourceLoader new SolrResourceLoader for directory: '/home/jenkins/workspace/Lucene-Solr-5.x-Linux/solr/build/solr-core/test/J1/temp/solr.handler.TestReplicationHandler_EA343A2A6C38B783-001/solr-instance-002/collection1'
   [junit4]   2> 1091796 INFO  (TEST-TestReplicationHandler.doTestReplicateAfterCoreReload-seed#[EA343A2A6C38B783]) [    ] o.a.s.s.SolrDispatchFilter user.dir=/home/jenkins/workspace/Lucene-Solr-5.x-Linux/solr/build/solr-core/test/J1
   [junit4]   2> 1091796 INFO  (TEST-TestReplicationHandler.doTestReplicateAfterCoreReload-seed#[EA343A2A6C38B783]) [    ] o.a.s.s.SolrDispatchFilter SolrDispatchFilter.init() done
   [junit4]   2> 1091796 INFO  (coreLoadExecutor-3696-thread-1) [    ] o.a.s.c.SolrResourceLoader JNDI not configured for solr (NoInitialContextEx)
   [junit4]   2> 1091796 INFO  (coreLoadExecutor-3696-thread-1) [    ] o.a.s.c.SolrResourceLoader solr home defaulted to 'solr/' (could not find system property or JNDI)
   [junit4]   2> 1091801 INFO  (coreLoadExecutor-3696-thread-1) [    ] o.a.s.c.SolrConfig current version of requestparams : -1
   [junit4]   2> 1091808 INFO  (coreLoadExecutor-3696-thread-1) [    ] o.a.s.c.SolrConfig Using Lucene MatchVersion: 5.6.0
   [junit4]   2> 1091821 INFO  (coreLoadExecutor-3696-thread-1) [    ] o.a.s.c.SolrConfig Loaded SolrConfig: solrconfig.xml
   [junit4]   2> 1091824 INFO  (coreLoadExecutor-3696-thread-1) [    ] o.a.s.s.IndexSchema [collection1] Schema name=test
   [junit4]   2> 1091828 INFO  (coreLoadExecutor-3696-thread-1) [    ] o.a.s.s.IndexSchema unique key field: id
   [junit4]   2> 1091829 INFO  (coreLoadExecutor-3696-thread-1) [    ] o.a.s.c.ConfigSetProperties Did not find ConfigSet properties, assuming default properties: Can't find resource 'configsetprops.json' in classpath or '/home/jenkins/workspace/Lucene-Solr-5.x-Linux/solr/build/solr-core/test/J1/temp/solr.handler.TestReplicationHandler_EA343A2A6C38B783-001/solr-instance-002/collection1'
   [junit4]   2> 1091829 INFO  (coreLoadExecutor-3696-thread-1) [    ] o.a.s.c.CoreContainer Creating SolrCore 'collection1' using configuration from instancedir /home/jenkins/workspace/Lucene-Solr-5.x-Linux/solr/build/solr-core/test/J1/temp/solr.handler.TestReplicationHandler_EA343A2A6C38B783-001/solr-instance-002/./collection1
   [junit4]   2> 1091829 INFO  (coreLoadExecutor-3696-thread-1) [    x:collection1] o.a.s.c.SolrCore org.apache.solr.core.MockDirectoryFactory
   [junit4]   2> 1091829 INFO  (coreLoadExecutor-3696-thread-1) [    x:collection1] o.a.s.c.SolrCore [[collection1] ] Opening new SolrCore at [/home/jenkins/workspace/Lucene-Solr-5.x-Linux/solr/build/solr-core/test/J1/temp/solr.handler.TestReplicationHandler_EA343A2A6C38B783-001/solr-instance-002/collection1], dataDir=[/home/jenkins/workspace/Lucene-Solr-5.x-Linux/solr/build/solr-core/test/J1/temp/solr.handler.TestReplicationHandler_EA343A2A6C38B783-001/solr-instance-002/./collection1/data/]
   [junit4]   2> 1091830 INFO  (coreLoadExecutor-3696-thread-1) [    x:collection1] o.a.s.c.SolrCore JMX monitoring not detected for core: collection1
   [junit4]   2> 1091830 INFO  (coreLoadExecutor-3696-thread-1) [    x:collection1] o.a.s.c.CachingDirectoryFactory return new directory for /home/jenkins/workspace/Lucene-Solr-5.x-Linux/solr/build/solr-core/test/J1/temp/solr.handler.TestReplicationHandler_EA343A2A6C38B783-001/solr-instance-002/./collection1/data
   [junit4]   2> 1091830 INFO  (coreLoadExecutor-3696-thread-1) [    x:collection1] o.a.s.c.SolrCore New index directory detected: old=null new=/home/jenkins/workspace/Lucene-Solr-5.x-Linux/solr/build/solr-core/test/J1/temp/solr.handler.TestReplicationHandler_EA343A2A6C38B783-001/solr-instance-002/./collection1/data/index/
   [junit4]   2> 1091830 WARN  (coreLoadExecutor-3696-thread-1) [    x:collection1] o.a.s.c.SolrCore [collection1] Solr index directory '/home/jenkins/workspace/Lucene-Solr-5.x-Linux/solr/build/solr-core/test/J1/temp/solr.handler.TestReplicationHandler_EA343A2A6C38B783-001/solr-instance-002/./collection1/data/index' doesn't exist. Creating new index...
   [junit4]   2> 1091830 INFO  (coreLoadExecutor-3696-thread-1) [    x:collection1] o.a.s.c.CachingDirectoryFactory return new directory for /home/jenkins/workspace/Lucene-Solr-5.x-Linux/solr/build/solr-core/test/J1/temp/solr.handler.TestReplicationHandler_EA343A2A6C38B783-001/solr-instance-002/./collection1/data/index
   [junit4]   2> 1091830 INFO  (coreLoadExecutor-3696-thread-1) [    x:collection1] o.a.s.u.RandomMergePolicy RandomMergePolicy wrapping class org.apache.lucene.index.TieredMergePolicy: [TieredMergePolicy: maxMergeAtOnce=32, maxMergeAtOnceExplicit=46, maxMergedSegmentMB=85.423828125, floorSegmentMB=1.779296875, forceMergeDeletesPctAllowed=2.9797590945183083, segmentsPerTier=34.0, maxCFSSegmentSizeMB=8.796093022207999E12, noCFSRatio=0.7820576984321492
   [junit4]   2> 1091831 INFO  (coreLoadExecutor-3696-thread-1) [    x:collection1] o.a.s.c.SolrDeletionPolicy SolrDeletionPolicy.onCommit: commits: num=1
   [junit4]   2> 	commit{dir=RawDirectoryWrapper(RAMDirectory@36993127 lockFactory=org.apache.lucene.store.SingleInstanceLockFactory@36a1372),segFN=segments_1,generation=1}
   [junit4]   2> 1091831 INFO  (coreLoadExecutor-3696-thread-1) [    x:collection1] o.a.s.c.SolrDeletionPolicy newest commit generation = 1
   [junit4]   2> 1091831 INFO  (OldIndexDirectoryCleanupThreadForCore-collection1) [    x:collection1] o.a.s.c.SolrCore Looking for old index directories to cleanup for core collection1 in /home/jenkins/workspace/Lucene-Solr-5.x-Linux/solr/build/solr-core/test/J1/temp/solr.handler.TestReplicationHandler_EA343A2A6C38B783-001/solr-instance-002/./collection1/data/
   [junit4]   2> 1091832 INFO  (coreLoadExecutor-3696-thread-1) [    x:collection1] o.a.s.c.SolrCore no updateRequestProcessorChain defined as default, creating implicit default
   [junit4]   2> 1091834 INFO  (coreLoadExecutor-3696-thread-1) [    x:collection1] o.a.s.h.l.XMLLoader xsltCacheLifetimeSeconds=60
   [junit4]   2> 1091834 INFO  (coreLoadExecutor-3696-thread-1) [    x:collection1] o.a.s.h.l.XMLLoader xsltCacheLifetimeSeconds=60
   [junit4]   2> 1091835 INFO  (coreLoadExecutor-3696-thread-1) [    x:collection1] o.a.s.h.l.XMLLoader xsltCacheLifetimeSeconds=60
   [junit4]   2> 1091836 INFO  (coreLoadExecutor-3696-thread-1) [    x:collection1] o.a.s.h.l.XMLLoader xsltCacheLifetimeSeconds=60
   [junit4]   2> 1091836 INFO  (coreLoadExecutor-3696-thread-1) [    x:collection1] o.a.s.c.PluginBag requestHandler : 'lazy' created with startup=lazy 
   [junit4]   2> 1091836 INFO  (coreLoadExecutor-3696-thread-1) [    x:collection1] o.a.s.c.RequestHandlers Registered paths: /update/json,/replication,/admin/file,/admin/luke,defaults,/admin/logging,lazy,/get,/update/json/docs,/update/csv,/admin/threads,standard,/admin/plugins,/admin/segments,/admin/ping,/config,/admin/system,/admin/properties,/admin/mbeans,/schema,/update
   [junit4]   2> 1091837 INFO  (coreLoadExecutor-3696-thread-1) [    x:collection1] o.a.s.c.SolrCore Using default statsCache cache: org.apache.solr.search.stats.LocalStatsCache
   [junit4]   2> 1091837 INFO  (coreLoadExecutor-3696-thread-1) [    x:collection1] o.a.s.u.CommitTracker Hard AutoCommit: disabled
   [junit4]   2> 1091837 INFO  (coreLoadExecutor-3696-thread-1) [    x:collection1] o.a.s.u.CommitTracker Soft AutoCommit: disabled
   [junit4]   2> 1091837 INFO  (coreLoadExecutor-3696-thread-1) [    x:collection1] o.a.s.u.RandomMergePolicy RandomMergePolicy wrapping class org.apache.lucene.index.TieredMergePolicy: [TieredMergePolicy: maxMergeAtOnce=32, maxMergeAtOnceExplicit=11, maxMergedSegmentMB=28.8291015625, floorSegmentMB=0.673828125, forceMergeDeletesPctAllowed=19.14320985655871, segmentsPerTier=22.0, maxCFSSegmentSizeMB=8.796093022207999E12, noCFSRatio=1.0
   [junit4]   2> 1091838 INFO  (coreLoadExecutor-3696-thread-1) [    x:collection1] o.a.s.c.SolrDeletionPolicy SolrDeletionPolicy.onInit: commits: num=1
   [junit4]   2> 	commit{dir=RawDirectoryWrapper(RAMDirectory@36993127 lockFactory=org.apache.lucene.store.SingleInstanceLockFactory@36a1372),segFN=segments_1,generation=1}
   [junit4]   2> 1091838 INFO  (coreLoadExecutor-3696-thread-1) [    x:collection1] o.a.s.c.SolrDeletionPolicy newest commit generation = 1
   [junit4]   2> 1091838 INFO  (coreLoadExecutor-3696-thread-1) [    x:collection1] o.a.s.s.SolrIndexSearcher Opening Searcher@4d39f724[collection1] main
   [junit4]   2> 1091838 INFO  (coreLoadExecutor-3696-thread-1) [    x:collection1] o.a.s.r.ManagedResourceStorage File-based storage initialized to use dir: /home/jenkins/workspace/Lucene-Solr-5.x-Linux/solr/build/solr-core/test/J1/temp/solr.handler.TestReplicationHandler_EA343A2A6C38B783-001/solr-instance-002/collection1/conf
   [junit4]   2> 1091838 INFO  (coreLoadExecutor-3696-thread-1) [    x:collection1] o.a.s.r.RestManager Initializing RestManager with initArgs: {storageDir=/home/jenkins/workspace/Lucene-Solr-5.x-Linux/solr/build/solr-core/test/J1/temp/solr.handler.TestReplicationHandler_EA343A2A6C38B783-001/solr-instance-002/collection1/conf}
   [junit4]   2> 1091838 INFO  (coreLoadExecutor-3696-thread-1) [    x:collection1] o.a.s.r.ManagedResourceStorage Reading _rest_managed.json using file:dir=/home/jenkins/workspace/Lucene-Solr-5.x-Linux/solr/build/solr-core/test/J1/temp/solr.handler.TestReplicationHandler_EA343A2A6C38B783-001/solr-instance-002/collection1/conf
   [junit4]   2> 1091839 INFO  (coreLoadExecutor-3696-thread-1) [    x:collection1] o.a.s.r.RestManager Initializing 0 registered ManagedResources
   [junit4]   2> 1091839 INFO  (coreLoadExecutor-3696-thread-1) [    x:collection1] o.a.s.h.ReplicationHandler Poll scheduled at an interval of 1000ms
   [junit4]   2> 1091839 INFO  (searcherExecutor-3697-thread-1-processing-x:collection1) [    x:collection1] o.a.s.c.SolrCore [collection1] Registered new searcher Searcher@4d39f724[collection1] main{ExitableDirectoryReader(UninvertingDirectoryReader())}
   [junit4]   2> 1091839 INFO  (coreLoadExecutor-3696-thread-1) [    x:collection1] o.a.s.c.CoreContainer registering core: collection1
   [junit4]   2> 1092219 INFO  (qtp2012650155-9017) [    x:collection1] o.a.s.c.S.Request [collection1]  webapp=/solr path=/replication params={version=2&command=indexversion&wt=javabin&qt=/replication} status=0 QTime=0
   [junit4]   2> 1092297 INFO  (TEST-TestReplicationHandler.doTestReplicateAfterCoreReload-seed#[EA343A2A6C38B783]) [    ] o.e.j.s.ServerConnector Stopped ServerConnector@112a690f{HTTP/1.1}{127.0.0.1:0}
   [junit4]   2> 1092297 INFO  (TEST-TestReplicationHandler.doTestReplicateAfterCoreReload-seed#[EA343A2A6C38B783]) [    ] o.a.s.c.CoreContainer Shutting down CoreContainer instance=1296768129
   [junit4]   2> 1092297 INFO  (coreCloseExecutor-3702-thread-1) [    x:collection1] o.a.s.c.SolrCore [collection1]  CLOSING SolrCore org.apache.solr.core.SolrCore@7d7e8ce6
   [junit4]   2> 1092298 INFO  (coreCloseExecutor-3702-thread-1) [    x:collection1] o.a.s.u.DirectUpdateHandler2 closing DirectUpdateHandler2{commits=0,autocommits=0,soft autocommits=0,optimizes=0,rollbacks=0,expungeDeletes=0,docsPending=0,adds=0,deletesById=0,deletesByQuery=0,errors=0,cumulative_adds=0,cumulative_deletesById=0,cumulative_deletesByQuery=0,cumulative_errors=0}
   [junit4]   2> 1092298 INFO  (coreCloseExecutor-3702-thread-1) [    x:collection1] o.a.s.u.SolrCoreState Closing SolrCoreState
   [junit4]   2> 1092298 INFO  (coreCloseExecutor-3702-thread-1) [    x:collection1] o.a.s.u.DefaultSolrCoreState SolrCoreState ref count has reached 0 - closing IndexWriter
   [junit4]   2> 1092298 INFO  (coreCloseExecutor-3702-thread-1) [    x:collection1] o.a.s.u.DefaultSolrCoreState closing IndexWriter with IndexWriterCloser
   [junit4]   2> 1092299 INFO  (coreCloseExecutor-3702-thread-1) [    x:collection1] o.a.s.c.SolrCore [collection1] Closing main searcher on request.
   [junit4]   2> 1092299 INFO  (coreCloseExecutor-3702-thread-1) [    x:collection1] o.a.s.c.CachingDirectoryFactory Closing MockDirectoryFactory - 2 directories currently being tracked
   [junit4]   2> 1092299 INFO  (coreCloseExecutor-3702-thread-1) [    x:collection1] o.a.s.c.CachingDirectoryFactory looking to close /home/jenkins/workspace/Lucene-Solr-5.x-Linux/solr/build/solr-core/test/J1/temp/solr.handler.TestReplicationHandler_EA343A2A6C38B783-001/solr-instance-002/./collection1/data/index [CachedDir<<refCount=0;path=/home/jenkins/workspace/Lucene-Solr-5.x-Linux/solr/build/solr-core/test/J1/temp/solr.handler.TestReplicationHandler_EA343A2A6C38B783-001/solr-instance-002/./collection1/data/index;done=false>>]
   [junit4]   2> 1092299 INFO  (coreCloseExecutor-3702-thread-1) [    x:collection1] o.a.s.c.CachingDirectoryFactory Closing directory: /home/jenkins/workspace/Lucene-Solr-5.x-Linux/solr/build/solr-core/test/J1/temp/solr.handler.TestReplicationHandler_EA343A2A6C38B783-001/solr-instance-002/./collection1/data/index
   [junit4]   2> 1092300 INFO  (coreCloseExecutor-3702-thread-1) [    x:collection1] o.a.s.c.CachingDirectoryFactory looking to close /home/jenkins/workspace/Lucene-Solr-5.x-Linux/solr/build/solr-core/test/J1/temp/solr.handler.TestReplicationHandler_EA343A2A6C38B783-001/solr-instance-002/./collection1/data [CachedDir<<refCount=0;path=/home/jenkins/workspace/Lucene-Solr-5.x-Linux/solr/build/solr-core/test/J1/temp/solr.handler.TestReplicationHandler_EA343A2A6C38B783-001/solr-instance-002/./collection1/data;done=false>>]
   [junit4]   2> 1092300 INFO  (coreCloseExecutor-3702-thread-1) [    x:collection1] o.a.s.c.CachingDirectoryFactory Closing directory: /home/jenkins/workspace/Lucene-Solr-5.x-Linux/solr/build/solr-core/test/J1/temp/solr.handler.TestReplicationHandler_EA343A2A6C38B783-001/solr-instance-002/./collection1/data
   [junit4]   2> 1092300 INFO  (TEST-TestReplicationHandler.doTestReplicateAfterCoreReload-seed#[EA343A2A6C38B783]) [    ] o.e.j.s.h.ContextHandler Stopped o.e.j.s.ServletContextHandler@4eb19068{/solr,null,UNAVAILABLE}
   [junit4]   2> 1092301 INFO  (TEST-TestReplicationHandler.doTestReplicateAfterCoreReload-seed#[EA343A2A6C38B783]) [    ] o.e.j.s.ServerConnector Stopped ServerConnector@2b41dcab{HTTP/1.1}{127.0.0.1:0}
   [junit4]   2> 1092301 INFO  (TEST-TestReplicationHandler.doTestReplicateAfterCoreReload-seed#[EA343A2A6C38B783]) [    ] o.a.s.c.CoreContainer Shutting down CoreContainer instance=1704571488
   [junit4]   2> 1092302 INFO  (coreCloseExecutor-3703-thread-1) [    x:collection1] o.a.s.c.SolrCore [collection1]  CLOSING SolrCore org.apache.solr.core.SolrCore@2737fd23
   [junit4]   2> 1092302 INFO  (coreCloseExecutor-3703-thread-1) [    x:collection1] o.a.s.u.DirectUpdateHandler2 closing DirectUpdateHandler2{commits=0,autocommits=0,soft autocommits=0,optimizes=0,rollbacks=0,expungeDeletes=0,docsPending=0,adds=0,deletesById=0,deletesByQuery=0,errors=0,cumulative_adds=0,cumulative_deletesById=0,cumulative_deletesByQuery=0,cumulative_errors=0}
   [junit4]   2> 1092302 INFO  (coreCloseExecutor-3703-thread-1) [    x:collection1] o.a.s.u.SolrCoreState Closing SolrCoreState
   [junit4]   2> 1092302 INFO  (coreCloseExecutor-3703-thread-1) [    x:collection1] o.a.s.u.DefaultSolrCoreState SolrCoreState ref count has reached 0 - closing IndexWriter
   [junit4]   2> 1092302 INFO  (coreCloseExecutor-3703-thread-1) [    x:collection1] o.a.s.u.DefaultSolrCoreState closing IndexWriter with IndexWriterCloser
   [junit4]   2> 1092303 INFO  (coreCloseExecutor-3703-thread-1) [    x:collection1] o.a.s.c.SolrCore [collection1] Closing main searcher on request.
   [junit4]   2> 1092303 INFO  (coreCloseExecutor-3703-thread-1) [    x:collection1] o.a.s.c.CachingDirectoryFactory Closing MockDirectoryFactory - 2 directories currently being tracked
   [junit4]   2> 1092303 INFO  (coreCloseExecutor-3703-thread-1) [    x:collection1] o.a.s.c.CachingDirectoryFactory looking to close /home/jenkins/workspace/Lucene-Solr-5.x-Linux/solr/build/solr-core/test/J1/temp/solr.handler.TestReplicationHandler_EA343A2A6C38B783-001/solr-instance-001/./collection1/data/index [CachedDir<<refCount=0;path=/home/jenkins/workspace/Lucene-Solr-5.x-Linux/solr/build/solr-core/test/J1/temp/solr.handler.TestReplicationHandler_EA343A2A6C38B783-001/solr-instance-001/./collection1/data/index;done=false>>]
   [junit4]   2> 1092303 INFO  (coreCloseExecutor-3703-thread-1) [    x:collection1] o.a.s.c.CachingDirectoryFactory Closing directory: /home/jenkins/workspace/Lucene-Solr-5.x-Linux/solr/build/solr-core/test/J1/temp/solr.handler.TestReplicationHandler_EA343A2A6C38B783-001/solr-instance-001/./collection1/data/index
   [junit4]   2> 1092303 INFO  (coreCloseExecutor-3703-thread-1) [    x:collection1] o.a.s.c.CachingDirectoryFactory looking to close /home/jenkins/workspace/Lucene-Solr-5.x-Linux/solr/build/solr-core/test/J1/temp/solr.handler.TestReplicationHandler_EA343A2A6C38B783-001/solr-instance-001/./collection1/data [CachedDir<<refCount=0;path=/home/jenkins/workspace/Lucene-Solr-5.x-Linux/solr/build/solr-core/test/J1/temp/solr.handler.TestReplicationHandler_EA343A2A6C38B783-001/solr-instance-001/./collection1/data;done=false>>]
   [junit4]   2> 1092303 INFO  (coreCloseExecutor-3703-thread-1) [    x:collection1] o.a.s.c.CachingDirectoryFactory Closing directory: /home/jenkins/workspace/Lucene-Solr-5.x-Linux/solr/build/solr-core/test/J1/temp/solr.handler.TestReplicationHandler_EA343A2A6C38B783-001/solr-instance-001/./collection1/data
   [junit4]   2> 1092304 INFO  (TEST-TestReplicationHandler.doTestReplicateAfterCoreReload-seed#[EA343A2A6C38B783]) [    ] o.e.j.s.h.ContextHandler Stopped o.e.j.s.ServletContextHandler@44c2362a{/solr,null,UNAVAILABLE}
   [junit4]   2> 1092304 INFO  (TEST-TestReplicationHandler.doTestReplicateAfterCoreReload-seed#[EA343A2A6C38B783]) [    ] o.e.j.s.Server jetty-9.2.13.v20150730
   [junit4]   2> 1092305 INFO  (TEST-TestReplicationHandler.doTestReplicateAfterCoreReload-seed#[EA343A2A6C38B783]) [    ] o.e.j.s.h.ContextHandler Started o.e.j.s.ServletContextHandler@3db6b8d9{/solr,null,AVAILABLE}
   [junit4]   2> 1092306 INFO  (TEST-TestReplicationHandler.doTestReplicateAfterCoreReload-seed#[EA343A2A6C38B783]) [    ] o.e.j.s.ServerConnector Started ServerConnector@1c694f4c{HTTP/1.1}{127.0.0.1:58488}
   [junit4]   2> 1092306 INFO  (TEST-TestReplicationHandler.doTestReplicateAfterCoreReload-seed#[EA343A2A6C38B783]) [    ] o.e.j.s.Server Started @1094028ms
   [junit4]   2> 1092306 INFO  (TEST-TestReplicationHandler.doTestReplicateAfterCoreReload-seed#[EA343A2A6C38B783]) [    ] o.a.s.c.s.e.JettySolrRunner Jetty properties: {hostContext=/solr, solr.data.dir=/home/jenkins/workspace/Lucene-Solr-5.x-Linux/solr/build/solr-core/test/J1/temp/solr.handler.TestReplicationHandler_EA343A2A6C38B783-001/solr-instance-001/collection1/data, hostPort=58488}
   [junit4]   2> 1092306 INFO  (TEST-TestReplicationHandler.doTestReplicateAfterCoreReload-seed#[EA343A2A6C38B783]) [    ] o.a.s.s.SolrDispatchFilter SolrDispatchFilter.init(): sun.misc.Launcher$AppClassLoader@2b49a2c8
   [junit4]   2> 1092306 INFO  (TEST-TestReplicationHandler.doTestReplicateAfterCoreReload-seed#[EA343A2A6C38B783]) [    ] o.a.s.c.SolrResourceLoader new SolrResourceLoader for directory: '/home/jenkins/workspace/Lucene-Solr-5.x-Linux/solr/build/solr-core/test/J1/temp/solr.handler.TestReplicationHandler_EA343A2A6C38B783-001/solr-instance-001'
   [junit4]   2> 1092306 INFO  (TEST-TestReplicationHandler.doTestReplicateAfterCoreReload-seed#[EA343A2A6C38B783]) [    ] o.a.s.c.SolrResourceLoader JNDI not configured for solr (NoInitialContextEx)
   [junit4]   2> 1092307 INFO  (TEST-TestReplicationHandler.doTestReplicateAfterCoreReload-seed#[EA343A2A6C38B783]) [    ] o.a.s.c.SolrResourceLoader solr home defaulted to 'solr/' (could not find system property or JNDI)
   [junit4]   2> 1092307 INFO  (TEST-TestReplicationHandler.doTestReplicateAfterCoreReload-seed#[EA343A2A6C38B783]) [    ] o.a.s.c.SolrXmlConfig Loading container configuration from /home/jenkins/workspace/Lucene-Solr-5.x-Linux/solr/build/solr-core/test/J1/temp/solr.handler.TestReplicationHandler_EA343A2A6C38B783-001/solr-instance-001/solr.xml
   [junit4]   2> 1092313 INFO  (TEST-TestReplicationHandler.doTestReplicateAfterCoreReload-seed#[EA343A2A6C38B783]) [    ] o.a.s.c.CorePropertiesLocator Config-defined core root directory: /home/jenkins/workspace/Lucene-Solr-5.x-Linux/solr/build/solr-core/test/J1/temp/solr.handler.TestReplicationHandler_EA343A2A6C38B783-001/solr-instance-001/.
   [junit4]   2> 1092313 INFO  (TEST-TestReplicationHandler.doTestReplicateAfterCoreReload-seed#[EA343A2A6C38B783]) [    ] o.a.s.c.CoreContainer New CoreContainer 1356429627
   [junit4]   2> 1092313 INFO  (TEST-TestReplicationHandler.doTestReplicateAfterCoreReload-seed#[EA343A2A6C38B783]) [    ] o.a.s.c.CoreContainer Loading cores into CoreContainer [instanceDir=/home/jenkins/workspace/Lucene-Solr-5.x-Linux/solr/build/solr-core/test/J1/temp/solr.handler.TestReplicationHandler_EA343A2A6C38B783-001/solr-instance-001]
   [junit4]   2> 1092313 WARN  (TEST-TestReplicationHandler.doTestReplicateAfterCoreReload-seed#[EA343A2A6C38B783]) [    ] o.a.s.c.CoreContainer Couldn't add files from /home/jenkins/workspace/Lucene-Solr-5.x-Linux/solr/build/solr-core/test/J1/temp/solr.handler.TestReplicationHandler_EA343A2A6C38B783-001/solr-instance-001/lib to classpath: /home/jenkins/workspace/Lucene-Solr-5.x-Linux/solr/build/solr-core/test/J1/temp/solr.handler.TestReplicationHandler_EA343A2A6C38B783-001/solr-instance-001/lib
   [junit4]   2> 1092314 INFO  (TEST-TestReplicationHandler.doTestReplicateAfterCoreReload-seed#[EA343A2A6C38B783]) [    ] o.a.s.h.c.HttpShardHandlerFactory created with socketTimeout : 90000,urlScheme : ,connTimeout : 15000,maxConnectionsPerHost : 20,maxConnections : 10000,corePoolSize : 0,maximumPoolSize : 2147483647,maxThreadIdleTime : 5,sizeOfQueue : -1,fairnessPolicy : false,useRetries : false,
   [junit4]   2> 1092314 INFO  (TEST-TestReplicationHandler.doTestReplicateAfterCoreReload-seed#[EA343A2A6C38B783]) [    ] o.a.s.u.UpdateShardHandler Creating UpdateShardHandler HTTP client with params: socketTimeout=340000&connTimeout=45000&retry=true
   [junit4]   2> 1092315 INFO  (TEST-TestReplicationHandler.doTestReplicateAfterCoreReload-seed#[EA343A2A6C38B783]) [    ] o.a.s.l.LogWatcher SLF4J impl is org.slf4j.impl.Log4jLoggerFactory
   [junit4]   2> 1092315 INFO  (TEST-TestReplicationHandler.doTestReplicateAfterCoreReload-seed#[EA343A2A6C38B783]) [    ] o.a.s.l.LogWatcher Registering Log Listener [Log4j (org.slf4j.impl.Log4jLoggerFactory)]
   [junit4]   2> 1092315 INFO  (TEST-TestReplicationHandler.doTestReplicateAfterCoreReload-seed#[EA343A2A6C38B783]) [    ] o.a.s.c.CoreContainer Security conf doesn't exist. Skipping setup for authorization module.
   [junit4]   2> 1092315 INFO  (TEST-TestReplicationHandler.doTestReplicateAfterCoreReload-seed#[EA343A2A6C38B783]) [    ] o.a.s.c.CoreContainer No authentication plugin used.
   [junit4]   2> 1092315 INFO  (TEST-TestReplicationHandler.doTestReplicateAfterCoreReload-seed#[EA343A2A6C38B783]) [    ] o.a.s.c.CorePropertiesLocator Looking for core definitions underneath /home/jenkins/workspace/Lucene-Solr-5.x-Linux/solr/build/solr-core/test/J1/temp/solr.handler.TestReplicationHandler_EA343A2A6C38B783-001/solr-instance-001/.
   [junit4]   2> 1092316 INFO  (TEST-TestReplicationHandler.doTestReplicateAfterCoreReload-seed#[EA343A2A6C38B783]) [    ] o.a.s.c.CoreDescriptor Created CoreDescriptor: {dataDir=data/, config=solrconfig.xml, schema=schema.xml, configSetProperties=configsetprops.json, transient=false, name=collection1, loadOnStartup=true}
   [junit4]   2> 1092316 INFO  (TEST-TestReplicationHandler.doTestReplicateAfterCoreReload-seed#[EA343A2A6C38B783]) [    ] o.a.s.c.CorePropertiesLocator Found core collection1 in /home/jenkins/workspace/Lucene-Solr-5.x-Linux/solr/build/solr-core/test/J1/temp/solr.handler.TestReplicationHandler_EA343A2A6C38B783-001/solr-instance-001/./collection1
   [junit4]   2> 1092316 INFO  (TEST-TestReplicationHandler.doTestReplicateAfterCoreReload-seed#[EA343A2A6C38B783]) [    ] o.a.s.c.CorePropertiesLocator Found 1 core definitions
   [junit4]   2> 1092316 INFO  (coreLoadExecutor-3709-thread-1) [    ] o.a.s.c.SolrResourceLoader new SolrResourceLoader for directory: '/home/jenkins/workspace/Lucene-Solr-5.x-Linux/solr/build/solr-core/test/J1/temp/solr.handler.TestReplicationHandler_EA343A2A6C38B783-001/solr-instance-001/collection1'
   [junit4]   2> 1092316 INFO  (TEST-TestReplicationHandler.doTestReplicateAfterCoreReload-seed#[EA343A2A6C38B783]) [    ] o.a.s.s.SolrDispatchFilter user.dir=/home/jenkins/workspace/Lucene-Solr-5.x-Linux/solr/build/solr-core/test/J1
   [junit4]   2> 1092317 INFO  (TEST-TestReplicationHandler.doTestReplicateAfterCoreReload-seed#[EA343A2A6C38B783]) [    ] o.a.s.s.SolrDispatchFilter SolrDispatchFilter.init() done
   [junit4]   2> 1092317 INFO  (coreLoadExecutor-3709-thread-1) [    ] o.a.s.c.SolrResourceLoader JNDI not configured for solr (NoInitialContextEx)
   [junit4]   2> 1092317 INFO  (coreLoadExecutor-3709-thread-1) [    ] o.a.s.c.SolrResourceLoader solr home defaulted to 'solr/' (could not find system property or JNDI)
   [junit4]   2> 1092322 INFO  (coreLoadExecutor-3709-thread-1) [    ] o.a.s.c.SolrConfig current version of requestparams : -1
   [junit4]   2> 1092328 INFO  (coreLoadExecutor-3709-thread-1) [    ] o.a.s.c.SolrConfig Using Lucene MatchVersion: 5.6.0
   [junit4]   2> 1092342 INFO  (coreLoadExecutor-3709-thread-1) [    ] o.a.s.c.SolrConfig Loaded SolrConfig: solrconfig.xml
   [junit4]   2> 1092345 INFO  (coreLoadExecutor-3709-thread-1) [    ] o.a.s.s.IndexSchema [collection1] Schema name=test
   [junit4]   2> 1092349 INFO  (coreLoadExecutor-3709-thread-1) [    ] o.a.s.s.IndexSchema unique key field: id
   [junit4]   2> 1092350 INFO  (coreLoadExecutor-3709-thread-1) [    ] o.a.s.c.ConfigSetProperties Did not find ConfigSet properties, assuming default properties: Can't find resource 'configsetprops.json' in classpath or '/home/jenkins/workspace/Lucene-Solr-5.x-Linux/solr/build/solr-core/test/J1/temp/solr.handler.TestReplicationHandler_EA343A2A6C38B783-001/solr-instance-001/collection1'
   [junit4]   2> 1092350 INFO  (coreLoadExecutor-3709-thread-1) [    ] o.a.s.c.CoreContainer Creating SolrCore 'collection1' using configuration from instancedir /home/jenkins/workspace/Lucene-Solr-5.x-Linux/solr/build/solr-core/test/J1/temp/solr.handler.TestReplicationHandler_EA343A2A6C38B783-001/solr-instance-001/./collection1
   [junit4]   2> 1092350 INFO  (coreLoadExecutor-3709-thread-1) [    x:collection1] o.a.s.c.SolrCore org.apache.solr.core.MockDirectoryFactory
   [junit4]   2> 1092350 INFO  (coreLoadExecutor-3709-thread-1) [    x:collection1] o.a.s.c.SolrCore [[collection1] ] Opening new SolrCore at [/home/jenkins/workspace/Lucene-Solr-5.x-Linux/solr/build/solr-core/test/J1/temp/solr.handler.TestReplicationHandler_EA343A2A6C38B783-001/solr-instance-001/collection1], dataDir=[/home/jenkins/workspace/Lucene-Solr-5.x-Linux/solr/build/solr-core/test/J1/temp/solr.handler.TestReplicationHandler_EA343A2A6C38B783-001/solr-instance-001/./collection1/data/]
   [junit4]   2> 1092350 INFO  (coreLoadExecutor-3709-thread-1) [    x:collection1] o.a.s.c.SolrCore JMX monitoring not detected for core: collection1
   [junit4]   2> 1092351 INFO  (coreLoadExecutor-3709-thread-1) [    x:collection1] o.a.s.c.CachingDirectoryFactory return new directory for /home/jenkins/workspace/Lucene-Solr-5.x-Linux/solr/build/solr-core/test/J1/temp/solr.handler.TestReplicationHandler_EA343A2A6C38B783-001/solr-instance-001/./collection1/data
   [junit4]   2> 1092351 INFO  (coreLoadExecutor-3709-thread-1) [    x:collection1] o.a.s.c.SolrCore New index directory detected: old=null new=/home/jenkins/workspace/Lucene-Solr-5.x-Linux/solr/build/solr-core/test/J1/temp/solr.handler.TestReplicationHandler_EA343A2A6C38B783-001/solr-instance-001/./collection1/data/index/
   [junit4]   2> 1092351 WARN  (coreLoadExecutor-3709-thread-1) [    x:collection1] o.a.s.c.SolrCore [collection1] Solr index directory '/home/jenkins/workspace/Lucene-Solr-5.x-Linux/solr/build/solr-core/test/J1/temp/solr.handler.TestReplicationHandler_EA343A2A6C38B783-001/solr-instance-001/./collection1/data/index' doesn't exist. Creating new index...
   [junit4]   2> 1092351 INFO  (coreLoadExecutor-3709-thread-1) [    x:collection1] o.a.s.c.CachingDirectoryFactory return new directory for /home/jenkins/workspace/Lucene-Solr-5.x-Linux/solr/build/solr-core/test/J1/temp/solr.handler.TestReplicationHandler_EA343A2A6C38B783-001/solr-instance-001/./collection1/data/index
   [junit4]   2> 1092351 INFO  (coreLoadExecutor-3709-thread-1) [    x:collection1] o.a.s.u.RandomMergePolicy RandomMergePolicy wrapping class org.apache.lucene.index.TieredMergePolicy: [TieredMergePolicy: maxMergeAtOnce=32, maxMergeAtOnceExplicit=46, maxMergedSegmentMB=85.423828125, floorSegmentMB=1.779296875, forceMergeDeletesPctAllowed=2.9797590945183083, segmentsPerTier=34.0, maxCFSSegmentSizeMB=8.796093022207999E12, noCFSRatio=0.7820576984321492
   [junit4]   2> 1092351 INFO  (coreLoadExecutor-3709-thread-1) [    x:collection1] o.a.s.c.SolrDeletionPolicy SolrDeletionPolicy.onCommit: commits: num=1
   [junit4]   2> 	commit{dir=RawDirectoryWrapper(RAMDirectory@560db697 lockFactory=org.apache.lucene.store.SingleInstanceLockFactory@1e4e9fa4),segFN=segments_1,generation=1}
   [junit4]   2> 1092351 INFO  (coreLoadExecutor-3709-thread-1) [    x:collection1] o.a.s.c.SolrDeletionPolicy newest commit generation = 1
   [junit4]   2> 1092352 INFO  (OldIndexDirectoryCleanupThreadForCore-collection1) [    x:collection1] o.a.s.c.SolrCore Looking for old index directories to cleanup for core collection1 in /home/jenkins/workspace/Lucene-Solr-5.x-Linux/solr/build/solr-core/test/J1/temp/solr.handler.TestReplicationHandler_EA343A2A6C38B783-001/solr-instance-001/./collection1/data/
   [junit4]   2> 1092353 INFO  (coreLoadExecutor-3709-thread-1) [    x:collection1] o.a.s.c.SolrCore no updateRequestProcessorChain defined as default, creating implicit default
   [junit4]   2> 1092354 INFO  (coreLoadExecutor-3709-thread-1) [    x:collection1] o.a.s.h.l.XMLLoader xsltCacheLifetimeSeconds=60
   [junit4]   2> 1092355 INFO  (coreLoadExecutor-3709-thread-1) [    x:collection1] o.a.s.h.l.XMLLoader xsltCacheLifetimeSeconds=60
   [junit4]   2> 1092355 INFO  (coreLoadExecutor-3709-thread-1) [    x:collection1] o.a.s.h.l.XMLLoader xsltCacheLifetimeSeconds=60
   [junit4]   2> 1092356 INFO  (coreLoadExecutor-3709-thread-1) [    x:collection1] o.a.s.h.l.XMLLoader xsltCacheLifetimeSeconds=60
   [junit4]   2> 1092356 INFO  (coreLoadExecutor-3709-thread-1) [    x:collection1] o.a.s.c.PluginBag requestHandler : 'lazy' created with startup=lazy 
   [junit4]   2> 1092356 INFO  (coreLoadExecutor-3709-thread-1) [    x:collection1] o.a.s.c.RequestHandlers Registered paths: /update/json,/replication,/admin/file,/admin/luke,defaults,/admin/logging,lazy,/get,/update/json/docs,/update/csv,/admin/threads,standard,/admin/plugins,/admin/segments,/admin/ping,/config,/admin/system,/admin/properties,/admin/mbeans,/schema,/update
   [junit4]   2> 1092357 INFO  (coreLoadExecutor-3709-thread-1) [    x:collection1] o.a.s.c.SolrCore Using default statsCache cache: org.apache.solr.search.stats.LocalStatsCache
   [junit4]   2> 1092358 INFO  (coreLoadExecutor-3709-thread-1) [    x:collection1] o.a.s.u.CommitTracker Hard AutoCommit: disabled
   [junit4]   2> 1092358 INFO  (coreLoadExecutor-3709-thread-1) [    x:collection1] o.a.s.u.CommitTracker Soft AutoCommit: disabled
   [junit4]   2> 1092358 INFO  (coreLoadExecutor-3709-thread-1) [    x:collection1] o.a.s.u.RandomMergePolicy RandomMergePolicy wrapping class org.apache.lucene.index.TieredMergePolicy: [TieredMergePolicy: maxMergeAtOnce=32, maxMergeAtOnceExplicit=11, maxMergedSegmentMB=28.8291015625, floorSegmentMB=0.673828125, forceMergeDeletesPctAllowed=19.14320985655871, segmentsPerTier=22.0, maxCFSSegmentSizeMB=8.796093022207999E12, noCFSRatio=1.0
   [junit4]   2> 1092358 INFO  (coreLoadExecutor-3709-thread-1) [    x:collection1] o.a.s.c.SolrDeletionPolicy SolrDeletionPolicy.onInit: commits: num=1
   [junit4]   2> 	commit{dir=RawDirectoryWrapper(RAMDirectory@560db697 lockFactory=org.apache.lucene.store.SingleInstanceLockFactory@1e4e9fa4),segFN=segments_1,generation=1}
   [junit4]   2> 1092358 INFO  (coreLoadExecutor-3709-thread-1) [    x:collection1] o.a.s.c.SolrDeletionPolicy newest commit generation = 1
   [junit4]   2> 1092358 INFO  (coreLoadExecutor-3709-thread-1) [    x:collection1] o.a.s.s.SolrIndexSearcher Opening Searcher@1f6cf816[collection1] main
   [junit4]   2> 1092358 INFO  (coreLoadExecutor-3709-thread-1) [    x:collection1] o.a.s.r.ManagedResourceStorage File-based storage initialized to use dir: /home/jenkins/workspace/Lucene-Solr-5.x-Linux/solr/build/solr-core/test/J1/temp/solr.handler.TestReplicationHandler_EA343A2A6C38B783-001/solr-instance-001/collection1/conf
   [junit4]   2> 1092358 INFO  (coreLoadExecutor-3709-thread-1) [    x:collection1] o.a.s.r.RestManager Initializing RestManager with initArgs: {storageDir=/home/jenkins/workspace/Lucene-Solr-5.x-Linux/solr/build/solr-core/test/J1/temp/solr.handler.TestReplicationHandler_EA343A2A6C38B783-001/solr-instance-001/collection1/conf}
   [junit4]   2> 1092358 INFO  (coreLoadExecutor-3709-thread-1) [    x:collection1] o.a.s.r.ManagedResourceStorage Reading _rest_managed.json using file:dir=/home/jenkins/workspace/Lucene-Solr-5.x-Linux/solr/build/solr-core/test/J1/temp/solr.handler.TestReplicationHandler_EA343A2A6C38B783-001/solr-instance-001/collection1/conf
   [junit4]   2> 1092358 INFO  (coreLoadExecutor-3709-thread-1) [    x:collection1] o.a.s.r.RestManager Initializing 0 registered ManagedResources
   [junit4]   2> 1092359 INFO  (coreLoadExecutor-3709-thread-1) [    x:collection1] o.a.s.h.ReplicationHandler Replication enabled for following config files: schema.xml
   [junit4]   2> 1092359 INFO  (coreLoadExecutor-3709-thread-1) [    x:collection1] o.a.s.h.ReplicationHandler Commits will be reserved for  10000
   [junit4]   2> 1092359 INFO  (searcherExecutor-3710-thread-1-processing-x:collection1) [    x:collection1] o.a.s.c.SolrCore [collection1] Registered new searcher Searcher@1f6cf816[collection1] main{ExitableDirectoryReader(UninvertingDirectoryReader())}
   [junit4]   2> 1092359 INFO  (coreLoadExecutor-3709-thread-1) [    x:collection1] o.a.s.c.CoreContainer registering core: collection1
   [junit4]   2> 1092819 INFO  (qtp626577478-9059) [    x:collection1] o.a.s.u.DirectUpdateHandler2 [collection1] REMOVING ALL DOCUMENTS FROM INDEX
   [junit4]   2> 1092820 INFO  (qtp626577478-9059) [    x:collection1] o.a.s.u.p.LogUpdateProcessorFactory [collection1]  webapp=/solr path=/update params={version=2&wt=javabin}{deleteByQuery=*:*} 0 0
   [junit4]   2> 1092821 INFO  (qtp626577478-9060) [    x:collection1] o.a.s.u.DirectUpdateHandler2 start commit{,optimize=false,openSearcher=true,waitSearcher=true,expungeDeletes=false,softCommit=false,prepareCommit=false}
   [junit4]   2> 1092822 INFO  (qtp626577478-9060) [    x:collection1] o.a.s.c.SolrDeletionPolicy SolrDeletionPolicy.onCommit: commits: num=2
   [junit4]   2> 	commit{dir=RawDirectoryWrapper(RAMDirectory@560db697 lockFactory=org.apache.lucene.store.SingleInstanceLockFactory@1e4e9fa4),segFN=segments_1,generation=1}
   [junit4]   2> 	commit{dir=RawDirectoryWrapper(RAMDirectory@560db697 lockFactory=org.apache.lucene.store.SingleInstanceLockFactory@1e4e9fa4),segFN=segments_2,generation=2}
   [junit4]   2> 1092822 INFO  (qtp626577478-9060) [    x:collection1] o.a.s.c.SolrDeletionPolicy newest commit generation = 2
   [junit4]   2> 1092823 INFO  (qtp626577478-9060) [    x:collection1] o.a.s.s.SolrIndexSearcher Opening Searcher@30cd6b9d[collection1] main
   [junit4]   2> 1092823 INFO  (qtp626577478-9060) [    x:collection1] o.a.s.u.DirectUpdateHandler2 end_commit_flush
   [junit4]   2> 1092823 INFO  (searcherExecutor-3710-thread-1-processing-x:collection1) [    x:collection1] o.a.s.c.SolrCore [collection1] Registered new searcher Searcher@30cd6b9d[collection1] main{ExitableDirectoryReader(UninvertingDirectoryReader())}
   [junit4]   2> 1092823 INFO  (qtp626577478-9060) [    x:collection1] o.a.s.u.p.LogUpdateProcessorFactory [collection1]  webapp=/solr path=/update params={version=2&softCommit=false&commit=true&wt=javabin&waitSearcher=true}{commit=} 0 1
   [junit4]   2> 1092825 INFO  (qtp626577478-9061) [    x:collection1] o.a.s.c.S.Request [collection1]  webapp=/solr path=/select params={version=2&wt=javabin&q=*:*&sort=id+desc} hits=0 status=0 QTime=0
   [junit4]   2> 1092825 INFO  (TEST-TestReplicationHandler.doTestReplicateAfterCoreReload-seed#[EA343A2A6C38B783]) [    ] o.a.s.h.TestReplicationHandler Waited for 0ms and found 0 docs
   [junit4]   2> 1092826 INFO  (TEST-TestReplicationHandler.doTestReplicateAfterCoreReload-seed#[EA343A2A6C38B783]) [    ] o.e.j.s.Server jetty-9.2.13.v20150730
   [junit4]   2> 1092827 INFO  (TEST-TestReplicationHandler.doTestReplicateAfterCoreReload-seed#[EA343A2A6C38B783]) [    ] o.e.j.s.h.ContextHandler Started o.e.j.s.ServletContextHandler@3b7396e{/solr,null,AVAILABLE}
   [junit4]   2> 1092828 INFO  (TEST-TestReplicationHandler.doTestReplicateAfterCoreReload-seed#[EA343A2A6C38B783]) [    ] o.e.j.s.ServerConnector Started ServerConnector@11565649{HTTP/1.1}{127.0.0.1:57773}
   [junit4]   2> 1092828 INFO  (TEST-TestReplicationHandler.doTestReplicateAfterCoreReload-seed#[EA343A2A6C38B783]) [    ] o.e.j.s.Server Started @1094550ms
   [junit4]   2> 1092828 INFO  (TEST-TestReplicationHandler.doTestReplicateAfterCoreReload-seed#[EA343A2A6C38B783]) [    ] o.a.s.c.s.e.JettySolrRunner Jetty properties: {hostContext=/solr, solr.data.dir=/home/jenkins/workspace/Lucene-Solr-5.x-Linux/solr/build/solr-core/test/J1/temp/solr.handler.TestReplicationHandler_EA343A2A6C38B783-001/solr-instance-002/collection1/data, hostPort=57773}
   [junit4]   2> 1092828 INFO  (TEST-TestReplicationHandler.doTestReplicateAfterCoreReload-seed#[EA343A2A6C38B783]) [    ] o.a.s.s.SolrDispatchFilter SolrDispatchFilter.init(): sun.misc.Launcher$AppClassLoader@2b49a2c8
   [junit4]   2> 1092828 INFO  (TEST-TestReplicationHandler.doTestReplicateAfterCoreReload-seed#[EA343A2A6C38B783]) [    ] o.a.s.c.SolrResourceLoader new SolrResourceLoader for directory: '/home/jenkins/workspace/Lucene-Solr-5.x-Linux/solr/build/solr-core/test/J1/temp/solr.handler.TestReplicationHandler_EA343A2A6C38B783-001/solr-instance-002'
   [junit4]   2> 1092828 INFO  (TEST-TestReplicationHandler.doTestReplicateAfterCoreReload-seed#[EA343A2A6C38B783]) [    ] o.a.s.c.SolrResourceLoader JNDI not configured for solr (NoInitialContextEx)
   [junit4]   2> 1092828 INFO  (TEST-TestReplicationHandler.doTestReplicateAfterCoreReload-seed#[EA343A2A6C38B783]) [    ] o.a.s.c.SolrResourceLoader solr home defaulted to 'solr/' (could not find system property or JNDI)
   [junit4]   2> 1092828 INFO  (TEST-TestReplicationHandler.doTestReplicateAfterCoreReload-seed#[EA343A2A6C38B783]) [    ] o.a.s.c.SolrXmlConfig Loading container configuration from /home/jenkins/workspace/Lucene-Solr-5.x-Linux/solr/build/solr-core/test/J1/temp/solr.handler.TestReplicationHandler_EA343A2A6C38B783-001/solr-instance-002/solr.xml
   [junit4]   2> 1092851 INFO  (TEST-TestReplicationHandler.doTestReplicateAfterCoreReload-seed#[EA343A2A6C38B783]) [    ] o.a.s.c.CorePropertiesLocator Config-defined core root directory: /home/jenkins/workspace/Lucene-Solr-5.x-Linux/solr/build/solr-core/test/J1/temp/solr.handler.TestReplicationHandler_EA343A2A6C38B783-001/solr-instance-002/.
   [junit4]   2> 1092851 INFO  (TEST-TestReplicationHandler.doTestReplicateAfterCoreReload-seed#[EA343A2A6C38B783]) [    ] o.a.s.c.CoreContainer New CoreContainer 896405701
   [junit4]   2> 1092851 INFO  (TEST-TestReplicationHandler.doTestReplicateAfterCoreReload-seed#[EA343A2A6C38B783]) [    ] o.a.s.c.CoreContainer Loading cores into CoreContainer [instanceDir=/home/jenkins/workspace/Lucene-Solr-5.x-Linux/solr/build/solr-core/test/J1/temp/solr.handler.TestReplicationHandler_EA343A2A6C38B783-001/solr-instance-002]
   [junit4]   2> 1092851 WARN  (TEST-TestReplicationHandler.doTestReplicateAfterCoreReload-seed#[EA343A2A6C38B783]) [    ] o.a.s.c.CoreContainer Couldn't add files from /home/jenkins/workspace/Lucene-Solr-5.x-Linux/solr/build/solr-core/test/J1/temp/solr.handler.TestReplicationHandler_EA343A2A6C38B783-001/solr-instance-002/lib to classpath: /home/jenkins/workspace/Lucene-Solr-5.x-Linux/solr/build/solr-core/test/J1/temp/solr.handler.TestReplicationHandler_EA343A2A6C38B783-001/solr-instance-002/lib
   [junit4]   2> 1092852 INFO  (TEST-TestReplicationHandler.doTestReplicateAfterCoreReload-seed#[EA343A2A6C38B783]) [    ] o.a.s.h.c.HttpShardHandlerFactory created with socketTimeout : 90000,urlScheme : ,connTimeout : 15000,maxConnectionsPerHost : 20,maxConnections : 10000,corePoolSize : 0,maximumPoolSize : 2147483647,maxThreadIdleTime : 5,sizeOfQueue : -1,fairnessPolicy : false,useRetries : false,
   [junit4]   2> 1092852 INFO  (TEST-TestReplicationHandler.doTestReplicateAfterCoreReload-seed#[EA343A2A6C38B783]) [    ] o.a.s.u.UpdateShardHandler Creating UpdateShardHandler HTTP client with params: socketTimeout=340000&connTimeout=45000&retry=true
   [junit4]   2> 1092853 INFO  (TEST-TestReplicationHandler.doTestReplicateAfterCoreReload-seed#[EA343A2A6C38B783]) [    ] o.a.s.l.LogWatcher SLF4J impl is org.slf4j.impl.Log4jLoggerFactory
   [junit4]   2> 1092853 INFO  (TEST-TestReplicationHandler.doTestReplicateAfterCoreReload-seed#[EA343A2A6C38B783]) [    ] o.a.s.l.LogWatcher Registering Log Listener [Log4j (org.slf4j.impl.Log4jLoggerFactory)]
   [junit4]   2> 1092853 INFO  (TEST-TestReplicationHandler.doTestReplicateAfterCoreReload-seed#[EA343A2A6C38B783]) [    ] o.a.s.c.CoreContainer Security conf doesn't exist. Skipping setup for authorization module.
   [junit4]   2> 1092853 INFO  (TEST-TestReplicationHandler.doTestReplicateAfterCoreReload-seed#[EA343A2A6C38B783]) [    ] o.a.s.c.CoreContainer No authentication plugin used.
   [junit4]   2> 1092853 INFO  (TEST-TestReplicationHandler.doTestReplicateAfterCoreReload-seed#[EA343A2A6C38B783]) [    ] o.a.s.c.CorePropertiesLocator Looking for core definitions underneath /home/jenkins/workspace/Lucene-Solr-5.x-Linux/solr/build/solr-core/test/J1/temp/solr.handler.TestReplicationHandler_EA343A2A6C38B783-001/solr-instance-002/.
   [junit4]   2> 1092854 INFO  (TEST-TestReplicationHandler.doTestReplicateAfterCoreReload-seed#[EA343A2A6C38B783]) [    ] o.a.s.c.CoreDescriptor Created CoreDescriptor: {dataDir=data/, schema=schema.xml, config=solrconfig.xml, configSetProperties=configsetprops.json, transient=false, name=collection1, loadOnStartup=true}
   [junit4]   2> 1092854 INFO  (TEST-TestReplicationHandler.doTestReplicateAfterCoreReload-seed#[EA343A2A6C38B783]) [    ] o.a.s.c.CorePropertiesLocator Found core collection1 in /home/jenkins/workspace/Lucene-Solr-5.x-Linux/solr/build/solr-core/test/J1/temp/solr.handler.TestReplicationHandler_EA343A2A6C38B783-001/solr-instance-002/./collection1
   [junit4]   2> 1092854 INFO  (TEST-TestReplicationHandler.doTestReplicateAfterCoreReload-seed#[EA343A2A6C38B783]) [    ] o.a.s.c.CorePropertiesLocator Found 1 core definitions
   [junit4]   2> 1092855 INFO  (coreLoadExecutor-3719-thread-1) [    ] o.a.s.c.SolrResourceLoader new SolrResourceLoader for directory: '/home/jenkins/workspace/Lucene-Solr-5.x-Linux/solr/build/solr-core/test/J1/temp/solr.handler.TestReplicationHandler_EA343A2A6C38B783-001/solr-instance-002/collection1'
   [junit4]   2> 1092855 INFO  (TEST-TestReplicationHandler.doTestReplicateAfterCoreReload-seed#[EA343A2A6C38B783]) [    ] o.a.s.s.SolrDispatchFilter user.dir=/home/jenkins/workspace/Lucene-Solr-5.x-Linux/solr/build/solr-core/test/J1
   [junit4]   2> 1092855 INFO  (TEST-TestReplicationHandler.doTestReplicateAfterCoreReload-seed#[EA343A2A6C38B783]) [    ] o.a.s.s.SolrDispatchFilter SolrDispatchFilter.init() done
   [junit4]   2> 1092855 INFO  (coreLoadExecutor-3719-thread-1) [    ] o.a.s.c.SolrResourceLoader JNDI not configured for solr (NoInitialContextEx)
   [junit4]   2> 1092855 INFO  (coreLoadExecutor-3719-thread-1) [    ] o.a.s.c.SolrResourceLoader solr home defaulted to 'solr/' (could not find system property or JNDI)
   [junit4]   2> 1092860 INFO  (coreLoadExecutor-3719-thread-1) [    ] o.a.s.c.SolrConfig current version of requestparams : -1
   [junit4]   2> 1092867 INFO  (coreLoadExecutor-3719-thread-1) [    ] o.a.s.c.SolrConfig Using Lucene MatchVersion: 5.6.0
   [junit4]   2> 1092881 INFO  (coreLoadExecutor-3719-thread-1) [    ] o.a.s.c.SolrConfig Loaded SolrConfig: solrconfig.xml
   [junit4]   2> 1092884 INFO  (coreLoadExecutor-3719-thread-1) [    ] o.a.s.s.IndexSchema [collection1] Schema name=test
   [junit4]   2> 1092889 INFO  (coreLoadExecutor-3719-thread-1) [    ] o.a.s.s.IndexSchema unique key field: id
   [junit4]   2> 1092890 INFO  (coreLoadExecutor-3719-thread-1) [    ] o.a.s.c.ConfigSetProperties Did not find ConfigSet properties, assuming default properties: Can't find resource 'configsetprops.json' in classpath or '/home/jenkins/workspace/Lucene-Solr-5.x-Linux/solr/build/solr-core/test/J1/temp/solr.handler.TestReplicationHandler_EA343A2A6C38B783-001/solr-instance-002/collection1'
   [junit4]   2> 1092890 INFO  (coreLoadExecutor-3719-thread-1) [    ] o.a.s.c.CoreContainer Creating SolrCore 'collection1' using configuration from instancedir /home/jenkins/workspace/Lucene-Solr-5.x-Linux/solr/build/solr-core/test/J1/temp/solr.handler.TestReplicationHandler_EA343A2A6C38B783-001/solr-instance-002/./collection1
   [junit4]   2> 1092890 INFO  (coreLoadExecutor-3719-thread-1) [    x:collection1] o.a.s.c.SolrCore org.apache.solr.core.MockDirectoryFactory
   [junit4]   2> 1092890 INFO  (coreLoadExecutor-3719-thread-1) [    x:collection1] o.a.s.c.SolrCore [[collection1] ] Opening new SolrCore at [/home/jenkins/workspace/Lucene-Solr-5.x-Linux/solr/build/solr-core/test/J1/temp/solr.handler.TestReplicationHandler_EA343A2A6C38B783-001/solr-instance-002/collection1], dataDir=[/home/jenkins/workspace/Lucene-Solr-5.x-Linux/solr/build/solr-core/test/J1/temp/solr.handler.TestReplicationHandler_EA343A2A6C38B783-001/solr-instance-002/./collection1/data/]
   [junit4]   2> 1092890 INFO  (coreLoadExecutor-3719-thread-1) [    x:collection1] o.a.s.c.SolrCore JMX monitoring not detected for core: collection1
   [junit4]   2> 1092890 INFO  (coreLoadExecutor-3719-thread-1) [    x:collection1] o.a.s.c.CachingDirectoryFactory return new directory for /home/jenkins/workspace/Lucene-Solr-5.x-Linux/solr/build/solr-core/test/J1/temp/solr.handler.TestReplicationHandler_EA343A2A6C38B783-001/solr-instance-002/./collection1/data
   [junit4]   2> 1092890 INFO  (coreLoadExecutor-3719-thread-1) [    x:collection1] o.a.s.c.SolrCore New index directory detected: old=null new=/home/jenkins/workspace/Lucene-Solr-5.x-Linux/solr/build/solr-core/test/J1/temp/solr.handler.TestReplicationHandler_EA343A2A6C38B783-001/solr-instance-002/./collection1/data/index/
   [junit4]   2> 1092890 WARN  (coreLoadExecutor-3719-thread-1) [    x:collection1] o.a.s.c.SolrCore [collection1] Solr index directory '/home/jenkins/workspace/Lucene-Solr-5.x-Linux/solr/build/solr-core/test/J1/temp/solr.handler.TestReplicationHandler_EA343A2A6C38B783-001/solr-instance-002/./collection1/data/index' doesn't exist. Creating new index...
   [junit4]   2> 1092891 INFO  (coreLoadExecutor-3719-thread-1) [    x:collection1] o.a.s.c.CachingDirectoryFactory return new directory for /home/jenkins/workspace/Lucene-Solr-5.x-Linux/solr/build/solr-core/test/J1/temp/solr.handler.TestReplicationHandler_EA343A2A6C38B783-001/solr-instance-002/./collection1/data/index
   [junit4]   2> 1092891 INFO  (coreLoadExecutor-3719-thread-1) [    x:collection1] o.a.s.u.RandomMergePolicy RandomMergePolicy wrapping class org.apache.lucene.index.TieredMergePolicy: [TieredMergePolicy: maxMergeAtOnce=32, maxMergeAtOnceExplicit=46, maxMergedSegmentMB=85.423828125, floorSegmentMB=1.779296875, forceMergeDeletesPctAllowed=2.9797590945183083, segmentsPerTier=34.0, maxCFSSegmentSizeMB=8.796093022207999E12, noCFSRatio=0.7820576984321492
   [junit4]   2> 1092891 INFO  (coreLoadExecutor-3719-thread-1) [    x:collection1] o.a.s.c.SolrDeletionPolicy SolrDeletionPolicy.onCommit: commits: num=1
   [junit4]   2> 	commit{dir=RawDirectoryWrapper(RAMDirectory@531d2ad0 lockFactory=org.apache.lucene.store.SingleInstanceLockFactory@1fe5e851),segFN=segments_1,generation=1}
   [junit4]   2> 1092891 INFO  (coreLoadExecutor-3719-thread-1) [    x:collection1] o.a.s.c.SolrDeletionPolicy newest commit generation = 1
   [junit4]   2> 1092891 INFO  (OldIndexDirectoryCleanupThreadForCore-collection1) [    x:collection1] o.a.s.c.SolrCore Looking for old index directories to cleanup for core collection1 in /home/jenkins/workspace/Lucene-Solr-5.x-Linux/solr/build/solr-core/test/J1/temp/solr.handler.TestReplicationHandler_EA343A2A6C38B783-001/solr-instance-002/./collection1/data/
   [junit4]   2> 1092893 INFO  (coreLoadExecutor-3719-thread-1) [    x:collection1] o.a.s.c.SolrCore no updateRequestProcessorChain defined as default, creating implicit default
   [junit4]   2> 1092894 INFO  (coreLoadExecutor-3719-thread-1) [    x:collection1] o.a.s.h.l.XMLLoader xsltCacheLifetimeSeconds=60
   [junit4]   2> 1092895 INFO  (coreLoadExecutor-3719-thread-1) [    x:collection1] o.a.s.h.l.XMLLoader xsltCacheLifetimeSeconds=60
   [junit4]   2> 1092896 INFO  (coreLoadExecutor-3719-thread-1) [    x:collection1] o.a.s.h.l.XMLLoader xsltCacheLifetimeSeconds=60
   [junit4]   2> 1092896 INFO  (coreLoadExecutor-3719-thread-1) [    x:collection1] o.a.s.h.l.XMLLoader xsltCacheLifetimeSeconds=60
   [junit4]   2> 1092897 INFO  (coreLoadExecutor-3719-thread-1) [    x:collection1] o.a.s.c.PluginBag requestHandler : 'lazy' created with startup=lazy 
   [junit4]   2> 1092897 INFO  (coreLoadExecutor-3719-thread-1) [    x:collection1] o.a.s.c.RequestHandlers Registered paths: /update/json,/replication,/admin/file,/admin/luke,defaults,/admin/logging,lazy,/get,/update/json/docs,/update/csv,/admin/threads,standard,/admin/plugins,/admin/segments,/admin/ping,/config,/admin/system,/admin/properties,/admin/mbeans,/schema,/update
   [junit4]   2> 1092898 INFO  (coreLoadExecutor-3719-thread-1) [    x:collection1] o.a.s.c.SolrCore Using default statsCache cache: org.apache.solr.search.stats.LocalStatsCache
   [junit4]   2> 1092898 INFO  (coreLoadExecutor-3719-thread-1) [    x:collection1] o.a.s.u.CommitTracker Hard AutoCommit: disabled
   [junit4]   2> 1092898 INFO  (coreLoadExecutor-3719-thread-1) [    x:collection1] o.a.s.u.CommitTracker Soft AutoCommit: disabled
   [junit4]   2> 1092898 INFO  (coreLoadExecutor-3719-thread-1) [    x:collection1] o.a.s.u.RandomMergePolicy RandomMergePolicy wrapping class org.apache.lucene.index.TieredMergePolicy: [TieredMergePolicy: maxMergeAtOnce=32, maxMergeAtOnceExplicit=11, maxMergedSegmentMB=28.8291015625, floorSegmentMB=0.673828125, forceMergeDeletesPctAllowed=19.14320985655871, segmentsPerTier=22.0, maxCFSSegmentSizeMB=8.796093022207999E12, noCFSRatio=1.0
   [junit4]   2> 1092898 INFO  (coreLoadExecutor-3719-thread-1) [    x:collection1] o.a.s.c.SolrDeletionPolicy SolrDeletionPolicy.onInit: commits: num=1
   [junit4]   2> 	commit{dir=RawDirectoryWrapper(RAMDirectory@531d2ad0 lockFactory=org.apache.lucene.store.SingleInstanceLockFactory@1fe5e851),segFN=segments_1,generation=1}
   [junit4]   2> 1092898 INFO  (coreLoadExecutor-3719-thread-1) [    x:collection1] o.a.s.c.SolrDeletionPolicy newest commit generation = 1
   [junit4]   2> 1092898 INFO  (coreLoadExecutor-3719-thread-1) [    x:collection1] o.a.s.s.SolrIndexSearcher Opening Searcher@2e3bdb39[collection1] main
   [junit4]   2> 1092899 INFO  (coreLoadExecutor-3719-thread-1) [    x:collection1] o.a.s.r.ManagedResourceStorage File-based storage initialized to use dir: /home/jenkins/workspace/Lucene-Solr-5.x-Linux/solr/build/solr-core/test/J1/temp/solr.handler.TestReplicationHandler_EA343A2A6C38B783-001/solr-instance-002/collection1/conf
   [junit4]   2> 1092899 INFO  (coreLoadExecutor-3719-thread-1) [    x:collection1] o.a.s.r.RestManager Initializing RestManager with initArgs: {storageDir=/home/jenkins/workspace/Lucene-Solr-5.x-Linux/solr/build/solr-core/test/J1/temp/solr.handler.TestReplicationHandler_EA343A2A6C38B783-001/solr-instance-002/collection1/conf}
   [junit4]   2> 1092899 INFO  (coreLoadExecutor-3719-thread-1) [    x:collection1] o.a.s.r.ManagedResourceStorage Reading _rest_managed.json using file:dir=/home/jenkins/workspace/Lucene-Solr-5.x-Linux/solr/build/solr-core/test/J1/temp/solr.handler.TestReplicationHandler_EA343A2A6C38B783-001/solr-instance-002/collection1/conf
   [junit4]   2> 1092899 INFO  (coreLoadExecutor-3719-thread-1) [    x:collection1] o.a.s.r.RestManager Initializing 0 registered ManagedResources
   [junit4]   2> 1092899 INFO  (coreLoadExecutor-3719-thread-1) [    x:collection1] o.a.s.h.ReplicationHandler Poll scheduled at an interval of 1000ms
   [junit4]   2> 1092900 INFO  (searcherExecutor-3720-thread-1-processing-x:collection1) [    x:collection1] o.a.s.c.SolrCore [collection1] Registered new searcher Searcher@2e3bdb39[collection1] main{ExitableDirectoryReader(UninvertingDirectoryReader())}
   [junit4]   2> 1092900 INFO  (coreLoadExecutor-3719-thread-1) [    x:collection1] o.a.s.c.CoreContainer registering core: collection1
   [junit4]   2> 1092901 INFO  (qtp626577478-9059) [    x:collection1] o.a.s.c.S.Request [collection1]  webapp=/solr path=/replication params={version=2&command=indexversion&wt=javabin&qt=/replication} status=0 QTime=0
   [junit4]   2> 1092901 INFO  (indexFetcher-3724-thread-1) [    x:collection1] o.a.s.h.IndexFetcher Master's generation: 2
   [junit4]   2> 1092901 INFO  (indexFetcher-3724-thread-1) [    x:collection1] o.a.s.h.IndexFetcher Slave's generation: 1
   [junit4]   2> 1092901 INFO  (indexFetcher-3724-thread-1) [    x:collection1] o.a.s.h.IndexFetcher Starting replication process
   [junit4]   2> 1092903 INFO  (qtp626577478-9060) [    x:collection1] o.a.s.c.S.Request [collection1]  webapp=/solr path=/replication params={version=2&command=filelist&generation=2&wt=javabin&qt=/replication} status=0 QTime=0
   [junit4]   2> 1092903 INFO  (indexFetcher-3724-thread-1) [    x:collection1] o.a.s.h.IndexFetcher Number of files in latest index in master: 1
   [junit4]   2> 1092904 INFO  (indexFetcher-3724-thread-1) [    x:collection1] o.a.s.c.CachingDirectoryFactory return new directory for /home/jenkins/workspace/Lucene-Solr-5.x-Linux/solr/build/solr-core/test/J1/temp/solr.handler.TestReplicationHandler_EA343A2A6C38B783-001/solr-instance-002/./collection1/data/index.20160214082529000
   [junit4]   2> 1092904 INFO  (indexFetcher-3724-thread-1) [    x:collection1] o.a.s.u.DefaultSolrCoreState Rollback old IndexWriter... core=collection1
   [junit4]   2> 1092904 INFO  (indexFetcher-3724-thread-1) [    x:collection1] o.a.s.u.RandomMergePolicy RandomMergePolicy wrapping class org.apache.lucene.index.LogByteSizeMergePolicy: [LogByteSizeMergePolicy: minMergeSize=1677721, mergeFactor=32, maxMergeSize=2147483648, maxMergeSizeForForcedMerge=9223372036854775807, calibrateSizeByDeletes=true, maxMergeDocs=2147483647, maxCFSSegmentSizeMB=8.796093022207999E12, noCFSRatio=0.6508711797504932]
   [junit4]   2> 1092905 INFO  (indexFetcher-3724-thread-1) [    x:collection1] o.a.s.c.SolrDeletionPolicy SolrDeletionPolicy.onInit: commits: num=1
   [junit4]   2> 	commit{dir=RawDirectoryWrapper(RAMDirectory@531d2ad0 lockFactory=org.apache.lucene.store.SingleInstanceLockFactory@1fe5e851),segFN=segments_1,generation=1}
   [junit4]   2> 1092905 INFO  (indexFetcher-3724-thread-1) [    x:collection1] o.a.s.c.SolrDeletionPolicy newest commit generation = 1
   [junit4]   2> 1092905 INFO  (indexFetcher-3724-thread-1) [    x:collection1] o.a.s.u.DefaultSolrCoreState New IndexWriter is ready to be used.
   [junit4]   2> 1092905 INFO  (indexFetcher-3724-thread-1) [    x:collection1] o.a.s.c.SolrDeletionPolicy SolrDeletionPolicy.onCommit: commits: num=1
   [junit4]   2> 	commit{dir=RawDirectoryWrapper(RAMDirectory@531d2ad0 lockFactory=org.apache.lucene.store.SingleInstanceLockFactory@1fe5e851),segFN=segments_1,generation=1}
   [junit4]   2> 1092905 INFO  (indexFetcher-3724-thread-1) [    x:collection1] o.a.s.c.SolrDeletionPolicy newest commit generation = 1
   [junit4]   2> 1092905 INFO  (indexFetcher-3724-thread-1) [    x:collection1] o.a.s.u.DefaultSolrCoreState Rollback old IndexWriter... core=collection1
   [junit4]   2> 1092905 INFO  (indexFetcher-3724-thread-1) [    x:collection1] o.a.s.h.IndexFetcher Starting download (fullCopy=false) to MockDirectoryWrapper(RAMDirectory@4a34acd5 lockFactory=org.apache.lucene.store.SingleInstanceLockFactory@483efa02)
   [junit4]   2> 1092907 INFO  (qtp626577478-9061) [    x:collection1] o.a.s.c.S.Request [collection1]  webapp=/solr path=/replication params={command=filecontent&generation=2&wt=filestream&checksum=true&file=segments_2&qt=/replication} status=0 QTime=0
   [junit4]   2> 1092907 INFO  (indexFetcher-3724-thread-1) [    x:collection1] o.a.s.h.IndexFetcher Total time taken for download (fullCopy=false,bytesDownloaded=100) : 0 secs (null bytes/sec) to MockDirectoryWrapper(RAMDirectory@4a34acd5 lockFactory=org.apache.lucene.store.SingleInstanceLockFactory@483efa02)
   [junit4]   2> 1092908 INFO  (indexFetcher-3724-thread-1) [    x:collection1] o.a.s.u.RandomMergePolicy RandomMergePolicy wrapping class org.apache.lucene.index.TieredMergePolicy: [TieredMergePolicy: maxMergeAtOnce=29, maxMergeAtOnceExplicit=17, maxMergedSegmentMB=1.5498046875, floorSegmentMB=1.509765625, forceMergeDeletesPctAllowed=27.347437471032446, segmentsPerTier=50.0, maxCFSSegmentSizeMB=8.796093022207999E12, noCFSRatio=1.0
   [junit4]   2> 1092908 INFO  (indexFetcher-3724-thread-1) [    x:collection1] o.a.s.c.SolrDeletionPolicy SolrDeletionPolicy.onInit: commits: num=2
   [junit4]   2> 	commit{dir=RawDirectoryWrapper(RAMDirectory@531d2ad0 lockFactory=org.apache.lucene.store.SingleInstanceLockFactory@1fe5e851),segFN=segments_1,generation=1}
   [junit4]   2> 	commit{dir=RawDirectoryWrapper(RAMDirectory@531d2ad0 lockFactory=org.apache.lucene.store.SingleInstanceLockFactory@1fe5e851),segFN=segments_2,generation=2}
   [junit4]   2> 1092908 INFO  (indexFetcher-3724-thread-1) [    x:collection1] o.a.s.c.SolrDeletionPolicy newest commit generation = 2
   [junit4]   2> 1092908 INFO  (indexFetcher-3724-thread-1) [    x:collection1] o.a.s.u.DefaultSolrCoreState New IndexWriter is ready to be used.
   [junit4]   2> 1092908 INFO  (indexFetcher-3724-thread-1) [    x:collection1] o.a.s.s.SolrIndexSearcher Opening Searcher@5540247d[collection1] main
   [junit4]   2> 1092909 INFO  (searcherExecutor-3720-thread-1-processing-x:collection1) [    x:collection1] o.a.s.c.SolrCore [collection1] Registered new searcher Searcher@5540247d[collection1] main{ExitableDirectoryReader(UninvertingDirectoryReader())}
   [junit4]   2> 1092909 INFO  (indexFetcher-3724-thread-1) [    x:collection1] o.a.s.c.CachingDirectoryFactory looking to close /home/jenkins/workspace/Lucene-Solr-5.x-Linux/solr/build/solr-core/test/J1/temp/solr.handler.TestReplicationHandler_EA343A2A6C38B783-001/solr-instance-002/./collection1/data/index.20160214082529000 [CachedDir<<refCount=0;path=/home/jenkins/workspace/Lucene-Solr-5.x-Linux/solr/build/solr-core/test/J1/temp/solr.handler.TestReplicationHandler_EA343A2A6C38B783-001/solr-instance-002/./collection1/data/index.20160214082529000;done=true>>]
   [junit4]   2> 1092909 INFO  (indexFetcher-3724-thread-1) [    x:collection1] o.a.s.c.CachingDirectoryFactory Closing directory: /home/jenkins/workspace/Lucene-Solr-5.x-Linux/solr/build/solr-core/test/J1/temp/solr.handler.TestReplicationHandler_EA343A2A6C38B783-001/solr-instance-002/./collection1/data/index.20160214082529000
   [junit4]   2> 1093358 INFO  (qtp28490084-9078) [    x:collection1] o.a.s.c.S.Request [collection1]  webapp=/solr path=/select params={version=2&wt=javabin&q=*:*&sort=id+desc} hits=0 status=0 QTime=0
   [junit4]   2> 1093358 INFO  (TEST-TestReplicationHandler.doTestReplicateAfterCoreReload-seed#[EA343A2A6C38B783]) [    ] o.a.s.h.TestReplicationHandler Waited for 0ms and found 0 docs
   [junit4]   2> 1093360 INFO  (qtp626577478-9059) [    x:collection1] o.a.s.c.S.Request [collection1]  webapp=/solr path=/replication params={version=2&command=indexversion&wt=javabin&qt=/replication&_trace=getIndexVersion} status=0 QTime=0
   [junit4]   2> 1093361 INFO  (qtp626577478-9060) [    x:collection1] o.a.s.c.S.Request [collection1]  webapp=/solr path=/replication params={version=2&command=commits&wt=javabin&qt=/replication&_trace=getCommits} status=0 QTime=0
   [junit4]   2> 1093363 INFO  (qtp626577478-9061) [    ] o.a.s.c.SolrResourceLoader new SolrResourceLoader for directory: '/home/jenkins/workspace/Lucene-Solr-5.x-Linux/solr/build/solr-core/test/J1/temp/solr.handler.TestReplicationHandler_EA343A2A6C38B783-001/solr-instance-001/collection1'
   [junit4]   2> 1093363 INFO  (qtp626577478-9061) [    ] o.a.s.c.SolrResourceLoader JNDI not configured for solr (NoInitialContextEx)
   [junit4]   2> 1093364 INFO  (qtp626577478-9061) [    ] o.a.s.c.SolrResourceLoader solr home defaulted to 'solr/' (could not find system property or JNDI)
   [junit4]   2> 1093371 INFO  (qtp626577478-9061) [    ] o.a.s.c.SolrConfig current version of requestparams : -1
   [junit4]   2> 1093378 INFO  (qtp626577478-9061) [    ] o.a.s.c.SolrConfig Using Lucene MatchVersion: 5.6.0
   [junit4]   2> 1093392 INFO  (qtp626577478-9061) [    ] o.a.s.c.SolrConfig Loaded SolrConfig: solrconfig.xml
   [junit4]   2> 1093395 INFO  (qtp626577478-9061) [    ] o.a.s.s.IndexSchema [collection1] Schema name=test
   [junit4]   2> 1093399 INFO  (qtp626577478-9061) [    ] o.a.s.s.IndexSchema unique key field: id
   [junit4]   2> 1093400 INFO  (qtp626577478-9061) [    ] o.a.s.c.ConfigSetProperties Did not find ConfigSet properties, assuming default properties: Can't find resource 'configsetprops.json' in classpath or '/home/jenkins/workspace/Lucene-Solr-5.x-Linux/solr/build/solr-core/test/J1/temp/solr.handler.TestReplicationHandler_EA343A2A6C38B783-001/solr-instance-001/collection1'
   [junit4]   2> 1093400 INFO  (qtp626577478-9061) [    ] o.a.s.c.CoreContainer Reloading SolrCore 'collection1' using configuration from instancedir /home/jenkins/workspace/Lucene-Solr-5.x-Linux/solr/build/solr-core/test/J1/temp/solr.handler.TestReplicationHandler_EA343A2A6C38B783-001/solr-instance-001/./collection1
   [junit4]   2

[...truncated too long message...]

./collection1/data [CachedDir<<refCount=0;path=/home/jenkins/workspace/Lucene-Solr-5.x-Linux/solr/build/solr-core/test/J1/temp/solr.handler.TestReplicationHandler_EA343A2A6C38B783-001/solr-instance-027/./collection1/data;done=false>>]
   [junit4]   2> 1165649 INFO  (coreCloseExecutor-4263-thread-1) [    x:collection1] o.a.s.c.CachingDirectoryFactory Closing directory: /home/jenkins/workspace/Lucene-Solr-5.x-Linux/solr/build/solr-core/test/J1/temp/solr.handler.TestReplicationHandler_EA343A2A6C38B783-001/solr-instance-027/./collection1/data
   [junit4]   2> 1165649 INFO  (TEST-TestReplicationHandler.testEmptyCommits-seed#[EA343A2A6C38B783]) [    ] o.e.j.s.h.ContextHandler Stopped o.e.j.s.ServletContextHandler@3ed6ecc1{/solr,null,UNAVAILABLE}
   [junit4]   2> 1165651 INFO  (TEST-TestReplicationHandler.testEmptyCommits-seed#[EA343A2A6C38B783]) [    ] o.e.j.s.ServerConnector Stopped ServerConnector@181a603b{HTTP/1.1}{127.0.0.1:0}
   [junit4]   2> 1165651 INFO  (TEST-TestReplicationHandler.testEmptyCommits-seed#[EA343A2A6C38B783]) [    ] o.a.s.c.CoreContainer Shutting down CoreContainer instance=10953885
   [junit4]   2> 1165652 INFO  (coreCloseExecutor-4264-thread-1) [    x:collection1] o.a.s.c.SolrCore [collection1]  CLOSING SolrCore org.apache.solr.core.SolrCore@12927a63
   [junit4]   2> 1165652 INFO  (coreCloseExecutor-4264-thread-1) [    x:collection1] o.a.s.u.DirectUpdateHandler2 closing DirectUpdateHandler2{commits=0,autocommits=0,soft autocommits=0,optimizes=0,rollbacks=0,expungeDeletes=0,docsPending=0,adds=0,deletesById=0,deletesByQuery=0,errors=0,cumulative_adds=0,cumulative_deletesById=0,cumulative_deletesByQuery=0,cumulative_errors=0}
   [junit4]   2> 1165652 INFO  (coreCloseExecutor-4264-thread-1) [    x:collection1] o.a.s.u.SolrCoreState Closing SolrCoreState
   [junit4]   2> 1165652 INFO  (coreCloseExecutor-4264-thread-1) [    x:collection1] o.a.s.u.DefaultSolrCoreState SolrCoreState ref count has reached 0 - closing IndexWriter
   [junit4]   2> 1165652 INFO  (coreCloseExecutor-4264-thread-1) [    x:collection1] o.a.s.u.DefaultSolrCoreState closing IndexWriter with IndexWriterCloser
   [junit4]   2> 1165652 INFO  (coreCloseExecutor-4264-thread-1) [    x:collection1] o.a.s.c.SolrCore [collection1] Closing main searcher on request.
   [junit4]   2> 1165652 INFO  (coreCloseExecutor-4264-thread-1) [    x:collection1] o.a.s.c.CachingDirectoryFactory Closing MockDirectoryFactory - 2 directories currently being tracked
   [junit4]   2> 1165652 INFO  (coreCloseExecutor-4264-thread-1) [    x:collection1] o.a.s.c.CachingDirectoryFactory looking to close /home/jenkins/workspace/Lucene-Solr-5.x-Linux/solr/build/solr-core/test/J1/temp/solr.handler.TestReplicationHandler_EA343A2A6C38B783-001/solr-instance-028/./collection1/data [CachedDir<<refCount=0;path=/home/jenkins/workspace/Lucene-Solr-5.x-Linux/solr/build/solr-core/test/J1/temp/solr.handler.TestReplicationHandler_EA343A2A6C38B783-001/solr-instance-028/./collection1/data;done=false>>]
   [junit4]   2> 1165652 INFO  (coreCloseExecutor-4264-thread-1) [    x:collection1] o.a.s.c.CachingDirectoryFactory Closing directory: /home/jenkins/workspace/Lucene-Solr-5.x-Linux/solr/build/solr-core/test/J1/temp/solr.handler.TestReplicationHandler_EA343A2A6C38B783-001/solr-instance-028/./collection1/data
   [junit4]   2> 1165652 INFO  (coreCloseExecutor-4264-thread-1) [    x:collection1] o.a.s.c.CachingDirectoryFactory looking to close /home/jenkins/workspace/Lucene-Solr-5.x-Linux/solr/build/solr-core/test/J1/temp/solr.handler.TestReplicationHandler_EA343A2A6C38B783-001/solr-instance-028/./collection1/data/index [CachedDir<<refCount=0;path=/home/jenkins/workspace/Lucene-Solr-5.x-Linux/solr/build/solr-core/test/J1/temp/solr.handler.TestReplicationHandler_EA343A2A6C38B783-001/solr-instance-028/./collection1/data/index;done=false>>]
   [junit4]   2> 1165653 INFO  (coreCloseExecutor-4264-thread-1) [    x:collection1] o.a.s.c.CachingDirectoryFactory Closing directory: /home/jenkins/workspace/Lucene-Solr-5.x-Linux/solr/build/solr-core/test/J1/temp/solr.handler.TestReplicationHandler_EA343A2A6C38B783-001/solr-instance-028/./collection1/data/index
   [junit4]   2> 1165657 INFO  (TEST-TestReplicationHandler.testEmptyCommits-seed#[EA343A2A6C38B783]) [    ] o.e.j.s.h.ContextHandler Stopped o.e.j.s.ServletContextHandler@1a2f21b9{/solr,null,UNAVAILABLE}
   [junit4]   2> 1165658 INFO  (SUITE-TestReplicationHandler-seed#[EA343A2A6C38B783]-worker) [    ] o.a.s.SolrTestCaseJ4 ###deleteCore
   [junit4]   2> ObjectTracker found 1 object(s) that were not released!!! [NRTCachingDirectory]
   [junit4]   2> org.apache.solr.common.util.ObjectReleaseTracker$ObjectTrackerException
   [junit4]   2> 	at org.apache.solr.common.util.ObjectReleaseTracker.track(ObjectReleaseTracker.java:42)
   [junit4]   2> 	at org.apache.solr.core.CachingDirectoryFactory.get(CachingDirectoryFactory.java:351)
   [junit4]   2> 	at org.apache.solr.handler.IndexFetcher.fetchLatestIndex(IndexFetcher.java:368)
   [junit4]   2> 	at org.apache.solr.handler.IndexFetcher.fetchLatestIndex(IndexFetcher.java:258)
   [junit4]   2> 	at org.apache.solr.handler.ReplicationHandler.doFetch(ReplicationHandler.java:385)
   [junit4]   2> 	at org.apache.solr.handler.ReplicationHandler$1.run(ReplicationHandler.java:273)
   [junit4]   2> 
   [junit4]   2> NOTE: test params are: codec=CheapBastard, sim=RandomSimilarity(queryNorm=true,coord=no): {}, locale=sk, timezone=Asia/Ashkhabad
   [junit4]   2> NOTE: Linux 3.19.0-47-generic amd64/Oracle Corporation 1.7.0_80 (64-bit)/cpus=12,threads=1,free=264515696,total=526909440
   [junit4]   2> NOTE: All tests run in this JVM: [MBeansHandlerTest, SimplePostToolTest, TestSolrQueryResponse, DistributedMLTComponentTest, SolrPluginUtilsTest, BasicFunctionalityTest, TestUpdate, CollectionTooManyReplicasTest, TestSchemaSimilarityResource, TestSolrCoreProperties, OpenExchangeRatesOrgProviderTest, TestInitQParser, TestRestoreCore, TriLevelCompositeIdRoutingTest, TestFieldResource, AnalyticsQueryTest, TestQuerySenderListener, FullHLLTest, TestCoreContainer, TestRuleBasedAuthorizationPlugin, AliasIntegrationTest, RollingRestartTest, TestLMJelinekMercerSimilarityFactory, TestDynamicLoading, TestReloadDeadlock, JavabinLoaderTest, RemoteQueryErrorTest, UpdateRequestProcessorFactoryTest, HdfsRecoveryZkTest, SimpleCollectionCreateDeleteTest, SoftAutoCommitTest, RankQueryTest, TermVectorComponentTest, TestStressVersions, BlockJoinFacetRandomTest, ConjunctionSolrSpellCheckerTest, ConfigSetsAPITest, SparseHLLTest, SolrIndexSplitterTest, DeleteShardTest, TestSortByMinMaxFunction, TestFiltering, TestConfigSetImmutable, PKIAuthenticationIntegrationTest, TestExpandComponent, TestCustomSort, TestQuerySenderNoQuery, CSVRequestHandlerTest, StressHdfsTest, MoreLikeThisHandlerTest, AnalysisErrorHandlingTest, TestCollectionAPI, CheckHdfsIndexTest, SolrIndexConfigTest, CloudExitableDirectoryReaderTest, TestHashPartitioner, NumericFieldsTest, DistributedSuggestComponentTest, TestRemoveLastDynamicCopyField, SolrInfoMBeanTest, TestAuthenticationFramework, TestConfigSetsAPIZkFailure, TestExceedMaxTermLength, ChaosMonkeyNothingIsSafeTest, SchemaVersionSpecificBehaviorTest, TestSimpleTrackingShardHandler, DistribDocExpirationUpdateProcessorTest, NotRequiredUniqueKeyTest, TestExactStatsCache, TestClassNameShortening, TestRequestStatusCollectionAPI, DistributedIntervalFacetingTest, ShardRoutingCustomTest, UniqFieldsUpdateProcessorFactoryTest, MinimalSchemaTest, TimeZoneUtilsTest, DistributedVersionInfoTest, DistributedFacetPivotLongTailTest, DistributedDebugComponentTest, ChaosMonkeySafeLeaderTest, TestPartialUpdateDeduplication, BlockCacheTest, TestStressUserVersions, SpellPossibilityIteratorTest, SpellingQueryConverterTest, TestBinaryResponseWriter, HighlighterTest, TestFastLRUCache, SolrCmdDistributorTest, FileUtilsTest, DOMUtilTest, TestScoreJoinQPScore, BasicDistributedZk2Test, OpenCloseCoreStressTest, LeaderElectionIntegrationTest, TestReplicationHandler]
   [junit4]   2> NOTE: reproduce with: ant test  -Dtestcase=TestReplicationHandler -Dtests.seed=EA343A2A6C38B783 -Dtests.multiplier=3 -Dtests.slow=true -Dtests.locale=sk -Dtests.timezone=Asia/Ashkhabad -Dtests.asserts=true -Dtests.file.encoding=UTF-8
   [junit4] ERROR   0.00s J1 | TestReplicationHandler (suite) <<<
   [junit4]    > Throwable #1: java.lang.AssertionError: ObjectTracker found 1 object(s) that were not released!!! [NRTCachingDirectory]
   [junit4]    > 	at __randomizedtesting.SeedInfo.seed([EA343A2A6C38B783]:0)
   [junit4]    > 	at org.apache.solr.SolrTestCaseJ4.afterClass(SolrTestCaseJ4.java:228)
   [junit4]    > 	at java.lang.Thread.run(Thread.java:745)
   [junit4] Completed [292/566 (1!)] on J1 in 74.45s, 13 tests, 1 failure <<< FAILURES!

[...truncated 872 lines...]
BUILD FAILED
/home/jenkins/workspace/Lucene-Solr-5.x-Linux/build.xml:750: The following error occurred while executing this line:
/home/jenkins/workspace/Lucene-Solr-5.x-Linux/build.xml:694: The following error occurred while executing this line:
/home/jenkins/workspace/Lucene-Solr-5.x-Linux/build.xml:59: The following error occurred while executing this line:
/home/jenkins/workspace/Lucene-Solr-5.x-Linux/solr/build.xml:233: The following error occurred while executing this line:
/home/jenkins/workspace/Lucene-Solr-5.x-Linux/solr/common-build.xml:534: The following error occurred while executing this line:
/home/jenkins/workspace/Lucene-Solr-5.x-Linux/lucene/common-build.xml:1477: The following error occurred while executing this line:
/home/jenkins/workspace/Lucene-Solr-5.x-Linux/lucene/common-build.xml:1033: There were test failures: 566 suites (7 ignored), 2279 tests, 1 suite-level error, 84 ignored (39 assumptions) [seed: EA343A2A6C38B783]

Total time: 52 minutes 59 seconds
Build step 'Invoke Ant' marked build as failure
Archiving artifacts
[WARNINGS] Skipping publisher since build result is FAILURE
Recording test results
Email was triggered for: Failure - Any
Sending email for trigger: Failure - Any



Mime
View raw message