lucene-dev mailing list archives

Site index · List index
Message view « Date » · « Thread »
Top « Date » · « Thread »
From Policeman Jenkins Server <jenk...@thetaphi.de>
Subject [JENKINS-EA] Lucene-Solr-5.5-Linux (64bit/jdk-9-ea+104) - Build # 8 - Failure!
Date Sun, 14 Feb 2016 22:51:25 GMT
Build: http://jenkins.thetaphi.de/job/Lucene-Solr-5.5-Linux/8/
Java: 64bit/jdk-9-ea+104 -XX:+UseCompressedOops -XX:+UseG1GC -XX:-CompactStrings -XX:-UseSuperWord

3 tests failed.
FAILED:  junit.framework.TestSuite.org.apache.solr.cloud.SaslZkACLProviderTest

Error Message:
5 threads leaked from SUITE scope at org.apache.solr.cloud.SaslZkACLProviderTest:     1) Thread[id=5130, name=groupCache.data, state=TIMED_WAITING, group=TGRP-SaslZkACLProviderTest]         at jdk.internal.misc.Unsafe.park(Native Method)         at java.util.concurrent.locks.LockSupport.parkNanos(LockSupport.java:230)         at java.util.concurrent.locks.AbstractQueuedSynchronizer$ConditionObject.awaitNanos(AbstractQueuedSynchronizer.java:2106)         at java.util.concurrent.ScheduledThreadPoolExecutor$DelayedWorkQueue.take(ScheduledThreadPoolExecutor.java:1131)         at java.util.concurrent.ScheduledThreadPoolExecutor$DelayedWorkQueue.take(ScheduledThreadPoolExecutor.java:848)         at java.util.concurrent.ThreadPoolExecutor.getTask(ThreadPoolExecutor.java:1083)         at java.util.concurrent.ThreadPoolExecutor.runWorker(ThreadPoolExecutor.java:1143)         at java.util.concurrent.ThreadPoolExecutor$Worker.run(ThreadPoolExecutor.java:632)         at java.lang.Thread.run(Thread.java:804)    2) Thread[id=5129, name=apacheds, state=WAITING, group=TGRP-SaslZkACLProviderTest]         at java.lang.Object.wait(Native Method)         at java.lang.Object.wait(Object.java:516)         at java.util.TimerThread.mainLoop(Timer.java:526)         at java.util.TimerThread.run(Timer.java:505)    3) Thread[id=5133, name=kdcReplayCache.data, state=TIMED_WAITING, group=TGRP-SaslZkACLProviderTest]         at jdk.internal.misc.Unsafe.park(Native Method)         at java.util.concurrent.locks.LockSupport.parkNanos(LockSupport.java:230)         at java.util.concurrent.locks.AbstractQueuedSynchronizer$ConditionObject.awaitNanos(AbstractQueuedSynchronizer.java:2106)         at java.util.concurrent.ScheduledThreadPoolExecutor$DelayedWorkQueue.take(ScheduledThreadPoolExecutor.java:1131)         at java.util.concurrent.ScheduledThreadPoolExecutor$DelayedWorkQueue.take(ScheduledThreadPoolExecutor.java:848)         at java.util.concurrent.ThreadPoolExecutor.getTask(ThreadPoolExecutor.java:1083)         at java.util.concurrent.ThreadPoolExecutor.runWorker(ThreadPoolExecutor.java:1143)         at java.util.concurrent.ThreadPoolExecutor$Worker.run(ThreadPoolExecutor.java:632)         at java.lang.Thread.run(Thread.java:804)    4) Thread[id=5131, name=changePwdReplayCache.data, state=TIMED_WAITING, group=TGRP-SaslZkACLProviderTest]         at jdk.internal.misc.Unsafe.park(Native Method)         at java.util.concurrent.locks.LockSupport.parkNanos(LockSupport.java:230)         at java.util.concurrent.locks.AbstractQueuedSynchronizer$ConditionObject.awaitNanos(AbstractQueuedSynchronizer.java:2106)         at java.util.concurrent.ScheduledThreadPoolExecutor$DelayedWorkQueue.take(ScheduledThreadPoolExecutor.java:1131)         at java.util.concurrent.ScheduledThreadPoolExecutor$DelayedWorkQueue.take(ScheduledThreadPoolExecutor.java:848)         at java.util.concurrent.ThreadPoolExecutor.getTask(ThreadPoolExecutor.java:1083)         at java.util.concurrent.ThreadPoolExecutor.runWorker(ThreadPoolExecutor.java:1143)         at java.util.concurrent.ThreadPoolExecutor$Worker.run(ThreadPoolExecutor.java:632)         at java.lang.Thread.run(Thread.java:804)    5) Thread[id=5132, name=ou=system.data, state=TIMED_WAITING, group=TGRP-SaslZkACLProviderTest]         at jdk.internal.misc.Unsafe.park(Native Method)         at java.util.concurrent.locks.LockSupport.parkNanos(LockSupport.java:230)         at java.util.concurrent.locks.AbstractQueuedSynchronizer$ConditionObject.awaitNanos(AbstractQueuedSynchronizer.java:2106)         at java.util.concurrent.ScheduledThreadPoolExecutor$DelayedWorkQueue.take(ScheduledThreadPoolExecutor.java:1131)         at java.util.concurrent.ScheduledThreadPoolExecutor$DelayedWorkQueue.take(ScheduledThreadPoolExecutor.java:848)         at java.util.concurrent.ThreadPoolExecutor.getTask(ThreadPoolExecutor.java:1083)         at java.util.concurrent.ThreadPoolExecutor.runWorker(ThreadPoolExecutor.java:1143)         at java.util.concurrent.ThreadPoolExecutor$Worker.run(ThreadPoolExecutor.java:632)         at java.lang.Thread.run(Thread.java:804)

Stack Trace:
com.carrotsearch.randomizedtesting.ThreadLeakError: 5 threads leaked from SUITE scope at org.apache.solr.cloud.SaslZkACLProviderTest: 
   1) Thread[id=5130, name=groupCache.data, state=TIMED_WAITING, group=TGRP-SaslZkACLProviderTest]
        at jdk.internal.misc.Unsafe.park(Native Method)
        at java.util.concurrent.locks.LockSupport.parkNanos(LockSupport.java:230)
        at java.util.concurrent.locks.AbstractQueuedSynchronizer$ConditionObject.awaitNanos(AbstractQueuedSynchronizer.java:2106)
        at java.util.concurrent.ScheduledThreadPoolExecutor$DelayedWorkQueue.take(ScheduledThreadPoolExecutor.java:1131)
        at java.util.concurrent.ScheduledThreadPoolExecutor$DelayedWorkQueue.take(ScheduledThreadPoolExecutor.java:848)
        at java.util.concurrent.ThreadPoolExecutor.getTask(ThreadPoolExecutor.java:1083)
        at java.util.concurrent.ThreadPoolExecutor.runWorker(ThreadPoolExecutor.java:1143)
        at java.util.concurrent.ThreadPoolExecutor$Worker.run(ThreadPoolExecutor.java:632)
        at java.lang.Thread.run(Thread.java:804)
   2) Thread[id=5129, name=apacheds, state=WAITING, group=TGRP-SaslZkACLProviderTest]
        at java.lang.Object.wait(Native Method)
        at java.lang.Object.wait(Object.java:516)
        at java.util.TimerThread.mainLoop(Timer.java:526)
        at java.util.TimerThread.run(Timer.java:505)
   3) Thread[id=5133, name=kdcReplayCache.data, state=TIMED_WAITING, group=TGRP-SaslZkACLProviderTest]
        at jdk.internal.misc.Unsafe.park(Native Method)
        at java.util.concurrent.locks.LockSupport.parkNanos(LockSupport.java:230)
        at java.util.concurrent.locks.AbstractQueuedSynchronizer$ConditionObject.awaitNanos(AbstractQueuedSynchronizer.java:2106)
        at java.util.concurrent.ScheduledThreadPoolExecutor$DelayedWorkQueue.take(ScheduledThreadPoolExecutor.java:1131)
        at java.util.concurrent.ScheduledThreadPoolExecutor$DelayedWorkQueue.take(ScheduledThreadPoolExecutor.java:848)
        at java.util.concurrent.ThreadPoolExecutor.getTask(ThreadPoolExecutor.java:1083)
        at java.util.concurrent.ThreadPoolExecutor.runWorker(ThreadPoolExecutor.java:1143)
        at java.util.concurrent.ThreadPoolExecutor$Worker.run(ThreadPoolExecutor.java:632)
        at java.lang.Thread.run(Thread.java:804)
   4) Thread[id=5131, name=changePwdReplayCache.data, state=TIMED_WAITING, group=TGRP-SaslZkACLProviderTest]
        at jdk.internal.misc.Unsafe.park(Native Method)
        at java.util.concurrent.locks.LockSupport.parkNanos(LockSupport.java:230)
        at java.util.concurrent.locks.AbstractQueuedSynchronizer$ConditionObject.awaitNanos(AbstractQueuedSynchronizer.java:2106)
        at java.util.concurrent.ScheduledThreadPoolExecutor$DelayedWorkQueue.take(ScheduledThreadPoolExecutor.java:1131)
        at java.util.concurrent.ScheduledThreadPoolExecutor$DelayedWorkQueue.take(ScheduledThreadPoolExecutor.java:848)
        at java.util.concurrent.ThreadPoolExecutor.getTask(ThreadPoolExecutor.java:1083)
        at java.util.concurrent.ThreadPoolExecutor.runWorker(ThreadPoolExecutor.java:1143)
        at java.util.concurrent.ThreadPoolExecutor$Worker.run(ThreadPoolExecutor.java:632)
        at java.lang.Thread.run(Thread.java:804)
   5) Thread[id=5132, name=ou=system.data, state=TIMED_WAITING, group=TGRP-SaslZkACLProviderTest]
        at jdk.internal.misc.Unsafe.park(Native Method)
        at java.util.concurrent.locks.LockSupport.parkNanos(LockSupport.java:230)
        at java.util.concurrent.locks.AbstractQueuedSynchronizer$ConditionObject.awaitNanos(AbstractQueuedSynchronizer.java:2106)
        at java.util.concurrent.ScheduledThreadPoolExecutor$DelayedWorkQueue.take(ScheduledThreadPoolExecutor.java:1131)
        at java.util.concurrent.ScheduledThreadPoolExecutor$DelayedWorkQueue.take(ScheduledThreadPoolExecutor.java:848)
        at java.util.concurrent.ThreadPoolExecutor.getTask(ThreadPoolExecutor.java:1083)
        at java.util.concurrent.ThreadPoolExecutor.runWorker(ThreadPoolExecutor.java:1143)
        at java.util.concurrent.ThreadPoolExecutor$Worker.run(ThreadPoolExecutor.java:632)
        at java.lang.Thread.run(Thread.java:804)
	at __randomizedtesting.SeedInfo.seed([D714505623ECAB10]:0)


FAILED:  junit.framework.TestSuite.org.apache.solr.cloud.SaslZkACLProviderTest

Error Message:
There are still zombie threads that couldn't be terminated:    1) Thread[id=5130, name=groupCache.data, state=TIMED_WAITING, group=TGRP-SaslZkACLProviderTest]         at jdk.internal.misc.Unsafe.park(Native Method)         at java.util.concurrent.locks.LockSupport.parkNanos(LockSupport.java:230)         at java.util.concurrent.locks.AbstractQueuedSynchronizer$ConditionObject.awaitNanos(AbstractQueuedSynchronizer.java:2106)         at java.util.concurrent.ScheduledThreadPoolExecutor$DelayedWorkQueue.take(ScheduledThreadPoolExecutor.java:1131)         at java.util.concurrent.ScheduledThreadPoolExecutor$DelayedWorkQueue.take(ScheduledThreadPoolExecutor.java:848)         at java.util.concurrent.ThreadPoolExecutor.getTask(ThreadPoolExecutor.java:1083)         at java.util.concurrent.ThreadPoolExecutor.runWorker(ThreadPoolExecutor.java:1143)         at java.util.concurrent.ThreadPoolExecutor$Worker.run(ThreadPoolExecutor.java:632)         at java.lang.Thread.run(Thread.java:804)    2) Thread[id=5129, name=apacheds, state=WAITING, group=TGRP-SaslZkACLProviderTest]         at java.lang.Object.wait(Native Method)         at java.lang.Object.wait(Object.java:516)         at java.util.TimerThread.mainLoop(Timer.java:526)         at java.util.TimerThread.run(Timer.java:505)    3) Thread[id=5133, name=kdcReplayCache.data, state=TIMED_WAITING, group=TGRP-SaslZkACLProviderTest]         at jdk.internal.misc.Unsafe.park(Native Method)         at java.util.concurrent.locks.LockSupport.parkNanos(LockSupport.java:230)         at java.util.concurrent.locks.AbstractQueuedSynchronizer$ConditionObject.awaitNanos(AbstractQueuedSynchronizer.java:2106)         at java.util.concurrent.ScheduledThreadPoolExecutor$DelayedWorkQueue.take(ScheduledThreadPoolExecutor.java:1131)         at java.util.concurrent.ScheduledThreadPoolExecutor$DelayedWorkQueue.take(ScheduledThreadPoolExecutor.java:848)         at java.util.concurrent.ThreadPoolExecutor.getTask(ThreadPoolExecutor.java:1083)         at java.util.concurrent.ThreadPoolExecutor.runWorker(ThreadPoolExecutor.java:1143)         at java.util.concurrent.ThreadPoolExecutor$Worker.run(ThreadPoolExecutor.java:632)         at java.lang.Thread.run(Thread.java:804)    4) Thread[id=5131, name=changePwdReplayCache.data, state=TIMED_WAITING, group=TGRP-SaslZkACLProviderTest]         at jdk.internal.misc.Unsafe.park(Native Method)         at java.util.concurrent.locks.LockSupport.parkNanos(LockSupport.java:230)         at java.util.concurrent.locks.AbstractQueuedSynchronizer$ConditionObject.awaitNanos(AbstractQueuedSynchronizer.java:2106)         at java.util.concurrent.ScheduledThreadPoolExecutor$DelayedWorkQueue.take(ScheduledThreadPoolExecutor.java:1131)         at java.util.concurrent.ScheduledThreadPoolExecutor$DelayedWorkQueue.take(ScheduledThreadPoolExecutor.java:848)         at java.util.concurrent.ThreadPoolExecutor.getTask(ThreadPoolExecutor.java:1083)         at java.util.concurrent.ThreadPoolExecutor.runWorker(ThreadPoolExecutor.java:1143)         at java.util.concurrent.ThreadPoolExecutor$Worker.run(ThreadPoolExecutor.java:632)         at java.lang.Thread.run(Thread.java:804)    5) Thread[id=5132, name=ou=system.data, state=TIMED_WAITING, group=TGRP-SaslZkACLProviderTest]         at jdk.internal.misc.Unsafe.park(Native Method)         at java.util.concurrent.locks.LockSupport.parkNanos(LockSupport.java:230)         at java.util.concurrent.locks.AbstractQueuedSynchronizer$ConditionObject.awaitNanos(AbstractQueuedSynchronizer.java:2106)         at java.util.concurrent.ScheduledThreadPoolExecutor$DelayedWorkQueue.take(ScheduledThreadPoolExecutor.java:1131)         at java.util.concurrent.ScheduledThreadPoolExecutor$DelayedWorkQueue.take(ScheduledThreadPoolExecutor.java:848)         at java.util.concurrent.ThreadPoolExecutor.getTask(ThreadPoolExecutor.java:1083)         at java.util.concurrent.ThreadPoolExecutor.runWorker(ThreadPoolExecutor.java:1143)         at java.util.concurrent.ThreadPoolExecutor$Worker.run(ThreadPoolExecutor.java:632)         at java.lang.Thread.run(Thread.java:804)

Stack Trace:
com.carrotsearch.randomizedtesting.ThreadLeakError: There are still zombie threads that couldn't be terminated:
   1) Thread[id=5130, name=groupCache.data, state=TIMED_WAITING, group=TGRP-SaslZkACLProviderTest]
        at jdk.internal.misc.Unsafe.park(Native Method)
        at java.util.concurrent.locks.LockSupport.parkNanos(LockSupport.java:230)
        at java.util.concurrent.locks.AbstractQueuedSynchronizer$ConditionObject.awaitNanos(AbstractQueuedSynchronizer.java:2106)
        at java.util.concurrent.ScheduledThreadPoolExecutor$DelayedWorkQueue.take(ScheduledThreadPoolExecutor.java:1131)
        at java.util.concurrent.ScheduledThreadPoolExecutor$DelayedWorkQueue.take(ScheduledThreadPoolExecutor.java:848)
        at java.util.concurrent.ThreadPoolExecutor.getTask(ThreadPoolExecutor.java:1083)
        at java.util.concurrent.ThreadPoolExecutor.runWorker(ThreadPoolExecutor.java:1143)
        at java.util.concurrent.ThreadPoolExecutor$Worker.run(ThreadPoolExecutor.java:632)
        at java.lang.Thread.run(Thread.java:804)
   2) Thread[id=5129, name=apacheds, state=WAITING, group=TGRP-SaslZkACLProviderTest]
        at java.lang.Object.wait(Native Method)
        at java.lang.Object.wait(Object.java:516)
        at java.util.TimerThread.mainLoop(Timer.java:526)
        at java.util.TimerThread.run(Timer.java:505)
   3) Thread[id=5133, name=kdcReplayCache.data, state=TIMED_WAITING, group=TGRP-SaslZkACLProviderTest]
        at jdk.internal.misc.Unsafe.park(Native Method)
        at java.util.concurrent.locks.LockSupport.parkNanos(LockSupport.java:230)
        at java.util.concurrent.locks.AbstractQueuedSynchronizer$ConditionObject.awaitNanos(AbstractQueuedSynchronizer.java:2106)
        at java.util.concurrent.ScheduledThreadPoolExecutor$DelayedWorkQueue.take(ScheduledThreadPoolExecutor.java:1131)
        at java.util.concurrent.ScheduledThreadPoolExecutor$DelayedWorkQueue.take(ScheduledThreadPoolExecutor.java:848)
        at java.util.concurrent.ThreadPoolExecutor.getTask(ThreadPoolExecutor.java:1083)
        at java.util.concurrent.ThreadPoolExecutor.runWorker(ThreadPoolExecutor.java:1143)
        at java.util.concurrent.ThreadPoolExecutor$Worker.run(ThreadPoolExecutor.java:632)
        at java.lang.Thread.run(Thread.java:804)
   4) Thread[id=5131, name=changePwdReplayCache.data, state=TIMED_WAITING, group=TGRP-SaslZkACLProviderTest]
        at jdk.internal.misc.Unsafe.park(Native Method)
        at java.util.concurrent.locks.LockSupport.parkNanos(LockSupport.java:230)
        at java.util.concurrent.locks.AbstractQueuedSynchronizer$ConditionObject.awaitNanos(AbstractQueuedSynchronizer.java:2106)
        at java.util.concurrent.ScheduledThreadPoolExecutor$DelayedWorkQueue.take(ScheduledThreadPoolExecutor.java:1131)
        at java.util.concurrent.ScheduledThreadPoolExecutor$DelayedWorkQueue.take(ScheduledThreadPoolExecutor.java:848)
        at java.util.concurrent.ThreadPoolExecutor.getTask(ThreadPoolExecutor.java:1083)
        at java.util.concurrent.ThreadPoolExecutor.runWorker(ThreadPoolExecutor.java:1143)
        at java.util.concurrent.ThreadPoolExecutor$Worker.run(ThreadPoolExecutor.java:632)
        at java.lang.Thread.run(Thread.java:804)
   5) Thread[id=5132, name=ou=system.data, state=TIMED_WAITING, group=TGRP-SaslZkACLProviderTest]
        at jdk.internal.misc.Unsafe.park(Native Method)
        at java.util.concurrent.locks.LockSupport.parkNanos(LockSupport.java:230)
        at java.util.concurrent.locks.AbstractQueuedSynchronizer$ConditionObject.awaitNanos(AbstractQueuedSynchronizer.java:2106)
        at java.util.concurrent.ScheduledThreadPoolExecutor$DelayedWorkQueue.take(ScheduledThreadPoolExecutor.java:1131)
        at java.util.concurrent.ScheduledThreadPoolExecutor$DelayedWorkQueue.take(ScheduledThreadPoolExecutor.java:848)
        at java.util.concurrent.ThreadPoolExecutor.getTask(ThreadPoolExecutor.java:1083)
        at java.util.concurrent.ThreadPoolExecutor.runWorker(ThreadPoolExecutor.java:1143)
        at java.util.concurrent.ThreadPoolExecutor$Worker.run(ThreadPoolExecutor.java:632)
        at java.lang.Thread.run(Thread.java:804)
	at __randomizedtesting.SeedInfo.seed([D714505623ECAB10]:0)


FAILED:  org.apache.solr.cloud.SaslZkACLProviderTest.testSaslZkACLProvider

Error Message:
org.apache.directory.api.ldap.model.exception.LdapOtherException: org.apache.directory.api.ldap.model.exception.LdapOtherException: ERR_04447_CANNOT_NORMALIZE_VALUE Cannot normalize the wrapped value ERR_04473_NOT_VALID_VALUE Not a valid value '20090818022733Z' for the AttributeType 'ATTRIBUTE_TYPE ( 1.3.6.1.4.1.18060.0.4.1.2.35  NAME 'schemaModifyTimestamp'  DESC time which schema was modified  SUP modifyTimestamp  EQUALITY generalizedTimeMatch  ORDERING generalizedTimeOrderingMatch  SYNTAX 1.3.6.1.4.1.1466.115.121.1.24  USAGE directoryOperation  ) '

Stack Trace:
java.lang.RuntimeException: org.apache.directory.api.ldap.model.exception.LdapOtherException: org.apache.directory.api.ldap.model.exception.LdapOtherException: ERR_04447_CANNOT_NORMALIZE_VALUE Cannot normalize the wrapped value ERR_04473_NOT_VALID_VALUE Not a valid value '20090818022733Z' for the AttributeType 'ATTRIBUTE_TYPE ( 1.3.6.1.4.1.18060.0.4.1.2.35
 NAME 'schemaModifyTimestamp'
 DESC time which schema was modified
 SUP modifyTimestamp
 EQUALITY generalizedTimeMatch
 ORDERING generalizedTimeOrderingMatch
 SYNTAX 1.3.6.1.4.1.1466.115.121.1.24
 USAGE directoryOperation
 )
'
	at org.apache.solr.cloud.SaslZkACLProviderTest$SaslZkTestServer.run(SaslZkACLProviderTest.java:210)
	at org.apache.solr.cloud.SaslZkACLProviderTest.setUp(SaslZkACLProviderTest.java:80)
	at sun.reflect.GeneratedMethodAccessor8.invoke(Unknown Source)
	at sun.reflect.DelegatingMethodAccessorImpl.invoke(DelegatingMethodAccessorImpl.java:43)
	at java.lang.reflect.Method.invoke(Method.java:520)
	at com.carrotsearch.randomizedtesting.RandomizedRunner.invoke(RandomizedRunner.java:1764)
	at com.carrotsearch.randomizedtesting.RandomizedRunner$9.evaluate(RandomizedRunner.java:905)
	at com.carrotsearch.randomizedtesting.RandomizedRunner$10.evaluate(RandomizedRunner.java:921)
	at com.carrotsearch.randomizedtesting.rules.SystemPropertiesRestoreRule$1.evaluate(SystemPropertiesRestoreRule.java:57)
	at org.apache.lucene.util.TestRuleSetupTeardownChained$1.evaluate(TestRuleSetupTeardownChained.java:49)
	at org.apache.lucene.util.AbstractBeforeAfterRule$1.evaluate(AbstractBeforeAfterRule.java:45)
	at org.apache.lucene.util.TestRuleThreadAndTestName$1.evaluate(TestRuleThreadAndTestName.java:48)
	at org.apache.lucene.util.TestRuleIgnoreAfterMaxFailures$1.evaluate(TestRuleIgnoreAfterMaxFailures.java:64)
	at org.apache.lucene.util.TestRuleMarkFailure$1.evaluate(TestRuleMarkFailure.java:47)
	at com.carrotsearch.randomizedtesting.rules.StatementAdapter.evaluate(StatementAdapter.java:36)
	at com.carrotsearch.randomizedtesting.ThreadLeakControl$StatementRunner.run(ThreadLeakControl.java:367)
	at com.carrotsearch.randomizedtesting.ThreadLeakControl.forkTimeoutingTask(ThreadLeakControl.java:809)
	at com.carrotsearch.randomizedtesting.ThreadLeakControl$3.evaluate(ThreadLeakControl.java:460)
	at com.carrotsearch.randomizedtesting.RandomizedRunner.runSingleTest(RandomizedRunner.java:880)
	at com.carrotsearch.randomizedtesting.RandomizedRunner$5.evaluate(RandomizedRunner.java:781)
	at com.carrotsearch.randomizedtesting.RandomizedRunner$6.evaluate(RandomizedRunner.java:816)
	at com.carrotsearch.randomizedtesting.RandomizedRunner$7.evaluate(RandomizedRunner.java:827)
	at com.carrotsearch.randomizedtesting.rules.StatementAdapter.evaluate(StatementAdapter.java:36)
	at com.carrotsearch.randomizedtesting.rules.SystemPropertiesRestoreRule$1.evaluate(SystemPropertiesRestoreRule.java:57)
	at org.apache.lucene.util.AbstractBeforeAfterRule$1.evaluate(AbstractBeforeAfterRule.java:45)
	at com.carrotsearch.randomizedtesting.rules.StatementAdapter.evaluate(StatementAdapter.java:36)
	at org.apache.lucene.util.TestRuleStoreClassName$1.evaluate(TestRuleStoreClassName.java:41)
	at com.carrotsearch.randomizedtesting.rules.NoShadowingOrOverridesOnMethodsRule$1.evaluate(NoShadowingOrOverridesOnMethodsRule.java:40)
	at com.carrotsearch.randomizedtesting.rules.NoShadowingOrOverridesOnMethodsRule$1.evaluate(NoShadowingOrOverridesOnMethodsRule.java:40)
	at com.carrotsearch.randomizedtesting.rules.StatementAdapter.evaluate(StatementAdapter.java:36)
	at com.carrotsearch.randomizedtesting.rules.StatementAdapter.evaluate(StatementAdapter.java:36)
	at com.carrotsearch.randomizedtesting.rules.StatementAdapter.evaluate(StatementAdapter.java:36)
	at org.apache.lucene.util.TestRuleAssertionsRequired$1.evaluate(TestRuleAssertionsRequired.java:53)
	at org.apache.lucene.util.TestRuleMarkFailure$1.evaluate(TestRuleMarkFailure.java:47)
	at org.apache.lucene.util.TestRuleIgnoreAfterMaxFailures$1.evaluate(TestRuleIgnoreAfterMaxFailures.java:64)
	at org.apache.lucene.util.TestRuleIgnoreTestSuites$1.evaluate(TestRuleIgnoreTestSuites.java:54)
	at com.carrotsearch.randomizedtesting.rules.StatementAdapter.evaluate(StatementAdapter.java:36)
	at com.carrotsearch.randomizedtesting.ThreadLeakControl$StatementRunner.run(ThreadLeakControl.java:367)
	at java.lang.Thread.run(Thread.java:804)
Caused by: org.apache.directory.api.ldap.model.exception.LdapOtherException: org.apache.directory.api.ldap.model.exception.LdapOtherException: ERR_04447_CANNOT_NORMALIZE_VALUE Cannot normalize the wrapped value ERR_04473_NOT_VALID_VALUE Not a valid value '20090818022733Z' for the AttributeType 'ATTRIBUTE_TYPE ( 1.3.6.1.4.1.18060.0.4.1.2.35
 NAME 'schemaModifyTimestamp'
 DESC time which schema was modified
 SUP modifyTimestamp
 EQUALITY generalizedTimeMatch
 ORDERING generalizedTimeOrderingMatch
 SYNTAX 1.3.6.1.4.1.1466.115.121.1.24
 USAGE directoryOperation
 )
'
	at org.apache.directory.server.core.api.partition.AbstractPartition.initialize(AbstractPartition.java:84)
	at org.apache.directory.server.core.DefaultDirectoryService.initialize(DefaultDirectoryService.java:1808)
	at org.apache.directory.server.core.DefaultDirectoryService.startup(DefaultDirectoryService.java:1248)
	at org.apache.hadoop.minikdc.MiniKdc.initDirectoryService(MiniKdc.java:383)
	at org.apache.hadoop.minikdc.MiniKdc.start(MiniKdc.java:319)
	at org.apache.solr.cloud.SaslZkACLProviderTest$SaslZkTestServer.run(SaslZkACLProviderTest.java:203)
	... 38 more
Caused by: java.lang.RuntimeException: org.apache.directory.api.ldap.model.exception.LdapOtherException: ERR_04447_CANNOT_NORMALIZE_VALUE Cannot normalize the wrapped value ERR_04473_NOT_VALID_VALUE Not a valid value '20090818022733Z' for the AttributeType 'ATTRIBUTE_TYPE ( 1.3.6.1.4.1.18060.0.4.1.2.35
 NAME 'schemaModifyTimestamp'
 DESC time which schema was modified
 SUP modifyTimestamp
 EQUALITY generalizedTimeMatch
 ORDERING generalizedTimeOrderingMatch
 SYNTAX 1.3.6.1.4.1.1466.115.121.1.24
 USAGE directoryOperation
 )
'
	at org.apache.directory.server.core.api.schema.SchemaPartition.doInit(SchemaPartition.java:226)
	at org.apache.directory.server.core.api.partition.AbstractPartition.initialize(AbstractPartition.java:79)
	... 43 more
Caused by: org.apache.directory.api.ldap.model.exception.LdapOtherException: ERR_04447_CANNOT_NORMALIZE_VALUE Cannot normalize the wrapped value ERR_04473_NOT_VALID_VALUE Not a valid value '20090818022733Z' for the AttributeType 'ATTRIBUTE_TYPE ( 1.3.6.1.4.1.18060.0.4.1.2.35
 NAME 'schemaModifyTimestamp'
 DESC time which schema was modified
 SUP modifyTimestamp
 EQUALITY generalizedTimeMatch
 ORDERING generalizedTimeOrderingMatch
 SYNTAX 1.3.6.1.4.1.1466.115.121.1.24
 USAGE directoryOperation
 )
'
	at org.apache.directory.server.core.api.partition.AbstractPartition.initialize(AbstractPartition.java:84)
	at org.apache.directory.server.core.api.schema.SchemaPartition.doInit(SchemaPartition.java:219)
	... 44 more
Caused by: org.apache.directory.api.ldap.model.exception.LdapInvalidAttributeValueException: ERR_04447_CANNOT_NORMALIZE_VALUE Cannot normalize the wrapped value ERR_04473_NOT_VALID_VALUE Not a valid value '20090818022733Z' for the AttributeType 'ATTRIBUTE_TYPE ( 1.3.6.1.4.1.18060.0.4.1.2.35
 NAME 'schemaModifyTimestamp'
 DESC time which schema was modified
 SUP modifyTimestamp
 EQUALITY generalizedTimeMatch
 ORDERING generalizedTimeOrderingMatch
 SYNTAX 1.3.6.1.4.1.1466.115.121.1.24
 USAGE directoryOperation
 )
'
	at org.apache.directory.api.ldap.model.entry.AbstractValue.apply(AbstractValue.java:211)
	at org.apache.directory.api.ldap.model.entry.StringValue.<init>(StringValue.java:107)
	at org.apache.directory.api.ldap.model.entry.DefaultAttribute.<init>(DefaultAttribute.java:468)
	at org.apache.directory.api.ldap.model.entry.DefaultEntry.<init>(DefaultEntry.java:315)
	at org.apache.directory.server.core.partition.ldif.LdifPartition.loadEntries(LdifPartition.java:517)
	at org.apache.directory.server.core.partition.ldif.LdifPartition.loadEntries(LdifPartition.java:549)
	at org.apache.directory.server.core.partition.ldif.LdifPartition.doInit(LdifPartition.java:164)
	at org.apache.directory.server.core.api.partition.AbstractPartition.initialize(AbstractPartition.java:79)
	... 45 more
Caused by: org.apache.directory.api.ldap.model.exception.LdapInvalidAttributeValueException: ERR_04473_NOT_VALID_VALUE Not a valid value '20090818022733Z' for the AttributeType 'ATTRIBUTE_TYPE ( 1.3.6.1.4.1.18060.0.4.1.2.35
 NAME 'schemaModifyTimestamp'
 DESC time which schema was modified
 SUP modifyTimestamp
 EQUALITY generalizedTimeMatch
 ORDERING generalizedTimeOrderingMatch
 SYNTAX 1.3.6.1.4.1.1466.115.121.1.24
 USAGE directoryOperation
 )
'
	at org.apache.directory.api.ldap.model.entry.AbstractValue.apply(AbstractValue.java:204)
	... 52 more




Build Log:
[...truncated 11364 lines...]
   [junit4] Suite: org.apache.solr.cloud.SaslZkACLProviderTest
   [junit4]   2> Creating dataDir: /home/jenkins/workspace/Lucene-Solr-5.5-Linux/solr/build/solr-core/test/J0/temp/solr.cloud.SaslZkACLProviderTest_D714505623ECAB10-001/init-core-data-001
   [junit4]   2> 666847 INFO  (SUITE-SaslZkACLProviderTest-seed#[D714505623ECAB10]-worker) [    ] o.a.s.SolrTestCaseJ4 Randomized ssl (false) and clientAuth (false)
   [junit4]   2> 666852 INFO  (TEST-SaslZkACLProviderTest.testSaslZkACLProvider-seed#[D714505623ECAB10]) [    ] o.a.s.SolrTestCaseJ4 ###Starting testSaslZkACLProvider
   [junit4]   2> 666853 INFO  (TEST-SaslZkACLProviderTest.testSaslZkACLProvider-seed#[D714505623ECAB10]) [    ] o.a.s.c.SaslZkACLProviderTest ####SETUP_START testSaslZkACLProvider
   [junit4]   2> 666853 INFO  (TEST-SaslZkACLProviderTest.testSaslZkACLProvider-seed#[D714505623ECAB10]) [    ] o.a.s.c.SaslZkACLProviderTest ZooKeeper dataDir:/home/jenkins/workspace/Lucene-Solr-5.5-Linux/solr/build/solr-core/test/J0/temp/solr.cloud.SaslZkACLProviderTest_D714505623ECAB10-001/tempDir-002/zookeeper/server1/data
   [junit4]   2> 668928 WARN  (TEST-SaslZkACLProviderTest.testSaslZkACLProvider-seed#[D714505623ECAB10]) [    ] o.a.d.a.l.m.e.DefaultEntry The attribute 'schemamodifytimestamp' cannot be stored
   [junit4]   2> 668946 ERROR (TEST-SaslZkACLProviderTest.testSaslZkACLProvider-seed#[D714505623ECAB10]) [    ] o.a.d.s.c.a.s.SchemaPartition ERR_90 Failed to initialize wrapped partition.
   [junit4]   2> org.apache.directory.api.ldap.model.exception.LdapOtherException: ERR_04447_CANNOT_NORMALIZE_VALUE Cannot normalize the wrapped value ERR_04473_NOT_VALID_VALUE Not a valid value '20090818022733Z' for the AttributeType 'ATTRIBUTE_TYPE ( 1.3.6.1.4.1.18060.0.4.1.2.35
   [junit4]   2>  NAME 'schemaModifyTimestamp'
   [junit4]   2>  DESC time which schema was modified
   [junit4]   2>  SUP modifyTimestamp
   [junit4]   2>  EQUALITY generalizedTimeMatch
   [junit4]   2>  ORDERING generalizedTimeOrderingMatch
   [junit4]   2>  SYNTAX 1.3.6.1.4.1.1466.115.121.1.24
   [junit4]   2>  USAGE directoryOperation
   [junit4]   2>  )
   [junit4]   2> '
   [junit4]   2> 	at org.apache.directory.server.core.api.partition.AbstractPartition.initialize(AbstractPartition.java:84)
   [junit4]   2> 	at org.apache.directory.server.core.api.schema.SchemaPartition.doInit(SchemaPartition.java:219)
   [junit4]   2> 	at org.apache.directory.server.core.api.partition.AbstractPartition.initialize(AbstractPartition.java:79)
   [junit4]   2> 	at org.apache.directory.server.core.DefaultDirectoryService.initialize(DefaultDirectoryService.java:1808)
   [junit4]   2> 	at org.apache.directory.server.core.DefaultDirectoryService.startup(DefaultDirectoryService.java:1248)
   [junit4]   2> 	at org.apache.hadoop.minikdc.MiniKdc.initDirectoryService(MiniKdc.java:383)
   [junit4]   2> 	at org.apache.hadoop.minikdc.MiniKdc.start(MiniKdc.java:319)
   [junit4]   2> 	at org.apache.solr.cloud.SaslZkACLProviderTest$SaslZkTestServer.run(SaslZkACLProviderTest.java:203)
   [junit4]   2> 	at org.apache.solr.cloud.SaslZkACLProviderTest.setUp(SaslZkACLProviderTest.java:80)
   [junit4]   2> 	at sun.reflect.GeneratedMethodAccessor8.invoke(Unknown Source)
   [junit4]   2> 	at sun.reflect.DelegatingMethodAccessorImpl.invoke(DelegatingMethodAccessorImpl.java:43)
   [junit4]   2> 	at java.lang.reflect.Method.invoke(Method.java:520)
   [junit4]   2> 	at com.carrotsearch.randomizedtesting.RandomizedRunner.invoke(RandomizedRunner.java:1764)
   [junit4]   2> 	at com.carrotsearch.randomizedtesting.RandomizedRunner$9.evaluate(RandomizedRunner.java:905)
   [junit4]   2> 	at com.carrotsearch.randomizedtesting.RandomizedRunner$10.evaluate(RandomizedRunner.java:921)
   [junit4]   2> 	at com.carrotsearch.randomizedtesting.rules.SystemPropertiesRestoreRule$1.evaluate(SystemPropertiesRestoreRule.java:57)
   [junit4]   2> 	at org.apache.lucene.util.TestRuleSetupTeardownChained$1.evaluate(TestRuleSetupTeardownChained.java:49)
   [junit4]   2> 	at org.apache.lucene.util.AbstractBeforeAfterRule$1.evaluate(AbstractBeforeAfterRule.java:45)
   [junit4]   2> 	at org.apache.lucene.util.TestRuleThreadAndTestName$1.evaluate(TestRuleThreadAndTestName.java:48)
   [junit4]   2> 	at org.apache.lucene.util.TestRuleIgnoreAfterMaxFailures$1.evaluate(TestRuleIgnoreAfterMaxFailures.java:64)
   [junit4]   2> 	at org.apache.lucene.util.TestRuleMarkFailure$1.evaluate(TestRuleMarkFailure.java:47)
   [junit4]   2> 	at com.carrotsearch.randomizedtesting.rules.StatementAdapter.evaluate(StatementAdapter.java:36)
   [junit4]   2> 	at com.carrotsearch.randomizedtesting.ThreadLeakControl$StatementRunner.run(ThreadLeakControl.java:367)
   [junit4]   2> 	at com.carrotsearch.randomizedtesting.ThreadLeakControl.forkTimeoutingTask(ThreadLeakControl.java:809)
   [junit4]   2> 	at com.carrotsearch.randomizedtesting.ThreadLeakControl$3.evaluate(ThreadLeakControl.java:460)
   [junit4]   2> 	at com.carrotsearch.randomizedtesting.RandomizedRunner.runSingleTest(RandomizedRunner.java:880)
   [junit4]   2> 	at com.carrotsearch.randomizedtesting.RandomizedRunner$5.evaluate(RandomizedRunner.java:781)
   [junit4]   2> 	at com.carrotsearch.randomizedtesting.RandomizedRunner$6.evaluate(RandomizedRunner.java:816)
   [junit4]   2> 	at com.carrotsearch.randomizedtesting.RandomizedRunner$7.evaluate(RandomizedRunner.java:827)
   [junit4]   2> 	at com.carrotsearch.randomizedtesting.rules.StatementAdapter.evaluate(StatementAdapter.java:36)
   [junit4]   2> 	at com.carrotsearch.randomizedtesting.rules.SystemPropertiesRestoreRule$1.evaluate(SystemPropertiesRestoreRule.java:57)
   [junit4]   2> 	at org.apache.lucene.util.AbstractBeforeAfterRule$1.evaluate(AbstractBeforeAfterRule.java:45)
   [junit4]   2> 	at com.carrotsearch.randomizedtesting.rules.StatementAdapter.evaluate(StatementAdapter.java:36)
   [junit4]   2> 	at org.apache.lucene.util.TestRuleStoreClassName$1.evaluate(TestRuleStoreClassName.java:41)
   [junit4]   2> 	at com.carrotsearch.randomizedtesting.rules.NoShadowingOrOverridesOnMethodsRule$1.evaluate(NoShadowingOrOverridesOnMethodsRule.java:40)
   [junit4]   2> 	at com.carrotsearch.randomizedtesting.rules.NoShadowingOrOverridesOnMethodsRule$1.evaluate(NoShadowingOrOverridesOnMethodsRule.java:40)
   [junit4]   2> 	at com.carrotsearch.randomizedtesting.rules.StatementAdapter.evaluate(StatementAdapter.java:36)
   [junit4]   2> 	at com.carrotsearch.randomizedtesting.rules.StatementAdapter.evaluate(StatementAdapter.java:36)
   [junit4]   2> 	at com.carrotsearch.randomizedtesting.rules.StatementAdapter.evaluate(StatementAdapter.java:36)
   [junit4]   2> 	at org.apache.lucene.util.TestRuleAssertionsRequired$1.evaluate(TestRuleAssertionsRequired.java:53)
   [junit4]   2> 	at org.apache.lucene.util.TestRuleMarkFailure$1.evaluate(TestRuleMarkFailure.java:47)
   [junit4]   2> 	at org.apache.lucene.util.TestRuleIgnoreAfterMaxFailures$1.evaluate(TestRuleIgnoreAfterMaxFailures.java:64)
   [junit4]   2> 	at org.apache.lucene.util.TestRuleIgnoreTestSuites$1.evaluate(TestRuleIgnoreTestSuites.java:54)
   [junit4]   2> 	at com.carrotsearch.randomizedtesting.rules.StatementAdapter.evaluate(StatementAdapter.java:36)
   [junit4]   2> 	at com.carrotsearch.randomizedtesting.ThreadLeakControl$StatementRunner.run(ThreadLeakControl.java:367)
   [junit4]   2> 	at java.lang.Thread.run(Thread.java:804)
   [junit4]   2> Caused by: org.apache.directory.api.ldap.model.exception.LdapInvalidAttributeValueException: ERR_04447_CANNOT_NORMALIZE_VALUE Cannot normalize the wrapped value ERR_04473_NOT_VALID_VALUE Not a valid value '20090818022733Z' for the AttributeType 'ATTRIBUTE_TYPE ( 1.3.6.1.4.1.18060.0.4.1.2.35
   [junit4]   2>  NAME 'schemaModifyTimestamp'
   [junit4]   2>  DESC time which schema was modified
   [junit4]   2>  SUP modifyTimestamp
   [junit4]   2>  EQUALITY generalizedTimeMatch
   [junit4]   2>  ORDERING generalizedTimeOrderingMatch
   [junit4]   2>  SYNTAX 1.3.6.1.4.1.1466.115.121.1.24
   [junit4]   2>  USAGE directoryOperation
   [junit4]   2>  )
   [junit4]   2> '
   [junit4]   2> 	at org.apache.directory.api.ldap.model.entry.AbstractValue.apply(AbstractValue.java:211)
   [junit4]   2> 	at org.apache.directory.api.ldap.model.entry.StringValue.<init>(StringValue.java:107)
   [junit4]   2> 	at org.apache.directory.api.ldap.model.entry.DefaultAttribute.<init>(DefaultAttribute.java:468)
   [junit4]   2> 	at org.apache.directory.api.ldap.model.entry.DefaultEntry.<init>(DefaultEntry.java:315)
   [junit4]   2> 	at org.apache.directory.server.core.partition.ldif.LdifPartition.loadEntries(LdifPartition.java:517)
   [junit4]   2> 	at org.apache.directory.server.core.partition.ldif.LdifPartition.loadEntries(LdifPartition.java:549)
   [junit4]   2> 	at org.apache.directory.server.core.partition.ldif.LdifPartition.doInit(LdifPartition.java:164)
   [junit4]   2> 	at org.apache.directory.server.core.api.partition.AbstractPartition.initialize(AbstractPartition.java:79)
   [junit4]   2> 	... 45 more
   [junit4]   2> Caused by: org.apache.directory.api.ldap.model.exception.LdapInvalidAttributeValueException: ERR_04473_NOT_VALID_VALUE Not a valid value '20090818022733Z' for the AttributeType 'ATTRIBUTE_TYPE ( 1.3.6.1.4.1.18060.0.4.1.2.35
   [junit4]   2>  NAME 'schemaModifyTimestamp'
   [junit4]   2>  DESC time which schema was modified
   [junit4]   2>  SUP modifyTimestamp
   [junit4]   2>  EQUALITY generalizedTimeMatch
   [junit4]   2>  ORDERING generalizedTimeOrderingMatch
   [junit4]   2>  SYNTAX 1.3.6.1.4.1.1466.115.121.1.24
   [junit4]   2>  USAGE directoryOperation
   [junit4]   2>  )
   [junit4]   2> '
   [junit4]   2> 	at org.apache.directory.api.ldap.model.entry.AbstractValue.apply(AbstractValue.java:204)
   [junit4]   2> 	... 52 more
   [junit4]   2> NOTE: reproduce with: ant test  -Dtestcase=SaslZkACLProviderTest -Dtests.method=testSaslZkACLProvider -Dtests.seed=D714505623ECAB10 -Dtests.multiplier=3 -Dtests.slow=true -Dtests.locale=ar-001 -Dtests.timezone=Europe/Simferopol -Dtests.asserts=true -Dtests.file.encoding=ISO-8859-1
   [junit4] ERROR   2.10s J0 | SaslZkACLProviderTest.testSaslZkACLProvider <<<
   [junit4]    > Throwable #1: java.lang.RuntimeException: org.apache.directory.api.ldap.model.exception.LdapOtherException: org.apache.directory.api.ldap.model.exception.LdapOtherException: ERR_04447_CANNOT_NORMALIZE_VALUE Cannot normalize the wrapped value ERR_04473_NOT_VALID_VALUE Not a valid value '20090818022733Z' for the AttributeType 'ATTRIBUTE_TYPE ( 1.3.6.1.4.1.18060.0.4.1.2.35
   [junit4]    >  NAME 'schemaModifyTimestamp'
   [junit4]    >  DESC time which schema was modified
   [junit4]    >  SUP modifyTimestamp
   [junit4]    >  EQUALITY generalizedTimeMatch
   [junit4]    >  ORDERING generalizedTimeOrderingMatch
   [junit4]    >  SYNTAX 1.3.6.1.4.1.1466.115.121.1.24
   [junit4]    >  USAGE directoryOperation
   [junit4]    >  )
   [junit4]    > '
   [junit4]    > 	at org.apache.solr.cloud.SaslZkACLProviderTest$SaslZkTestServer.run(SaslZkACLProviderTest.java:210)
   [junit4]    > 	at org.apache.solr.cloud.SaslZkACLProviderTest.setUp(SaslZkACLProviderTest.java:80)
   [junit4]    > 	at java.lang.Thread.run(Thread.java:804)
   [junit4]    > Caused by: org.apache.directory.api.ldap.model.exception.LdapOtherException: org.apache.directory.api.ldap.model.exception.LdapOtherException: ERR_04447_CANNOT_NORMALIZE_VALUE Cannot normalize the wrapped value ERR_04473_NOT_VALID_VALUE Not a valid value '20090818022733Z' for the AttributeType 'ATTRIBUTE_TYPE ( 1.3.6.1.4.1.18060.0.4.1.2.35
   [junit4]    >  NAME 'schemaModifyTimestamp'
   [junit4]    >  DESC time which schema was modified
   [junit4]    >  SUP modifyTimestamp
   [junit4]    >  EQUALITY generalizedTimeMatch
   [junit4]    >  ORDERING generalizedTimeOrderingMatch
   [junit4]    >  SYNTAX 1.3.6.1.4.1.1466.115.121.1.24
   [junit4]    >  USAGE directoryOperation
   [junit4]    >  )
   [junit4]    > '
   [junit4]    > 	at org.apache.directory.server.core.api.partition.AbstractPartition.initialize(AbstractPartition.java:84)
   [junit4]    > 	at org.apache.directory.server.core.DefaultDirectoryService.initialize(DefaultDirectoryService.java:1808)
   [junit4]    > 	at org.apache.directory.server.core.DefaultDirectoryService.startup(DefaultDirectoryService.java:1248)
   [junit4]    > 	at org.apache.hadoop.minikdc.MiniKdc.initDirectoryService(MiniKdc.java:383)
   [junit4]    > 	at org.apache.hadoop.minikdc.MiniKdc.start(MiniKdc.java:319)
   [junit4]    > 	at org.apache.solr.cloud.SaslZkACLProviderTest$SaslZkTestServer.run(SaslZkACLProviderTest.java:203)
   [junit4]    > 	... 38 more
   [junit4]    > Caused by: java.lang.RuntimeException: org.apache.directory.api.ldap.model.exception.LdapOtherException: ERR_04447_CANNOT_NORMALIZE_VALUE Cannot normalize the wrapped value ERR_04473_NOT_VALID_VALUE Not a valid value '20090818022733Z' for the AttributeType 'ATTRIBUTE_TYPE ( 1.3.6.1.4.1.18060.0.4.1.2.35
   [junit4]    >  NAME 'schemaModifyTimestamp'
   [junit4]    >  DESC time which schema was modified
   [junit4]    >  SUP modifyTimestamp
   [junit4]    >  EQUALITY generalizedTimeMatch
   [junit4]    >  ORDERING generalizedTimeOrderingMatch
   [junit4]    >  SYNTAX 1.3.6.1.4.1.1466.115.121.1.24
   [junit4]    >  USAGE directoryOperation
   [junit4]    >  )
   [junit4]    > '
   [junit4]    > 	at org.apache.directory.server.core.api.schema.SchemaPartition.doInit(SchemaPartition.java:226)
   [junit4]    > 	at org.apache.directory.server.core.api.partition.AbstractPartition.initialize(AbstractPartition.java:79)
   [junit4]    > 	... 43 more
   [junit4]    > Caused by: org.apache.directory.api.ldap.model.exception.LdapOtherException: ERR_04447_CANNOT_NORMALIZE_VALUE Cannot normalize the wrapped value ERR_04473_NOT_VALID_VALUE Not a valid value '20090818022733Z' for the AttributeType 'ATTRIBUTE_TYPE ( 1.3.6.1.4.1.18060.0.4.1.2.35
   [junit4]    >  NAME 'schemaModifyTimestamp'
   [junit4]    >  DESC time which schema was modified
   [junit4]    >  SUP modifyTimestamp
   [junit4]    >  EQUALITY generalizedTimeMatch
   [junit4]    >  ORDERING generalizedTimeOrderingMatch
   [junit4]    >  SYNTAX 1.3.6.1.4.1.1466.115.121.1.24
   [junit4]    >  USAGE directoryOperation
   [junit4]    >  )
   [junit4]    > '
   [junit4]    > 	at org.apache.directory.server.core.api.partition.AbstractPartition.initialize(AbstractPartition.java:84)
   [junit4]    > 	at org.apache.directory.server.core.api.schema.SchemaPartition.doInit(SchemaPartition.java:219)
   [junit4]    > 	... 44 more
   [junit4]    > Caused by: org.apache.directory.api.ldap.model.exception.LdapInvalidAttributeValueException: ERR_04447_CANNOT_NORMALIZE_VALUE Cannot normalize the wrapped value ERR_04473_NOT_VALID_VALUE Not a valid value '20090818022733Z' for the AttributeType 'ATTRIBUTE_TYPE ( 1.3.6.1.4.1.18060.0.4.1.2.35
   [junit4]    >  NAME 'schemaModifyTimestamp'
   [junit4]    >  DESC time which schema was modified
   [junit4]    >  SUP modifyTimestamp
   [junit4]    >  EQUALITY generalizedTimeMatch
   [junit4]    >  ORDERING generalizedTimeOrderingMatch
   [junit4]    >  SYNTAX 1.3.6.1.4.1.1466.115.121.1.24
   [junit4]    >  USAGE directoryOperation
   [junit4]    >  )
   [junit4]    > '
   [junit4]    > 	at org.apache.directory.api.ldap.model.entry.AbstractValue.apply(AbstractValue.java:211)
   [junit4]    > 	at org.apache.directory.api.ldap.model.entry.StringValue.<init>(StringValue.java:107)
   [junit4]    > 	at org.apache.directory.api.ldap.model.entry.DefaultAttribute.<init>(DefaultAttribute.java:468)
   [junit4]    > 	at org.apache.directory.api.ldap.model.entry.DefaultEntry.<init>(DefaultEntry.java:315)
   [junit4]    > 	at org.apache.directory.server.core.partition.ldif.LdifPartition.loadEntries(LdifPartition.java:517)
   [junit4]    > 	at org.apache.directory.server.core.partition.ldif.LdifPartition.loadEntries(LdifPartition.java:549)
   [junit4]    > 	at org.apache.directory.server.core.partition.ldif.LdifPartition.doInit(LdifPartition.java:164)
   [junit4]    > 	at org.apache.directory.server.core.api.partition.AbstractPartition.initialize(AbstractPartition.java:79)
   [junit4]    > 	... 45 more
   [junit4]    > Caused by: org.apache.directory.api.ldap.model.exception.LdapInvalidAttributeValueException: ERR_04473_NOT_VALID_VALUE Not a valid value '20090818022733Z' for the AttributeType 'ATTRIBUTE_TYPE ( 1.3.6.1.4.1.18060.0.4.1.2.35
   [junit4]    >  NAME 'schemaModifyTimestamp'
   [junit4]    >  DESC time which schema was modified
   [junit4]    >  SUP modifyTimestamp
   [junit4]    >  EQUALITY generalizedTimeMatch
   [junit4]    >  ORDERING generalizedTimeOrderingMatch
   [junit4]    >  SYNTAX 1.3.6.1.4.1.1466.115.121.1.24
   [junit4]    >  USAGE directoryOperation
   [junit4]    >  )
   [junit4]    > '
   [junit4]    > 	at org.apache.directory.api.ldap.model.entry.AbstractValue.apply(AbstractValue.java:204)
   [junit4]    > 	... 52 moreThrowable #2: java.lang.NullPointerException
   [junit4]    > 	at org.apache.solr.cloud.ZkTestServer$ZKServerMain.shutdown(ZkTestServer.java:334)
   [junit4]    > 	at org.apache.solr.cloud.ZkTestServer.shutdown(ZkTestServer.java:526)
   [junit4]    > 	at org.apache.solr.cloud.SaslZkACLProviderTest$SaslZkTestServer.shutdown(SaslZkACLProviderTest.java:217)
   [junit4]    > 	at org.apache.solr.cloud.SaslZkACLProviderTest.tearDown(SaslZkACLProviderTest.java:115)
   [junit4]    > 	at java.lang.Thread.run(Thread.java:804)
   [junit4]   2> 668950 INFO  (SUITE-SaslZkACLProviderTest-seed#[D714505623ECAB10]-worker) [    ] o.a.s.SolrTestCaseJ4 ###deleteCore
   [junit4]   2> NOTE: leaving temporary files on disk at: /home/jenkins/workspace/Lucene-Solr-5.5-Linux/solr/build/solr-core/test/J0/temp/solr.cloud.SaslZkACLProviderTest_D714505623ECAB10-001
   [junit4]   2> Feb 14, 2016 10:47:07 PM com.carrotsearch.randomizedtesting.ThreadLeakControl checkThreadLeaks
   [junit4]   2> WARNING: Will linger awaiting termination of 5 leaked thread(s).
   [junit4]   2> Feb 14, 2016 10:47:27 PM com.carrotsearch.randomizedtesting.ThreadLeakControl checkThreadLeaks
   [junit4]   2> SEVERE: 5 threads leaked from SUITE scope at org.apache.solr.cloud.SaslZkACLProviderTest: 
   [junit4]   2>    1) Thread[id=5130, name=groupCache.data, state=TIMED_WAITING, group=TGRP-SaslZkACLProviderTest]
   [junit4]   2>         at jdk.internal.misc.Unsafe.park(Native Method)
   [junit4]   2>         at java.util.concurrent.locks.LockSupport.parkNanos(LockSupport.java:230)
   [junit4]   2>         at java.util.concurrent.locks.AbstractQueuedSynchronizer$ConditionObject.awaitNanos(AbstractQueuedSynchronizer.java:2106)
   [junit4]   2>         at java.util.concurrent.ScheduledThreadPoolExecutor$DelayedWorkQueue.take(ScheduledThreadPoolExecutor.java:1131)
   [junit4]   2>         at java.util.concurrent.ScheduledThreadPoolExecutor$DelayedWorkQueue.take(ScheduledThreadPoolExecutor.java:848)
   [junit4]   2>         at java.util.concurrent.ThreadPoolExecutor.getTask(ThreadPoolExecutor.java:1083)
   [junit4]   2>         at java.util.concurrent.ThreadPoolExecutor.runWorker(ThreadPoolExecutor.java:1143)
   [junit4]   2>         at java.util.concurrent.ThreadPoolExecutor$Worker.run(ThreadPoolExecutor.java:632)
   [junit4]   2>         at java.lang.Thread.run(Thread.java:804)
   [junit4]   2>    2) Thread[id=5129, name=apacheds, state=WAITING, group=TGRP-SaslZkACLProviderTest]
   [junit4]   2>         at java.lang.Object.wait(Native Method)
   [junit4]   2>         at java.lang.Object.wait(Object.java:516)
   [junit4]   2>         at java.util.TimerThread.mainLoop(Timer.java:526)
   [junit4]   2>         at java.util.TimerThread.run(Timer.java:505)
   [junit4]   2>    3) Thread[id=5133, name=kdcReplayCache.data, state=TIMED_WAITING, group=TGRP-SaslZkACLProviderTest]
   [junit4]   2>         at jdk.internal.misc.Unsafe.park(Native Method)
   [junit4]   2>         at java.util.concurrent.locks.LockSupport.parkNanos(LockSupport.java:230)
   [junit4]   2>         at java.util.concurrent.locks.AbstractQueuedSynchronizer$ConditionObject.awaitNanos(AbstractQueuedSynchronizer.java:2106)
   [junit4]   2>         at java.util.concurrent.ScheduledThreadPoolExecutor$DelayedWorkQueue.take(ScheduledThreadPoolExecutor.java:1131)
   [junit4]   2>         at java.util.concurrent.ScheduledThreadPoolExecutor$DelayedWorkQueue.take(ScheduledThreadPoolExecutor.java:848)
   [junit4]   2>         at java.util.concurrent.ThreadPoolExecutor.getTask(ThreadPoolExecutor.java:1083)
   [junit4]   2>         at java.util.concurrent.ThreadPoolExecutor.runWorker(ThreadPoolExecutor.java:1143)
   [junit4]   2>         at java.util.concurrent.ThreadPoolExecutor$Worker.run(ThreadPoolExecutor.java:632)
   [junit4]   2>         at java.lang.Thread.run(Thread.java:804)
   [junit4]   2>    4) Thread[id=5131, name=changePwdReplayCache.data, state=TIMED_WAITING, group=TGRP-SaslZkACLProviderTest]
   [junit4]   2>         at jdk.internal.misc.Unsafe.park(Native Method)
   [junit4]   2>         at java.util.concurrent.locks.LockSupport.parkNanos(LockSupport.java:230)
   [junit4]   2>         at java.util.concurrent.locks.AbstractQueuedSynchronizer$ConditionObject.awaitNanos(AbstractQueuedSynchronizer.java:2106)
   [junit4]   2>         at java.util.concurrent.ScheduledThreadPoolExecutor$DelayedWorkQueue.take(ScheduledThreadPoolExecutor.java:1131)
   [junit4]   2>         at java.util.concurrent.ScheduledThreadPoolExecutor$DelayedWorkQueue.take(ScheduledThreadPoolExecutor.java:848)
   [junit4]   2>         at java.util.concurrent.ThreadPoolExecutor.getTask(ThreadPoolExecutor.java:1083)
   [junit4]   2>         at java.util.concurrent.ThreadPoolExecutor.runWorker(ThreadPoolExecutor.java:1143)
   [junit4]   2>         at java.util.concurrent.ThreadPoolExecutor$Worker.run(ThreadPoolExecutor.java:632)
   [junit4]   2>         at java.lang.Thread.run(Thread.java:804)
   [junit4]   2>    5) Thread[id=5132, name=ou=system.data, state=TIMED_WAITING, group=TGRP-SaslZkACLProviderTest]
   [junit4]   2>         at jdk.internal.misc.Unsafe.park(Native Method)
   [junit4]   2>         at java.util.concurrent.locks.LockSupport.parkNanos(LockSupport.java:230)
   [junit4]   2>         at java.util.concurrent.locks.AbstractQueuedSynchronizer$ConditionObject.awaitNanos(AbstractQueuedSynchronizer.java:2106)
   [junit4]   2>         at java.util.concurrent.ScheduledThreadPoolExecutor$DelayedWorkQueue.take(ScheduledThreadPoolExecutor.java:1131)
   [junit4]   2>         at java.util.concurrent.ScheduledThreadPoolExecutor$DelayedWorkQueue.take(ScheduledThreadPoolExecutor.java:848)
   [junit4]   2>         at java.util.concurrent.ThreadPoolExecutor.getTask(ThreadPoolExecutor.java:1083)
   [junit4]   2>         at java.util.concurrent.ThreadPoolExecutor.runWorker(ThreadPoolExecutor.java:1143)
   [junit4]   2>         at java.util.concurrent.ThreadPoolExecutor$Worker.run(ThreadPoolExecutor.java:632)
   [junit4]   2>         at java.lang.Thread.run(Thread.java:804)
   [junit4]   2> Feb 14, 2016 10:47:27 PM com.carrotsearch.randomizedtesting.ThreadLeakControl tryToInterruptAll
   [junit4]   2> INFO: Starting to interrupt leaked threads:
   [junit4]   2>    1) Thread[id=5130, name=groupCache.data, state=TIMED_WAITING, group=TGRP-SaslZkACLProviderTest]
   [junit4]   2>    2) Thread[id=5129, name=apacheds, state=WAITING, group=TGRP-SaslZkACLProviderTest]
   [junit4]   2>    3) Thread[id=5133, name=kdcReplayCache.data, state=TIMED_WAITING, group=TGRP-SaslZkACLProviderTest]
   [junit4]   2>    4) Thread[id=5131, name=changePwdReplayCache.data, state=TIMED_WAITING, group=TGRP-SaslZkACLProviderTest]
   [junit4]   2>    5) Thread[id=5132, name=ou=system.data, state=TIMED_WAITING, group=TGRP-SaslZkACLProviderTest]
   [junit4]   2> Feb 14, 2016 10:47:30 PM com.carrotsearch.randomizedtesting.ThreadLeakControl tryToInterruptAll
   [junit4]   2> SEVERE: There are still zombie threads that couldn't be terminated:
   [junit4]   2>    1) Thread[id=5130, name=groupCache.data, state=TIMED_WAITING, group=TGRP-SaslZkACLProviderTest]
   [junit4]   2>         at jdk.internal.misc.Unsafe.park(Native Method)
   [junit4]   2>         at java.util.concurrent.locks.LockSupport.parkNanos(LockSupport.java:230)
   [junit4]   2>         at java.util.concurrent.locks.AbstractQueuedSynchronizer$ConditionObject.awaitNanos(AbstractQueuedSynchronizer.java:2106)
   [junit4]   2>         at java.util.concurrent.ScheduledThreadPoolExecutor$DelayedWorkQueue.take(ScheduledThreadPoolExecutor.java:1131)
   [junit4]   2>         at java.util.concurrent.ScheduledThreadPoolExecutor$DelayedWorkQueue.take(ScheduledThreadPoolExecutor.java:848)
   [junit4]   2>         at java.util.concurrent.ThreadPoolExecutor.getTask(ThreadPoolExecutor.java:1083)
   [junit4]   2>         at java.util.concurrent.ThreadPoolExecutor.runWorker(ThreadPoolExecutor.java:1143)
   [junit4]   2>         at java.util.concurrent.ThreadPoolExecutor$Worker.run(ThreadPoolExecutor.java:632)
   [junit4]   2>         at java.lang.Thread.run(Thread.java:804)
   [junit4]   2>    2) Thread[id=5129, name=apacheds, state=WAITING, group=TGRP-SaslZkACLProviderTest]
   [junit4]   2>         at java.lang.Object.wait(Native Method)
   [junit4]   2>         at java.lang.Object.wait(Object.java:516)
   [junit4]   2>         at java.util.TimerThread.mainLoop(Timer.java:526)
   [junit4]   2>         at java.util.TimerThread.run(Timer.java:505)
   [junit4]   2>    3) Thread[id=5133, name=kdcReplayCache.data, state=TIMED_WAITING, group=TGRP-SaslZkACLProviderTest]
   [junit4]   2>         at jdk.internal.misc.Unsafe.park(Native Method)
   [junit4]   2>         at java.util.concurrent.locks.LockSupport.parkNanos(LockSupport.java:230)
   [junit4]   2>         at java.util.concurrent.locks.AbstractQueuedSynchronizer$ConditionObject.awaitNanos(AbstractQueuedSynchronizer.java:2106)
   [junit4]   2>         at java.util.concurrent.ScheduledThreadPoolExecutor$DelayedWorkQueue.take(ScheduledThreadPoolExecutor.java:1131)
   [junit4]   2>         at java.util.concurrent.ScheduledThreadPoolExecutor$DelayedWorkQueue.take(ScheduledThreadPoolExecutor.java:848)
   [junit4]   2>         at java.util.concurrent.ThreadPoolExecutor.getTask(ThreadPoolExecutor.java:1083)
   [junit4]   2>         at java.util.concurrent.ThreadPoolExecutor.runWorker(ThreadPoolExecutor.java:1143)
   [junit4]   2>         at java.util.concurrent.ThreadPoolExecutor$Worker.run(ThreadPoolExecutor.java:632)
   [junit4]   2>         at java.lang.Thread.run(Thread.java:804)
   [junit4]   2>    4) Thread[id=5131, name=changePwdReplayCache.data, state=TIMED_WAITING, group=TGRP-SaslZkACLProviderTest]
   [junit4]   2>         at jdk.internal.misc.Unsafe.park(Native Method)
   [junit4]   2>         at java.util.concurrent.locks.LockSupport.parkNanos(LockSupport.java:230)
   [junit4]   2>         at java.util.concurrent.locks.AbstractQueuedSynchronizer$ConditionObject.awaitNanos(AbstractQueuedSynchronizer.java:2106)
   [junit4]   2>         at java.util.concurrent.ScheduledThreadPoolExecutor$DelayedWorkQueue.take(ScheduledThreadPoolExecutor.java:1131)
   [junit4]   2>         at java.util.concurrent.ScheduledThreadPoolExecutor$DelayedWorkQueue.take(ScheduledThreadPoolExecutor.java:848)
   [junit4]   2>         at java.util.concurrent.ThreadPoolExecutor.getTask(ThreadPoolExecutor.java:1083)
   [junit4]   2>         at java.util.concurrent.ThreadPoolExecutor.runWorker(ThreadPoolExecutor.java:1143)
   [junit4]   2>         at java.util.concurrent.ThreadPoolExecutor$Worker.run(ThreadPoolExecutor.java:632)
   [junit4]   2>         at java.lang.Thread.run(Thread.java:804)
   [junit4]   2>    5) Thread[id=5132, name=ou=system.data, state=TIMED_WAITING, group=TGRP-SaslZkACLProviderTest]
   [junit4]   2>         at jdk.internal.misc.Unsafe.park(Native Method)
   [junit4]   2>         at java.util.concurrent.locks.LockSupport.parkNanos(LockSupport.java:230)
   [junit4]   2>         at java.util.concurrent.locks.AbstractQueuedSynchronizer$ConditionObject.awaitNanos(AbstractQueuedSynchronizer.java:2106)
   [junit4]   2>         at java.util.concurrent.ScheduledThreadPoolExecutor$DelayedWorkQueue.take(ScheduledThreadPoolExecutor.java:1131)
   [junit4]   2>         at java.util.concurrent.ScheduledThreadPoolExecutor$DelayedWorkQueue.take(ScheduledThreadPoolExecutor.java:848)
   [junit4]   2>         at java.util.concurrent.ThreadPoolExecutor.getTask(ThreadPoolExecutor.java:1083)
   [junit4]   2>         at java.util.concurrent.ThreadPoolExecutor.runWorker(ThreadPoolExecutor.java:1143)
   [junit4]   2>         at java.util.concurrent.ThreadPoolExecutor$Worker.run(ThreadPoolExecutor.java:632)
   [junit4]   2>         at java.lang.Thread.run(Thread.java:804)
   [junit4]   2> NOTE: test params are: codec=CheapBastard, sim=RandomSimilarity(queryNorm=true,coord=yes): {}, locale=ar-001, timezone=Europe/Simferopol
   [junit4]   2> NOTE: Linux 3.19.0-47-generic amd64/Oracle Corporation 9-ea (64-bit)/cpus=12,threads=6,free=176188640,total=536870912
   [junit4]   2> NOTE: All tests run in this JVM: [DistributedFacetPivotLargeTest, BlockJoinFacetDistribTest, IndexSchemaRuntimeFieldTest, TestBadConfig, TestComplexPhraseQParserPlugin, SOLR749Test, BasicZkTest, PolyFieldTest, TestDistributedStatsComponentCardinality, TestInfoStreamLogging, ResponseLogComponentTest, TestDistributedSearch, BadCopyFieldTest, CloudMLTQParserTest, OverseerRolesTest, ResponseHeaderTest, RAMDirectoryFactoryTest, TestConfigOverlay, ExplicitHLLTest, TestStandardQParsers, TestSchemaManager, TestScoreJoinQPNoScore, TestPseudoReturnFields, SpatialHeatmapFacetsTest, TestBulkSchemaConcurrent, CacheHeaderTest, TestSolr4Spatial, DocumentAnalysisRequestHandlerTest, RestartWhileUpdatingTest, CustomCollectionTest, TestConfig, TestLeaderElectionZkExpiry, AnalysisAfterCoreReloadTest, TestCloudSchemaless, TestFieldTypeResource, EchoParamsTest, RulesTest, LeaderElectionIntegrationTest, RequiredFieldsTest, TestPhraseSuggestions, TestBinaryField, TestRandomDVFaceting, DateFieldTest, TestConfigSets, LeaderInitiatedRecoveryOnShardRestartTest, TestBulkSchemaAPI, CloneFieldUpdateProcessorFactoryTest, DistributedQueryElevationComponentTest, SaslZkACLProviderTest]
   [junit4]   2> NOTE: reproduce with: ant test  -Dtestcase=SaslZkACLProviderTest -Dtests.seed=D714505623ECAB10 -Dtests.multiplier=3 -Dtests.slow=true -Dtests.locale=ar-001 -Dtests.timezone=Europe/Simferopol -Dtests.asserts=true -Dtests.file.encoding=ISO-8859-1
   [junit4] ERROR   0.00s J0 | SaslZkACLProviderTest (suite) <<<
   [junit4]    > Throwable #1: com.carrotsearch.randomizedtesting.ThreadLeakError: 5 threads leaked from SUITE scope at org.apache.solr.cloud.SaslZkACLProviderTest: 
   [junit4]    >    1) Thread[id=5130, name=groupCache.data, state=TIMED_WAITING, group=TGRP-SaslZkACLProviderTest]
   [junit4]    >         at jdk.internal.misc.Unsafe.park(Native Method)
   [junit4]    >         at java.util.concurrent.locks.LockSupport.parkNanos(LockSupport.java:230)
   [junit4]    >         at java.util.concurrent.locks.AbstractQueuedSynchronizer$ConditionObject.awaitNanos(AbstractQueuedSynchronizer.java:2106)
   [junit4]    >         at java.util.concurrent.ScheduledThreadPoolExecutor$DelayedWorkQueue.take(ScheduledThreadPoolExecutor.java:1131)
   [junit4]    >         at java.util.concurrent.ScheduledThreadPoolExecutor$DelayedWorkQueue.take(ScheduledThreadPoolExecutor.java:848)
   [junit4]    >         at java.util.concurrent.ThreadPoolExecutor.getTask(ThreadPoolExecutor.java:1083)
   [junit4]    >         at java.util.concurrent.ThreadPoolExecutor.runWorker(ThreadPoolExecutor.java:1143)
   [junit4]    >         at java.util.concurrent.ThreadPoolExecutor$Worker.run(ThreadPoolExecutor.java:632)
   [junit4]    >         at java.lang.Thread.run(Thread.java:804)
   [junit4]    >    2) Thread[id=5129, name=apacheds, state=WAITING, group=TGRP-SaslZkACLProviderTest]
   [junit4]    >         at java.lang.Object.wait(Native Method)
   [junit4]    >         at java.lang.Object.wait(Object.java:516)
   [junit4]    >         at java.util.TimerThread.mainLoop(Timer.java:526)
   [junit4]    >         at java.util.TimerThread.run(Timer.java:505)
   [junit4]    >    3) Thread[id=5133, name=kdcReplayCache.data, state=TIMED_WAITING, group=TGRP-SaslZkACLProviderTest]
   [junit4]    >         at jdk.internal.misc.Unsafe.park(Native Method)
   [junit4]    >         at java.util.concurrent.locks.LockSupport.parkNanos(LockSupport.java:230)
   [junit4]    >         at java.util.concurrent.locks.AbstractQueuedSynchronizer$ConditionObject.awaitNanos(AbstractQueuedSynchronizer.java:2106)
   [junit4]    >         at java.util.concurrent.ScheduledThreadPoolExecutor$DelayedWorkQueue.take(ScheduledThreadPoolExecutor.java:1131)
   [junit4]    >         at java.util.concurrent.ScheduledThreadPoolExecutor$DelayedWorkQueue.take(ScheduledThreadPoolExecutor.java:848)
   [junit4]    >         at java.util.concurrent.ThreadPoolExecutor.getTask(ThreadPoolExecutor.java:1083)
   [junit4]    >         at java.util.concurrent.ThreadPoolExecutor.runWorker(ThreadPoolExecutor.java:1143)
   [junit4]    >         at java.util.concurrent.ThreadPoolExecutor$Worker.run(ThreadPoolExecutor.java:632)
   [junit4]    >         at java.lang.Thread.run(Thread.java:804)
   [junit4]    >    4) Thread[id=5131, name=changePwdReplayCache.data, state=TIMED_WAITING, group=TGRP-SaslZkACLProviderTest]
   [junit4]    >         at jdk.internal.misc.Unsafe.park(Native Method)
   [junit4]    >         at java.util.concurrent.locks.LockSupport.parkNanos(LockSupport.java:230)
   [junit4]    >         at java.util.concurrent.locks.AbstractQueuedSynchronizer$ConditionObject.awaitNanos(AbstractQueuedSynchronizer.java:2106)
   [junit4]    >         at java.util.concurrent.ScheduledThreadPoolExecutor$DelayedWorkQueue.take(ScheduledThreadPoolExecutor.java:1131)
   [junit4]    >         at java.util.concurrent.ScheduledThreadPoolExecutor$DelayedWorkQueue.take(ScheduledThreadPoolExecutor.java:848)
   [junit4]    >         at java.util.concurrent.ThreadPoolExecutor.getTask(ThreadPoolExecutor.java:1083)
   [junit4]    >         at java.util.concurrent.ThreadPoolExecutor.runWorker(ThreadPoolExecutor.java:1143)
   [junit4]    >         at java.util.concurrent.ThreadPoolExecutor$Worker.run(ThreadPoolExecutor.java:632)
   [junit4]    >         at java.lang.Thread.run(Thread.java:804)
   [junit4]    >    5) Thread[id=5132, name=ou=system.data, state=TIMED_WAITING, group=TGRP-SaslZkACLProviderTest]
   [junit4]    >         at jdk.internal.misc.Unsafe.park(Native Method)
   [junit4]    >         at java.util.concurrent.locks.LockSupport.parkNanos(LockSupport.java:230)
   [junit4]    >         at java.util.concurrent.locks.AbstractQueuedSynchronizer$ConditionObject.awaitNanos(AbstractQueuedSynchronizer.java:2106)
   [junit4]    >         at java.util.concurrent.ScheduledThreadPoolExecutor$DelayedWorkQueue.take(ScheduledThreadPoolExecutor.java:1131)
   [junit4]    >         at java.util.concurrent.ScheduledThreadPoolExecutor$DelayedWorkQueue.take(ScheduledThreadPoolExecutor.java:848)
   [junit4]    >         at java.util.concurrent.ThreadPoolExecutor.getTask(ThreadPoolExecutor.java:1083)
   [junit4]    >         at java.util.concurrent.ThreadPoolExecutor.runWorker(ThreadPoolExecutor.java:1143)
   [junit4]    >         at java.util.concurrent.ThreadPoolExecutor$Worker.run(ThreadPoolExecutor.java:632)
   [junit4]    >         at java.lang.Thread.run(Thread.java:804)
   [junit4]    > 	at __randomizedtesting.SeedInfo.seed([D714505623ECAB10]:0)Throwable #2: com.carrotsearch.randomizedtesting.ThreadLeakError: There are still zombie threads that couldn't be terminated:
   [junit4]    >    1) Thread[id=5130, name=groupCache.data, state=TIMED_WAITING, group=TGRP-SaslZkACLProviderTest]
   [junit4]    >         at jdk.internal.misc.Unsafe.park(Native Method)
   [junit4]    >         at java.util.concurrent.locks.LockSupport.parkNanos(LockSupport.java:230)
   [junit4]    >         at java.util.concurrent.locks.AbstractQueuedSynchronizer$ConditionObject.awaitNanos(AbstractQueuedSynchronizer.java:2106)
   [junit4]    >         at java.util.concurrent.ScheduledThreadPoolExecutor$DelayedWorkQueue.take(ScheduledThreadPoolExecutor.java:1131)
   [junit4]    >         at java.util.concurrent.ScheduledThreadPoolExecutor$DelayedWorkQueue.take(ScheduledThreadPoolExecutor.java:848)
   [junit4]    >         at java.util.concurrent.ThreadPoolExecutor.getTask(ThreadPoolExecutor.java:1083)
   [junit4]    >         at java.util.concurrent.ThreadPoolExecutor.runWorker(ThreadPoolExecutor.java:1143)
   [junit4]    >         at java.util.concurrent.ThreadPoolExecutor$Worker.run(ThreadPoolExecutor.java:632)
   [junit4]    >         at java.lang.Thread.run(Thread.java:804)
   [junit4]    >    2) Thread[id=5129, name=apacheds, state=WAITING, group=TGRP-SaslZkACLProviderTest]
   [junit4]    >         at java.lang.Object.wait(Native Method)
   [junit4]    >         at java.lang.Object.wait(Object.java:516)
   [junit4]    >         at java.util.TimerThread.mainLoop(Timer.java:526)
   [junit4]    >         at java.util.TimerThread.run(Timer.java:505)
   [junit4]    >    3) Thread[id=5133, name=kdcReplayCache.data, state=TIMED_WAITING, group=TGRP-SaslZkACLProviderTest]
   [junit4]    >         at jdk.internal.misc.Unsafe.park(Native Method)
   [junit4]    >         at java.util.concurrent.locks.LockSupport.parkNanos(LockSupport.java:230)
   [junit4]    >         at java.util.concurrent.locks.AbstractQueuedSynchronizer$ConditionObject.awaitNanos(AbstractQueuedSynchronizer.java:2106)
   [junit4]    >         at java.util.concurrent.ScheduledThreadPoolExecutor$DelayedWorkQueue.take(ScheduledThreadPoolExecutor.java:1131)
   [junit4]    >         at java.util.concurrent.ScheduledThreadPoolExecutor$DelayedWorkQueue.take(ScheduledThreadPoolExecutor.java:848)
   [junit4]    >         at java.util.concurrent.ThreadPoolExecutor.getTask(ThreadPoolExecutor.java:1083)
   [junit4]    >         at java.util.concurrent.ThreadPoolExecutor.runWorker(ThreadPoolExecutor.java:1143)
   [junit4]    >         at java.util.concurrent.ThreadPoolExecutor$Worker.run(ThreadPoolExecutor.java:632)
   [junit4]    >         at java.lang.Thread.run(Thread.java:804)
   [junit4]    >    4) Thread[id=5131, name=changePwdReplayCache.data, state=TIMED_WAITING, group=TGRP-SaslZkACLProviderTest]
   [junit4]    >         at jdk.internal.misc.Unsafe.park(Native Method)
   [junit4]    >         at java.util.concurrent.locks.LockSupport.parkNanos(LockSupport.java:230)
   [junit4]    >         at java.util.concurrent.locks.AbstractQueuedSynchronizer$ConditionObject.awaitNanos(AbstractQueuedSynchronizer.java:2106)
   [junit4]    >         at java.util.concurrent.ScheduledThreadPoolExecutor$DelayedWorkQueue.take(ScheduledThreadPoolExecutor.java:1131)
   [junit4]    >         at java.util.concurrent.ScheduledThreadPoolExecutor$DelayedWorkQueue.take(ScheduledThreadPoolExecutor.java:848)
   [junit4]    >         at java.util.concurrent.ThreadPoolExecutor.getTask(ThreadPoolExecutor.java:1083)
   [junit4]    >         at java.util.concurrent.ThreadPoolExecutor.runWorker(ThreadPoolExecutor.java:1143)
   [junit4]    >         at java.util.concurrent.ThreadPoolExecutor$Worker.run(ThreadPoolExecutor.java:632)
   [junit4]    >         at java.lang.Thread.run(Thread.java:804)
   [junit4]    >    5) Thread[id=5132, name=ou=system.data, state=TIMED_WAITING, group=TGRP-SaslZkACLProviderTest]
   [junit4]    >         at jdk.internal.misc.Unsafe.park(Native Method)
   [junit4]    >         at java.util.concurrent.locks.LockSupport.parkNanos(LockSupport.java:230)
   [junit4]    >         at java.util.concurrent.locks.AbstractQueuedSynchronizer$ConditionObject.awaitNanos(AbstractQueuedSynchronizer.java:2106)
   [junit4]    >         at java.util.concurrent.ScheduledThreadPoolExecutor$DelayedWorkQueue.take(ScheduledThreadPoolExecutor.java:1131)
   [junit4]    >         at java.util.concurrent.ScheduledThreadPoolExecutor$DelayedWorkQueue.take(ScheduledThreadPoolExecutor.java:848)
   [junit4]    >         at java.util.concurrent.ThreadPoolExecutor.getTask(ThreadPoolExecutor.java:1083)
   [junit4]    >         at java.util.concurrent.ThreadPoolExecutor.runWorker(ThreadPoolExecutor.java:1143)
   [junit4]    >         at java.util.concurrent.ThreadPoolExecutor$Worker.run(ThreadPoolExecutor.java:632)
   [junit4]    >         at java.lang.Thread.run(Thread.java:804)
   [junit4]    > 	at __randomizedtesting.SeedInfo.seed([D714505623ECAB10]:0)
   [junit4] Completed [237/566 (1!)] on J0 in 25.33s, 1 test, 3 errors <<< FAILURES!

[...truncated 1020 lines...]
BUILD FAILED
/home/jenkins/workspace/Lucene-Solr-5.5-Linux/build.xml:750: The following error occurred while executing this line:
/home/jenkins/workspace/Lucene-Solr-5.5-Linux/build.xml:694: The following error occurred while executing this line:
/home/jenkins/workspace/Lucene-Solr-5.5-Linux/build.xml:59: The following error occurred while executing this line:
/home/jenkins/workspace/Lucene-Solr-5.5-Linux/solr/build.xml:233: The following error occurred while executing this line:
/home/jenkins/workspace/Lucene-Solr-5.5-Linux/solr/common-build.xml:534: The following error occurred while executing this line:
/home/jenkins/workspace/Lucene-Solr-5.5-Linux/lucene/common-build.xml:1477: The following error occurred while executing this line:
/home/jenkins/workspace/Lucene-Solr-5.5-Linux/lucene/common-build.xml:1033: There were test failures: 566 suites (7 ignored), 2275 tests, 2 suite-level errors, 1 error, 1303 ignored (32 assumptions) [seed: D714505623ECAB10]

Total time: 35 minutes 14 seconds
Build step 'Invoke Ant' marked build as failure
Archiving artifacts
[WARNINGS] Skipping publisher since build result is FAILURE
Recording test results
Email was triggered for: Failure - Any
Sending email for trigger: Failure - Any



Mime
View raw message