lucene-dev mailing list archives

Site index · List index
Message view « Date » · « Thread »
Top « Date » · « Thread »
From Policeman Jenkins Server <jenk...@thetaphi.de>
Subject [JENKINS] Lucene-Solr-trunk-Windows (32bit/jdk1.8.0_72) - Build # 5625 - Failure!
Date Wed, 17 Feb 2016 16:57:15 GMT
Build: http://jenkins.thetaphi.de/job/Lucene-Solr-trunk-Windows/5625/
Java: 32bit/jdk1.8.0_72 -client -XX:+UseParallelGC

1 tests failed.
FAILED:  org.apache.solr.handler.TestReplicationHandler.doTestIndexAndConfigAliasReplication

Error Message:
Index: 0, Size: 0

Stack Trace:
java.lang.IndexOutOfBoundsException: Index: 0, Size: 0
	at __randomizedtesting.SeedInfo.seed([52E3CAF9EB06AE07:A59024A12DEE01E1]:0)
	at java.util.ArrayList.rangeCheck(ArrayList.java:653)
	at java.util.ArrayList.get(ArrayList.java:429)
	at org.apache.solr.handler.TestReplicationHandler.doTestIndexAndConfigAliasReplication(TestReplicationHandler.java:1241)
	at sun.reflect.NativeMethodAccessorImpl.invoke0(Native Method)
	at sun.reflect.NativeMethodAccessorImpl.invoke(NativeMethodAccessorImpl.java:62)
	at sun.reflect.DelegatingMethodAccessorImpl.invoke(DelegatingMethodAccessorImpl.java:43)
	at java.lang.reflect.Method.invoke(Method.java:498)
	at com.carrotsearch.randomizedtesting.RandomizedRunner.invoke(RandomizedRunner.java:1764)
	at com.carrotsearch.randomizedtesting.RandomizedRunner$8.evaluate(RandomizedRunner.java:871)
	at com.carrotsearch.randomizedtesting.RandomizedRunner$9.evaluate(RandomizedRunner.java:907)
	at com.carrotsearch.randomizedtesting.RandomizedRunner$10.evaluate(RandomizedRunner.java:921)
	at com.carrotsearch.randomizedtesting.rules.SystemPropertiesRestoreRule$1.evaluate(SystemPropertiesRestoreRule.java:57)
	at org.apache.lucene.util.TestRuleSetupTeardownChained$1.evaluate(TestRuleSetupTeardownChained.java:49)
	at org.apache.lucene.util.AbstractBeforeAfterRule$1.evaluate(AbstractBeforeAfterRule.java:45)
	at org.apache.lucene.util.TestRuleThreadAndTestName$1.evaluate(TestRuleThreadAndTestName.java:48)
	at org.apache.lucene.util.TestRuleIgnoreAfterMaxFailures$1.evaluate(TestRuleIgnoreAfterMaxFailures.java:64)
	at org.apache.lucene.util.TestRuleMarkFailure$1.evaluate(TestRuleMarkFailure.java:47)
	at com.carrotsearch.randomizedtesting.rules.StatementAdapter.evaluate(StatementAdapter.java:36)
	at com.carrotsearch.randomizedtesting.ThreadLeakControl$StatementRunner.run(ThreadLeakControl.java:367)
	at com.carrotsearch.randomizedtesting.ThreadLeakControl.forkTimeoutingTask(ThreadLeakControl.java:809)
	at com.carrotsearch.randomizedtesting.ThreadLeakControl$3.evaluate(ThreadLeakControl.java:460)
	at com.carrotsearch.randomizedtesting.RandomizedRunner.runSingleTest(RandomizedRunner.java:880)
	at com.carrotsearch.randomizedtesting.RandomizedRunner$5.evaluate(RandomizedRunner.java:781)
	at com.carrotsearch.randomizedtesting.RandomizedRunner$6.evaluate(RandomizedRunner.java:816)
	at com.carrotsearch.randomizedtesting.RandomizedRunner$7.evaluate(RandomizedRunner.java:827)
	at com.carrotsearch.randomizedtesting.rules.StatementAdapter.evaluate(StatementAdapter.java:36)
	at com.carrotsearch.randomizedtesting.rules.SystemPropertiesRestoreRule$1.evaluate(SystemPropertiesRestoreRule.java:57)
	at org.apache.lucene.util.AbstractBeforeAfterRule$1.evaluate(AbstractBeforeAfterRule.java:45)
	at com.carrotsearch.randomizedtesting.rules.StatementAdapter.evaluate(StatementAdapter.java:36)
	at org.apache.lucene.util.TestRuleStoreClassName$1.evaluate(TestRuleStoreClassName.java:41)
	at com.carrotsearch.randomizedtesting.rules.NoShadowingOrOverridesOnMethodsRule$1.evaluate(NoShadowingOrOverridesOnMethodsRule.java:40)
	at com.carrotsearch.randomizedtesting.rules.NoShadowingOrOverridesOnMethodsRule$1.evaluate(NoShadowingOrOverridesOnMethodsRule.java:40)
	at com.carrotsearch.randomizedtesting.rules.StatementAdapter.evaluate(StatementAdapter.java:36)
	at com.carrotsearch.randomizedtesting.rules.StatementAdapter.evaluate(StatementAdapter.java:36)
	at com.carrotsearch.randomizedtesting.rules.StatementAdapter.evaluate(StatementAdapter.java:36)
	at org.apache.lucene.util.TestRuleAssertionsRequired$1.evaluate(TestRuleAssertionsRequired.java:53)
	at org.apache.lucene.util.TestRuleMarkFailure$1.evaluate(TestRuleMarkFailure.java:47)
	at org.apache.lucene.util.TestRuleIgnoreAfterMaxFailures$1.evaluate(TestRuleIgnoreAfterMaxFailures.java:64)
	at org.apache.lucene.util.TestRuleIgnoreTestSuites$1.evaluate(TestRuleIgnoreTestSuites.java:54)
	at com.carrotsearch.randomizedtesting.rules.StatementAdapter.evaluate(StatementAdapter.java:36)
	at com.carrotsearch.randomizedtesting.ThreadLeakControl$StatementRunner.run(ThreadLeakControl.java:367)
	at java.lang.Thread.run(Thread.java:745)




Build Log:
[...truncated 11334 lines...]
   [junit4] Suite: org.apache.solr.handler.TestReplicationHandler
   [junit4]   2> Creating dataDir: C:\Users\JenkinsSlave\workspace\Lucene-Solr-trunk-Windows\solr\build\solr-core\test\J1\temp\solr.handler.TestReplicationHandler_52E3CAF9EB06AE07-001\init-core-data-001
   [junit4]   2> 2021633 INFO  (TEST-TestReplicationHandler.doTestReplicateAfterCoreReload-seed#[52E3CAF9EB06AE07]) [    ] o.a.s.SolrTestCaseJ4 ###Starting doTestReplicateAfterCoreReload
   [junit4]   2> 2021634 INFO  (TEST-TestReplicationHandler.doTestReplicateAfterCoreReload-seed#[52E3CAF9EB06AE07]) [    ] o.a.s.SolrTestCaseJ4 Writing core.properties file to C:\Users\JenkinsSlave\workspace\Lucene-Solr-trunk-Windows\solr\build\solr-core\test\J1\temp\solr.handler.TestReplicationHandler_52E3CAF9EB06AE07-001\solr-instance-001\collection1
   [junit4]   2> 2021650 INFO  (TEST-TestReplicationHandler.doTestReplicateAfterCoreReload-seed#[52E3CAF9EB06AE07]) [    ] o.e.j.s.Server jetty-9.3.6.v20151106
   [junit4]   2> 2021654 INFO  (TEST-TestReplicationHandler.doTestReplicateAfterCoreReload-seed#[52E3CAF9EB06AE07]) [    ] o.e.j.s.h.ContextHandler Started o.e.j.s.ServletContextHandler@8fef7b{/solr,null,AVAILABLE}
   [junit4]   2> 2021658 INFO  (TEST-TestReplicationHandler.doTestReplicateAfterCoreReload-seed#[52E3CAF9EB06AE07]) [    ] o.e.j.s.ServerConnector Started ServerConnector@66b2f3{HTTP/1.1,[http/1.1]}{127.0.0.1:63249}
   [junit4]   2> 2021658 INFO  (TEST-TestReplicationHandler.doTestReplicateAfterCoreReload-seed#[52E3CAF9EB06AE07]) [    ] o.e.j.s.Server Started @2028674ms
   [junit4]   2> 2021658 INFO  (TEST-TestReplicationHandler.doTestReplicateAfterCoreReload-seed#[52E3CAF9EB06AE07]) [    ] o.a.s.c.s.e.JettySolrRunner Jetty properties: {solr.data.dir=C:\Users\JenkinsSlave\workspace\Lucene-Solr-trunk-Windows\solr\build\solr-core\test\J1\temp\solr.handler.TestReplicationHandler_52E3CAF9EB06AE07-001\solr-instance-001\collection1\data, hostContext=/solr, hostPort=63249}
   [junit4]   2> 2021658 INFO  (TEST-TestReplicationHandler.doTestReplicateAfterCoreReload-seed#[52E3CAF9EB06AE07]) [    ] o.a.s.s.SolrDispatchFilter SolrDispatchFilter.init(): sun.misc.Launcher$AppClassLoader@1d16e93
   [junit4]   2> 2021658 INFO  (TEST-TestReplicationHandler.doTestReplicateAfterCoreReload-seed#[52E3CAF9EB06AE07]) [    ] o.a.s.c.SolrResourceLoader new SolrResourceLoader for directory: 'C:\Users\JenkinsSlave\workspace\Lucene-Solr-trunk-Windows\solr\build\solr-core\test\J1\temp\solr.handler.TestReplicationHandler_52E3CAF9EB06AE07-001\solr-instance-001'
   [junit4]   2> 2021659 INFO  (TEST-TestReplicationHandler.doTestReplicateAfterCoreReload-seed#[52E3CAF9EB06AE07]) [    ] o.a.s.c.SolrResourceLoader JNDI not configured for solr (NoInitialContextEx)
   [junit4]   2> 2021659 INFO  (TEST-TestReplicationHandler.doTestReplicateAfterCoreReload-seed#[52E3CAF9EB06AE07]) [    ] o.a.s.c.SolrResourceLoader solr home defaulted to 'solr/' (could not find system property or JNDI)
   [junit4]   2> 2021659 INFO  (TEST-TestReplicationHandler.doTestReplicateAfterCoreReload-seed#[52E3CAF9EB06AE07]) [    ] o.a.s.c.SolrXmlConfig Loading container configuration from C:\Users\JenkinsSlave\workspace\Lucene-Solr-trunk-Windows\solr\build\solr-core\test\J1\temp\solr.handler.TestReplicationHandler_52E3CAF9EB06AE07-001\solr-instance-001\solr.xml
   [junit4]   2> 2021687 INFO  (TEST-TestReplicationHandler.doTestReplicateAfterCoreReload-seed#[52E3CAF9EB06AE07]) [    ] o.a.s.c.CorePropertiesLocator Config-defined core root directory: C:\Users\JenkinsSlave\workspace\Lucene-Solr-trunk-Windows\solr\build\solr-core\test\J1\temp\solr.handler.TestReplicationHandler_52E3CAF9EB06AE07-001\solr-instance-001\.
   [junit4]   2> 2021687 INFO  (TEST-TestReplicationHandler.doTestReplicateAfterCoreReload-seed#[52E3CAF9EB06AE07]) [    ] o.a.s.c.CoreContainer New CoreContainer 33128705
   [junit4]   2> 2021687 INFO  (TEST-TestReplicationHandler.doTestReplicateAfterCoreReload-seed#[52E3CAF9EB06AE07]) [    ] o.a.s.c.CoreContainer Loading cores into CoreContainer [instanceDir=C:\Users\JenkinsSlave\workspace\Lucene-Solr-trunk-Windows\solr\build\solr-core\test\J1\temp\solr.handler.TestReplicationHandler_52E3CAF9EB06AE07-001\solr-instance-001]
   [junit4]   2> 2021687 WARN  (TEST-TestReplicationHandler.doTestReplicateAfterCoreReload-seed#[52E3CAF9EB06AE07]) [    ] o.a.s.c.CoreContainer Couldn't add files from C:\Users\JenkinsSlave\workspace\Lucene-Solr-trunk-Windows\solr\build\solr-core\test\J1\temp\solr.handler.TestReplicationHandler_52E3CAF9EB06AE07-001\solr-instance-001\lib to classpath: C:\Users\JenkinsSlave\workspace\Lucene-Solr-trunk-Windows\solr\build\solr-core\test\J1\temp\solr.handler.TestReplicationHandler_52E3CAF9EB06AE07-001\solr-instance-001\lib
   [junit4]   2> 2021688 INFO  (TEST-TestReplicationHandler.doTestReplicateAfterCoreReload-seed#[52E3CAF9EB06AE07]) [    ] o.a.s.h.c.HttpShardHandlerFactory created with socketTimeout : 90000,urlScheme : ,connTimeout : 15000,maxConnectionsPerHost : 20,maxConnections : 10000,corePoolSize : 0,maximumPoolSize : 2147483647,maxThreadIdleTime : 5,sizeOfQueue : -1,fairnessPolicy : false,useRetries : false,
   [junit4]   2> 2021694 INFO  (TEST-TestReplicationHandler.doTestReplicateAfterCoreReload-seed#[52E3CAF9EB06AE07]) [    ] o.a.s.u.UpdateShardHandler Creating UpdateShardHandler HTTP client with params: socketTimeout=340000&connTimeout=45000&retry=true
   [junit4]   2> 2021695 INFO  (TEST-TestReplicationHandler.doTestReplicateAfterCoreReload-seed#[52E3CAF9EB06AE07]) [    ] o.a.s.l.LogWatcher SLF4J impl is org.slf4j.impl.Log4jLoggerFactory
   [junit4]   2> 2021695 INFO  (TEST-TestReplicationHandler.doTestReplicateAfterCoreReload-seed#[52E3CAF9EB06AE07]) [    ] o.a.s.l.LogWatcher Registering Log Listener [Log4j (org.slf4j.impl.Log4jLoggerFactory)]
   [junit4]   2> 2021697 INFO  (TEST-TestReplicationHandler.doTestReplicateAfterCoreReload-seed#[52E3CAF9EB06AE07]) [    ] o.a.s.c.CoreContainer Security conf doesn't exist. Skipping setup for authorization module.
   [junit4]   2> 2021697 INFO  (TEST-TestReplicationHandler.doTestReplicateAfterCoreReload-seed#[52E3CAF9EB06AE07]) [    ] o.a.s.c.CoreContainer No authentication plugin used.
   [junit4]   2> 2021699 INFO  (TEST-TestReplicationHandler.doTestReplicateAfterCoreReload-seed#[52E3CAF9EB06AE07]) [    ] o.a.s.c.CorePropertiesLocator Looking for core definitions underneath C:\Users\JenkinsSlave\workspace\Lucene-Solr-trunk-Windows\solr\build\solr-core\test\J1\temp\solr.handler.TestReplicationHandler_52E3CAF9EB06AE07-001\solr-instance-001\.
   [junit4]   2> 2021703 INFO  (TEST-TestReplicationHandler.doTestReplicateAfterCoreReload-seed#[52E3CAF9EB06AE07]) [    ] o.a.s.c.CoreDescriptor Created CoreDescriptor: {name=collection1, config=solrconfig.xml, loadOnStartup=true, schema=schema.xml, configSetProperties=configsetprops.json, transient=false, dataDir=data\}
   [junit4]   2> 2021703 INFO  (TEST-TestReplicationHandler.doTestReplicateAfterCoreReload-seed#[52E3CAF9EB06AE07]) [    ] o.a.s.c.CorePropertiesLocator Found core collection1 in C:\Users\JenkinsSlave\workspace\Lucene-Solr-trunk-Windows\solr\build\solr-core\test\J1\temp\solr.handler.TestReplicationHandler_52E3CAF9EB06AE07-001\solr-instance-001\.\collection1
   [junit4]   2> 2021705 INFO  (TEST-TestReplicationHandler.doTestReplicateAfterCoreReload-seed#[52E3CAF9EB06AE07]) [    ] o.a.s.c.CorePropertiesLocator Found 1 core definitions
   [junit4]   2> 2021706 INFO  (coreLoadExecutor-5865-thread-1) [    ] o.a.s.c.SolrResourceLoader new SolrResourceLoader for directory: 'C:\Users\JenkinsSlave\workspace\Lucene-Solr-trunk-Windows\solr\build\solr-core\test\J1\temp\solr.handler.TestReplicationHandler_52E3CAF9EB06AE07-001\solr-instance-001\collection1'
   [junit4]   2> 2021706 INFO  (TEST-TestReplicationHandler.doTestReplicateAfterCoreReload-seed#[52E3CAF9EB06AE07]) [    ] o.a.s.s.SolrDispatchFilter user.dir=C:\Users\JenkinsSlave\workspace\Lucene-Solr-trunk-Windows\solr\build\solr-core\test\J1
   [junit4]   2> 2021706 INFO  (coreLoadExecutor-5865-thread-1) [    ] o.a.s.c.SolrResourceLoader JNDI not configured for solr (NoInitialContextEx)
   [junit4]   2> 2021706 INFO  (TEST-TestReplicationHandler.doTestReplicateAfterCoreReload-seed#[52E3CAF9EB06AE07]) [    ] o.a.s.s.SolrDispatchFilter SolrDispatchFilter.init() done
   [junit4]   2> 2021706 INFO  (coreLoadExecutor-5865-thread-1) [    ] o.a.s.c.SolrResourceLoader solr home defaulted to 'solr/' (could not find system property or JNDI)
   [junit4]   2> 2021737 INFO  (coreLoadExecutor-5865-thread-1) [    ] o.a.s.c.SolrConfig current version of requestparams : -1
   [junit4]   2> 2021749 INFO  (coreLoadExecutor-5865-thread-1) [    ] o.a.s.c.SolrConfig Using Lucene MatchVersion: 6.0.0
   [junit4]   2> 2021764 INFO  (coreLoadExecutor-5865-thread-1) [    ] o.a.s.c.SolrConfig Loaded SolrConfig: solrconfig.xml
   [junit4]   2> 2021771 INFO  (coreLoadExecutor-5865-thread-1) [    ] o.a.s.s.IndexSchema [collection1] Schema name=test
   [junit4]   2> 2021779 INFO  (coreLoadExecutor-5865-thread-1) [    ] o.a.s.s.IndexSchema unique key field: id
   [junit4]   2> 2021788 INFO  (coreLoadExecutor-5865-thread-1) [    ] o.a.s.c.ConfigSetProperties Did not find ConfigSet properties, assuming default properties: Can't find resource 'configsetprops.json' in classpath or 'C:\Users\JenkinsSlave\workspace\Lucene-Solr-trunk-Windows\solr\build\solr-core\test\J1\temp\solr.handler.TestReplicationHandler_52E3CAF9EB06AE07-001\solr-instance-001\collection1'
   [junit4]   2> 2021788 INFO  (coreLoadExecutor-5865-thread-1) [    ] o.a.s.c.CoreContainer Creating SolrCore 'collection1' using configuration from instancedir C:\Users\JenkinsSlave\workspace\Lucene-Solr-trunk-Windows\solr\build\solr-core\test\J1\temp\solr.handler.TestReplicationHandler_52E3CAF9EB06AE07-001\solr-instance-001\.\collection1
   [junit4]   2> 2021788 INFO  (coreLoadExecutor-5865-thread-1) [    x:collection1] o.a.s.c.SolrCore org.apache.solr.core.MockDirectoryFactory
   [junit4]   2> 2021789 INFO  (coreLoadExecutor-5865-thread-1) [    x:collection1] o.a.s.c.SolrCore [[collection1] ] Opening new SolrCore at [C:\Users\JenkinsSlave\workspace\Lucene-Solr-trunk-Windows\solr\build\solr-core\test\J1\temp\solr.handler.TestReplicationHandler_52E3CAF9EB06AE07-001\solr-instance-001\collection1], dataDir=[C:\Users\JenkinsSlave\workspace\Lucene-Solr-trunk-Windows\solr\build\solr-core\test\J1\temp\solr.handler.TestReplicationHandler_52E3CAF9EB06AE07-001\solr-instance-001\.\collection1\data\]
   [junit4]   2> 2021789 INFO  (coreLoadExecutor-5865-thread-1) [    x:collection1] o.a.s.c.SolrCore JMX monitoring not detected for core: collection1
   [junit4]   2> 2021789 INFO  (coreLoadExecutor-5865-thread-1) [    x:collection1] o.a.s.c.CachingDirectoryFactory return new directory for C:\Users\JenkinsSlave\workspace\Lucene-Solr-trunk-Windows\solr\build\solr-core\test\J1\temp\solr.handler.TestReplicationHandler_52E3CAF9EB06AE07-001\solr-instance-001\.\collection1\data\
   [junit4]   2> 2021789 INFO  (coreLoadExecutor-5865-thread-1) [    x:collection1] o.a.s.c.SolrCore New index directory detected: old=null new=C:\Users\JenkinsSlave\workspace\Lucene-Solr-trunk-Windows\solr\build\solr-core\test\J1\temp\solr.handler.TestReplicationHandler_52E3CAF9EB06AE07-001\solr-instance-001\.\collection1\data\index/
   [junit4]   2> 2021789 WARN  (coreLoadExecutor-5865-thread-1) [    x:collection1] o.a.s.c.SolrCore [collection1] Solr index directory 'C:\Users\JenkinsSlave\workspace\Lucene-Solr-trunk-Windows\solr\build\solr-core\test\J1\temp\solr.handler.TestReplicationHandler_52E3CAF9EB06AE07-001\solr-instance-001\.\collection1\data\index' doesn't exist. Creating new index...
   [junit4]   2> 2021790 INFO  (coreLoadExecutor-5865-thread-1) [    x:collection1] o.a.s.c.CachingDirectoryFactory return new directory for C:\Users\JenkinsSlave\workspace\Lucene-Solr-trunk-Windows\solr\build\solr-core\test\J1\temp\solr.handler.TestReplicationHandler_52E3CAF9EB06AE07-001\solr-instance-001\.\collection1\data\index
   [junit4]   2> 2021790 INFO  (coreLoadExecutor-5865-thread-1) [    x:collection1] o.a.s.u.RandomMergePolicy RandomMergePolicy wrapping class org.apache.lucene.index.LogByteSizeMergePolicy: [LogByteSizeMergePolicy: minMergeSize=1677721, mergeFactor=18, maxMergeSize=2147483648, maxMergeSizeForForcedMerge=9223372036854775807, calibrateSizeByDeletes=true, maxMergeDocs=2147483647, maxCFSSegmentSizeMB=8.796093022207999E12, noCFSRatio=0.0]
   [junit4]   2> 2021790 INFO  (coreLoadExecutor-5865-thread-1) [    x:collection1] o.a.s.c.SolrDeletionPolicy SolrDeletionPolicy.onCommit: commits: num=1
   [junit4]   2> 	commit{dir=MockDirectoryWrapper(RAMDirectory@15e6bb0 lockFactory=org.apache.lucene.store.SingleInstanceLockFactory@1f849e7),segFN=segments_1,generation=1}
   [junit4]   2> 2021790 INFO  (coreLoadExecutor-5865-thread-1) [    x:collection1] o.a.s.c.SolrDeletionPolicy newest commit generation = 1
   [junit4]   2> 2021792 INFO  (OldIndexDirectoryCleanupThreadForCore-collection1) [    x:collection1] o.a.s.c.SolrCore Looking for old index directories to cleanup for core collection1 in C:\Users\JenkinsSlave\workspace\Lucene-Solr-trunk-Windows\solr\build\solr-core\test\J1\temp\solr.handler.TestReplicationHandler_52E3CAF9EB06AE07-001\solr-instance-001\.\collection1\data\
   [junit4]   2> 2021796 INFO  (coreLoadExecutor-5865-thread-1) [    x:collection1] o.a.s.c.SolrCore no updateRequestProcessorChain defined as default, creating implicit default
   [junit4]   2> 2021804 INFO  (coreLoadExecutor-5865-thread-1) [    x:collection1] o.a.s.h.l.XMLLoader xsltCacheLifetimeSeconds=60
   [junit4]   2> 2021806 INFO  (coreLoadExecutor-5865-thread-1) [    x:collection1] o.a.s.h.l.XMLLoader xsltCacheLifetimeSeconds=60
   [junit4]   2> 2021807 INFO  (coreLoadExecutor-5865-thread-1) [    x:collection1] o.a.s.h.l.XMLLoader xsltCacheLifetimeSeconds=60
   [junit4]   2> 2021808 INFO  (coreLoadExecutor-5865-thread-1) [    x:collection1] o.a.s.h.l.XMLLoader xsltCacheLifetimeSeconds=60
   [junit4]   2> 2021813 INFO  (coreLoadExecutor-5865-thread-1) [    x:collection1] o.a.s.c.PluginBag requestHandler : 'lazy' created with startup=lazy 
   [junit4]   2> 2021813 INFO  (coreLoadExecutor-5865-thread-1) [    x:collection1] o.a.s.c.RequestHandlers Registered paths: /admin/mbeans,standard,lazy,/update/json/docs,/admin/luke,/export,/get,/admin/properties,/update/json,/admin/threads,/update/csv,/sql,/admin/segments,/admin/system,/replication,defaults,/config,/stream,/schema,/admin/plugins,/admin/logging,/admin/ping,/update,/admin/file
   [junit4]   2> 2021813 INFO  (coreLoadExecutor-5865-thread-1) [    x:collection1] o.a.s.c.SolrCore Using default statsCache cache: org.apache.solr.search.stats.LocalStatsCache
   [junit4]   2> 2021814 INFO  (coreLoadExecutor-5865-thread-1) [    x:collection1] o.a.s.u.CommitTracker Hard AutoCommit: disabled
   [junit4]   2> 2021814 INFO  (coreLoadExecutor-5865-thread-1) [    x:collection1] o.a.s.u.CommitTracker Soft AutoCommit: disabled
   [junit4]   2> 2021814 INFO  (coreLoadExecutor-5865-thread-1) [    x:collection1] o.a.s.u.RandomMergePolicy RandomMergePolicy wrapping class org.apache.lucene.index.LogDocMergePolicy: [LogDocMergePolicy: minMergeSize=1000, mergeFactor=17, maxMergeSize=9223372036854775807, maxMergeSizeForForcedMerge=9223372036854775807, calibrateSizeByDeletes=true, maxMergeDocs=2147483647, maxCFSSegmentSizeMB=8.796093022207999E12, noCFSRatio=0.0]
   [junit4]   2> 2021814 INFO  (coreLoadExecutor-5865-thread-1) [    x:collection1] o.a.s.c.SolrDeletionPolicy SolrDeletionPolicy.onInit: commits: num=1
   [junit4]   2> 	commit{dir=MockDirectoryWrapper(RAMDirectory@15e6bb0 lockFactory=org.apache.lucene.store.SingleInstanceLockFactory@1f849e7),segFN=segments_1,generation=1}
   [junit4]   2> 2021814 INFO  (coreLoadExecutor-5865-thread-1) [    x:collection1] o.a.s.c.SolrDeletionPolicy newest commit generation = 1
   [junit4]   2> 2021814 INFO  (coreLoadExecutor-5865-thread-1) [    x:collection1] o.a.s.s.SolrIndexSearcher Opening [Searcher@352c57[collection1] main]
   [junit4]   2> 2021815 INFO  (coreLoadExecutor-5865-thread-1) [    x:collection1] o.a.s.r.ManagedResourceStorage File-based storage initialized to use dir: C:\Users\JenkinsSlave\workspace\Lucene-Solr-trunk-Windows\solr\build\solr-core\test\J1\temp\solr.handler.TestReplicationHandler_52E3CAF9EB06AE07-001\solr-instance-001\collection1\conf
   [junit4]   2> 2021815 INFO  (coreLoadExecutor-5865-thread-1) [    x:collection1] o.a.s.r.RestManager Initializing RestManager with initArgs: {storageDir=C:\Users\JenkinsSlave\workspace\Lucene-Solr-trunk-Windows\solr\build\solr-core\test\J1\temp\solr.handler.TestReplicationHandler_52E3CAF9EB06AE07-001\solr-instance-001\collection1\conf}
   [junit4]   2> 2021815 INFO  (coreLoadExecutor-5865-thread-1) [    x:collection1] o.a.s.r.ManagedResourceStorage Reading _rest_managed.json using file:dir=C:\Users\JenkinsSlave\workspace\Lucene-Solr-trunk-Windows\solr\build\solr-core\test\J1\temp\solr.handler.TestReplicationHandler_52E3CAF9EB06AE07-001\solr-instance-001\collection1\conf
   [junit4]   2> 2021817 INFO  (coreLoadExecutor-5865-thread-1) [    x:collection1] o.a.s.r.RestManager Initializing 0 registered ManagedResources
   [junit4]   2> 2021817 INFO  (coreLoadExecutor-5865-thread-1) [    x:collection1] o.a.s.h.ReplicationHandler Replication enabled for following config files: schema.xml,xslt/dummy.xsl
   [junit4]   2> 2021817 INFO  (coreLoadExecutor-5865-thread-1) [    x:collection1] o.a.s.h.ReplicationHandler Commits will be reserved for  10000
   [junit4]   2> 2021817 INFO  (searcherExecutor-5866-thread-1-processing-x:collection1) [    x:collection1] o.a.s.c.SolrCore [collection1] Registered new searcher Searcher@352c57[collection1] main{ExitableDirectoryReader(UninvertingDirectoryReader())}
   [junit4]   2> 2021817 INFO  (coreLoadExecutor-5865-thread-1) [    x:collection1] o.a.s.c.CoreContainer registering core: collection1
   [junit4]   2> 2022439 INFO  (TEST-TestReplicationHandler.doTestReplicateAfterCoreReload-seed#[52E3CAF9EB06AE07]) [    ] o.a.s.SolrTestCaseJ4 Writing core.properties file to C:\Users\JenkinsSlave\workspace\Lucene-Solr-trunk-Windows\solr\build\solr-core\test\J1\temp\solr.handler.TestReplicationHandler_52E3CAF9EB06AE07-001\solr-instance-002\collection1
   [junit4]   2> 2022450 INFO  (TEST-TestReplicationHandler.doTestReplicateAfterCoreReload-seed#[52E3CAF9EB06AE07]) [    ] o.e.j.s.Server jetty-9.3.6.v20151106
   [junit4]   2> 2022453 INFO  (TEST-TestReplicationHandler.doTestReplicateAfterCoreReload-seed#[52E3CAF9EB06AE07]) [    ] o.e.j.s.h.ContextHandler Started o.e.j.s.ServletContextHandler@725d4f{/solr,null,AVAILABLE}
   [junit4]   2> 2022456 INFO  (TEST-TestReplicationHandler.doTestReplicateAfterCoreReload-seed#[52E3CAF9EB06AE07]) [    ] o.e.j.s.ServerConnector Started ServerConnector@1a35009{HTTP/1.1,[http/1.1]}{127.0.0.1:63260}
   [junit4]   2> 2022456 INFO  (TEST-TestReplicationHandler.doTestReplicateAfterCoreReload-seed#[52E3CAF9EB06AE07]) [    ] o.e.j.s.Server Started @2029239ms
   [junit4]   2> 2022456 INFO  (TEST-TestReplicationHandler.doTestReplicateAfterCoreReload-seed#[52E3CAF9EB06AE07]) [    ] o.a.s.c.s.e.JettySolrRunner Jetty properties: {solr.data.dir=C:\Users\JenkinsSlave\workspace\Lucene-Solr-trunk-Windows\solr\build\solr-core\test\J1\temp\solr.handler.TestReplicationHandler_52E3CAF9EB06AE07-001\solr-instance-002\collection1\data, hostContext=/solr, hostPort=63260}
   [junit4]   2> 2022457 INFO  (TEST-TestReplicationHandler.doTestReplicateAfterCoreReload-seed#[52E3CAF9EB06AE07]) [    ] o.a.s.s.SolrDispatchFilter SolrDispatchFilter.init(): sun.misc.Launcher$AppClassLoader@1d16e93
   [junit4]   2> 2022457 INFO  (TEST-TestReplicationHandler.doTestReplicateAfterCoreReload-seed#[52E3CAF9EB06AE07]) [    ] o.a.s.c.SolrResourceLoader new SolrResourceLoader for directory: 'C:\Users\JenkinsSlave\workspace\Lucene-Solr-trunk-Windows\solr\build\solr-core\test\J1\temp\solr.handler.TestReplicationHandler_52E3CAF9EB06AE07-001\solr-instance-002'
   [junit4]   2> 2022457 INFO  (TEST-TestReplicationHandler.doTestReplicateAfterCoreReload-seed#[52E3CAF9EB06AE07]) [    ] o.a.s.c.SolrResourceLoader JNDI not configured for solr (NoInitialContextEx)
   [junit4]   2> 2022457 INFO  (TEST-TestReplicationHandler.doTestReplicateAfterCoreReload-seed#[52E3CAF9EB06AE07]) [    ] o.a.s.c.SolrResourceLoader solr home defaulted to 'solr/' (could not find system property or JNDI)
   [junit4]   2> 2022458 INFO  (TEST-TestReplicationHandler.doTestReplicateAfterCoreReload-seed#[52E3CAF9EB06AE07]) [    ] o.a.s.c.SolrXmlConfig Loading container configuration from C:\Users\JenkinsSlave\workspace\Lucene-Solr-trunk-Windows\solr\build\solr-core\test\J1\temp\solr.handler.TestReplicationHandler_52E3CAF9EB06AE07-001\solr-instance-002\solr.xml
   [junit4]   2> 2022467 INFO  (TEST-TestReplicationHandler.doTestReplicateAfterCoreReload-seed#[52E3CAF9EB06AE07]) [    ] o.a.s.c.CorePropertiesLocator Config-defined core root directory: C:\Users\JenkinsSlave\workspace\Lucene-Solr-trunk-Windows\solr\build\solr-core\test\J1\temp\solr.handler.TestReplicationHandler_52E3CAF9EB06AE07-001\solr-instance-002\.
   [junit4]   2> 2022467 INFO  (TEST-TestReplicationHandler.doTestReplicateAfterCoreReload-seed#[52E3CAF9EB06AE07]) [    ] o.a.s.c.CoreContainer New CoreContainer 1532320
   [junit4]   2> 2022467 INFO  (TEST-TestReplicationHandler.doTestReplicateAfterCoreReload-seed#[52E3CAF9EB06AE07]) [    ] o.a.s.c.CoreContainer Loading cores into CoreContainer [instanceDir=C:\Users\JenkinsSlave\workspace\Lucene-Solr-trunk-Windows\solr\build\solr-core\test\J1\temp\solr.handler.TestReplicationHandler_52E3CAF9EB06AE07-001\solr-instance-002]
   [junit4]   2> 2022468 WARN  (TEST-TestReplicationHandler.doTestReplicateAfterCoreReload-seed#[52E3CAF9EB06AE07]) [    ] o.a.s.c.CoreContainer Couldn't add files from C:\Users\JenkinsSlave\workspace\Lucene-Solr-trunk-Windows\solr\build\solr-core\test\J1\temp\solr.handler.TestReplicationHandler_52E3CAF9EB06AE07-001\solr-instance-002\lib to classpath: C:\Users\JenkinsSlave\workspace\Lucene-Solr-trunk-Windows\solr\build\solr-core\test\J1\temp\solr.handler.TestReplicationHandler_52E3CAF9EB06AE07-001\solr-instance-002\lib
   [junit4]   2> 2022468 INFO  (TEST-TestReplicationHandler.doTestReplicateAfterCoreReload-seed#[52E3CAF9EB06AE07]) [    ] o.a.s.h.c.HttpShardHandlerFactory created with socketTimeout : 90000,urlScheme : ,connTimeout : 15000,maxConnectionsPerHost : 20,maxConnections : 10000,corePoolSize : 0,maximumPoolSize : 2147483647,maxThreadIdleTime : 5,sizeOfQueue : -1,fairnessPolicy : false,useRetries : false,
   [junit4]   2> 2022469 INFO  (TEST-TestReplicationHandler.doTestReplicateAfterCoreReload-seed#[52E3CAF9EB06AE07]) [    ] o.a.s.u.UpdateShardHandler Creating UpdateShardHandler HTTP client with params: socketTimeout=340000&connTimeout=45000&retry=true
   [junit4]   2> 2022469 INFO  (TEST-TestReplicationHandler.doTestReplicateAfterCoreReload-seed#[52E3CAF9EB06AE07]) [    ] o.a.s.l.LogWatcher SLF4J impl is org.slf4j.impl.Log4jLoggerFactory
   [junit4]   2> 2022469 INFO  (TEST-TestReplicationHandler.doTestReplicateAfterCoreReload-seed#[52E3CAF9EB06AE07]) [    ] o.a.s.l.LogWatcher Registering Log Listener [Log4j (org.slf4j.impl.Log4jLoggerFactory)]
   [junit4]   2> 2022469 INFO  (TEST-TestReplicationHandler.doTestReplicateAfterCoreReload-seed#[52E3CAF9EB06AE07]) [    ] o.a.s.c.CoreContainer Security conf doesn't exist. Skipping setup for authorization module.
   [junit4]   2> 2022471 INFO  (TEST-TestReplicationHandler.doTestReplicateAfterCoreReload-seed#[52E3CAF9EB06AE07]) [    ] o.a.s.c.CoreContainer No authentication plugin used.
   [junit4]   2> 2022472 INFO  (TEST-TestReplicationHandler.doTestReplicateAfterCoreReload-seed#[52E3CAF9EB06AE07]) [    ] o.a.s.c.CorePropertiesLocator Looking for core definitions underneath C:\Users\JenkinsSlave\workspace\Lucene-Solr-trunk-Windows\solr\build\solr-core\test\J1\temp\solr.handler.TestReplicationHandler_52E3CAF9EB06AE07-001\solr-instance-002\.
   [junit4]   2> 2022476 INFO  (TEST-TestReplicationHandler.doTestReplicateAfterCoreReload-seed#[52E3CAF9EB06AE07]) [    ] o.a.s.c.CoreDescriptor Created CoreDescriptor: {name=collection1, config=solrconfig.xml, loadOnStartup=true, schema=schema.xml, configSetProperties=configsetprops.json, transient=false, dataDir=data\}
   [junit4]   2> 2022476 INFO  (TEST-TestReplicationHandler.doTestReplicateAfterCoreReload-seed#[52E3CAF9EB06AE07]) [    ] o.a.s.c.CorePropertiesLocator Found core collection1 in C:\Users\JenkinsSlave\workspace\Lucene-Solr-trunk-Windows\solr\build\solr-core\test\J1\temp\solr.handler.TestReplicationHandler_52E3CAF9EB06AE07-001\solr-instance-002\.\collection1
   [junit4]   2> 2022476 INFO  (TEST-TestReplicationHandler.doTestReplicateAfterCoreReload-seed#[52E3CAF9EB06AE07]) [    ] o.a.s.c.CorePropertiesLocator Found 1 core definitions
   [junit4]   2> 2022478 INFO  (coreLoadExecutor-5875-thread-1) [    ] o.a.s.c.SolrResourceLoader new SolrResourceLoader for directory: 'C:\Users\JenkinsSlave\workspace\Lucene-Solr-trunk-Windows\solr\build\solr-core\test\J1\temp\solr.handler.TestReplicationHandler_52E3CAF9EB06AE07-001\solr-instance-002\collection1'
   [junit4]   2> 2022478 INFO  (coreLoadExecutor-5875-thread-1) [    ] o.a.s.c.SolrResourceLoader JNDI not configured for solr (NoInitialContextEx)
   [junit4]   2> 2022478 INFO  (coreLoadExecutor-5875-thread-1) [    ] o.a.s.c.SolrResourceLoader solr home defaulted to 'solr/' (could not find system property or JNDI)
   [junit4]   2> 2022478 INFO  (TEST-TestReplicationHandler.doTestReplicateAfterCoreReload-seed#[52E3CAF9EB06AE07]) [    ] o.a.s.s.SolrDispatchFilter user.dir=C:\Users\JenkinsSlave\workspace\Lucene-Solr-trunk-Windows\solr\build\solr-core\test\J1
   [junit4]   2> 2022478 INFO  (TEST-TestReplicationHandler.doTestReplicateAfterCoreReload-seed#[52E3CAF9EB06AE07]) [    ] o.a.s.s.SolrDispatchFilter SolrDispatchFilter.init() done
   [junit4]   2> 2022494 INFO  (coreLoadExecutor-5875-thread-1) [    ] o.a.s.c.SolrConfig current version of requestparams : -1
   [junit4]   2> 2022500 INFO  (coreLoadExecutor-5875-thread-1) [    ] o.a.s.c.SolrConfig Using Lucene MatchVersion: 6.0.0
   [junit4]   2> 2022509 INFO  (coreLoadExecutor-5875-thread-1) [    ] o.a.s.c.SolrConfig Loaded SolrConfig: solrconfig.xml
   [junit4]   2> 2022516 INFO  (coreLoadExecutor-5875-thread-1) [    ] o.a.s.s.IndexSchema [collection1] Schema name=test
   [junit4]   2> 2022520 INFO  (coreLoadExecutor-5875-thread-1) [    ] o.a.s.s.IndexSchema unique key field: id
   [junit4]   2> 2022525 INFO  (coreLoadExecutor-5875-thread-1) [    ] o.a.s.c.ConfigSetProperties Did not find ConfigSet properties, assuming default properties: Can't find resource 'configsetprops.json' in classpath or 'C:\Users\JenkinsSlave\workspace\Lucene-Solr-trunk-Windows\solr\build\solr-core\test\J1\temp\solr.handler.TestReplicationHandler_52E3CAF9EB06AE07-001\solr-instance-002\collection1'
   [junit4]   2> 2022525 INFO  (coreLoadExecutor-5875-thread-1) [    ] o.a.s.c.CoreContainer Creating SolrCore 'collection1' using configuration from instancedir C:\Users\JenkinsSlave\workspace\Lucene-Solr-trunk-Windows\solr\build\solr-core\test\J1\temp\solr.handler.TestReplicationHandler_52E3CAF9EB06AE07-001\solr-instance-002\.\collection1
   [junit4]   2> 2022525 INFO  (coreLoadExecutor-5875-thread-1) [    x:collection1] o.a.s.c.SolrCore org.apache.solr.core.MockDirectoryFactory
   [junit4]   2> 2022526 INFO  (coreLoadExecutor-5875-thread-1) [    x:collection1] o.a.s.c.SolrCore [[collection1] ] Opening new SolrCore at [C:\Users\JenkinsSlave\workspace\Lucene-Solr-trunk-Windows\solr\build\solr-core\test\J1\temp\solr.handler.TestReplicationHandler_52E3CAF9EB06AE07-001\solr-instance-002\collection1], dataDir=[C:\Users\JenkinsSlave\workspace\Lucene-Solr-trunk-Windows\solr\build\solr-core\test\J1\temp\solr.handler.TestReplicationHandler_52E3CAF9EB06AE07-001\solr-instance-002\.\collection1\data\]
   [junit4]   2> 2022526 INFO  (coreLoadExecutor-5875-thread-1) [    x:collection1] o.a.s.c.SolrCore JMX monitoring not detected for core: collection1
   [junit4]   2> 2022526 INFO  (coreLoadExecutor-5875-thread-1) [    x:collection1] o.a.s.c.CachingDirectoryFactory return new directory for C:\Users\JenkinsSlave\workspace\Lucene-Solr-trunk-Windows\solr\build\solr-core\test\J1\temp\solr.handler.TestReplicationHandler_52E3CAF9EB06AE07-001\solr-instance-002\.\collection1\data\
   [junit4]   2> 2022526 INFO  (coreLoadExecutor-5875-thread-1) [    x:collection1] o.a.s.c.SolrCore New index directory detected: old=null new=C:\Users\JenkinsSlave\workspace\Lucene-Solr-trunk-Windows\solr\build\solr-core\test\J1\temp\solr.handler.TestReplicationHandler_52E3CAF9EB06AE07-001\solr-instance-002\.\collection1\data\index/
   [junit4]   2> 2022526 WARN  (coreLoadExecutor-5875-thread-1) [    x:collection1] o.a.s.c.SolrCore [collection1] Solr index directory 'C:\Users\JenkinsSlave\workspace\Lucene-Solr-trunk-Windows\solr\build\solr-core\test\J1\temp\solr.handler.TestReplicationHandler_52E3CAF9EB06AE07-001\solr-instance-002\.\collection1\data\index' doesn't exist. Creating new index...
   [junit4]   2> 2022526 INFO  (coreLoadExecutor-5875-thread-1) [    x:collection1] o.a.s.c.CachingDirectoryFactory return new directory for C:\Users\JenkinsSlave\workspace\Lucene-Solr-trunk-Windows\solr\build\solr-core\test\J1\temp\solr.handler.TestReplicationHandler_52E3CAF9EB06AE07-001\solr-instance-002\.\collection1\data\index
   [junit4]   2> 2022527 INFO  (coreLoadExecutor-5875-thread-1) [    x:collection1] o.a.s.u.RandomMergePolicy RandomMergePolicy wrapping class org.apache.lucene.index.LogByteSizeMergePolicy: [LogByteSizeMergePolicy: minMergeSize=1677721, mergeFactor=18, maxMergeSize=2147483648, maxMergeSizeForForcedMerge=9223372036854775807, calibrateSizeByDeletes=true, maxMergeDocs=2147483647, maxCFSSegmentSizeMB=8.796093022207999E12, noCFSRatio=0.0]
   [junit4]   2> 2022527 INFO  (coreLoadExecutor-5875-thread-1) [    x:collection1] o.a.s.c.SolrDeletionPolicy SolrDeletionPolicy.onCommit: commits: num=1
   [junit4]   2> 	commit{dir=MockDirectoryWrapper(RAMDirectory@1542f18 lockFactory=org.apache.lucene.store.SingleInstanceLockFactory@16a6976),segFN=segments_1,generation=1}
   [junit4]   2> 2022527 INFO  (coreLoadExecutor-5875-thread-1) [    x:collection1] o.a.s.c.SolrDeletionPolicy newest commit generation = 1
   [junit4]   2> 2022529 INFO  (OldIndexDirectoryCleanupThreadForCore-collection1) [    x:collection1] o.a.s.c.SolrCore Looking for old index directories to cleanup for core collection1 in C:\Users\JenkinsSlave\workspace\Lucene-Solr-trunk-Windows\solr\build\solr-core\test\J1\temp\solr.handler.TestReplicationHandler_52E3CAF9EB06AE07-001\solr-instance-002\.\collection1\data\
   [junit4]   2> 2022532 INFO  (coreLoadExecutor-5875-thread-1) [    x:collection1] o.a.s.c.SolrCore no updateRequestProcessorChain defined as default, creating implicit default
   [junit4]   2> 2022533 INFO  (coreLoadExecutor-5875-thread-1) [    x:collection1] o.a.s.h.l.XMLLoader xsltCacheLifetimeSeconds=60
   [junit4]   2> 2022536 INFO  (coreLoadExecutor-5875-thread-1) [    x:collection1] o.a.s.h.l.XMLLoader xsltCacheLifetimeSeconds=60
   [junit4]   2> 2022537 INFO  (coreLoadExecutor-5875-thread-1) [    x:collection1] o.a.s.h.l.XMLLoader xsltCacheLifetimeSeconds=60
   [junit4]   2> 2022538 INFO  (coreLoadExecutor-5875-thread-1) [    x:collection1] o.a.s.h.l.XMLLoader xsltCacheLifetimeSeconds=60
   [junit4]   2> 2022541 INFO  (coreLoadExecutor-5875-thread-1) [    x:collection1] o.a.s.c.PluginBag requestHandler : 'lazy' created with startup=lazy 
   [junit4]   2> 2022541 INFO  (coreLoadExecutor-5875-thread-1) [    x:collection1] o.a.s.c.RequestHandlers Registered paths: /admin/mbeans,standard,lazy,/update/json/docs,/admin/luke,/export,/get,/admin/properties,/update/json,/admin/threads,/update/csv,/sql,/admin/segments,/admin/system,/replication,defaults,/config,/stream,/schema,/admin/plugins,/admin/logging,/admin/ping,/update,/admin/file
   [junit4]   2> 2022562 INFO  (coreLoadExecutor-5875-thread-1) [    x:collection1] o.a.s.c.SolrCore Using default statsCache cache: org.apache.solr.search.stats.LocalStatsCache
   [junit4]   2> 2022563 INFO  (coreLoadExecutor-5875-thread-1) [    x:collection1] o.a.s.u.CommitTracker Hard AutoCommit: disabled
   [junit4]   2> 2022563 INFO  (coreLoadExecutor-5875-thread-1) [    x:collection1] o.a.s.u.CommitTracker Soft AutoCommit: disabled
   [junit4]   2> 2022563 INFO  (coreLoadExecutor-5875-thread-1) [    x:collection1] o.a.s.u.RandomMergePolicy RandomMergePolicy wrapping class org.apache.lucene.index.LogDocMergePolicy: [LogDocMergePolicy: minMergeSize=1000, mergeFactor=17, maxMergeSize=9223372036854775807, maxMergeSizeForForcedMerge=9223372036854775807, calibrateSizeByDeletes=true, maxMergeDocs=2147483647, maxCFSSegmentSizeMB=8.796093022207999E12, noCFSRatio=0.0]
   [junit4]   2> 2022563 INFO  (coreLoadExecutor-5875-thread-1) [    x:collection1] o.a.s.c.SolrDeletionPolicy SolrDeletionPolicy.onInit: commits: num=1
   [junit4]   2> 	commit{dir=MockDirectoryWrapper(RAMDirectory@1542f18 lockFactory=org.apache.lucene.store.SingleInstanceLockFactory@16a6976),segFN=segments_1,generation=1}
   [junit4]   2> 2022563 INFO  (coreLoadExecutor-5875-thread-1) [    x:collection1] o.a.s.c.SolrDeletionPolicy newest commit generation = 1
   [junit4]   2> 2022565 INFO  (coreLoadExecutor-5875-thread-1) [    x:collection1] o.a.s.s.SolrIndexSearcher Opening [Searcher@1fe1409[collection1] main]
   [junit4]   2> 2022565 INFO  (coreLoadExecutor-5875-thread-1) [    x:collection1] o.a.s.r.ManagedResourceStorage File-based storage initialized to use dir: C:\Users\JenkinsSlave\workspace\Lucene-Solr-trunk-Windows\solr\build\solr-core\test\J1\temp\solr.handler.TestReplicationHandler_52E3CAF9EB06AE07-001\solr-instance-002\collection1\conf
   [junit4]   2> 2022565 INFO  (coreLoadExecutor-5875-thread-1) [    x:collection1] o.a.s.r.RestManager Initializing RestManager with initArgs: {storageDir=C:\Users\JenkinsSlave\workspace\Lucene-Solr-trunk-Windows\solr\build\solr-core\test\J1\temp\solr.handler.TestReplicationHandler_52E3CAF9EB06AE07-001\solr-instance-002\collection1\conf}
   [junit4]   2> 2022565 INFO  (coreLoadExecutor-5875-thread-1) [    x:collection1] o.a.s.r.ManagedResourceStorage Reading _rest_managed.json using file:dir=C:\Users\JenkinsSlave\workspace\Lucene-Solr-trunk-Windows\solr\build\solr-core\test\J1\temp\solr.handler.TestReplicationHandler_52E3CAF9EB06AE07-001\solr-instance-002\collection1\conf
   [junit4]   2> 2022566 INFO  (coreLoadExecutor-5875-thread-1) [    x:collection1] o.a.s.r.RestManager Initializing 0 registered ManagedResources
   [junit4]   2> 2022572 INFO  (coreLoadExecutor-5875-thread-1) [    x:collection1] o.a.s.h.ReplicationHandler Poll scheduled at an interval of 1000ms
   [junit4]   2> 2022572 INFO  (searcherExecutor-5876-thread-1-processing-x:collection1) [    x:collection1] o.a.s.c.SolrCore [collection1] Registered new searcher Searcher@1fe1409[collection1] main{ExitableDirectoryReader(UninvertingDirectoryReader())}
   [junit4]   2> 2022572 INFO  (coreLoadExecutor-5875-thread-1) [    x:collection1] o.a.s.c.CoreContainer registering core: collection1
   [junit4]   2> 2023187 INFO  (TEST-TestReplicationHandler.doTestReplicateAfterCoreReload-seed#[52E3CAF9EB06AE07]) [    ] o.e.j.s.ServerConnector Stopped ServerConnector@1a35009{HTTP/1.1,[http/1.1]}{127.0.0.1:0}
   [junit4]   2> 2023187 INFO  (TEST-TestReplicationHandler.doTestReplicateAfterCoreReload-seed#[52E3CAF9EB06AE07]) [    ] o.a.s.c.CoreContainer Shutting down CoreContainer instance=1532320
   [junit4]   2> 2023188 INFO  (coreCloseExecutor-5881-thread-1) [    x:collection1] o.a.s.c.SolrCore [collection1]  CLOSING SolrCore org.apache.solr.core.SolrCore@df0f70
   [junit4]   2> 2023190 INFO  (coreCloseExecutor-5881-thread-1) [    x:collection1] o.a.s.u.DirectUpdateHandler2 closing DirectUpdateHandler2{commits=0,autocommits=0,soft autocommits=0,optimizes=0,rollbacks=0,expungeDeletes=0,docsPending=0,adds=0,deletesById=0,deletesByQuery=0,errors=0,cumulative_adds=0,cumulative_deletesById=0,cumulative_deletesByQuery=0,cumulative_errors=0}
   [junit4]   2> 2023190 INFO  (coreCloseExecutor-5881-thread-1) [    x:collection1] o.a.s.u.SolrCoreState Closing SolrCoreState
   [junit4]   2> 2023190 INFO  (coreCloseExecutor-5881-thread-1) [    x:collection1] o.a.s.u.DefaultSolrCoreState SolrCoreState ref count has reached 0 - closing IndexWriter
   [junit4]   2> 2023190 INFO  (coreCloseExecutor-5881-thread-1) [    x:collection1] o.a.s.u.DefaultSolrCoreState closing IndexWriter with IndexWriterCloser
   [junit4]   2> 2023190 INFO  (coreCloseExecutor-5881-thread-1) [    x:collection1] o.a.s.c.SolrCore [collection1] Closing main searcher on request.
   [junit4]   2> 2023190 INFO  (coreCloseExecutor-5881-thread-1) [    x:collection1] o.a.s.c.CachingDirectoryFactory Closing MockDirectoryFactory - 2 directories currently being tracked
   [junit4]   2> 2023190 INFO  (coreCloseExecutor-5881-thread-1) [    x:collection1] o.a.s.c.CachingDirectoryFactory looking to close C:\Users\JenkinsSlave\workspace\Lucene-Solr-trunk-Windows\solr\build\solr-core\test\J1\temp\solr.handler.TestReplicationHandler_52E3CAF9EB06AE07-001\solr-instance-002\.\collection1\data\index [CachedDir<<refCount=0;path=C:\Users\JenkinsSlave\workspace\Lucene-Solr-trunk-Windows\solr\build\solr-core\test\J1\temp\solr.handler.TestReplicationHandler_52E3CAF9EB06AE07-001\solr-instance-002\.\collection1\data\index;done=false>>]
   [junit4]   2> 2023190 INFO  (coreCloseExecutor-5881-thread-1) [    x:collection1] o.a.s.c.CachingDirectoryFactory Closing directory: C:\Users\JenkinsSlave\workspace\Lucene-Solr-trunk-Windows\solr\build\solr-core\test\J1\temp\solr.handler.TestReplicationHandler_52E3CAF9EB06AE07-001\solr-instance-002\.\collection1\data\index
   [junit4]   2> 2023190 INFO  (coreCloseExecutor-5881-thread-1) [    x:collection1] o.a.s.c.CachingDirectoryFactory looking to close C:\Users\JenkinsSlave\workspace\Lucene-Solr-trunk-Windows\solr\build\solr-core\test\J1\temp\solr.handler.TestReplicationHandler_52E3CAF9EB06AE07-001\solr-instance-002\.\collection1\data\ [CachedDir<<refCount=0;path=C:\Users\JenkinsSlave\workspace\Lucene-Solr-trunk-Windows\solr\build\solr-core\test\J1\temp\solr.handler.TestReplicationHandler_52E3CAF9EB06AE07-001\solr-instance-002\.\collection1\data\;done=false>>]
   [junit4]   2> 2023191 INFO  (coreCloseExecutor-5881-thread-1) [    x:collection1] o.a.s.c.CachingDirectoryFactory Closing directory: C:\Users\JenkinsSlave\workspace\Lucene-Solr-trunk-Windows\solr\build\solr-core\test\J1\temp\solr.handler.TestReplicationHandler_52E3CAF9EB06AE07-001\solr-instance-002\.\collection1\data\
   [junit4]   2> 2023193 INFO  (TEST-TestReplicationHandler.doTestReplicateAfterCoreReload-seed#[52E3CAF9EB06AE07]) [    ] o.e.j.s.h.ContextHandler Stopped o.e.j.s.ServletContextHandler@725d4f{/solr,null,UNAVAILABLE}
   [junit4]   2> 2023198 INFO  (TEST-TestReplicationHandler.doTestReplicateAfterCoreReload-seed#[52E3CAF9EB06AE07]) [    ] o.e.j.s.ServerConnector Stopped ServerConnector@66b2f3{HTTP/1.1,[http/1.1]}{127.0.0.1:0}
   [junit4]   2> 2023198 INFO  (TEST-TestReplicationHandler.doTestReplicateAfterCoreReload-seed#[52E3CAF9EB06AE07]) [    ] o.a.s.c.CoreContainer Shutting down CoreContainer instance=33128705
   [junit4]   2> 2023198 INFO  (coreCloseExecutor-5882-thread-1) [    x:collection1] o.a.s.c.SolrCore [collection1]  CLOSING SolrCore org.apache.solr.core.SolrCore@faadda
   [junit4]   2> 2023198 INFO  (coreCloseExecutor-5882-thread-1) [    x:collection1] o.a.s.u.DirectUpdateHandler2 closing DirectUpdateHandler2{commits=0,autocommits=0,soft autocommits=0,optimizes=0,rollbacks=0,expungeDeletes=0,docsPending=0,adds=0,deletesById=0,deletesByQuery=0,errors=0,cumulative_adds=0,cumulative_deletesById=0,cumulative_deletesByQuery=0,cumulative_errors=0}
   [junit4]   2> 2023198 INFO  (coreCloseExecutor-5882-thread-1) [    x:collection1] o.a.s.u.SolrCoreState Closing SolrCoreState
   [junit4]   2> 2023198 INFO  (coreCloseExecutor-5882-thread-1) [    x:collection1] o.a.s.u.DefaultSolrCoreState SolrCoreState ref count has reached 0 - closing IndexWriter
   [junit4]   2> 2023198 INFO  (coreCloseExecutor-5882-thread-1) [    x:collection1] o.a.s.u.DefaultSolrCoreState closing IndexWriter with IndexWriterCloser
   [junit4]   2> 2023200 INFO  (coreCloseExecutor-5882-thread-1) [    x:collection1] o.a.s.c.SolrCore [collection1] Closing main searcher on request.
   [junit4]   2> 2023200 INFO  (coreCloseExecutor-5882-thread-1) [    x:collection1] o.a.s.c.CachingDirectoryFactory Closing MockDirectoryFactory - 2 directories currently being tracked
   [junit4]   2> 2023200 INFO  (coreCloseExecutor-5882-thread-1) [    x:collection1] o.a.s.c.CachingDirectoryFactory looking to close C:\Users\JenkinsSlave\workspace\Lucene-Solr-trunk-Windows\solr\build\solr-core\test\J1\temp\solr.handler.TestReplicationHandler_52E3CAF9EB06AE07-001\solr-instance-001\.\collection1\data\ [CachedDir<<refCount=0;path=C:\Users\JenkinsSlave\workspace\Lucene-Solr-trunk-Windows\solr\build\solr-core\test\J1\temp\solr.handler.TestReplicationHandler_52E3CAF9EB06AE07-001\solr-instance-001\.\collection1\data\;done=false>>]
   [junit4]   2> 2023200 INFO  (coreCloseExecutor-5882-thread-1) [    x:collection1] o.a.s.c.CachingDirectoryFactory Closing directory: C:\Users\JenkinsSlave\workspace\Lucene-Solr-trunk-Windows\solr\build\solr-core\test\J1\temp\solr.handler.TestReplicationHandler_52E3CAF9EB06AE07-001\solr-instance-001\.\collection1\data\
   [junit4]   2> 2023200 INFO  (coreCloseExecutor-5882-thread-1) [    x:collection1] o.a.s.c.CachingDirectoryFactory looking to close C:\Users\JenkinsSlave\workspace\Lucene-Solr-trunk-Windows\solr\build\solr-core\test\J1\temp\solr.handler.TestReplicationHandler_52E3CAF9EB06AE07-001\solr-instance-001\.\collection1\data\index [CachedDir<<refCount=0;path=C:\Users\JenkinsSlave\workspace\Lucene-Solr-trunk-Windows\solr\build\solr-core\test\J1\temp\solr.handler.TestReplicationHandler_52E3CAF9EB06AE07-001\solr-instance-001\.\collection1\data\index;done=false>>]
   [junit4]   2> 2023200 INFO  (coreCloseExecutor-5882-thread-1) [    x:collection1] o.a.s.c.CachingDirectoryFactory Closing directory: C:\Users\JenkinsSlave\workspace\Lucene-Solr-trunk-Windows\solr\build\solr-core\test\J1\temp\solr.handler.TestReplicationHandler_52E3CAF9EB06AE07-001\solr-instance-001\.\collection1\data\index
   [junit4]   2> 2023201 INFO  (TEST-TestReplicationHandler.doTestReplicateAfterCoreReload-seed#[52E3CAF9EB06AE07]) [    ] o.e.j.s.h.ContextHandler Stopped o.e.j.s.ServletContextHandler@8fef7b{/solr,null,UNAVAILABLE}
   [junit4]   2> 2023209 INFO  (TEST-TestReplicationHandler.doTestReplicateAfterCoreReload-seed#[52E3CAF9EB06AE07]) [    ] o.e.j.s.Server jetty-9.3.6.v20151106
   [junit4]   2> 2023212 INFO  (TEST-TestReplicationHandler.doTestReplicateAfterCoreReload-seed#[52E3CAF9EB06AE07]) [    ] o.e.j.s.h.ContextHandler Started o.e.j.s.ServletContextHandler@88d86b{/solr,null,AVAILABLE}
   [junit4]   2> 2023213 INFO  (TEST-TestReplicationHandler.doTestReplicateAfterCoreReload-seed#[52E3CAF9EB06AE07]) [    ] o.e.j.s.ServerConnector Started ServerConnector@1aef479{HTTP/1.1,[http/1.1]}{127.0.0.1:63263}
   [junit4]   2> 2023213 INFO  (TEST-TestReplicationHandler.doTestReplicateAfterCoreReload-seed#[52E3CAF9EB06AE07]) [    ] o.e.j.s.Server Started @2029775ms
   [junit4]   2> 2023213 INFO  (TEST-TestReplicationHandler.doTestReplicateAfterCoreReload-seed#[52E3CAF9EB06AE07]) [    ] o.a.s.c.s.e.JettySolrRunner Jetty properties: {solr.data.dir=C:\Users\JenkinsSlave\workspace\Lucene-Solr-trunk-Windows\solr\build\solr-core\test\J1\temp\solr.handler.TestReplicationHandler_52E3CAF9EB06AE07-001\solr-instance-001\collection1\data, hostContext=/solr, hostPort=63263}
   [junit4]   2> 2023215 INFO  (TEST-TestReplicationHandler.doTestReplicateAfterCoreReload-seed#[52E3CAF9EB06AE07]) [    ] o.a.s.s.SolrDispatchFilter SolrDispatchFilter.init(): sun.misc.Launcher$AppClassLoader@1d16e93
   [junit4]   2> 2023215 INFO  (TEST-TestReplicationHandler.doTestReplicateAfterCoreReload-seed#[52E3CAF9EB06AE07]) [    ] o.a.s.c.SolrResourceLoader new SolrResourceLoader for directory: 'C:\Users\JenkinsSlave\workspace\Lucene-Solr-trunk-Windows\solr\build\solr-core\test\J1\temp\solr.handler.TestReplicationHandler_52E3CAF9EB06AE07-001\solr-instance-001'
   [junit4]   2> 2023215 INFO  (TEST-TestReplicationHandler.doTestReplicateAfterCoreReload-seed#[52E3CAF9EB06AE07]) [    ] o.a.s.c.SolrResourceLoader JNDI not configured for solr (NoInitialContextEx)
   [junit4]   2> 2023215 INFO  (TEST-TestReplicationHandler.doTestReplicateAfterCoreReload-seed#[52E3CAF9EB06AE07]) [    ] o.a.s.c.SolrResourceLoader solr home defaulted to 'solr/' (could not find system property or JNDI)
   [junit4]   2> 2023215 INFO  (TEST-TestReplicationHandler.doTestReplicateAfterCoreReload-seed#[52E3CAF9EB06AE07]) [    ] o.a.s.c.SolrXmlConfig Loading container configuration from C:\Users\JenkinsSlave\workspace\Lucene-Solr-trunk-Windows\solr\build\solr-core\test\J1\temp\solr.handler.TestReplicationHandler_52E3CAF9EB06AE07-001\solr-instance-001\solr.xml
   [junit4]   2> 2023224 INFO  (TEST-TestReplicationHandler.doTestReplicateAfterCoreReload-seed#[52E3CAF9EB06AE07]) [    ] o.a.s.c.CorePropertiesLocator Config-defined core root directory: C:\Users\JenkinsSlave\workspace\Lucene-Solr-trunk-Windows\solr\build\solr-core\test\J1\temp\solr.handler.TestReplicationHandler_52E3CAF9EB06AE07-001\solr-instance-001\.
   [junit4]   2> 2023224 INFO  (TEST-TestReplicationHandler.doTestReplicateAfterCoreReload-seed#[52E3CAF9EB06AE07]) [    ] o.a.s.c.CoreContainer New CoreContainer 18926048
   [junit4]   2> 2023224 INFO  (TEST-TestReplicationHandler.doTestReplicateAfterCoreReload-seed#[52E3CAF9EB06AE07]) [    ] o.a.s.c.CoreContainer Loading cores into CoreContainer [instanceDir=C:\Users\JenkinsSlave\workspace\Lucene-Solr-trunk-Windows\solr\build\solr-core\test\J1\temp\solr.handler.TestReplicationHandler_52E3CAF9EB06AE07-001\solr-instance-001]
   [junit4]   2> 2023224 WARN  (TEST-TestReplicationHandler.doTestReplicateAfterCoreReload-seed#[52E3CAF9EB06AE07]) [    ] o.a.s.c.CoreContainer Couldn't add files from C:\Users\JenkinsSlave\workspace\Lucene-Solr-trunk-Windows\solr\build\solr-core\test\J1\temp\solr.handler.TestReplicationHandler_52E3CAF9EB06AE07-001\solr-instance-001\lib to classpath: C:\Users\JenkinsSlave\workspace\Lucene-Solr-trunk-Windows\solr\build\solr-core\test\J1\temp\solr.handler.TestReplicationHandler_52E3CAF9EB06AE07-001\solr-instance-001\lib
   [junit4]   2> 2023224 INFO  (TEST-TestReplicationHandler.doTestReplicateAfterCoreReload-seed#[52E3CAF9EB06AE07]) [    ] o.a.s.h.c.HttpShardHandlerFactory created with socketTimeout : 90000,urlScheme : ,connTimeout : 15000,maxConnectionsPerHost : 20,maxConnections : 10000,corePoolSize : 0,maximumPoolSize : 2147483647,maxThreadIdleTime : 5,sizeOfQueue : -1,fairnessPolicy : false,useRetries : false,
   [junit4]   2> 2023226 INFO  (TEST-TestReplicationHandler.doTestReplicateAfterCoreReload-seed#[52E3CAF9EB06AE07]) [    ] o.a.s.u.UpdateShardHandler Creating UpdateShardHandler HTTP client with params: socketTimeout=340000&connTimeout=45000&retry=true
   [junit4]   2> 2023227 INFO  (TEST-TestReplicationHandler.doTestReplicateAfterCoreReload-seed#[52E3CAF9EB06AE07]) [    ] o.a.s.l.LogWatcher SLF4J impl is org.slf4j.impl.Log4jLoggerFactory
   [junit4]   2> 2023227 INFO  (TEST-TestReplicationHandler.doTestReplicateAfterCoreReload-seed#[52E3CAF9EB06AE07]) [    ] o.a.s.l.LogWatcher Registering Log Listener [Log4j (org.slf4j.impl.Log4jLoggerFactory)]
   [junit4]   2> 2023227 INFO  (TEST-TestReplicationHandler.doTestReplicateAfterCoreReload-seed#[52E3CAF9EB06AE07]) [    ] o.a.s.c.CoreContainer Security conf doesn't exist. Skipping setup for authorization module.
   [junit4]   2> 2023227 INFO  (TEST-TestReplicationHandler.doTestReplicateAfterCoreReload-seed#[52E3CAF9EB06AE07]) [    ] o.a.s.c.CoreContainer No authentication plugin used.
   [junit4]   2> 2023228 INFO  (TEST-TestReplicationHandler.doTestReplicateAfterCoreReload-seed#[52E3CAF9EB06AE07]) [    ] o.a.s.c.CorePropertiesLocator Looking for core definitions underneath C:\Users\JenkinsSlave\workspace\Lucene-Solr-trunk-Windows\solr\build\solr-core\test\J1\temp\solr.handler.TestReplicationHandler_52E3CAF9EB06AE07-001\solr-instance-001\.
   [junit4]   2> 2023230 INFO  (TEST-TestReplicationHandler.doTestReplicateAfterCoreReload-seed#[52E3CAF9EB06AE07]) [    ] o.a.s.c.CoreDescriptor Created CoreDescriptor: {name=collection1, config=solrconfig.xml, loadOnStartup=true, schema=schema.xml, configSetProperties=configsetprops.json, transient=false, dataDir=data\}
   [junit4]   2> 2023230 INFO  (TEST-TestReplicationHandler.doTestReplicateAfterCoreReload-seed#[52E3CAF9EB06AE07]) [    ] o.a.s.c.CorePropertiesLocator Found core collection1 in C:\Users\JenkinsSlave\workspace\Lucene-Solr-trunk-Windows\solr\build\solr-core\test\J1\temp\solr.handler.TestReplicationHandler_52E3CAF9EB06AE07-001\solr-instance-001\.\collection1
   [junit4]   2> 2023231 INFO  (TEST-TestReplicationHandler.doTestReplicateAfterCoreReload-seed#[52E3CAF9EB06AE07]) [    ] o.a.s.c.CorePropertiesLocator Found 1 core definitions
   [junit4]   2> 2023231 INFO  (coreLoadExecutor-5888-thread-1) [    ] o.a.s.c.SolrResourceLoader new SolrResourceLoader for directory: 'C:\Users\JenkinsSlave\workspace\Lucene-Solr-trunk-Windows\solr\build\solr-core\test\J1\temp\solr.handler.TestReplicationHandler_52E3CAF9EB06AE07-001\solr-instance-001\collection1'
   [junit4]   2> 2023231 INFO  (coreLoadExecutor-5888-thread-1) [    ] o.a.s.c.SolrResourceLoader JNDI not configured for solr (NoInitialContextEx)
   [junit4]   2> 2023231 INFO  (coreLoadExecutor-5888-thread-1) [    ] o.a.s.c.SolrResourceLoader solr home defaulted to 'solr/' (could not find system property or JNDI)
   [junit4]   2> 2023233 INFO  (TEST-TestReplicationHandler.doTestReplicateAfterCoreReload-seed#[52E3CAF9EB06AE07]) [    ] o.a.s.s.SolrDispatchFilter user.dir=C:\Users\JenkinsSlave\workspace\Lucene-Solr-trunk-Windows\solr\build\solr-core\test\J1
   [junit4]   2> 2023233 INFO  (TEST-TestReplicationHandler.doTestReplicateAfterCoreReload-seed#[52E3CAF9EB06AE07]) [    ] o.a.s.s.SolrDispatchFilter SolrDispatchFilter.init() done
   [junit4]   2> 2023245 INFO  (coreLoadExecutor-5888-thread-1) [    ] o.a.s.c.SolrConfig current version of requestparams : -1
   [junit4]   2> 2023249 INFO  (coreLoadExecutor-5888-thread-1) [    ] o.a.s.c.SolrConfig Using Lucene MatchVersion: 6.0.0
   [junit4]   2> 2023260 INFO  (coreLoadExecutor-5888-thread-1) [    ] o.a.s.c.SolrConfig Loaded SolrConfig: solrconfig.xml
   [junit4]   2> 2023266 INFO  (coreLoadExecutor-5888-thread-1) [    ] o.a.s.s.IndexSchema [collection1] Schema name=test
   [junit4]   2> 2023270 INFO  (coreLoadExecutor-5888-thread-1) [    ] o.a.s.s.IndexSchema unique key field: id
   [junit4]   2> 2023271 INFO  (coreLoadExecutor-5888-thread-1) [    ] o.a.s.c.ConfigSetProperties Did not find ConfigSet properties, assuming default properties: Can't find resource 'configsetprops.json' in classpath or 'C:\Users\JenkinsSlave\workspace\Lucene-Solr-trunk-Windows\solr\build\solr-core\test\J1\temp\solr.handler.TestReplicationHandler_52E3CAF9EB06AE07-001\solr-instance-001\collection1'
   [junit4]   2> 2023271 INFO  (coreLoadExecutor-5888-thread-1) [    ] o.a.s.c.CoreContainer Creating SolrCore 'collection1' using configuration from instancedir C:\Users\JenkinsSlave\workspace\Lucene-Solr-trunk-Windows\solr\build\solr-core\test\J1\temp\solr.handler.TestReplicationHandler_52E3CAF9EB06AE07-001\solr-instance-001\.\collection1
   [junit4]   2> 2023273 INFO  (coreLoadExecutor-5888-thread-1) [    x:collection1] o.a.s.c.SolrCore org.apache.solr.core.MockDirectoryFactory
   [junit4]   2> 2023273 INFO  (coreLoadExecutor-5888-thread-1) [    x:collection1] o.a.s.c.SolrCore [[collection1] ] Opening new SolrCore at [C:\Users\JenkinsSlave\workspace\Lucene-Solr-trunk-Windows\solr\build\solr-core\test\J1\temp\solr.handler.TestReplicationHandler_52E3CAF9EB06AE07-001\solr-instance-001\collection1], dataDir=[C:\Users\JenkinsSlave\workspace\Lucene-Solr-trunk-Windows\solr\build\solr-core\test\J1\temp\solr.handler.TestReplicationHandler_52E3CAF9EB06AE07-001\solr-instance-001\.\collection1\data\]
   [junit4]   2> 2023273 INFO  (coreLoadExecutor-5888-thread-1) [    x:collection1] o.a.s.c.SolrCore JMX monitoring not detected for core: collection1
   [junit4]   2> 2023273 INFO  (coreLoadExecutor-5888-thread-1) [    x:collection1] o.a.s.c.CachingDirectoryFactory return new directory for C:\Users\JenkinsSlave\workspace\Lucene-Solr-trunk-Windows\solr\build\solr-core\test\J1\temp\solr.handler.TestReplicationHandler_52E3CAF9EB06AE07-001\solr-instance-001\.\collection1\data\
   [junit4]   2> 2023273 INFO  (coreLoadExecutor-5888-thread-1) [    x:collection1] o.a.s.c.SolrCore New index directory detected: old=null new=C:\Users\JenkinsSlave\workspace\Lucene-Solr-trunk-Windows\solr\build\solr-core\test\J1\temp\solr.handler.TestReplicationHandler_52E3CAF9EB06AE07-001\solr-instance-001\.\collection1\data\index/
   [junit4]   2> 2023273 WARN  (coreLoadExecutor-5888-thread-1) [    x:collection1] o.a.s.c.SolrCore [collection1] Solr index directory 'C:\Users\JenkinsSlave\workspace\Lucene-Solr-trunk-Windows\solr\build\solr-core\test\J1\temp\solr.handler.TestReplicationHandler_52E3CAF9EB06AE07-001\solr-instance-001\.\collection1\data\index' doesn't exist. Creating new index...
   [junit4]   2> 2023274 INFO  (coreLoadExecutor-5888-thread-1) [    x:collection1] o.a.s.c.CachingDirectoryFactory return new directory for C:\Users\JenkinsSlave\workspace\Lucene-Solr-trunk-Windows\solr\build\solr-core\test\J1\temp\solr.handler.TestReplicationHandler_52E3CAF9EB06AE07-001\solr-instance-001\.\collection1\data\index
   [junit4]   2> 2023274 INFO  (coreLoadExecutor-5888-thread-1) [    x:collection1] o.a.s.u.RandomMergePolicy RandomMergePolicy wrapping class org.apache.lucene.index.LogByteSizeMergePolicy: [LogByteSizeMergePolicy: minMergeSize=1677721, mergeFactor=18, maxMergeSize=2147483648, maxMergeSizeForForcedMerge=9223372036854775807, calibrateSizeByDeletes=true, maxMergeDocs=2147483647, maxCFSSegmentSizeMB=8.796093022207999E12, noCFSRatio=0.0]
   [junit4]   2> 2023274 INFO  (coreLoadExecutor-5888-thread-1) [    x:collection1] o.a.s.c.SolrDeletionPolicy SolrDeletionPolicy.onCommit: commits: num=1
   [junit4]   2> 	commit{dir=MockDirectoryWrapper(RAMDirectory@4c5e3a lockFactory=org.apache.lucene.store.SingleInstanceLockFactory@f642c),segFN=segments_1,generation=1}
   [junit4]   2> 2023274 INFO  (coreLoadExecutor-5888-thread-1) [    x:collection1] o.a.s.c.SolrDeletionPolicy newest commit generation = 1
   [junit4]   2> 2023275 INFO  (OldIndexDirectoryCleanupThreadForCore-collection1) [    x:collection1] o.a.s.c.SolrCore Looking for old index directories to cleanup for core collection1 in C:\Users\JenkinsSlave\workspace\Lucene-Solr-trunk-Windows\solr\build\solr-core\test\J1\temp\solr.handler.TestReplicationHandler_52E3CAF9EB06AE07-001\solr-instance-001\.\collection1\data\
   [junit4]   2> 2023277 INFO  (coreLoadExecutor-5888-thread-1) [    x:collection1] o.a.s.c.SolrCore no updateRequestProcessorChain defined as default, creating implicit default
   [junit4]   2> 2023281 INFO  (coreLoadExecutor-5888-thread-1) [    x:collection1] o.a.s.h.l.XMLLoader xsltCacheLifetimeSeconds=60
   [junit4]   2> 2023282 INFO  (coreLoadExecutor-5888-thread-1) [    x:collection1] o.a.s.h.l.XMLLoader xsltCacheLifetimeSeconds=60
   [junit4]   2> 2023284 INFO  (coreLoadExecutor-5888-thread-1) [    x:collection1] o.a.s.h.l.XMLLoader xsltCacheLifetimeSeconds=60
   [junit4]   2> 2023285 INFO  (coreLoadExecutor-5888-thread-1) [    x:collection1] o.a.s.h.l.XMLLoader xsltCacheLifetimeSeconds=60
   [junit4]   2> 2023289 INFO  (coreLoadExecutor-5888-thread-1) [    x:collection1] o.a.s.c.PluginBag requestHandler : 'lazy' created with startup=lazy 
   [junit4]   2> 2023289 INFO  (coreLoadExecutor-5888-thread-1) [    x:collection1] o.a.s.c.RequestHandlers Registered paths: /admin/mbeans,standard,lazy,/update/json/docs,/admin/luke,/export,/get,/admin/properties,/update/json,/admin/threads,/update/csv,/sql,/admin/segments,/admin/system,/replication,defaults,/config,/stream,/schema,/admin/plugins,/admin/logging,/admin/ping,/update,/admin/file
   [junit4]   2> 2023289 INFO  (coreLoadExecutor-5888-thread-1) [    x:collection1] o.a.s.c.SolrCore Using default statsCache cache: org.apache.solr.search.stats.LocalStatsCache
   [junit4]   2> 2023291 INFO  (coreLoadExecutor-5888-thread-1) [    x:collection1] o.a.s.u.CommitTracker Hard AutoCommit: disabled
   [junit4]   2> 2023291 INFO  (coreLoadExecutor-5888-thread-1) [    x:collection1] o.a.s.u.CommitTracker Soft AutoCommit: disabled
   [junit4]   2> 2023291 INFO  (coreLoadExecutor-5888-thread-1) [    x:collection1] o.a.s.u.RandomMergePolicy RandomMergePolicy wrapping class org.apache.lucene.index.LogDocMergePolicy: [LogDocMergePolicy: minMergeSize=1000, mergeFactor=17, maxMergeSize=9223372036854775807, maxMergeSizeForForcedMerge=9223372036854775807, calibrateSizeByDeletes=true, maxMergeDocs=2147483647, maxCFSSegmentSizeMB=8.796093022207999E12, noCFSRatio=0.0]
   [junit4]   2> 2023291 INFO  (coreLoadExecutor-5888-thread-1) [    x:collection1] o.a.s.c.SolrDeletionPolicy SolrDeletionPolicy.onInit: commits: num=1
   [junit4]   2> 	commit{dir=MockDirectoryWrapper(RAMDirectory@4c5e3a lockFactory=org.apache.lucene.store.SingleInstanceLockFactory@f642c),segFN=segments_1,generation=1}
   [junit4]   2> 2023291 INFO  (coreLoadExecutor-5888-thread-1) [    x:collection1] o.a.s.c.SolrDeletionPolicy newest commit generation = 1
   [junit4]   2> 2023291 INFO  (coreLoadExecutor-5888-thread-1) [    x:collection1] o.a.s.s.SolrIndexSearcher Opening [Searcher@ac6e30[collection1] main]
   [junit4]   2> 2023292 INFO  (coreLoadExecutor-5888-thread-1) [    x:collection1] o.a.s.r.ManagedResourceStorage File-based storage initialized to use dir: C:\Users\JenkinsSlave\workspace\Lucene-Solr-trunk-Windows\solr\build\solr-core\test\J1\temp\solr.handler.TestReplicationHandler_52E3CAF9EB06AE07-001\solr-instance-001\collection1\conf
   [junit4]   2> 2023292 INFO  (coreLoadExecutor-5888-thread-1) [    x:collection1] o.a.s.r.RestManager Initializing RestManager with initArgs: {storageDir=C:\Users\JenkinsSlave\workspace\Lucene-Solr-trunk-Windows\solr\build\solr-core\test\J1\temp\solr.handler.TestReplicationHandler_52E3CAF9EB06AE07-001\solr-instance-001\collection1\conf}
   [junit4]   2> 2023292 INFO  (coreLoadExecutor-5888-thread-1) [    x:collection1] o.a.s.r.ManagedResourceStorage Reading _rest_managed.json using file:dir=C:\Users\JenkinsSlave\workspace\Lucene-Solr-trunk-Windows\solr\build\solr-core\test\J1\temp\solr.handler.TestReplicationHandler_52E3CAF9EB06AE07-001\solr-instance-001\collection1\conf
   [junit4]   2> 2023292 INFO  (coreLoadExecutor-5888-thread-1) [    x:collection1] o.a.s.r.RestManager Initializing 0 registered ManagedResources
   [junit4]   2> 2023292 INFO  (coreLoadExecutor-5888-thread-1) [    x:collection1] o.a.s.h.ReplicationHandler Replication enabled for following config files: schema.xml
   [junit4]   2> 2023292 INFO  (coreLoadExecutor-5888-thread-1) [    x:collection1] o.a.s.h.ReplicationHandler Commits will be reserved for  10000
   [junit4]   2> 2023293 INFO  (searcherExecutor-5889-thread-1-processing-x:collection1) [    x:collection1] o.a.s.c.SolrCore [collection1] Registered new searcher Searcher@ac6e30[collection1] main{ExitableDirectoryReader(UninvertingDirectoryReader())}
   [junit4]   2> 2023293 INFO  (coreLoadExecutor-5888-thread-1) [    x:collection1] o.a.s.c.CoreContainer registering core: collection1
   [junit4]   2> 2023949 INFO  (qtp17763956-14001) [    x:collection1] o.a.s.u.DirectUpdateHandler2 [collection1] REMOVING ALL DOCUMENTS FROM INDEX
   [junit4]   2> 2023949 INFO  (qtp17763956-14001) [    x:collection1] o.a.s.u.p.LogUpdateProcessorFactory [collection1]  webapp=/solr path=/update params={wt=javabin&version=2}{deleteByQuery=*:*} 0 1
   [junit4]   2> 2023953 INFO  (qtp17763956-14002) [    x:collection1] o.a.s.u.DirectUpdateHandler2 start commit{,optimize=false,openSearcher=true,waitSearcher=true,expungeDeletes=false,softCommit=false,prepareCommit=false}
   [junit4]   2> 2023954 INFO  (qtp17763956-14002) [    x:collection1] o.a.s.c.SolrDeletionPolicy SolrDeletionPolicy.onCommit: commits: num=2
   [junit4]   2> 	commit{dir=MockDirectoryWrapper(RAMDirectory@4c5e3a lockFactory=org.apache.lucene.store.SingleInstanceLockFactory@f642c),segFN=segments_1,generation=1}
   [junit4]   2> 	commit{dir=MockDirectoryWrapper(RAMDirectory@4c5e3a lockFactory=org.apache.lucene.store.SingleInstanceLockFactory@f642c),segFN=segments_2,generation=2}
   [junit4]   2> 2023954 INFO  (qtp17763956-14002) [    x:collection1] o.a.s.c.SolrDeletionPolicy newest commit generation = 2
   [junit4]   2> 2023954 INFO  (qtp17763956-14002) [    x:collection1] o.a.s.s.SolrIndexSearcher Opening [Searcher@1ff4d62[collection1] main]
   [junit4]   2> 2023956 INFO  (qtp17763956-14002) [    x:collection1] o.a.s.u.DirectUpdateHandler2 end_commit_flush
   [junit4]   2> 2023956 INFO  (searcherExecutor-5889-thread-1-processing-x:collection1) [    x:collection1] o.a.s.c.SolrCore [collection1] Registered new searcher Searcher@1ff4d62[collection1] main{ExitableDirectoryReader(UninvertingDirectoryReader())}
   [junit4]   2> 2023956 INFO  (qtp17763956-14002) [    x:collection1] o.a.s.u.p.LogUpdateProcessorFactory [collection1]  webapp=/solr path=/update params={waitSearcher=true&commit=true&softCommit=false&wt=javabin&version=2}{commit=} 0 1
   [junit4]   2> 2023959 INFO  (qtp17763956-14003) [    x:collection1] o.a.s.c.S.Request [collection1]  webapp=/solr path=/select params={q=*:*&sort=id+desc&wt=javabin&version=2} hits=0 status=0 QTime=0
   [junit4]   2> 2023960 INFO  (TEST-TestReplicationHandler.doTestReplicateAfterCoreReload-seed#[52E3CAF9EB06AE07]) [    ] o.a.s.h.TestReplicationHandler Waited for 0ms and found 0 docs
   [junit4]   2> 2023961 INFO  (TEST-TestReplicationHandler.doTestReplicateAfterCoreReload-seed#[52E3CAF9EB06AE07]) [    ] o.e.j.s.Server jetty-9.3.6.v20151106
   [junit4]   2> 2023967 INFO  (TEST-TestReplicationHandler.doTestReplicateAfterCoreReload-seed#[52E3CAF9EB06AE07]) [    ] o.e.j.s.h.ContextHandler Started o.e.j.s.ServletContextHandler@15b67ee{/solr,null,AVAILABLE}
   [junit4]   2> 2023968 INFO  (TEST-TestReplicationHandler.doTestReplicateAfterCoreReload-seed#[52E3CAF9EB06AE07]) [    ] o.e.j.s.ServerConnector Started ServerConnector@b93b1a{HTTP/1.1,[http/1.1]}{127.0.0.1:63267}
   [junit4]   2> 2023968 INFO  (TEST-TestReplicationHandler.doTestReplicateAfterCoreReload-seed#[52E3CAF9EB06AE07]) [    ] o.e.j.s.Server Started @2030309ms
   [junit4]   2> 2023968 INFO  (TEST-TestReplicationHandler.doTestReplicateAfterCoreReload-seed#[52E3CAF9EB06AE07]) [    ] o.a.s.c.s.e.JettySolrRunner Jetty properties: {solr.data.dir=C:\Users\JenkinsSlave\workspace\Lucene-Solr-trunk-Windows\solr\build\solr-core\test\J1\temp\solr.handler.TestReplicationHandler_52E3CAF9EB06AE07-001\solr-instance-002\collection1\data, hostContext=/solr, hostPort=63267}
   [junit4]   2> 2023968 INFO  (TEST-TestReplicationHandler.doTestReplicateAfterCoreReload-seed#[52E3CAF9EB06AE07]) [    ] o.a.s.s.SolrDispatchFilter SolrDispatchFilter.init(): sun.misc.Launcher$AppClassLoader@1d16e93
   [junit4]   2> 2023968 INFO  (TEST-TestReplicationHandler.doTestReplicateAfterCoreReload-seed#[52E3CAF9EB06AE07]) [    ] o.a.s.c.SolrResourceLoader new SolrResourceLoader for directory: 'C:\Users\JenkinsSlave\workspace\Lucene-Solr-trunk-Windows\solr\build\solr-core\test\J1\temp\solr.handler.TestReplicationHandler_52E3CAF9EB06AE07-001\solr-instance-002'
   [junit4]   2> 2023968 INFO  (TEST-TestReplicationHandler.doTestReplicateAfterCoreReload-seed#[52E3CAF9EB06AE07]) [    ] o.a.s.c.SolrResourceLoader JNDI not configured for solr (NoInitialContextEx)
   [junit4]   2> 2023968 INFO  (TEST-TestReplicationHandler.doTestReplicateAfterCoreReload-seed#[52E3CAF9EB06AE07]) [    ] o.a.s.c.SolrResourceLoader solr home defaulted to 'solr/' (could not find system property or JNDI)
   [junit4]   2> 2023970 INFO  (TEST-TestReplicationHandler.doTestReplicateAfterCoreReload-seed#[52E3CAF9EB06AE07]) [    ] o.a.s.c.SolrXmlConfig Loading container configuration from C:\Users\JenkinsSlave\workspace\Lucene-Solr-trunk-Windows\solr\build\solr-core\test\J1\temp\solr.handler.TestReplicationHandler_52E3CAF9EB06AE07-001\solr-instance-002\solr.xml
   [junit4]   2> 2023978 INFO  (TEST-TestReplicationHandler.doTestReplicateAfterCoreReload-seed#[52E3CAF9EB06AE07]) [    ] o.a.s.c.CorePropertiesLocator Config-defined core root directory: C:\Users\JenkinsSlave\workspace\Lucene-Solr-trunk-Windows\solr\build\solr-core\test\J1\temp\solr.handler.TestReplicationHandler_52E3CAF9EB06AE07-001\solr-instance-002\.
   [junit4]   2> 2023978 INFO  (TEST-TestReplicationHandler.doTestReplicateAfterCoreReload-seed#[52E3CAF9EB06AE07]) [    ] o.a.s.c.CoreContainer New CoreContainer 8171209
   [junit4]   2> 2023978 INFO  (TEST-TestReplicationHandler.doTestReplicateAfterCoreReload-seed#[52E3CAF9EB06AE07]) [    ] o.a.s.c.CoreContainer Loading cores into CoreContainer [instanceDir=C:\Users\JenkinsSlave\workspace\Lucene-Solr-trunk-Windows\solr\build\solr-core\test\J1\temp\solr.handler.TestReplicationHandler_52E3CAF9EB06AE07-001\solr-instance-002]
   [junit4]   2> 2023978 WARN  (TEST-TestReplicationHandler.doTestReplicateAfterCoreReload-seed#[52E3CAF9EB06AE07]) [    ] o.a.s.c.CoreContainer Couldn't add files from C:\Users\JenkinsSlave\workspace\Lucene-Solr-trunk-Windows\solr\build\solr-core\test\J1\temp\solr.handler.TestReplicationHandler_52E3CAF9EB06AE07-001\solr-instance-002\lib to classpath: C:\Users\JenkinsSlave\workspace\Lucene-Solr-trunk-Windows\solr\build\solr-core\test\J1\temp\solr.handler.TestReplicationHandler_52E3CAF9EB06AE07-001\solr-instance-002\lib
   [junit4]   2> 2023979 INFO  (TEST-TestReplicationHandler.doTestReplicateAfterCoreReload-seed#[52E3CAF9EB06AE07]) [    ] o.a.s.h.c.HttpShardHandlerFactory created with socketTimeout : 90000,urlScheme : ,connTimeout : 15000,maxConnectionsPerHost : 20,maxConnections : 10000,corePoolSize : 0,maximumPoolSize : 2147483647,maxThreadIdleTime : 5,sizeOfQueue : -1,fairnessPolicy : false,useRetries : false,
   [junit4]   2> 2023979 INFO  (TEST-TestReplicationHandler.doTestReplicateAfterCoreReload-seed#[52E3CAF9EB06AE07]) [    ] o.a.s.u.UpdateShardHandler Creating UpdateShardHandler HTTP client with params: socketTimeout=340000&connTimeout=45000&retry=true
   [junit4]   2> 2023981 INFO  (TEST-TestReplicationHandler.doTestReplicateAfterCoreReload-seed#[52E3CAF9EB06AE07]) [    ] o.a.s.l.LogWatcher SLF4J impl is org.slf4j.impl.Log4jLoggerFactory
   [junit4]   2> 2023981 INFO  (TEST-TestReplicationHandler.doTestReplicateAfterCoreReload-seed#[52E3CAF9EB06AE07]) [    ] o.a.s.l.LogWatcher Registering Log Listener [Log4j (org.slf4j.impl.Log4jLoggerFactory)]
   [junit4]   2> 2023981 INFO  (TEST-TestReplicationHandler.doTestReplicateAfterCoreReload-seed#[52E3CAF9EB06AE07]) [    ] o.a.s.c.CoreContainer Security conf doesn't exist. Skipping setup for authorization module.
   [junit4]   2> 2023982 INFO  (TEST-TestReplicationHandler.doTestReplicateAfterCoreReload-seed#[52E3CAF9EB06AE07]) [    ] o.a.s.c.CoreContainer No authentication plugin used.
   [junit4]   2> 2023982 INFO  (TEST-TestReplicationHandler.doTestReplicateAfterCoreReload-seed#[52E3CAF9EB06AE07]) [    ] o.a.s.c.CorePropertiesLocator Looking for core definitions underneath C:\Users\JenkinsSlave\workspace\Lucene-Solr-trunk-Windows\solr\build\solr-core\test\J1\temp\solr.handler.TestReplicationHandler_52E3CAF9EB06AE07-001\solr-instance-002\.
   [junit4]   2> 2023985 INFO  (TEST-TestReplicationHandler.doTestReplicateAfterCoreReload-seed#[52E3CAF9EB06AE07]) [    ] o.a.s.c.CoreDescriptor Created CoreDescriptor: {name=collection1, config=solrconfig.xml, loadOnStartup=true, schema=schema.xml, configSetProperties=configsetprops.json, transient=false, dataDir=data\}
   [junit4]   2> 2023985 INFO  (TEST-TestReplicationHandler.doTestReplicateAfterCoreReload-seed#[52E3CAF9EB06AE07]) [    ] o.a.s.c.CorePropertiesLocator Found core collection1 in C:\Users\JenkinsSlave\workspace\Lucene-Solr-trunk-Windows\solr\build\solr-core\test\J1\temp\solr.handler.TestReplicationHandler_52E3CAF9EB06AE07-001\solr-instance-002\.\collection1
   [junit4]   2> 2023985 INFO  (TEST-TestReplicationHandler.doTestReplicateAfterCoreReload-seed#[52E3CAF9EB06AE07]) [    ] o.a.s.c.CorePropertiesLocator Found 1 core definitions
   [junit4]   2> 2023985 INFO  (coreLoadExecutor-5898-thread-1) [    ] o.a.s.c.SolrResourceLoader new SolrResourceLoader for directory: 'C:\Users\JenkinsSlave\workspace\Lucene-Solr-trunk-Windows\solr\build\solr-core\test\J1\temp\solr.handler.TestReplicationHandler_52E3CAF9EB06AE07-001\solr-instance-002\collection1'
   [junit4]   2> 2023986 INFO  (coreLoadExecutor-5898-thread-1) [    ] o.a.s.c.SolrResourceLoader JNDI not configured for solr (NoInitialContextEx)
   [junit4]   2> 2023986 INFO  (coreLoadExecutor-5898-thread-1) [    ] o.a.s.c.SolrResourceLoader solr home defaulted to 'solr/' (could not find system property or JNDI)
   [junit4]   2> 2023986 INFO  (TEST-TestReplicationHandler.doTestReplicateAfterCoreReload-seed#[52E3CAF9EB06AE07]) [    ] o.a.s.s.SolrDispatchFilter user.dir=C:\Users\JenkinsSlave\workspace\Lucene-Solr-trunk-Windows\solr\build\solr-core\test\J1
   [junit4]   2> 2023986 INFO  (TEST-TestReplicationHandler.doTestReplicateAfterCoreReload-seed#[52E3CAF9EB06AE07]) [    ] o.a.s.s.SolrDispatchFilter SolrDispatchFilter.init() done
   [junit4]   2> 2023997 INFO  (coreLoadExecutor-5898-thread-1) [    ] o.a.s.c.SolrConfig current version of requestparams : -1
   [junit4]   2> 2024003 INFO  (coreLoadExecutor-5898-thread-1) [    ] o.a.s.c.SolrConfig Using Lucene MatchVersion: 6.0.0
   [junit4]   2> 2024012 INFO  (coreLoadExecutor-5898-thread-1) [    ] o.a.s.c.SolrConfig Loaded SolrConfig: solrconfig.xml
   [junit4]   2> 2024019 INFO  (coreLoadExecutor-5898-thread-1) [    ] o.a.s.s.IndexSchema [collection1] Schema name=test
   [junit4]   2> 2024022 INFO  (coreLoadExecutor-5898-thread-1) [    ] o.a.s.s.IndexSchema unique key field: id
   [junit4]   2> 2024025 INFO  (coreLoadExecutor-5898-thread-1) [    ] o.a.s.c.ConfigSetProperties Did not find ConfigSet properties, assuming default properties: Can't find resource 'configsetprops.json' in classpath or 'C:\Users\JenkinsSlave\workspace\Lucene-Solr-trunk-Windows\solr\build\solr-core\test\J1\temp\solr.handler.TestReplicationHandler_52E3CAF9EB06AE07-001\solr-instance-002\collection1'
   [junit4]   2> 2024025 INFO  (coreLoadExecutor-5898-thread-1) [    ] o.a.s.c.CoreContainer Creating SolrCore 'collection1' using configuration from instancedir C:\Users\JenkinsSlave\workspace\Lucene-Solr-trunk-Windows\solr\build\solr-core\test\J1\temp\solr.handler.TestReplicationHandler_52E3CAF9EB06AE07-001\solr-instance-002\.\collection1
   [junit4]   2> 2024025 INFO  (coreLoadExecutor-5898-thread-1) [    x:collection1] o.a.s.c.SolrCore org.apache.solr.core.MockDirectoryFactory
   [junit4]   2> 2024026 INFO  (coreLoadExecutor-5898-thread-1) [    x:collection1] o.a.s.c.SolrCore [[collection1] ] Opening new SolrCore at [C:\Users\JenkinsSlave\workspace\Lucene-Solr-trunk-Windows\solr\build\solr-core\test\J1\temp\solr.handler.TestReplicationHandler_52E3CAF9EB06AE07-001\solr-instance-002\collection1], dataDir=[C:\Users\JenkinsSlave\workspace\Lucene-Solr-trunk-Windows\solr\build\solr-core\test\J1\temp\solr.handler.TestReplicationHandler_52E3CAF9EB06AE07-001\solr-instance-002\.\collection1\data\]
   [junit4]   2> 2024026 INFO  (coreLoadExecutor-5898-thread-1) [    x:collection1] o.a.s.c.SolrCore JMX monitoring not detected for core: collection1
   [junit4]   2> 2024026 INFO  (coreLoadExecutor-5898-thread-1) [    x:collection1] o.a.s.c.CachingDirectoryFactory return new directory for C:\Users\JenkinsSlave\workspace\Lucene-Solr-trunk-Windows\solr\build\solr-core\test\J1\temp\solr.handler.TestReplicationHandler_52E3CAF9EB06AE07-001\solr-instance-002\.\collection1\data\
   [junit4]   2> 2024026 INFO  (coreLoadExecutor-5898-thread-1) [    x:collection1] o.a.s.c.SolrCore New index directory detected: old=null new=C:\Users\JenkinsSlave\workspace\Lucene-Solr-trunk-Windows\solr\build\solr-core\test\J1\temp\solr.handler.TestReplicationHandler_52E3CAF9EB06AE07-001\solr-instance-002\.\collection1\data\index/
   [junit4]   2> 2024026 WARN  (coreLoadExecutor-5898-thread-1) [    x:collection1] o.a.s.c.SolrCore [collection1] Solr index directory 'C:\Users\JenkinsSlave\workspace\Lucene-Solr-trunk-Windows\solr\build\solr-core\test\J1\temp\solr.handler.TestReplicationHandler_52E3CAF9EB06AE07-001\solr-instance-002\.\collection1\data\index' doesn't exist. Creating new index...
   [junit4]   2> 2024028 INFO  (coreLoadExecutor-5898-thread-1) [    x:collection1] o.a.s.c.CachingDirectoryFactory return new directory for C:\Users\JenkinsSlave\workspace\Lucene-Solr-trunk-Windows\solr\build\solr-core\test\J1\temp\solr.handler.TestReplicationHandler_52E3CAF9EB06AE07-001\solr-instance-002\.\collection1\data\index
   [junit4]   2> 2024028 INFO  (coreLoadExecutor-5898-thread-1) [    x:collection1] o.a.s.u.RandomMergePolicy RandomMergePolicy wrapping class org.apache.lucene.index.LogByteSizeMergePolicy: [LogByteSizeMergePolicy: minMergeSize=1677721, mergeFactor=18, maxMergeSize=2147483648, maxMergeSizeForForcedMerge=9223372036854775807, calibrateSizeByDeletes=true, maxMergeDocs=2147483647, maxCFSSegmentSizeMB=8.796093022207999E12, noCFSRatio=0.0]
   [junit4]   2> 2024028 INFO  (coreLoadExecutor-5898-thread-1) [    x:collection1] o.a.s.c.SolrDeletionPolicy SolrDeletionPolicy.onCommit: commits: num=1
   [junit4]   2> 	commit{dir=MockDirectoryWrapper(RAMDirectory@14ef2fa lockFactory=org.apache.lucene.store.SingleInstanceLockFactory@3c2e6e),segFN=segments_1,generation=1}
   [junit4]   2> 2024028 INFO  (coreLoadExecutor-5898-thread-1) [    x:collection1] o.a.s.c.SolrDeletionPolicy newest commit generation = 1
   [junit4]   2> 2024029 INFO  (OldIndexDirectoryCleanupThreadForCore-collection1) [    x:collection1] o.a.s.c.SolrCore Looking for old index directories to cleanup for core collection1 in C:\Users\JenkinsSlave\workspace\Lucene-Solr-trunk-Windows\solr\build\solr-core\test\J1\temp\solr.handler.TestReplicationHandler_52E3CAF9EB06AE07-001\solr-instance-002\.\collection1\data\
   [junit4]   2> 2024032 INFO  (coreLoadExecutor-5898-thread-1) [    x:collection1] o.a.s.c.SolrCore no updateRequestProcessorChain defined as default, creating implicit default
   [junit4]   2> 2024033 INFO  (coreLoadExecutor-5898-thread-1) [    x:collection1] o.a.s.h.l.XMLLoader xsltCacheLifetimeSeconds=60
   [junit4]   2> 2024036 INFO  (coreLoadExecutor-5898-thread-1) [    x:collection1] o.a.s.h.l.XMLLoader xsltCacheLifetimeSeconds=60
   [junit4]   2> 2024037 INFO  (coreLoadExecutor-5898-thread-1) [    x:collection1] o.a.s.h.l.XMLLoader xsltCacheLifetimeSeconds=60
   [junit4]   2> 2024039 INFO  (coreLoadExecutor-5898-thread-1) [    x:collection1] o.a.s.h.l.XMLLoader xsltCacheLifetimeSeconds=60
   [junit4]   2> 2024041 INFO  (coreLoadExecutor-5898-thread-1) [    x:collection1] o.a.s.c.PluginBag requestHandler : 'lazy' created with startup=lazy 
   [junit4]   2> 2024041 INFO  (coreLoadExecutor-5898-thread-1) [    x:collection1] o.a.s.c.RequestHandlers Registered paths: /admin/mbeans,standard,lazy,/update/json/docs,/admin/luke,/export,/get,/admin/properties,/update/json,/admin/threads,/update/csv,/sql,/admin/segments,/admin/system,/replication,defaults,/config,/stream,/schema,/admin/plugins,/admin/logging,/admin/ping,/update,/admin/file
   [junit4]   2> 2024041 INFO  (coreLoadExecutor-5898-thread-1) [    x:collection1] o.a.s.c.SolrCore Using default statsCache cache: org.apache.solr.search.stats.LocalStatsCache
   [junit4]   2> 2024043 INFO  (coreLoadExecutor-5898-thread-1) [    x:collection1] o.a.s.u.CommitTracker Hard AutoCommit: disabled
   [junit4]   2> 2024043 INFO  (coreLoadExecutor-5898-thread-1) [    x:collection1] o.a.s.u.CommitTracker Soft AutoCommit: disabled
   [junit4]   2> 2024043 INFO  (coreLoadExecutor-5898-thread-1) [    x:collection1] o.a.s.u.RandomMergePolicy RandomMergePolicy wrapping class org.apache.lucene.index.LogDocMergePolicy: [LogDocMergePolicy: minMergeSize=1000, mergeFactor=17, maxMergeSize=9223372036854775807, maxMergeSizeForForcedMerge=9223372036854775807, calibrateSizeByDeletes=true, maxMergeDocs=2147483647, maxCFSSegmentSizeMB=8.796093022207999E12, noCFSRatio=0.0]
   [junit4]   2> 2024043 INFO  (coreLoadExecutor-5898-thread-1) [    x:collection1] o.a.s.c.SolrDeletionPolicy SolrDeletionPolicy.onInit: commits: num=1
   [junit4]   2> 	commit{dir=MockDirectoryWrapper(RAMDirectory@14ef2fa lockFactory=org.apache.lucene.store.SingleInstanceLockFactory@3c2e6e),segFN=segments_1,generation=1}
   [junit4]   2> 2024043 INFO  (coreLoadExecutor-5898-thread-1) [    x:collection1] o.a.s.c.SolrDeletionPolicy newest commit generation = 1
   [junit4]   2> 2024044 INFO  (coreLoadExecutor-5898-thread-1) [    x:collection1] o.a.s.s.SolrIndexSearcher Opening [Searcher@178ca6a[collection1] main]
   [junit4]   2> 2024044 INFO  (coreLoadExecutor-5898-thread-1) [    x:collection1] o.a.s.r.ManagedResourceStorage File-based storage initialized to use dir: C:\Users\JenkinsSlave\workspace\Lucene-Solr-trunk-Windows\solr\build\solr-core\test\J1\temp\solr.handler.TestReplicationHandler_52E3CAF9EB06AE07-001\solr-instance-002\collection1\conf
   [junit4]   2> 2024044 INFO  (coreLoadExecutor-5898-thread-1) [    x:collection1] o.a.s.r.RestManager Initializing RestManager with initArgs: {storageDir=C:\Users\JenkinsSlave\workspace\Lucene-Solr-trunk-Windows\solr\build\solr-core\test\J1\temp\solr.handler.TestReplicationHandler_52E3CAF9EB06AE07-001\solr-instance-002\collection1\conf}
   [junit4]   2> 2024044 INFO  (coreLoadExecutor-5898-thread-1) [    x:collection1] o.a.s.r.ManagedResourceStorage Reading _rest_managed.json using file:dir=C:\Users\JenkinsSlave\workspace\Lucene-Solr-trunk-Windows\solr\build\solr-core\test\J1\temp\solr.handler.TestReplicationHandler_52E3CAF9EB06AE07-001\solr-instance-002\collection1\conf
   [junit4]   2> 2024044 INFO  (coreLoadExecutor-5898-thread-1) [    x:collection1] o.a.s.r.RestManager Initializing 0 registered ManagedResources
   [junit4]   2> 2024046 INFO  (coreLoadExecutor-5898-thread-1) [    x:collection1] o.a.s.h.ReplicationHandler Poll scheduled at an interval of 1000ms
   [junit4]   2> 2024046 INFO  (searcherExecutor-5899-thread-1-processing-x:collection1) [    x:collection1] o.a.s.c.SolrCore [collection1] Registered new searcher Searcher@178ca6a[collection1] main{ExitableDirectoryReader(UninvertingDirectoryReader())}
   [junit4]   2> 2024047 INFO  (coreLoadExecutor-5898-thread-1) [    x:collection1] o.a.s.c.CoreContainer registering core: collection1
   [junit4]   2> 2024048 INFO  (qtp17763956-14005) [    x:collection1] o.a.s.c.S.Request [collection1]  webapp=/solr path=/replication params={qt=/replication&wt=javabin&version=2&command=indexversion} status=0 QTime=0
   [junit4]   2> 2024048 INFO  (indexFetcher-5903-thread-1) [    x:collection1] o.a.s.h.IndexFetcher Master's generation: 2
   [junit4]   2> 2024050 INFO  (indexFetcher-5903-thread-1) [    x:collection1] o.a.s.h.IndexFetcher Slave's generation: 1
   [junit4]   2> 2024050 INFO  (indexFetcher-5903-thread-1) [    x:collection1] o.a.s.h.IndexFetcher Starting replication process
   [junit4]   2> 2024058 INFO  (qtp17763956-14006) [    x:collection1] o.a.s.c.S.Request [collection1]  webapp=/solr path=/replication params={generation=2&qt=/replication&wt=javabin&version=2&command=filelist} status=0 QTime=3
   [junit4]   2> 2024058 INFO  (indexFetcher-5903-thread-1) [    x:collection1] o.a.s.h.IndexFetcher Number of files in latest index in master: 1
   [junit4]   2> 2024059 INFO  (indexFetcher-5903-thread-1) [    x:collection1] o.a.s.c.CachingDirectoryFactory return new directory for C:\Users\JenkinsSlave\workspace\Lucene-Solr-trunk-Windows\solr\build\solr-core\test\J1\temp\solr.handler.TestReplicationHandler_52E3CAF9EB06AE07-001\solr-instance-002\.\collection1\data\index.20160217093406814
   [junit4]   2> 2024059 INFO  (indexFetcher-5903-thread-1) [    x:collection1] o.a.s.u.DefaultSolrCoreState Rollback old IndexWriter... core=collection1
   [junit4]   2> 2024059 INFO  (indexFetcher-5903-thread-1) [    x:collection1] o.a.s.u.RandomMergePolicy RandomMergePolicy wrapping class org.apache.lucene.index.TieredMergePolicy: [TieredMergePolicy: maxMergeAtOnce=45, maxMergeAtOnceExplicit=22, maxMergedSegmentMB=16.6826171875, floorSegmentMB=2.18359375, forceMergeDeletesPctAllowed=19.88812122481778, segmentsPerTier=41.0, maxCFSSegmentSizeMB=8.796093022207999E12, noCFSRatio=0.3163309213268085
   [junit4]   2> 2024061 INFO  (indexFetcher-5903-thread-1) [    x:collection1] o.a.s.c.SolrDeletionPolicy SolrDeletionPolicy.onInit: commits: num=1
   [junit4]   2> 	commit{dir=MockDirectoryWrapper(RAMDirectory@14ef2fa lockFactory=org.apache.lucene.store.SingleInstanceLockFactory@3c2e6e),segFN=segments_1,generation=1}
   [junit4]   2> 2024061 INFO  (indexFetcher-5903-thread-1) [    x:collection1] o.a.s.c.SolrDeletionPolicy newest commit generation = 1
   [junit4]   2> 2024061 INFO  (indexFetcher-5903-thread-1) [    x:collection1] o.a.s.u.DefaultSolrCoreState New IndexWriter is ready to be used.
   [junit4]   2> 2024061 INFO  (indexFetcher-5903-thread-1) [    x:collection1] o.a.s.c.SolrDeletionPolicy SolrDeletionPolicy.onCommit: commits: num=1
   [junit4]   2> 	commit{dir=MockDirectoryWrapper(RAMDirectory@14ef2fa lockFactory=org.apache.lucene.store.SingleInstanceLockFactory@3c2e6e),segFN=segments_1,generation=1}
   [junit4]   2> 2024061 INFO  (indexFetcher-5903-thread-1) [    x:collection1] o.a.s.c.SolrDeletionPolicy newest commit generation = 1
   [junit4]   2> 2024061 INFO  (indexFetcher-5903-thread-1) [    x:collection1] o.a.s.u.DefaultSolrCoreState Rollback old IndexWriter... core=collection1
   [junit4]   2> 2024061 INFO  (indexFetcher-5903-thread-1) [    x:collection1] o.a.s.h.IndexFetcher Starting download (fullCopy=false) to MockDirectoryWrapper(RAMDirectory@170a7f0 lockFactory=org.apache.lucene.store.SingleInstanceLockFactory@91779)
   [junit4]   2> 2024065 INFO  (qtp17763956-13999) [    x:collection1] o.a.s.c.S.Request [collection1]  webapp=/solr path=/replication params={generation=2&qt=/replication&file=segments_2&checksum=true&wt=filestream&command=filecontent} status=0 QTime=0
   [junit4]   2> 2024066 INFO  (indexFetcher-5903-thread-1) [    x:collection1] o.a.s.h.IndexFetcher Total time taken for download (fullCopy=false,bytesDownloaded=100) : 0 secs (null bytes/sec) to MockDirectoryWrapper(RAMDirectory@170a7f0 lockFactory=org.apache.lucene.store.SingleInstanceLockFactory@91779)
   [junit4]   2> 2024069 INFO  (indexFetcher-5903-thread-1) [    x:collection1] o.a.s.u.RandomMergePolicy RandomMergePolicy wrapping class org.apache.lucene.index.LogByteSizeMergePolicy: [LogByteSizeMergePolicy: minMergeSize=1677721, mergeFactor=12, maxMergeSize=2147483648, maxMergeSizeForForcedMerge=9223372036854775807, calibrateSizeByDeletes=false, maxMergeDocs=2147483647, maxCFSSegmentSizeMB=8.796093022207999E12, noCFSRatio=1.0]
   [junit4]   2> 2024069 INFO  (indexFetcher-5903-thread-1) [    x:collection1] o.a.s.c.SolrDeletionPolicy SolrDeletionPolicy.onInit: commits: num=2
   [junit4]   2> 	commit{dir=MockDirectoryWrapper(RAMDirectory@14ef2fa lockFactory=org.apache.lucene.store.SingleInstanceLockFactory@3c2e6e),segFN=segments_1,generation=1}
   [junit4]   2> 	commit{dir=MockDirectoryWrapper(RAMDirectory@14ef2fa lockFactory=org.apache.lucene.store.SingleInstanceLockFactory@3c2e6e),segFN=segments_2,generation=2}
   [junit4]   2> 2024069 INFO  (indexFetcher-5903-thread-1) [    x:collection1] o.a.s.c.SolrDeletionPolicy newest commit generation = 2
   [junit4]   2> 2024069 INFO  (indexFetcher-5903-thread-1) [    x:collection1] o.a.s.u.DefaultSolrCoreState New IndexWriter is ready to be used.
   [junit4]   2> 2024070 INFO  (indexFetcher-5903-thread-1) [    x:collection1] o.a.s.s.SolrIndexSearcher Opening [Searcher@1b56991[collection1] main]
   [junit4]   2> 2024070 INFO  (searcherExecutor-5899-thread-1-processing-x:collection1) [    x:collection1] o.a.s.c.SolrCore [collection1] Registered new searcher Searcher@1b56991[collection1] main{ExitableDirectoryReader(UninvertingDirectoryReader())}
   [junit4]   2> 2024070 INFO  (indexFetcher-5903-thread-1) [    x:collection1] o.a.s.c.CachingDirectoryFactory looking to close C:\Users\JenkinsSlave\workspace\Lucene-Solr-trunk-Windows\solr\build\solr-core\test\J1\temp\solr.handler.TestReplicationHandler_52E3CAF9EB06AE07-001\solr-instance-002\.\collection1\data\index.20160217093406814 [CachedDir<<refCount=0;path=C:\Users\JenkinsSlave\workspace\Lucene-Solr-trunk-Windows\solr\build\solr-core\test\J1\temp\solr.handler.TestReplicationHandler_52E3CAF9EB06AE07-001\solr-instance-002\.\collection1\data\index.20160217093406814;done=true>>]

[...truncated too long message...]

oryFactory Closing directory: C:\Users\JenkinsSlave\workspace\Lucene-Solr-trunk-Windows\solr\build\solr-core\test\J1\temp\solr.handler.TestReplicationHandler_52E3CAF9EB06AE07-001\solr-instance-026\.\collection1\data\
   [junit4]   2> 2131902 INFO  (TEST-TestReplicationHandler.doTestRepeater-seed#[52E3CAF9EB06AE07]) [    ] o.e.j.s.h.ContextHandler Stopped o.e.j.s.ServletContextHandler@dabe75{/solr,null,UNAVAILABLE}
   [junit4]   2> 2131903 INFO  (TEST-TestReplicationHandler.doTestRepeater-seed#[52E3CAF9EB06AE07]) [    ] o.e.j.s.ServerConnector Stopped ServerConnector@1a5a8b9{HTTP/1.1,[http/1.1]}{127.0.0.1:0}
   [junit4]   2> 2131903 INFO  (TEST-TestReplicationHandler.doTestRepeater-seed#[52E3CAF9EB06AE07]) [    ] o.a.s.c.CoreContainer Shutting down CoreContainer instance=27340731
   [junit4]   2> 2131904 INFO  (coreCloseExecutor-6452-thread-1) [    x:collection1] o.a.s.c.SolrCore [collection1]  CLOSING SolrCore org.apache.solr.core.SolrCore@1968d7d
   [junit4]   2> 2131905 INFO  (coreCloseExecutor-6452-thread-1) [    x:collection1] o.a.s.u.DirectUpdateHandler2 closing DirectUpdateHandler2{commits=0,autocommits=0,soft autocommits=0,optimizes=0,rollbacks=0,expungeDeletes=0,docsPending=0,adds=0,deletesById=0,deletesByQuery=0,errors=0,cumulative_adds=0,cumulative_deletesById=0,cumulative_deletesByQuery=0,cumulative_errors=0}
   [junit4]   2> 2131905 INFO  (coreCloseExecutor-6452-thread-1) [    x:collection1] o.a.s.u.SolrCoreState Closing SolrCoreState
   [junit4]   2> 2131905 INFO  (coreCloseExecutor-6452-thread-1) [    x:collection1] o.a.s.u.DefaultSolrCoreState SolrCoreState ref count has reached 0 - closing IndexWriter
   [junit4]   2> 2131905 INFO  (coreCloseExecutor-6452-thread-1) [    x:collection1] o.a.s.u.DefaultSolrCoreState closing IndexWriter with IndexWriterCloser
   [junit4]   2> 2131906 INFO  (coreCloseExecutor-6452-thread-1) [    x:collection1] o.a.s.c.SolrCore [collection1] Closing main searcher on request.
   [junit4]   2> 2131906 INFO  (coreCloseExecutor-6452-thread-1) [    x:collection1] o.a.s.c.CachingDirectoryFactory Closing MockDirectoryFactory - 2 directories currently being tracked
   [junit4]   2> 2131907 INFO  (coreCloseExecutor-6452-thread-1) [    x:collection1] o.a.s.c.CachingDirectoryFactory looking to close C:\Users\JenkinsSlave\workspace\Lucene-Solr-trunk-Windows\solr\build\solr-core\test\J1\temp\solr.handler.TestReplicationHandler_52E3CAF9EB06AE07-001\solr-instance-027\.\collection1\data\index [CachedDir<<refCount=0;path=C:\Users\JenkinsSlave\workspace\Lucene-Solr-trunk-Windows\solr\build\solr-core\test\J1\temp\solr.handler.TestReplicationHandler_52E3CAF9EB06AE07-001\solr-instance-027\.\collection1\data\index;done=false>>]
   [junit4]   2> 2131907 INFO  (coreCloseExecutor-6452-thread-1) [    x:collection1] o.a.s.c.CachingDirectoryFactory Closing directory: C:\Users\JenkinsSlave\workspace\Lucene-Solr-trunk-Windows\solr\build\solr-core\test\J1\temp\solr.handler.TestReplicationHandler_52E3CAF9EB06AE07-001\solr-instance-027\.\collection1\data\index
   [junit4]   2> 2131907 INFO  (coreCloseExecutor-6452-thread-1) [    x:collection1] o.a.s.c.CachingDirectoryFactory looking to close C:\Users\JenkinsSlave\workspace\Lucene-Solr-trunk-Windows\solr\build\solr-core\test\J1\temp\solr.handler.TestReplicationHandler_52E3CAF9EB06AE07-001\solr-instance-027\.\collection1\data\ [CachedDir<<refCount=0;path=C:\Users\JenkinsSlave\workspace\Lucene-Solr-trunk-Windows\solr\build\solr-core\test\J1\temp\solr.handler.TestReplicationHandler_52E3CAF9EB06AE07-001\solr-instance-027\.\collection1\data\;done=false>>]
   [junit4]   2> 2131908 INFO  (coreCloseExecutor-6452-thread-1) [    x:collection1] o.a.s.c.CachingDirectoryFactory Closing directory: C:\Users\JenkinsSlave\workspace\Lucene-Solr-trunk-Windows\solr\build\solr-core\test\J1\temp\solr.handler.TestReplicationHandler_52E3CAF9EB06AE07-001\solr-instance-027\.\collection1\data\
   [junit4]   2> 2131910 INFO  (TEST-TestReplicationHandler.doTestRepeater-seed#[52E3CAF9EB06AE07]) [    ] o.e.j.s.h.ContextHandler Stopped o.e.j.s.ServletContextHandler@3b9fe5{/solr,null,UNAVAILABLE}
   [junit4]   2> 2131913 INFO  (SUITE-TestReplicationHandler-seed#[52E3CAF9EB06AE07]-worker) [    ] o.a.s.SolrTestCaseJ4 ###deleteCore
   [junit4]   2> NOTE: leaving temporary files on disk at: C:\Users\JenkinsSlave\workspace\Lucene-Solr-trunk-Windows\solr\build\solr-core\test\J1\temp\solr.handler.TestReplicationHandler_52E3CAF9EB06AE07-001
   [junit4]   2> NOTE: test params are: codec=Asserting(Lucene60): {name=PostingsFormat(name=Memory doPackFST= false), id=PostingsFormat(name=Memory doPackFST= false), newname=PostingsFormat(name=Memory doPackFST= false)}, docValues:{}, sim=ClassicSimilarity, locale=uk-UA, timezone=America/Dawson_Creek
   [junit4]   2> NOTE: Windows 7 6.1 x86/Oracle Corporation 1.8.0_72 (32-bit)/cpus=3,threads=1,free=193255352,total=397934592
   [junit4]   2> NOTE: All tests run in this JVM: [DocExpirationUpdateProcessorFactoryTest, TestManagedResourceStorage, SuggestComponentTest, FieldAnalysisRequestHandlerTest, TestConfigOverlay, DeleteInactiveReplicaTest, HdfsWriteToMultipleCollectionsTest, QueryParsingTest, TestMiniSolrCloudClusterBase, StatsComponentTest, TestAtomicUpdateErrorCases, TestFieldCollectionResource, OverseerTaskQueueTest, ConnectionReuseTest, TestExactSharedStatsCache, MergeStrategyTest, TestValueSourceCache, AutoCommitTest, TestSQLHandler, TestBulkSchemaAPI, AtomicUpdatesTest, TestOrdValues, TestSchemaManager, SpellCheckComponentTest, WordBreakSolrSpellCheckerTest, TestMacros, TestSystemIdResolver, HdfsBasicDistributedZkTest, DistributedIntervalFacetingTest, SuggesterTest, LeaderFailoverAfterPartitionTest, TestSchemaNameResource, BaseCdcrDistributedZkTest, TestRTimerTree, TestManagedSchemaFieldTypeResource, RemoteQueryErrorTest, SearchHandlerTest, TestFieldSortValues, TestScoreJoinQPScore, DefaultValueUpdateProcessorTest, TestFreeTextSuggestions, TestLRUStatsCache, ShowFileRequestHandlerTest, TestPKIAuthenticationPlugin, NotRequiredUniqueKeyTest, ResourceLoaderTest, ConnectionManagerTest, TermVectorComponentDistributedTest, HdfsTlogReplayBufferedWhileIndexingTest, SolrCloudExampleTest, DebugComponentTest, SortSpecParsingTest, SpatialHeatmapFacetsTest, TestConfigSetsAPI, TestSuggestSpellingConverter, DateRangeFieldTest, LoggingHandlerTest, MultiTermTest, SuggesterTSTTest, FullSolrCloudDistribCmdsTest, HdfsDirectoryFactoryTest, SmileWriterTest, RestartWhileUpdatingTest, CdcrVersionReplicationTest, TestExclusionRuleCollectionAccess, BadCopyFieldTest, LukeRequestHandlerTest, MultiThreadedOCPTest, DistributedSuggestComponentTest, CollectionTooManyReplicasTest, SSLMigrationTest, DirectoryFactoryTest, TestSha256AuthenticationProvider, UpdateRequestProcessorFactoryTest, TestSolrCoreProperties, AsyncCallRequestStatusResponseTest, TestBM25SimilarityFactory, PKIAuthenticationIntegrationTest, DistributedFacetPivotSmallTest, BasicZkTest, ZkSolrClientTest, TestNoOpRegenerator, HighlighterMaxOffsetTest, TestDynamicLoading, TestCollationFieldDocValues, TestDynamicFieldCollectionResource, BasicFunctionalityTest, DistributedQueryComponentCustomSortTest, DataDrivenBlockJoinTest, TestTrie, CheckHdfsIndexTest, TestJoin, DistributedExpandComponentTest, TestRTGBase, DistribDocExpirationUpdateProcessorTest, TestInfoStreamLogging, TestJsonFacets, TestSchemaSimilarityResource, TestSolrDynamicMBean, TestOmitPositions, TestConfigSetProperties, TermVectorComponentTest, DistanceFunctionTest, OutputWriterTest, TestBinaryResponseWriter, TestLeaderInitiatedRecoveryThread, TestZkChroot, EnumFieldTest, CoreAdminRequestStatusTest, TestRebalanceLeaders, TestSolrIndexConfig, TestTrackingShardHandlerFactory, TestFastOutputStream, TlogReplayBufferedWhileIndexingTest, OverriddenZkACLAndCredentialsProvidersTest, DeleteReplicaTest, CoreAdminHandlerTest, DateFieldTest, SortByFunctionTest, ConjunctionSolrSpellCheckerTest, HdfsRecoveryZkTest, SpellingQueryConverterTest, BufferStoreTest, ExplicitHLLTest, LeaderInitiatedRecoveryOnShardRestartTest, SolrCoreCheckLockOnStartupTest, CollectionsAPIDistributedZkTest, TestRecoveryHdfs, TestQueryTypes, TestQueryUtils, BJQParserTest, NoCacheHeaderTest, TestMaxScoreQueryParser, SolrIndexSplitterTest, TestStandardQParsers, HdfsSyncSliceTest, TestAuthenticationFramework, ConcurrentDeleteAndCreateCollectionTest, ShardSplitTest, UniqFieldsUpdateProcessorFactoryTest, TestCopyFieldCollectionResource, ChaosMonkeySafeLeaderTest, BasicDistributedZk2Test, OpenCloseCoreStressTest, LeaderElectionIntegrationTest, RecoveryZkTest, TestReplicationHandler]
   [junit4] Completed [301/579 (1!)] on J1 in 110.32s, 13 tests, 1 error <<< FAILURES!

[...truncated 914 lines...]
BUILD FAILED
C:\Users\JenkinsSlave\workspace\Lucene-Solr-trunk-Windows\build.xml:740: The following error occurred while executing this line:
C:\Users\JenkinsSlave\workspace\Lucene-Solr-trunk-Windows\build.xml:684: The following error occurred while executing this line:
C:\Users\JenkinsSlave\workspace\Lucene-Solr-trunk-Windows\build.xml:59: The following error occurred while executing this line:
C:\Users\JenkinsSlave\workspace\Lucene-Solr-trunk-Windows\solr\build.xml:233: The following error occurred while executing this line:
C:\Users\JenkinsSlave\workspace\Lucene-Solr-trunk-Windows\solr\common-build.xml:524: The following error occurred while executing this line:
C:\Users\JenkinsSlave\workspace\Lucene-Solr-trunk-Windows\lucene\common-build.xml:1457: The following error occurred while executing this line:
C:\Users\JenkinsSlave\workspace\Lucene-Solr-trunk-Windows\lucene\common-build.xml:1014: There were test failures: 579 suites (8 ignored), 2331 tests, 1 error, 127 ignored (82 assumptions) [seed: 52E3CAF9EB06AE07]

Total time: 75 minutes 44 seconds
Build step 'Invoke Ant' marked build as failure
Archiving artifacts
[WARNINGS] Skipping publisher since build result is FAILURE
Recording test results
Email was triggered for: Failure - Any
Sending email for trigger: Failure - Any



Mime
View raw message