lucene-dev mailing list archives

Site index · List index
Message view « Date » · « Thread »
Top « Date » · « Thread »
From Apache Jenkins Server <jenk...@builds.apache.org>
Subject [JENKINS] Lucene-Solr-Tests-5.5-Java7 - Build # 24 - Failure
Date Mon, 22 Feb 2016 09:24:49 GMT
Build: https://builds.apache.org/job/Lucene-Solr-Tests-5.5-Java7/24/

2 tests failed.
FAILED:  org.apache.solr.security.BasicAuthIntegrationTest.testBasics

Error Message:
Test abandoned because suite timeout was reached.

Stack Trace:
java.lang.Exception: Test abandoned because suite timeout was reached.
	at __randomizedtesting.SeedInfo.seed([6C10E527400A77DD]:0)


FAILED:  junit.framework.TestSuite.org.apache.solr.security.BasicAuthIntegrationTest

Error Message:
Suite timeout exceeded (>= 7200000 msec).

Stack Trace:
java.lang.Exception: Suite timeout exceeded (>= 7200000 msec).
	at __randomizedtesting.SeedInfo.seed([6C10E527400A77DD]:0)




Build Log:
[...truncated 12473 lines...]
   [junit4] Suite: org.apache.solr.security.BasicAuthIntegrationTest
   [junit4]   2> 1996876 INFO  (TEST-BasicAuthIntegrationTest.testBasics-seed#[6C10E527400A77DD]) [    ] o.a.s.c.ZkTestServer STARTING ZK TEST SERVER
   [junit4]   2> 1996883 INFO  (Thread-7090) [    ] o.a.s.c.ZkTestServer client port:0.0.0.0/0.0.0.0:0
   [junit4]   2> 1996883 INFO  (Thread-7090) [    ] o.a.s.c.ZkTestServer Starting server
   [junit4]   2> 1996983 INFO  (TEST-BasicAuthIntegrationTest.testBasics-seed#[6C10E527400A77DD]) [    ] o.a.s.c.ZkTestServer start zk server on port:51933
   [junit4]   2> 1996983 INFO  (TEST-BasicAuthIntegrationTest.testBasics-seed#[6C10E527400A77DD]) [    ] o.a.s.c.c.SolrZkClient Using default ZkCredentialsProvider
   [junit4]   2> 1996985 INFO  (TEST-BasicAuthIntegrationTest.testBasics-seed#[6C10E527400A77DD]) [    ] o.a.s.c.c.ConnectionManager Waiting for client to connect to ZooKeeper
   [junit4]   2> 1996992 INFO  (zkCallback-1995-thread-1) [    ] o.a.s.c.c.ConnectionManager Watcher org.apache.solr.common.cloud.ConnectionManager@6c53b743 name:ZooKeeperConnection Watcher:127.0.0.1:51933 got event WatchedEvent state:SyncConnected type:None path:null path:null type:None
   [junit4]   2> 1996992 INFO  (TEST-BasicAuthIntegrationTest.testBasics-seed#[6C10E527400A77DD]) [    ] o.a.s.c.c.ConnectionManager Client is connected to ZooKeeper
   [junit4]   2> 1996992 INFO  (TEST-BasicAuthIntegrationTest.testBasics-seed#[6C10E527400A77DD]) [    ] o.a.s.c.c.SolrZkClient Using default ZkACLProvider
   [junit4]   2> 1996992 INFO  (TEST-BasicAuthIntegrationTest.testBasics-seed#[6C10E527400A77DD]) [    ] o.a.s.c.c.SolrZkClient makePath: /solr/solr.xml
   [junit4]   2> 1997039 INFO  (jetty-launcher-1994-thread-1) [    ] o.e.j.s.Server jetty-9.2.13.v20150730
   [junit4]   2> 1997043 INFO  (jetty-launcher-1994-thread-3) [    ] o.e.j.s.Server jetty-9.2.13.v20150730
   [junit4]   2> 1997047 INFO  (jetty-launcher-1994-thread-2) [    ] o.e.j.s.Server jetty-9.2.13.v20150730
   [junit4]   2> 1997048 INFO  (jetty-launcher-1994-thread-5) [    ] o.e.j.s.Server jetty-9.2.13.v20150730
   [junit4]   2> 1997049 INFO  (jetty-launcher-1994-thread-3) [    ] o.e.j.s.h.ContextHandler Started o.e.j.s.ServletContextHandler@6643f24a{/solr,null,AVAILABLE}
   [junit4]   2> 1997050 INFO  (jetty-launcher-1994-thread-3) [    ] o.e.j.s.ServerConnector Started ServerConnector@622b82a3{HTTP/1.1}{127.0.0.1:50112}
   [junit4]   2> 1997050 INFO  (jetty-launcher-1994-thread-3) [    ] o.e.j.s.Server Started @1999738ms
   [junit4]   2> 1997050 INFO  (jetty-launcher-1994-thread-3) [    ] o.a.s.c.s.e.JettySolrRunner Jetty properties: {hostContext=/solr, hostPort=50112}
   [junit4]   2> 1997050 INFO  (jetty-launcher-1994-thread-3) [    ] o.a.s.s.SolrDispatchFilter SolrDispatchFilter.init(): sun.misc.Launcher$AppClassLoader@3827de24
   [junit4]   2> 1997051 INFO  (jetty-launcher-1994-thread-3) [    ] o.a.s.c.SolrResourceLoader new SolrResourceLoader for directory: '/x1/jenkins/jenkins-slave/workspace/Lucene-Solr-Tests-5.5-Java7/solr/build/solr-core/test/J1/temp/solr.security.BasicAuthIntegrationTest_6C10E527400A77DD-001/tempDir-001/node3'
   [junit4]   2> 1997051 INFO  (jetty-launcher-1994-thread-3) [    ] o.a.s.c.SolrResourceLoader JNDI not configured for solr (NoInitialContextEx)
   [junit4]   2> 1997051 INFO  (jetty-launcher-1994-thread-3) [    ] o.a.s.c.SolrResourceLoader solr home defaulted to 'solr/' (could not find system property or JNDI)
   [junit4]   2> 1997051 INFO  (jetty-launcher-1994-thread-3) [    ] o.a.s.c.c.SolrZkClient Using default ZkCredentialsProvider
   [junit4]   2> 1997055 INFO  (jetty-launcher-1994-thread-3) [    ] o.a.s.c.c.ConnectionManager Waiting for client to connect to ZooKeeper
   [junit4]   2> 1997056 INFO  (jetty-launcher-1994-thread-4) [    ] o.e.j.s.Server jetty-9.2.13.v20150730
   [junit4]   2> 1997083 INFO  (zkCallback-1996-thread-1) [    ] o.a.s.c.c.ConnectionManager Watcher org.apache.solr.common.cloud.ConnectionManager@3b6365dc name:ZooKeeperConnection Watcher:127.0.0.1:51933/solr got event WatchedEvent state:SyncConnected type:None path:null path:null type:None
   [junit4]   2> 1997084 INFO  (jetty-launcher-1994-thread-3) [    ] o.a.s.c.c.ConnectionManager Client is connected to ZooKeeper
   [junit4]   2> 1997084 INFO  (jetty-launcher-1994-thread-3) [    ] o.a.s.c.c.SolrZkClient Using default ZkACLProvider
   [junit4]   2> 1997084 INFO  (jetty-launcher-1994-thread-3) [    ] o.a.s.s.SolrDispatchFilter solr.xml found in ZooKeeper. Loading...
   [junit4]   2> 1997126 INFO  (jetty-launcher-1994-thread-1) [    ] o.e.j.s.h.ContextHandler Started o.e.j.s.ServletContextHandler@7ad7e30d{/solr,null,AVAILABLE}
   [junit4]   2> 1997127 INFO  (jetty-launcher-1994-thread-1) [    ] o.e.j.s.ServerConnector Started ServerConnector@38a962d8{HTTP/1.1}{127.0.0.1:59719}
   [junit4]   2> 1997127 INFO  (jetty-launcher-1994-thread-1) [    ] o.e.j.s.Server Started @1999815ms
   [junit4]   2> 1997127 INFO  (jetty-launcher-1994-thread-1) [    ] o.a.s.c.s.e.JettySolrRunner Jetty properties: {hostPort=59719, hostContext=/solr}
   [junit4]   2> 1997127 INFO  (jetty-launcher-1994-thread-1) [    ] o.a.s.s.SolrDispatchFilter SolrDispatchFilter.init(): sun.misc.Launcher$AppClassLoader@3827de24
   [junit4]   2> 1997127 INFO  (jetty-launcher-1994-thread-1) [    ] o.a.s.c.SolrResourceLoader new SolrResourceLoader for directory: '/x1/jenkins/jenkins-slave/workspace/Lucene-Solr-Tests-5.5-Java7/solr/build/solr-core/test/J1/temp/solr.security.BasicAuthIntegrationTest_6C10E527400A77DD-001/tempDir-001/node1'
   [junit4]   2> 1997128 INFO  (jetty-launcher-1994-thread-1) [    ] o.a.s.c.SolrResourceLoader JNDI not configured for solr (NoInitialContextEx)
   [junit4]   2> 1997128 INFO  (jetty-launcher-1994-thread-1) [    ] o.a.s.c.SolrResourceLoader solr home defaulted to 'solr/' (could not find system property or JNDI)
   [junit4]   2> 1997128 INFO  (jetty-launcher-1994-thread-1) [    ] o.a.s.c.c.SolrZkClient Using default ZkCredentialsProvider
   [junit4]   2> 1997176 INFO  (jetty-launcher-1994-thread-2) [    ] o.e.j.s.h.ContextHandler Started o.e.j.s.ServletContextHandler@5983bf9a{/solr,null,AVAILABLE}
   [junit4]   2> 1997177 INFO  (jetty-launcher-1994-thread-2) [    ] o.e.j.s.ServerConnector Started ServerConnector@5898455f{HTTP/1.1}{127.0.0.1:53287}
   [junit4]   2> 1997177 INFO  (jetty-launcher-1994-thread-2) [    ] o.e.j.s.Server Started @1999865ms
   [junit4]   2> 1997177 INFO  (jetty-launcher-1994-thread-2) [    ] o.a.s.c.s.e.JettySolrRunner Jetty properties: {hostContext=/solr, hostPort=53287}
   [junit4]   2> 1997177 INFO  (jetty-launcher-1994-thread-2) [    ] o.a.s.s.SolrDispatchFilter SolrDispatchFilter.init(): sun.misc.Launcher$AppClassLoader@3827de24
   [junit4]   2> 1997177 INFO  (jetty-launcher-1994-thread-2) [    ] o.a.s.c.SolrResourceLoader new SolrResourceLoader for directory: '/x1/jenkins/jenkins-slave/workspace/Lucene-Solr-Tests-5.5-Java7/solr/build/solr-core/test/J1/temp/solr.security.BasicAuthIntegrationTest_6C10E527400A77DD-001/tempDir-001/node2'
   [junit4]   2> 1997177 INFO  (jetty-launcher-1994-thread-2) [    ] o.a.s.c.SolrResourceLoader JNDI not configured for solr (NoInitialContextEx)
   [junit4]   2> 1997177 INFO  (jetty-launcher-1994-thread-2) [    ] o.a.s.c.SolrResourceLoader solr home defaulted to 'solr/' (could not find system property or JNDI)
   [junit4]   2> 1997178 INFO  (jetty-launcher-1994-thread-2) [    ] o.a.s.c.c.SolrZkClient Using default ZkCredentialsProvider
   [junit4]   2> 1997184 INFO  (jetty-launcher-1994-thread-2) [    ] o.a.s.c.c.ConnectionManager Waiting for client to connect to ZooKeeper
   [junit4]   2> 1997208 INFO  (jetty-launcher-1994-thread-4) [    ] o.e.j.s.h.ContextHandler Started o.e.j.s.ServletContextHandler@5d8c9500{/solr,null,AVAILABLE}
   [junit4]   2> 1997215 INFO  (jetty-launcher-1994-thread-1) [    ] o.a.s.c.c.ConnectionManager Waiting for client to connect to ZooKeeper
   [junit4]   2> 1997216 INFO  (jetty-launcher-1994-thread-4) [    ] o.e.j.s.ServerConnector Started ServerConnector@73f47732{HTTP/1.1}{127.0.0.1:48695}
   [junit4]   2> 1997216 INFO  (jetty-launcher-1994-thread-4) [    ] o.e.j.s.Server Started @1999904ms
   [junit4]   2> 1997216 INFO  (jetty-launcher-1994-thread-4) [    ] o.a.s.c.s.e.JettySolrRunner Jetty properties: {hostContext=/solr, hostPort=48695}
   [junit4]   2> 1997216 INFO  (jetty-launcher-1994-thread-4) [    ] o.a.s.s.SolrDispatchFilter SolrDispatchFilter.init(): sun.misc.Launcher$AppClassLoader@3827de24
   [junit4]   2> 1997216 INFO  (jetty-launcher-1994-thread-4) [    ] o.a.s.c.SolrResourceLoader new SolrResourceLoader for directory: '/x1/jenkins/jenkins-slave/workspace/Lucene-Solr-Tests-5.5-Java7/solr/build/solr-core/test/J1/temp/solr.security.BasicAuthIntegrationTest_6C10E527400A77DD-001/tempDir-001/node4'
   [junit4]   2> 1997216 INFO  (jetty-launcher-1994-thread-4) [    ] o.a.s.c.SolrResourceLoader JNDI not configured for solr (NoInitialContextEx)
   [junit4]   2> 1997217 INFO  (jetty-launcher-1994-thread-4) [    ] o.a.s.c.SolrResourceLoader solr home defaulted to 'solr/' (could not find system property or JNDI)
   [junit4]   2> 1997217 INFO  (jetty-launcher-1994-thread-4) [    ] o.a.s.c.c.SolrZkClient Using default ZkCredentialsProvider
   [junit4]   2> 1997217 INFO  (jetty-launcher-1994-thread-5) [    ] o.e.j.s.h.ContextHandler Started o.e.j.s.ServletContextHandler@14e34153{/solr,null,AVAILABLE}
   [junit4]   2> 1997218 INFO  (jetty-launcher-1994-thread-3) [    ] o.a.s.c.CorePropertiesLocator Config-defined core root directory: /x1/jenkins/jenkins-slave/workspace/Lucene-Solr-Tests-5.5-Java7/solr/build/solr-core/test/J1/temp/solr.security.BasicAuthIntegrationTest_6C10E527400A77DD-001/tempDir-001/node3/.
   [junit4]   2> 1997218 INFO  (jetty-launcher-1994-thread-3) [    ] o.a.s.c.CoreContainer New CoreContainer 463216782
   [junit4]   2> 1997218 INFO  (jetty-launcher-1994-thread-3) [    ] o.a.s.c.CoreContainer Loading cores into CoreContainer [instanceDir=/x1/jenkins/jenkins-slave/workspace/Lucene-Solr-Tests-5.5-Java7/solr/build/solr-core/test/J1/temp/solr.security.BasicAuthIntegrationTest_6C10E527400A77DD-001/tempDir-001/node3]
   [junit4]   2> 1997218 WARN  (jetty-launcher-1994-thread-3) [    ] o.a.s.c.CoreContainer Couldn't add files from /x1/jenkins/jenkins-slave/workspace/Lucene-Solr-Tests-5.5-Java7/solr/build/solr-core/test/J1/temp/solr.security.BasicAuthIntegrationTest_6C10E527400A77DD-001/tempDir-001/node3/lib to classpath: /x1/jenkins/jenkins-slave/workspace/Lucene-Solr-Tests-5.5-Java7/solr/build/solr-core/test/J1/temp/solr.security.BasicAuthIntegrationTest_6C10E527400A77DD-001/tempDir-001/node3/lib
   [junit4]   2> 1997218 INFO  (jetty-launcher-1994-thread-3) [    ] o.a.s.h.c.HttpShardHandlerFactory created with socketTimeout : 90000,urlScheme : ,connTimeout : 15000,maxConnectionsPerHost : 20,maxConnections : 10000,corePoolSize : 0,maximumPoolSize : 2147483647,maxThreadIdleTime : 5,sizeOfQueue : -1,fairnessPolicy : false,useRetries : false,
   [junit4]   2> 1997219 INFO  (jetty-launcher-1994-thread-3) [    ] o.a.s.u.UpdateShardHandler Creating UpdateShardHandler HTTP client with params: socketTimeout=340000&connTimeout=45000&retry=true
   [junit4]   2> 1997220 INFO  (jetty-launcher-1994-thread-3) [    ] o.a.s.l.LogWatcher SLF4J impl is org.slf4j.impl.Log4jLoggerFactory
   [junit4]   2> 1997220 INFO  (jetty-launcher-1994-thread-3) [    ] o.a.s.l.LogWatcher Registering Log Listener [Log4j (org.slf4j.impl.Log4jLoggerFactory)]
   [junit4]   2> 1997220 INFO  (jetty-launcher-1994-thread-3) [    ] o.a.s.c.ZkContainer Zookeeper client=127.0.0.1:51933/solr
   [junit4]   2> 1997220 INFO  (jetty-launcher-1994-thread-3) [    ] o.a.s.c.ZkController zkHost includes chroot
   [junit4]   2> 1997220 INFO  (jetty-launcher-1994-thread-3) [    ] o.a.s.c.c.SolrZkClient Using default ZkCredentialsProvider
   [junit4]   2> 1997223 INFO  (zkCallback-1998-thread-1) [    ] o.a.s.c.c.ConnectionManager Watcher org.apache.solr.common.cloud.ConnectionManager@1161f1a1 name:ZooKeeperConnection Watcher:127.0.0.1:51933/solr got event WatchedEvent state:SyncConnected type:None path:null path:null type:None
   [junit4]   2> 1997223 INFO  (jetty-launcher-1994-thread-2) [    ] o.a.s.c.c.ConnectionManager Client is connected to ZooKeeper
   [junit4]   2> 1997224 INFO  (jetty-launcher-1994-thread-2) [    ] o.a.s.c.c.SolrZkClient Using default ZkACLProvider
   [junit4]   2> 1997225 INFO  (jetty-launcher-1994-thread-2) [    ] o.a.s.s.SolrDispatchFilter solr.xml found in ZooKeeper. Loading...
   [junit4]   2> 1997280 INFO  (jetty-launcher-1994-thread-4) [    ] o.a.s.c.c.ConnectionManager Waiting for client to connect to ZooKeeper
   [junit4]   2> 1997280 INFO  (jetty-launcher-1994-thread-2) [    ] o.a.s.c.CorePropertiesLocator Config-defined core root directory: /x1/jenkins/jenkins-slave/workspace/Lucene-Solr-Tests-5.5-Java7/solr/build/solr-core/test/J1/temp/solr.security.BasicAuthIntegrationTest_6C10E527400A77DD-001/tempDir-001/node2/.
   [junit4]   2> 1997280 INFO  (jetty-launcher-1994-thread-2) [    ] o.a.s.c.CoreContainer New CoreContainer 1475293259
   [junit4]   2> 1997280 INFO  (jetty-launcher-1994-thread-5) [    ] o.e.j.s.ServerConnector Started ServerConnector@5d181494{HTTP/1.1}{127.0.0.1:39967}
   [junit4]   2> 1997280 INFO  (jetty-launcher-1994-thread-2) [    ] o.a.s.c.CoreContainer Loading cores into CoreContainer [instanceDir=/x1/jenkins/jenkins-slave/workspace/Lucene-Solr-Tests-5.5-Java7/solr/build/solr-core/test/J1/temp/solr.security.BasicAuthIntegrationTest_6C10E527400A77DD-001/tempDir-001/node2]
   [junit4]   2> 1997280 INFO  (jetty-launcher-1994-thread-5) [    ] o.e.j.s.Server Started @1999968ms
   [junit4]   2> 1997280 INFO  (jetty-launcher-1994-thread-5) [    ] o.a.s.c.s.e.JettySolrRunner Jetty properties: {hostContext=/solr, hostPort=39967}
   [junit4]   2> 1997281 WARN  (jetty-launcher-1994-thread-2) [    ] o.a.s.c.CoreContainer Couldn't add files from /x1/jenkins/jenkins-slave/workspace/Lucene-Solr-Tests-5.5-Java7/solr/build/solr-core/test/J1/temp/solr.security.BasicAuthIntegrationTest_6C10E527400A77DD-001/tempDir-001/node2/lib to classpath: /x1/jenkins/jenkins-slave/workspace/Lucene-Solr-Tests-5.5-Java7/solr/build/solr-core/test/J1/temp/solr.security.BasicAuthIntegrationTest_6C10E527400A77DD-001/tempDir-001/node2/lib
   [junit4]   2> 1997281 INFO  (jetty-launcher-1994-thread-5) [    ] o.a.s.s.SolrDispatchFilter SolrDispatchFilter.init(): sun.misc.Launcher$AppClassLoader@3827de24
   [junit4]   2> 1997281 INFO  (jetty-launcher-1994-thread-2) [    ] o.a.s.h.c.HttpShardHandlerFactory created with socketTimeout : 90000,urlScheme : ,connTimeout : 15000,maxConnectionsPerHost : 20,maxConnections : 10000,corePoolSize : 0,maximumPoolSize : 2147483647,maxThreadIdleTime : 5,sizeOfQueue : -1,fairnessPolicy : false,useRetries : false,
   [junit4]   2> 1997281 INFO  (jetty-launcher-1994-thread-5) [    ] o.a.s.c.SolrResourceLoader new SolrResourceLoader for directory: '/x1/jenkins/jenkins-slave/workspace/Lucene-Solr-Tests-5.5-Java7/solr/build/solr-core/test/J1/temp/solr.security.BasicAuthIntegrationTest_6C10E527400A77DD-001/tempDir-001/node5'
   [junit4]   2> 1997281 INFO  (jetty-launcher-1994-thread-5) [    ] o.a.s.c.SolrResourceLoader JNDI not configured for solr (NoInitialContextEx)
   [junit4]   2> 1997281 INFO  (jetty-launcher-1994-thread-5) [    ] o.a.s.c.SolrResourceLoader solr home defaulted to 'solr/' (could not find system property or JNDI)
   [junit4]   2> 1997281 INFO  (jetty-launcher-1994-thread-5) [    ] o.a.s.c.c.SolrZkClient Using default ZkCredentialsProvider
   [junit4]   2> 1997282 INFO  (jetty-launcher-1994-thread-2) [    ] o.a.s.u.UpdateShardHandler Creating UpdateShardHandler HTTP client with params: socketTimeout=340000&connTimeout=45000&retry=true
   [junit4]   2> 1997282 INFO  (jetty-launcher-1994-thread-2) [    ] o.a.s.l.LogWatcher SLF4J impl is org.slf4j.impl.Log4jLoggerFactory
   [junit4]   2> 1997282 INFO  (jetty-launcher-1994-thread-2) [    ] o.a.s.l.LogWatcher Registering Log Listener [Log4j (org.slf4j.impl.Log4jLoggerFactory)]
   [junit4]   2> 1997282 INFO  (jetty-launcher-1994-thread-2) [    ] o.a.s.c.ZkContainer Zookeeper client=127.0.0.1:51933/solr
   [junit4]   2> 1997283 INFO  (jetty-launcher-1994-thread-2) [    ] o.a.s.c.ZkController zkHost includes chroot
   [junit4]   2> 1997283 INFO  (jetty-launcher-1994-thread-2) [    ] o.a.s.c.c.SolrZkClient Using default ZkCredentialsProvider
   [junit4]   2> 1997297 INFO  (jetty-launcher-1994-thread-5) [    ] o.a.s.c.c.ConnectionManager Waiting for client to connect to ZooKeeper
   [junit4]   2> 1997298 INFO  (jetty-launcher-1994-thread-3) [    ] o.a.s.c.c.ConnectionManager Waiting for client to connect to ZooKeeper
   [junit4]   2> 1997299 INFO  (zkCallback-1999-thread-1) [    ] o.a.s.c.c.ConnectionManager Watcher org.apache.solr.common.cloud.ConnectionManager@5fd4903b name:ZooKeeperConnection Watcher:127.0.0.1:51933/solr got event WatchedEvent state:SyncConnected type:None path:null path:null type:None
   [junit4]   2> 1997300 INFO  (jetty-launcher-1994-thread-4) [    ] o.a.s.c.c.ConnectionManager Client is connected to ZooKeeper
   [junit4]   2> 1997300 INFO  (jetty-launcher-1994-thread-4) [    ] o.a.s.c.c.SolrZkClient Using default ZkACLProvider
   [junit4]   2> 1997303 INFO  (jetty-launcher-1994-thread-4) [    ] o.a.s.s.SolrDispatchFilter solr.xml found in ZooKeeper. Loading...
   [junit4]   2> 1997330 INFO  (jetty-launcher-1994-thread-2) [    ] o.a.s.c.c.ConnectionManager Waiting for client to connect to ZooKeeper
   [junit4]   2> 1997344 INFO  (zkCallback-1997-thread-1) [    ] o.a.s.c.c.ConnectionManager Watcher org.apache.solr.common.cloud.ConnectionManager@42c3151f name:ZooKeeperConnection Watcher:127.0.0.1:51933/solr got event WatchedEvent state:SyncConnected type:None path:null path:null type:None
   [junit4]   2> 1997344 INFO  (jetty-launcher-1994-thread-1) [    ] o.a.s.c.c.ConnectionManager Client is connected to ZooKeeper
   [junit4]   2> 1997344 INFO  (jetty-launcher-1994-thread-1) [    ] o.a.s.c.c.SolrZkClient Using default ZkACLProvider
   [junit4]   2> 1997345 INFO  (jetty-launcher-1994-thread-1) [    ] o.a.s.s.SolrDispatchFilter solr.xml found in ZooKeeper. Loading...
   [junit4]   2> 1997359 INFO  (zkCallback-2003-thread-1) [    ] o.a.s.c.c.ConnectionManager Watcher org.apache.solr.common.cloud.ConnectionManager@5044c027 name:ZooKeeperConnection Watcher:127.0.0.1:51933/solr got event WatchedEvent state:SyncConnected type:None path:null path:null type:None
   [junit4]   2> 1997359 INFO  (jetty-launcher-1994-thread-5) [    ] o.a.s.c.c.ConnectionManager Client is connected to ZooKeeper
   [junit4]   2> 1997359 INFO  (jetty-launcher-1994-thread-5) [    ] o.a.s.c.c.SolrZkClient Using default ZkACLProvider
   [junit4]   2> 1997360 INFO  (jetty-launcher-1994-thread-5) [    ] o.a.s.s.SolrDispatchFilter solr.xml found in ZooKeeper. Loading...
   [junit4]   2> 1997384 INFO  (jetty-launcher-1994-thread-1) [    ] o.a.s.c.CorePropertiesLocator Config-defined core root directory: /x1/jenkins/jenkins-slave/workspace/Lucene-Solr-Tests-5.5-Java7/solr/build/solr-core/test/J1/temp/solr.security.BasicAuthIntegrationTest_6C10E527400A77DD-001/tempDir-001/node1/.
   [junit4]   2> 1997384 INFO  (jetty-launcher-1994-thread-1) [    ] o.a.s.c.CoreContainer New CoreContainer 1555634647
   [junit4]   2> 1997384 INFO  (jetty-launcher-1994-thread-1) [    ] o.a.s.c.CoreContainer Loading cores into CoreContainer [instanceDir=/x1/jenkins/jenkins-slave/workspace/Lucene-Solr-Tests-5.5-Java7/solr/build/solr-core/test/J1/temp/solr.security.BasicAuthIntegrationTest_6C10E527400A77DD-001/tempDir-001/node1]
   [junit4]   2> 1997384 WARN  (jetty-launcher-1994-thread-1) [    ] o.a.s.c.CoreContainer Couldn't add files from /x1/jenkins/jenkins-slave/workspace/Lucene-Solr-Tests-5.5-Java7/solr/build/solr-core/test/J1/temp/solr.security.BasicAuthIntegrationTest_6C10E527400A77DD-001/tempDir-001/node1/lib to classpath: /x1/jenkins/jenkins-slave/workspace/Lucene-Solr-Tests-5.5-Java7/solr/build/solr-core/test/J1/temp/solr.security.BasicAuthIntegrationTest_6C10E527400A77DD-001/tempDir-001/node1/lib
   [junit4]   2> 1997385 INFO  (jetty-launcher-1994-thread-1) [    ] o.a.s.h.c.HttpShardHandlerFactory created with socketTimeout : 90000,urlScheme : ,connTimeout : 15000,maxConnectionsPerHost : 20,maxConnections : 10000,corePoolSize : 0,maximumPoolSize : 2147483647,maxThreadIdleTime : 5,sizeOfQueue : -1,fairnessPolicy : false,useRetries : false,
   [junit4]   2> 1997386 INFO  (jetty-launcher-1994-thread-1) [    ] o.a.s.u.UpdateShardHandler Creating UpdateShardHandler HTTP client with params: socketTimeout=340000&connTimeout=45000&retry=true
   [junit4]   2> 1997386 INFO  (jetty-launcher-1994-thread-1) [    ] o.a.s.l.LogWatcher SLF4J impl is org.slf4j.impl.Log4jLoggerFactory
   [junit4]   2> 1997386 INFO  (jetty-launcher-1994-thread-1) [    ] o.a.s.l.LogWatcher Registering Log Listener [Log4j (org.slf4j.impl.Log4jLoggerFactory)]
   [junit4]   2> 1997387 INFO  (jetty-launcher-1994-thread-1) [    ] o.a.s.c.ZkContainer Zookeeper client=127.0.0.1:51933/solr
   [junit4]   2> 1997387 INFO  (jetty-launcher-1994-thread-1) [    ] o.a.s.c.ZkController zkHost includes chroot
   [junit4]   2> 1997387 INFO  (jetty-launcher-1994-thread-1) [    ] o.a.s.c.c.SolrZkClient Using default ZkCredentialsProvider
   [junit4]   2> 1997387 INFO  (zkCallback-2006-thread-1) [    ] o.a.s.c.c.ConnectionManager Watcher org.apache.solr.common.cloud.ConnectionManager@17d57a14 name:ZooKeeperConnection Watcher:127.0.0.1:51933 got event WatchedEvent state:SyncConnected type:None path:null path:null type:None
   [junit4]   2> 1997387 INFO  (jetty-launcher-1994-thread-2) [    ] o.a.s.c.c.ConnectionManager Client is connected to ZooKeeper
   [junit4]   2> 1997388 INFO  (jetty-launcher-1994-thread-2) [    ] o.a.s.c.c.SolrZkClient Using default ZkACLProvider
   [junit4]   2> 1997392 INFO  (zkCallback-2002-thread-1) [    ] o.a.s.c.c.ConnectionManager Watcher org.apache.solr.common.cloud.ConnectionManager@784839e6 name:ZooKeeperConnection Watcher:127.0.0.1:51933 got event WatchedEvent state:SyncConnected type:None path:null path:null type:None
   [junit4]   2> 1997392 INFO  (jetty-launcher-1994-thread-3) [    ] o.a.s.c.c.ConnectionManager Client is connected to ZooKeeper
   [junit4]   2> 1997393 INFO  (jetty-launcher-1994-thread-3) [    ] o.a.s.c.c.SolrZkClient Using default ZkACLProvider
   [junit4]   2> 1997393 INFO  (jetty-launcher-1994-thread-2) [n:127.0.0.1:53287_solr    ] o.a.s.c.c.ConnectionManager Waiting for client to connect to ZooKeeper
   [junit4]   2> 1997393 INFO  (jetty-launcher-1994-thread-1) [    ] o.a.s.c.c.ConnectionManager Waiting for client to connect to ZooKeeper
   [junit4]   2> 1997394 INFO  (jetty-launcher-1994-thread-4) [    ] o.a.s.c.CorePropertiesLocator Config-defined core root directory: /x1/jenkins/jenkins-slave/workspace/Lucene-Solr-Tests-5.5-Java7/solr/build/solr-core/test/J1/temp/solr.security.BasicAuthIntegrationTest_6C10E527400A77DD-001/tempDir-001/node4/.
   [junit4]   2> 1997394 INFO  (jetty-launcher-1994-thread-4) [    ] o.a.s.c.CoreContainer New CoreContainer 1936661986
   [junit4]   2> 1997394 INFO  (jetty-launcher-1994-thread-4) [    ] o.a.s.c.CoreContainer Loading cores into CoreContainer [instanceDir=/x1/jenkins/jenkins-slave/workspace/Lucene-Solr-Tests-5.5-Java7/solr/build/solr-core/test/J1/temp/solr.security.BasicAuthIntegrationTest_6C10E527400A77DD-001/tempDir-001/node4]
   [junit4]   2> 1997394 WARN  (jetty-launcher-1994-thread-4) [    ] o.a.s.c.CoreContainer Couldn't add files from /x1/jenkins/jenkins-slave/workspace/Lucene-Solr-Tests-5.5-Java7/solr/build/solr-core/test/J1/temp/solr.security.BasicAuthIntegrationTest_6C10E527400A77DD-001/tempDir-001/node4/lib to classpath: /x1/jenkins/jenkins-slave/workspace/Lucene-Solr-Tests-5.5-Java7/solr/build/solr-core/test/J1/temp/solr.security.BasicAuthIntegrationTest_6C10E527400A77DD-001/tempDir-001/node4/lib
   [junit4]   2> 1997394 INFO  (jetty-launcher-1994-thread-4) [    ] o.a.s.h.c.HttpShardHandlerFactory created with socketTimeout : 90000,urlScheme : ,connTimeout : 15000,maxConnectionsPerHost : 20,maxConnections : 10000,corePoolSize : 0,maximumPoolSize : 2147483647,maxThreadIdleTime : 5,sizeOfQueue : -1,fairnessPolicy : false,useRetries : false,
   [junit4]   2> 1997395 INFO  (jetty-launcher-1994-thread-5) [    ] o.a.s.c.CorePropertiesLocator Config-defined core root directory: /x1/jenkins/jenkins-slave/workspace/Lucene-Solr-Tests-5.5-Java7/solr/build/solr-core/test/J1/temp/solr.security.BasicAuthIntegrationTest_6C10E527400A77DD-001/tempDir-001/node5/.
   [junit4]   2> 1997395 INFO  (jetty-launcher-1994-thread-5) [    ] o.a.s.c.CoreContainer New CoreContainer 794631863
   [junit4]   2> 1997395 INFO  (jetty-launcher-1994-thread-5) [    ] o.a.s.c.CoreContainer Loading cores into CoreContainer [instanceDir=/x1/jenkins/jenkins-slave/workspace/Lucene-Solr-Tests-5.5-Java7/solr/build/solr-core/test/J1/temp/solr.security.BasicAuthIntegrationTest_6C10E527400A77DD-001/tempDir-001/node5]
   [junit4]   2> 1997396 WARN  (jetty-launcher-1994-thread-5) [    ] o.a.s.c.CoreContainer Couldn't add files from /x1/jenkins/jenkins-slave/workspace/Lucene-Solr-Tests-5.5-Java7/solr/build/solr-core/test/J1/temp/solr.security.BasicAuthIntegrationTest_6C10E527400A77DD-001/tempDir-001/node5/lib to classpath: /x1/jenkins/jenkins-slave/workspace/Lucene-Solr-Tests-5.5-Java7/solr/build/solr-core/test/J1/temp/solr.security.BasicAuthIntegrationTest_6C10E527400A77DD-001/tempDir-001/node5/lib
   [junit4]   2> 1997396 INFO  (jetty-launcher-1994-thread-5) [    ] o.a.s.h.c.HttpShardHandlerFactory created with socketTimeout : 90000,urlScheme : ,connTimeout : 15000,maxConnectionsPerHost : 20,maxConnections : 10000,corePoolSize : 0,maximumPoolSize : 2147483647,maxThreadIdleTime : 5,sizeOfQueue : -1,fairnessPolicy : false,useRetries : false,
   [junit4]   2> 1997396 INFO  (jetty-launcher-1994-thread-4) [    ] o.a.s.u.UpdateShardHandler Creating UpdateShardHandler HTTP client with params: socketTimeout=340000&connTimeout=45000&retry=true
   [junit4]   2> 1997396 INFO  (jetty-launcher-1994-thread-5) [    ] o.a.s.u.UpdateShardHandler Creating UpdateShardHandler HTTP client with params: socketTimeout=340000&connTimeout=45000&retry=true
   [junit4]   2> 1997396 INFO  (jetty-launcher-1994-thread-4) [    ] o.a.s.l.LogWatcher SLF4J impl is org.slf4j.impl.Log4jLoggerFactory
   [junit4]   2> 1997397 INFO  (jetty-launcher-1994-thread-4) [    ] o.a.s.l.LogWatcher Registering Log Listener [Log4j (org.slf4j.impl.Log4jLoggerFactory)]
   [junit4]   2> 1997397 INFO  (jetty-launcher-1994-thread-4) [    ] o.a.s.c.ZkContainer Zookeeper client=127.0.0.1:51933/solr
   [junit4]   2> 1997397 INFO  (jetty-launcher-1994-thread-4) [    ] o.a.s.c.ZkController zkHost includes chroot
   [junit4]   2> 1997397 INFO  (jetty-launcher-1994-thread-4) [    ] o.a.s.c.c.SolrZkClient Using default ZkCredentialsProvider
   [junit4]   2> 1997397 INFO  (jetty-launcher-1994-thread-5) [    ] o.a.s.l.LogWatcher SLF4J impl is org.slf4j.impl.Log4jLoggerFactory
   [junit4]   2> 1997397 INFO  (jetty-launcher-1994-thread-5) [    ] o.a.s.l.LogWatcher Registering Log Listener [Log4j (org.slf4j.impl.Log4jLoggerFactory)]
   [junit4]   2> 1997397 INFO  (jetty-launcher-1994-thread-5) [    ] o.a.s.c.ZkContainer Zookeeper client=127.0.0.1:51933/solr
   [junit4]   2> 1997397 INFO  (jetty-launcher-1994-thread-5) [    ] o.a.s.c.ZkController zkHost includes chroot
   [junit4]   2> 1997397 INFO  (jetty-launcher-1994-thread-5) [    ] o.a.s.c.c.SolrZkClient Using default ZkCredentialsProvider
   [junit4]   2> 1997445 INFO  (jetty-launcher-1994-thread-4) [    ] o.a.s.c.c.ConnectionManager Waiting for client to connect to ZooKeeper
   [junit4]   2> 1997460 INFO  (jetty-launcher-1994-thread-5) [    ] o.a.s.c.c.ConnectionManager Waiting for client to connect to ZooKeeper
   [junit4]   2> 1997474 INFO  (jetty-launcher-1994-thread-3) [n:127.0.0.1:50112_solr    ] o.a.s.c.c.ConnectionManager Waiting for client to connect to ZooKeeper
   [junit4]   2> 1997474 INFO  (zkCallback-2009-thread-1) [    ] o.a.s.c.c.ConnectionManager Watcher org.apache.solr.common.cloud.ConnectionManager@45b70627 name:ZooKeeperConnection Watcher:127.0.0.1:51933 got event WatchedEvent state:SyncConnected type:None path:null path:null type:None
   [junit4]   2> 1997475 INFO  (jetty-launcher-1994-thread-1) [    ] o.a.s.c.c.ConnectionManager Client is connected to ZooKeeper
   [junit4]   2> 1997475 INFO  (jetty-launcher-1994-thread-1) [    ] o.a.s.c.c.SolrZkClient Using default ZkACLProvider
   [junit4]   2> 1997475 INFO  (zkCallback-2010-thread-1-processing-n:127.0.0.1:53287_solr) [n:127.0.0.1:53287_solr    ] o.a.s.c.c.ConnectionManager Watcher org.apache.solr.common.cloud.ConnectionManager@4a67c98d name:ZooKeeperConnection Watcher:127.0.0.1:51933/solr got event WatchedEvent state:SyncConnected type:None path:null path:null type:None
   [junit4]   2> 1997475 INFO  (jetty-launcher-1994-thread-2) [n:127.0.0.1:53287_solr    ] o.a.s.c.c.ConnectionManager Client is connected to ZooKeeper
   [junit4]   2> 1997476 INFO  (zkCallback-2015-thread-1) [    ] o.a.s.c.c.ConnectionManager Watcher org.apache.solr.common.cloud.ConnectionManager@38503849 name:ZooKeeperConnection Watcher:127.0.0.1:51933 got event WatchedEvent state:SyncConnected type:None path:null path:null type:None
   [junit4]   2> 1997477 INFO  (jetty-launcher-1994-thread-4) [    ] o.a.s.c.c.ConnectionManager Client is connected to ZooKeeper
   [junit4]   2> 1997477 INFO  (jetty-launcher-1994-thread-4) [    ] o.a.s.c.c.SolrZkClient Using default ZkACLProvider
   [junit4]   2> 1997478 INFO  (zkCallback-2017-thread-1-processing-n:127.0.0.1:50112_solr) [n:127.0.0.1:50112_solr    ] o.a.s.c.c.ConnectionManager Watcher org.apache.solr.common.cloud.ConnectionManager@38f2416a name:ZooKeeperConnection Watcher:127.0.0.1:51933/solr got event WatchedEvent state:SyncConnected type:None path:null path:null type:None
   [junit4]   2> 1997478 INFO  (jetty-launcher-1994-thread-3) [n:127.0.0.1:50112_solr    ] o.a.s.c.c.ConnectionManager Client is connected to ZooKeeper
   [junit4]   2> 1997478 INFO  (jetty-launcher-1994-thread-2) [n:127.0.0.1:53287_solr    ] o.a.s.c.c.SolrZkClient makePath: /overseer/queue
   [junit4]   2> 1997481 INFO  (jetty-launcher-1994-thread-1) [n:127.0.0.1:59719_solr    ] o.a.s.c.c.ConnectionManager Waiting for client to connect to ZooKeeper
   [junit4]   2> 1997483 INFO  (jetty-launcher-1994-thread-2) [n:127.0.0.1:53287_solr    ] o.a.s.c.c.SolrZkClient makePath: /overseer/collection-queue-work
   [junit4]   2> 1997488 INFO  (zkCallback-2016-thread-1) [    ] o.a.s.c.c.ConnectionManager Watcher org.apache.solr.common.cloud.ConnectionManager@46836dd9 name:ZooKeeperConnection Watcher:127.0.0.1:51933 got event WatchedEvent state:SyncConnected type:None path:null path:null type:None
   [junit4]   2> 1997488 INFO  (jetty-launcher-1994-thread-5) [    ] o.a.s.c.c.ConnectionManager Client is connected to ZooKeeper
   [junit4]   2> 1997488 INFO  (jetty-launcher-1994-thread-5) [    ] o.a.s.c.c.SolrZkClient Using default ZkACLProvider
   [junit4]   2> 1997488 INFO  (jetty-launcher-1994-thread-3) [n:127.0.0.1:50112_solr    ] o.a.s.c.c.SolrZkClient makePath: /overseer/collection-queue-work
   [junit4]   2> 1997489 INFO  (jetty-launcher-1994-thread-4) [n:127.0.0.1:48695_solr    ] o.a.s.c.c.ConnectionManager Waiting for client to connect to ZooKeeper
   [junit4]   2> 1997505 INFO  (jetty-launcher-1994-thread-2) [n:127.0.0.1:53287_solr    ] o.a.s.c.c.SolrZkClient makePath: /overseer/collection-map-running
   [junit4]   2> 1997508 INFO  (jetty-launcher-1994-thread-2) [n:127.0.0.1:53287_solr    ] o.a.s.c.c.SolrZkClient makePath: /overseer/collection-map-completed
   [junit4]   2> 1997510 INFO  (jetty-launcher-1994-thread-2) [n:127.0.0.1:53287_solr    ] o.a.s.c.c.SolrZkClient makePath: /overseer/collection-map-failure
   [junit4]   2> 1997513 INFO  (jetty-launcher-1994-thread-2) [n:127.0.0.1:53287_solr    ] o.a.s.c.c.SolrZkClient makePath: /live_nodes
   [junit4]   2> 1997514 INFO  (jetty-launcher-1994-thread-2) [n:127.0.0.1:53287_solr    ] o.a.s.c.c.SolrZkClient makePath: /collections
   [junit4]   2> 1997516 INFO  (jetty-launcher-1994-thread-2) [n:127.0.0.1:53287_solr    ] o.a.s.c.c.SolrZkClient makePath: /aliases.json
   [junit4]   2> 1997517 INFO  (jetty-launcher-1994-thread-2) [n:127.0.0.1:53287_solr    ] o.a.s.c.c.SolrZkClient makePath: /clusterstate.json
   [junit4]   2> 1997518 INFO  (jetty-launcher-1994-thread-2) [n:127.0.0.1:53287_solr    ] o.a.s.c.c.SolrZkClient makePath: /security.json
   [junit4]   2> 1997521 INFO  (zkCallback-2018-thread-1-processing-n:127.0.0.1:59719_solr) [n:127.0.0.1:59719_solr    ] o.a.s.c.c.ConnectionManager Watcher org.apache.solr.common.cloud.ConnectionManager@31e8a40 name:ZooKeeperConnection Watcher:127.0.0.1:51933/solr got event WatchedEvent state:SyncConnected type:None path:null path:null type:None
   [junit4]   2> 1997521 INFO  (jetty-launcher-1994-thread-1) [n:127.0.0.1:59719_solr    ] o.a.s.c.c.ConnectionManager Client is connected to ZooKeeper
   [junit4]   2> 1997522 INFO  (jetty-launcher-1994-thread-2) [n:127.0.0.1:53287_solr    ] o.a.s.c.ZkController Register node as live in ZooKeeper:/live_nodes/127.0.0.1:53287_solr
   [junit4]   2> 1997523 INFO  (jetty-launcher-1994-thread-2) [n:127.0.0.1:53287_solr    ] o.a.s.c.c.SolrZkClient makePath: /live_nodes/127.0.0.1:53287_solr
   [junit4]   2> 1997527 INFO  (jetty-launcher-1994-thread-2) [n:127.0.0.1:53287_solr    ] o.a.s.c.c.SolrZkClient makePath: /overseer_elect
   [junit4]   2> 1997527 INFO  (jetty-launcher-1994-thread-3) [n:127.0.0.1:50112_solr    ] o.a.s.c.c.ZkStateReader Updating cluster state from ZooKeeper... 
   [junit4]   2> 1997529 INFO  (jetty-launcher-1994-thread-2) [n:127.0.0.1:53287_solr    ] o.a.s.c.c.SolrZkClient makePath: /overseer_elect/election
   [junit4]   2> 1997531 INFO  (jetty-launcher-1994-thread-1) [n:127.0.0.1:59719_solr    ] o.a.s.c.c.ZkStateReader Updating cluster state from ZooKeeper... 
   [junit4]   2> 1997531 INFO  (jetty-launcher-1994-thread-2) [n:127.0.0.1:53287_solr    ] o.a.s.c.Overseer Overseer (id=null) closing
   [junit4]   2> 1997532 INFO  (jetty-launcher-1994-thread-2) [n:127.0.0.1:53287_solr    ] o.a.s.c.LeaderElector Joined leadership election with path: /overseer_elect/election/95428655558361096-127.0.0.1:53287_solr-n_0000000000
   [junit4]   2> 1997532 INFO  (jetty-launcher-1994-thread-2) [n:127.0.0.1:53287_solr    ] o.a.s.c.OverseerElectionContext I am going to be the leader 127.0.0.1:53287_solr
   [junit4]   2> 1997532 INFO  (jetty-launcher-1994-thread-2) [n:127.0.0.1:53287_solr    ] o.a.s.c.c.SolrZkClient makePath: /overseer_elect/leader
   [junit4]   2> 1997534 INFO  (jetty-launcher-1994-thread-2) [n:127.0.0.1:53287_solr    ] o.a.s.c.Overseer Overseer (id=95428655558361096-127.0.0.1:53287_solr-n_0000000000) starting
   [junit4]   2> 1997537 INFO  (jetty-launcher-1994-thread-2) [n:127.0.0.1:53287_solr    ] o.a.s.c.c.SolrZkClient makePath: /overseer/queue-work
   [junit4]   2> 1997555 INFO  (jetty-launcher-1994-thread-5) [n:127.0.0.1:39967_solr    ] o.a.s.c.c.ConnectionManager Waiting for client to connect to ZooKeeper
   [junit4]   2> 1997560 INFO  (zkCallback-2019-thread-1-processing-n:127.0.0.1:48695_solr) [n:127.0.0.1:48695_solr    ] o.a.s.c.c.ConnectionManager Watcher org.apache.solr.common.cloud.ConnectionManager@29f61f89 name:ZooKeeperConnection Watcher:127.0.0.1:51933/solr got event WatchedEvent state:SyncConnected type:None path:null path:null type:None
   [junit4]   2> 1997560 INFO  (jetty-launcher-1994-thread-4) [n:127.0.0.1:48695_solr    ] o.a.s.c.c.ConnectionManager Client is connected to ZooKeeper
   [junit4]   2> 1997569 INFO  (zkCallback-2020-thread-1-processing-n:127.0.0.1:39967_solr) [n:127.0.0.1:39967_solr    ] o.a.s.c.c.ConnectionManager Watcher org.apache.solr.common.cloud.ConnectionManager@79749552 name:ZooKeeperConnection Watcher:127.0.0.1:51933/solr got event WatchedEvent state:SyncConnected type:None path:null path:null type:None
   [junit4]   2> 1997570 INFO  (jetty-launcher-1994-thread-5) [n:127.0.0.1:39967_solr    ] o.a.s.c.c.ConnectionManager Client is connected to ZooKeeper
   [junit4]   2> 1997574 INFO  (jetty-launcher-1994-thread-2) [n:127.0.0.1:53287_solr    ] o.a.s.c.OverseerAutoReplicaFailoverThread Starting OverseerAutoReplicaFailoverThread autoReplicaFailoverWorkLoopDelay=10000 autoReplicaFailoverWaitAfterExpiration=30000 autoReplicaFailoverBadNodeExpiration=60000
   [junit4]   2> 1997579 INFO  (jetty-launcher-1994-thread-4) [n:127.0.0.1:48695_solr    ] o.a.s.c.c.ZkStateReader Updating cluster state from ZooKeeper... 
   [junit4]   2> 1997581 INFO  (jetty-launcher-1994-thread-5) [n:127.0.0.1:39967_solr    ] o.a.s.c.c.ZkStateReader Updating cluster state from ZooKeeper... 
   [junit4]   2> 1997586 INFO  (OverseerStateUpdate-95428655558361096-127.0.0.1:53287_solr-n_0000000000) [n:127.0.0.1:53287_solr    ] o.a.s.c.Overseer Starting to work on the main queue
   [junit4]   2> 1997587 INFO  (OverseerStateUpdate-95428655558361096-127.0.0.1:53287_solr-n_0000000000) [n:127.0.0.1:53287_solr    ] o.a.s.c.c.ZkStateReader Updating cluster state from ZooKeeper... 
   [junit4]   2> 1997633 INFO  (jetty-launcher-1994-thread-2) [n:127.0.0.1:53287_solr    ] o.a.s.c.c.ZkStateReader Updating cluster state from ZooKeeper... 
   [junit4]   2> 1997633 INFO  (OverseerCollectionConfigSetProcessor-95428655558361096-127.0.0.1:53287_solr-n_0000000000) [n:127.0.0.1:53287_solr    ] o.a.s.c.OverseerTaskProcessor Process current queue of overseer operations
   [junit4]   2> 1997651 INFO  (jetty-launcher-1994-thread-2) [n:127.0.0.1:53287_solr    ] o.a.s.c.CoreContainer Security conf doesn't exist. Skipping setup for authorization module.
   [junit4]   2> 1997652 INFO  (jetty-launcher-1994-thread-2) [n:127.0.0.1:53287_solr    ] o.a.s.c.CoreContainer No authentication plugin used.
   [junit4]   2> 1997653 INFO  (jetty-launcher-1994-thread-2) [n:127.0.0.1:53287_solr    ] o.a.s.c.CorePropertiesLocator Looking for core definitions underneath /x1/jenkins/jenkins-slave/workspace/Lucene-Solr-Tests-5.5-Java7/solr/build/solr-core/test/J1/temp/solr.security.BasicAuthIntegrationTest_6C10E527400A77DD-001/tempDir-001/node2/.
   [junit4]   2> 1997653 INFO  (jetty-launcher-1994-thread-2) [n:127.0.0.1:53287_solr    ] o.a.s.c.CorePropertiesLocator Found 0 core definitions
   [junit4]   2> 1997658 INFO  (jetty-launcher-1994-thread-2) [n:127.0.0.1:53287_solr    ] o.a.s.s.SolrDispatchFilter user.dir=/x1/jenkins/jenkins-slave/workspace/Lucene-Solr-Tests-5.5-Java7/solr/build/solr-core/test/J1
   [junit4]   2> 1997658 INFO  (jetty-launcher-1994-thread-2) [n:127.0.0.1:53287_solr    ] o.a.s.s.SolrDispatchFilter SolrDispatchFilter.init() done
   [junit4]   2> 1998534 INFO  (jetty-launcher-1994-thread-3) [n:127.0.0.1:50112_solr    ] o.a.s.c.ZkController Register node as live in ZooKeeper:/live_nodes/127.0.0.1:50112_solr
   [junit4]   2> 1998549 INFO  (jetty-launcher-1994-thread-3) [n:127.0.0.1:50112_solr    ] o.a.s.c.c.SolrZkClient makePath: /live_nodes/127.0.0.1:50112_solr
   [junit4]   2> 1998552 INFO  (zkCallback-2019-thread-1-processing-n:127.0.0.1:48695_solr) [n:127.0.0.1:48695_solr    ] o.a.s.c.c.ZkStateReader A live node change: [WatchedEvent state:SyncConnected type:NodeChildrenChanged path:/live_nodes], has occurred - updating... (live nodes size: [1])
   [junit4]   2> 1998552 INFO  (zkCallback-2020-thread-1-processing-n:127.0.0.1:39967_solr) [n:127.0.0.1:39967_solr    ] o.a.s.c.c.ZkStateReader A live node change: [WatchedEvent state:SyncConnected type:NodeChildrenChanged path:/live_nodes], has occurred - updating... (live nodes size: [1])
   [junit4]   2> 1998553 INFO  (zkCallback-2017-thread-1-processing-n:127.0.0.1:50112_solr) [n:127.0.0.1:50112_solr    ] o.a.s.c.c.ZkStateReader A live node change: [WatchedEvent state:SyncConnected type:NodeChildrenChanged path:/live_nodes], has occurred - updating... (live nodes size: [1])
   [junit4]   2> 1998553 INFO  (zkCallback-2010-thread-1-processing-n:127.0.0.1:53287_solr) [n:127.0.0.1:53287_solr    ] o.a.s.c.c.ZkStateReader A live node change: [WatchedEvent state:SyncConnected type:NodeChildrenChanged path:/live_nodes], has occurred - updating... (live nodes size: [1])
   [junit4]   2> 1998554 INFO  (jetty-launcher-1994-thread-1) [n:127.0.0.1:59719_solr    ] o.a.s.c.ZkController Register node as live in ZooKeeper:/live_nodes/127.0.0.1:59719_solr
   [junit4]   2> 1998555 INFO  (jetty-launcher-1994-thread-1) [n:127.0.0.1:59719_solr    ] o.a.s.c.c.SolrZkClient makePath: /live_nodes/127.0.0.1:59719_solr
   [junit4]   2> 1998555 INFO  (jetty-launcher-1994-thread-3) [n:127.0.0.1:50112_solr    ] o.a.s.c.Overseer Overseer (id=null) closing
   [junit4]   2> 1998555 INFO  (zkCallback-2010-thread-2-processing-n:127.0.0.1:53287_solr) [n:127.0.0.1:53287_solr    ] o.a.s.c.c.ZkStateReader A live node change: [WatchedEvent state:SyncConnected type:NodeChildrenChanged path:/live_nodes], has occurred - updating... (live nodes size: [2])
   [junit4]   2> 1998560 INFO  (zkCallback-2018-thread-1-processing-n:127.0.0.1:59719_solr) [n:127.0.0.1:59719_solr    ] o.a.s.c.c.ZkStateReader A live node change: [WatchedEvent state:SyncConnected type:NodeChildrenChanged path:/live_nodes], has occurred - updating... (live nodes size: [1])
   [junit4]   2> 1998567 INFO  (jetty-launcher-1994-thread-3) [n:127.0.0.1:50112_solr    ] o.a.s.c.LeaderElector Joined leadership election with path: /overseer_elect/election/95428655558361100-127.0.0.1:50112_solr-n_0000000001
   [junit4]   2> 1998573 INFO  (zkCallback-2018-thread-1-processing-n:127.0.0.1:59719_solr) [n:127.0.0.1:59719_solr    ] o.a.s.c.c.ZkStateReader A live node change: [WatchedEvent state:SyncConnected type:NodeChildrenChanged path:/live_nodes], has occurred - updating... (live nodes size: [2])
   [junit4]   2> 1998573 INFO  (zkCallback-2020-thread-1-processing-n:127.0.0.1:39967_solr) [n:127.0.0.1:39967_solr    ] o.a.s.c.c.ZkStateReader A live node change: [WatchedEvent state:SyncConnected type:NodeChildrenChanged path:/live_nodes], has occurred - updating... (live nodes size: [2])
   [junit4]   2> 1998573 INFO  (zkCallback-2019-thread-1-processing-n:127.0.0.1:48695_solr) [n:127.0.0.1:48695_solr    ] o.a.s.c.c.ZkStateReader A live node change: [WatchedEvent state:SyncConnected type:NodeChildrenChanged path:/live_nodes], has occurred - updating... (live nodes size: [2])
   [junit4]   2> 1998573 INFO  (zkCallback-2010-thread-1-processing-n:127.0.0.1:53287_solr) [n:127.0.0.1:53287_solr    ] o.a.s.c.c.ZkStateReader A live node change: [WatchedEvent state:SyncConnected type:NodeChildrenChanged path:/live_nodes], has occurred - updating... (live nodes size: [2])
   [junit4]   2> 1998573 INFO  (jetty-launcher-1994-thread-3) [n:127.0.0.1:50112_solr    ] o.a.s.c.LeaderElector Watching path /overseer_elect/election/95428655558361096-127.0.0.1:53287_solr-n_0000000000 to know if I could be the leader
   [junit4]   2> 1998573 INFO  (zkCallback-2017-thread-1-processing-n:127.0.0.1:50112_solr) [n:127.0.0.1:50112_solr    ] o.a.s.c.c.ZkStateReader A live node change: [WatchedEvent state:SyncConnected type:NodeChildrenChanged path:/live_nodes], has occurred - updating... (live nodes size: [2])
   [junit4]   2> 1998574 INFO  (zkCallback-2010-thread-2-processing-n:127.0.0.1:53287_solr) [n:127.0.0.1:53287_solr    ] o.a.s.c.c.ZkStateReader A live node change: [WatchedEvent state:SyncConnected type:NodeChildrenChanged path:/live_nodes], has occurred - updating... (live nodes size: [2])
   [junit4]   2> 1998584 INFO  (jetty-launcher-1994-thread-4) [n:127.0.0.1:48695_solr    ] o.a.s.c.ZkController Register node as live in ZooKeeper:/live_nodes/127.0.0.1:48695_solr
   [junit4]   2> 1998586 INFO  (jetty-launcher-1994-thread-1) [n:127.0.0.1:59719_solr    ] o.a.s.c.Overseer Overseer (id=null) closing
   [junit4]   2> 1998586 INFO  (jetty-launcher-1994-thread-4) [n:127.0.0.1:48695_solr    ] o.a.s.c.c.SolrZkClient makePath: /live_nodes/127.0.0.1:48695_solr
   [junit4]   2> 1998589 INFO  (zkCallback-2010-thread-2-processing-n:127.0.0.1:53287_solr) [n:127.0.0.1:53287_solr    ] o.a.s.c.c.ZkStateReader A live node change: [WatchedEvent state:SyncConnected type:NodeChildrenChanged path:/live_nodes], has occurred - updating... (live nodes size: [3])
   [junit4]   2> 1998589 INFO  (zkCallback-2010-thread-1-processing-n:127.0.0.1:53287_solr) [n:127.0.0.1:53287_solr    ] o.a.s.c.c.ZkStateReader A live node change: [WatchedEvent state:SyncConnected type:NodeChildrenChanged path:/live_nodes], has occurred - updating... (live nodes size: [3])
   [junit4]   2> 1998589 INFO  (zkCallback-2019-thread-1-processing-n:127.0.0.1:48695_solr) [n:127.0.0.1:48695_solr    ] o.a.s.c.c.ZkStateReader A live node change: [WatchedEvent state:SyncConnected type:NodeChildrenChanged path:/live_nodes], has occurred - updating... (live nodes size: [3])
   [junit4]   2> 1998591 INFO  (jetty-launcher-1994-thread-4) [n:127.0.0.1:48695_solr    ] o.a.s.c.Overseer Overseer (id=null) closing
   [junit4]   2> 1998591 INFO  (zkCallback-2020-thread-1-processing-n:127.0.0.1:39967_solr) [n:127.0.0.1:39967_solr    ] o.a.s.c.c.ZkStateReader A live node change: [WatchedEvent state:SyncConnected type:NodeChildrenChanged path:/live_nodes], has occurred - updating... (live nodes size: [3])
   [junit4]   2> 1998591 INFO  (jetty-launcher-1994-thread-1) [n:127.0.0.1:59719_solr    ] o.a.s.c.LeaderElector Joined leadership election with path: /overseer_elect/election/95428655558361101-127.0.0.1:59719_solr-n_0000000002
   [junit4]   2> 1998591 INFO  (zkCallback-2018-thread-1-processing-n:127.0.0.1:59719_solr) [n:127.0.0.1:59719_solr    ] o.a.s.c.c.ZkStateReader A live node change: [WatchedEvent state:SyncConnected type:NodeChildrenChanged path:/live_nodes], has occurred - updating... (live nodes size: [3])
   [junit4]   2> 1998592 INFO  (zkCallback-2017-thread-1-processing-n:127.0.0.1:50112_solr) [n:127.0.0.1:50112_solr    ] o.a.s.c.c.ZkStateReader A live node change: [WatchedEvent state:SyncConnected type:NodeChildrenChanged path:/live_nodes], has occurred - updating... (live nodes size: [3])
   [junit4]   2> 1998593 INFO  (jetty-launcher-1994-thread-4) [n:127.0.0.1:48695_solr    ] o.a.s.c.LeaderElector Joined leadership election with path: /overseer_elect/election/95428655558361102-127.0.0.1:48695_solr-n_0000000003
   [junit4]   2> 1998593 INFO  (jetty-launcher-1994-thread-5) [n:127.0.0.1:39967_solr    ] o.a.s.c.ZkController Register node as live in ZooKeeper:/live_nodes/127.0.0.1:39967_solr
   [junit4]   2> 1998598 INFO  (jetty-launcher-1994-thread-5) [n:127.0.0.1:39967_solr    ] o.a.s.c.c.SolrZkClient makePath: /live_nodes/127.0.0.1:39967_solr
   [junit4]   2> 1998598 INFO  (jetty-launcher-1994-thread-4) [n:127.0.0.1:48695_solr    ] o.a.s.c.LeaderElector Watching path /overseer_elect/election/95428655558361101-127.0.0.1:59719_solr-n_0000000002 to know if I could be the leader
   [junit4]   2> 1998598 INFO  (jetty-launcher-1994-thread-1) [n:127.0.0.1:59719_solr    ] o.a.s.c.LeaderElector Watching path /overseer_elect/election/95428655558361100-127.0.0.1:50112_solr-n_0000000001 to know if I could be the leader
   [junit4]   2> 1998605 INFO  (zkCallback-2010-thread-1-processing-n:127.0.0.1:53287_solr) [n:127.0.0.1:53287_solr    ] o.a.s.c.c.ZkStateReader A live node change: [WatchedEvent state:SyncConnected type:NodeChildrenChanged path:/live_nodes], has occurred - updating... (live nodes size: [4])
   [junit4]   2> 1998606 INFO  (zkCallback-2018-thread-1-processing-n:127.0.0.1:59719_solr) [n:127.0.0.1:59719_solr    ] o.a.s.c.c.ZkStateReader A live node change: [WatchedEvent state:SyncConnected type:NodeChildrenChanged path:/live_nodes], has occurred - updating... (live nodes size: [4])
   [junit4]   2> 1998606 INFO  (zkCallback-2010-thread-2-processing-n:127.0.0.1:53287_solr) [n:127.0.0.1:53287_solr    ] o.a.s.c.c.ZkStateReader A live node change: [WatchedEvent state:SyncConnected type:NodeChildrenChanged path:/live_nodes], has occurred - updating... (live nodes size: [4])
   [junit4]   2> 1998606 INFO  (zkCallback-2017-thread-1-processing-n:127.0.0.1:50112_solr) [n:127.0.0.1:50112_solr    ] o.a.s.c.c.ZkStateReader A live node change: [WatchedEvent state:SyncConnected type:NodeChildrenChanged path:/live_nodes], has occurred - updating... (live nodes size: [4])
   [junit4]   2> 1998606 INFO  (zkCallback-2020-thread-1-processing-n:127.0.0.1:39967_solr) [n:127.0.0.1:39967_solr    ] o.a.s.c.c.ZkStateReader A live node change: [WatchedEvent state:SyncConnected type:NodeChildrenChanged path:/live_nodes], has occurred - updating... (live nodes size: [4])
   [junit4]   2> 1998606 INFO  (zkCallback-2019-thread-1-processing-n:127.0.0.1:48695_solr) [n:127.0.0.1:48695_solr    ] o.a.s.c.c.ZkStateReader A live node change: [WatchedEvent state:SyncConnected type:NodeChildrenChanged path:/live_nodes], has occurred - updating... (live nodes size: [4])
   [junit4]   2> 1998607 INFO  (jetty-launcher-1994-thread-5) [n:127.0.0.1:39967_solr    ] o.a.s.c.Overseer Overseer (id=null) closing
   [junit4]   2> 1998609 INFO  (jetty-launcher-1994-thread-5) [n:127.0.0.1:39967_solr    ] o.a.s.c.LeaderElector Joined leadership election with path: /overseer_elect/election/95428655558361103-127.0.0.1:39967_solr-n_0000000004
   [junit4]   2> 1998609 INFO  (jetty-launcher-1994-thread-5) [n:127.0.0.1:39967_solr    ] o.a.s.c.LeaderElector Watching path /overseer_elect/election/95428655558361102-127.0.0.1:48695_solr-n_0000000003 to know if I could be the leader
   [junit4]   2> 1998613 INFO  (jetty-launcher-1994-thread-3) [n:127.0.0.1:50112_solr    ] o.a.s.c.CoreContainer Security conf doesn't exist. Skipping setup for authorization module.
   [junit4]   2> 1998613 INFO  (jetty-launcher-1994-thread-3) [n:127.0.0.1:50112_solr    ] o.a.s.c.CoreContainer No authentication plugin used.
   [junit4]   2> 1998615 INFO  (jetty-launcher-1994-thread-3) [n:127.0.0.1:50112_solr    ] o.a.s.c.CorePropertiesLocator Looking for core definitions underneath /x1/jenkins/jenkins-slave/workspace/Lucene-Solr-Tests-5.5-Java7/solr/build/solr-core/test/J1/temp/solr.security.BasicAuthIntegrationTest_6C10E527400A77DD-001/tempDir-001/node3/.
   [junit4]   2> 1998615 INFO  (jetty-launcher-1994-thread-3) [n:127.0.0.1:50112_solr    ] o.a.s.c.CorePropertiesLocator Found 0 core definitions
   [junit4]   2> 1998615 INFO  (jetty-launcher-1994-thread-1) [n:127.0.0.1:59719_solr    ] o.a.s.c.CoreContainer Security conf doesn't exist. Skipping setup for authorization module.
   [junit4]   2> 1998615 INFO  (jetty-launcher-1994-thread-1) [n:127.0.0.1:59719_solr    ] o.a.s.c.CoreContainer No authentication plugin used.
   [junit4]   2> 1998616 INFO  (jetty-launcher-1994-thread-1) [n:127.0.0.1:59719_solr    ] o.a.s.c.CorePropertiesLocator Looking for core definitions underneath /x1/jenkins/jenkins-slave/workspace/Lucene-Solr-Tests-5.5-Java7/solr/build/solr-core/test/J1/temp/solr.security.BasicAuthIntegrationTest_6C10E527400A77DD-001/tempDir-001/node1/.
   [junit4]   2> 1998617 INFO  (jetty-launcher-1994-thread-1) [n:127.0.0.1:59719_solr    ] o.a.s.c.CorePropertiesLocator Found 0 core definitions
   [junit4]   2> 1998631 INFO  (jetty-launcher-1994-thread-4) [n:127.0.0.1:48695_solr    ] o.a.s.c.CoreContainer Security conf doesn't exist. Skipping setup for authorization module.
   [junit4]   2> 1998631 INFO  (jetty-launcher-1994-thread-4) [n:127.0.0.1:48695_solr    ] o.a.s.c.CoreContainer No authentication plugin used.
   [junit4]   2> 1998632 INFO  (jetty-launcher-1994-thread-4) [n:127.0.0.1:48695_solr    ] o.a.s.c.CorePropertiesLocator Looking for core definitions underneath /x1/jenkins/jenkins-slave/workspace/Lucene-Solr-Tests-5.5-Java7/solr/build/solr-core/test/J1/temp/solr.security.BasicAuthIntegrationTest_6C10E527400A77DD-001/tempDir-001/node4/.
   [junit4]   2> 1998632 INFO  (jetty-launcher-1994-thread-4) [n:127.0.0.1:48695_solr    ] o.a.s.c.CorePropertiesLocator Found 0 core definitions
   [junit4]   2> 1998646 INFO  (jetty-launcher-1994-thread-5) [n:127.0.0.1:39967_solr    ] o.a.s.c.CoreContainer Security conf doesn't exist. Skipping setup for authorization module.
   [junit4]   2> 1998646 INFO  (jetty-launcher-1994-thread-5) [n:127.0.0.1:39967_solr    ] o.a.s.c.CoreContainer No authentication plugin used.
   [junit4]   2> 1998647 INFO  (jetty-launcher-1994-thread-5) [n:127.0.0.1:39967_solr    ] o.a.s.c.CorePropertiesLocator Looking for core definitions underneath /x1/jenkins/jenkins-slave/workspace/Lucene-Solr-Tests-5.5-Java7/solr/build/solr-core/test/J1/temp/solr.security.BasicAuthIntegrationTest_6C10E527400A77DD-001/tempDir-001/node5/.
   [junit4]   2> 1998648 INFO  (jetty-launcher-1994-thread-3) [n:127.0.0.1:50112_solr    ] o.a.s.s.SolrDispatchFilter user.dir=/x1/jenkins/jenkins-slave/workspace/Lucene-Solr-Tests-5.5-Java7/solr/build/solr-core/test/J1
   [junit4]   2> 1998648 INFO  (jetty-launcher-1994-thread-3) [n:127.0.0.1:50112_solr    ] o.a.s.s.SolrDispatchFilter SolrDispatchFilter.init() done
   [junit4]   2> 1998649 INFO  (jetty-launcher-1994-thread-1) [n:127.0.0.1:59719_solr    ] o.a.s.s.SolrDispatchFilter user.dir=/x1/jenkins/jenkins-slave/workspace/Lucene-Solr-Tests-5.5-Java7/solr/build/solr-core/test/J1
   [junit4]   2> 1998649 INFO  (jetty-launcher-1994-thread-1) [n:127.0.0.1:59719_solr    ] o.a.s.s.SolrDispatchFilter SolrDispatchFilter.init() done
   [junit4]   2> 1998654 INFO  (jetty-launcher-1994-thread-5) [n:127.0.0.1:39967_solr    ] o.a.s.c.CorePropertiesLocator Found 0 core definitions
   [junit4]   2> 1998654 INFO  (jetty-launcher-1994-thread-4) [n:127.0.0.1:48695_solr    ] o.a.s.s.SolrDispatchFilter user.dir=/x1/jenkins/jenkins-slave/workspace/Lucene-Solr-Tests-5.5-Java7/solr/build/solr-core/test/J1
   [junit4]   2> 1998654 INFO  (jetty-launcher-1994-thread-4) [n:127.0.0.1:48695_solr    ] o.a.s.s.SolrDispatchFilter SolrDispatchFilter.init() done
   [junit4]   2> 1998655 INFO  (jetty-launcher-1994-thread-5) [n:127.0.0.1:39967_solr    ] o.a.s.s.SolrDispatchFilter user.dir=/x1/jenkins/jenkins-slave/workspace/Lucene-Solr-Tests-5.5-Java7/solr/build/solr-core/test/J1
   [junit4]   2> 1998655 INFO  (jetty-launcher-1994-thread-5) [n:127.0.0.1:39967_solr    ] o.a.s.s.SolrDispatchFilter SolrDispatchFilter.init() done
   [junit4]   2> 1998656 INFO  (TEST-BasicAuthIntegrationTest.testBasics-seed#[6C10E527400A77DD]) [    ] o.a.s.c.c.SolrZkClient Using default ZkCredentialsProvider
   [junit4]   2> 1998656 INFO  (TEST-BasicAuthIntegrationTest.testBasics-seed#[6C10E527400A77DD]) [    ] o.a.s.c.c.ConnectionManager Waiting for client to connect to ZooKeeper
   [junit4]   2> 1998668 INFO  (zkCallback-2021-thread-1) [    ] o.a.s.c.c.ConnectionManager Watcher org.apache.solr.common.cloud.ConnectionManager@b10b980 name:ZooKeeperConnection Watcher:127.0.0.1:51933 got event WatchedEvent state:SyncConnected type:None path:null path:null type:None
   [junit4]   2> 1998668 INFO  (TEST-BasicAuthIntegrationTest.testBasics-seed#[6C10E527400A77DD]) [    ] o.a.s.c.c.ConnectionManager Client is connected to ZooKeeper
   [junit4]   2> 1998668 INFO  (TEST-BasicAuthIntegrationTest.testBasics-seed#[6C10E527400A77DD]) [    ] o.a.s.c.c.SolrZkClient Using default ZkACLProvider
   [junit4]   2> 1998674 INFO  (TEST-BasicAuthIntegrationTest.testBasics-seed#[6C10E527400A77DD]) [    ] o.e.j.s.ServerConnector Stopped ServerConnector@5898455f{HTTP/1.1}{127.0.0.1:0}
   [junit4]   2> 1998687 INFO  (TEST-BasicAuthIntegrationTest.testBasics-seed#[6C10E527400A77DD]) [    ] o.a.s.c.CoreContainer Shutting down CoreContainer instance=1475293259
   [junit4]   2> 1998688 INFO  (TEST-BasicAuthIntegrationTest.testBasics-seed#[6C10E527400A77DD]) [    ] o.a.s.c.ZkController Publish node=127.0.0.1:53287_solr as DOWN
   [junit4]   2> 1998693 INFO  (OverseerStateUpdate-95428655558361096-127.0.0.1:53287_solr-n_0000000000) [n:127.0.0.1:53287_solr    ] o.a.s.c.Overseer processMessage: queueSize: 1, message = {
   [junit4]   2>   "operation":"downnode",
   [junit4]   2>   "node_name":"127.0.0.1:53287_solr"} current state version: 0
   [junit4]   2> 1998694 INFO  (OverseerStateUpdate-95428655558361096-127.0.0.1:53287_solr-n_0000000000) [n:127.0.0.1:53287_solr    ] o.a.s.c.o.NodeMutator DownNode state invoked for node: 127.0.0.1:53287_solr
   [junit4]   2> 1998695 INFO  (TEST-BasicAuthIntegrationTest.testBasics-seed#[6C10E527400A77DD]) [    ] o.a.s.c.Overseer Overseer (id=95428655558361096-127.0.0.1:53287_solr-n_0000000000) closing
   [junit4]   2> 1998699 INFO  (OverseerStateUpdate-95428655558361096-127.0.0.1:53287_solr-n_0000000000) [n:127.0.0.1:53287_solr    ] o.a.s.c.Overseer Overseer Loop exiting : 127.0.0.1:53287_solr
   [junit4]   2> 1998701 INFO  (zkCallback-2019-thread-1-processing-n:127.0.0.1:48695_solr) [n:127.0.0.1:48695_solr    ] o.a.s.c.c.ZkStateReader A live node change: [WatchedEvent state:SyncConnected type:NodeChildrenChanged path:/live_nodes], has occurred - updating... (live nodes size: [5])
   [junit4]   2> 1998701 INFO  (zkCallback-2020-thread-1-processing-n:127.0.0.1:39967_solr) [n:127.0.0.1:39967_solr    ] o.a.s.c.c.ZkStateReader A live node change: [WatchedEvent state:SyncConnected type:NodeChildrenChanged path:/live_nodes], has occurred - updating... (live nodes size: [5])
   [junit4]   2> 1998701 INFO  (zkCallback-2018-thread-1-processing-n:127.0.0.1:59719_solr) [n:127.0.0.1:59719_solr    ] o.a.s.c.c.ZkStateReader A live node change: [WatchedEvent state:SyncConnected type:NodeChildrenChanged path:/live_nodes], has occurred - updating... (live nodes size: [5])
   [junit4]   2> 1998701 INFO  (zkCallback-2010-thread-2-processing-n:127.0.0.1:53287_solr) [n:127.0.0.1:53287_solr    ] o.a.s.c.c.ZkStateReader A live node change: [WatchedEvent state:SyncConnected type:NodeChildrenChanged path:/live_nodes], has occurred - updating... (live nodes size: [5])
   [junit4]   2> 1998701 WARN  (zkCallback-2010-thread-2-processing-n:127.0.0.1:53287_solr) [n:127.0.0.1:53287_solr    ] o.a.s.c.c.ZkStateReader ZooKeeper watch triggered, but Solr cannot talk to ZK: [KeeperErrorCode = Session expired for /live_nodes]
   [junit4]   2> 1998701 INFO  (zkCallback-2010-thread-1-processing-n:127.0.0.1:53287_solr) [n:127.0.0.1:53287_solr    ] o.a.s.c.c.ZkStateReader A live node change: [WatchedEvent state:SyncConnected type:NodeChildrenChanged path:/live_nodes], has occurred - updating... (live nodes size: [5])
   [junit4]   2> 1998701 WARN  (zkCallback-2010-thread-1-processing-n:127.0.0.1:53287_solr) [n:127.0.0.1:53287_solr    ] o.a.s.c.c.ZkStateReader ZooKeeper watch triggered, but Solr cannot talk to ZK: [KeeperErrorCode = Session expired for /live_nodes]
   [junit4]   2> 1998720 INFO  (zkCallback-2017-thread-1-processing-n:127.0.0.1:50112_solr) [n:127.0.0.1:50112_solr    ] o.a.s.c.OverseerElectionContext I am going to be the leader 127.0.0.1:50112_solr
   [junit4]   2> 1998720 INFO  (zkCallback-2017-thread-1-processing-n:127.0.0.1:50112_solr) [n:127.0.0.1:50112_solr    ] o.a.s.c.c.SolrZkClient makePath: /overseer_elect/leader
   [junit4]   2> 1998723 INFO  (zkCallback-2017-thread-1-processing-n:127.0.0.1:50112_solr) [n:127.0.0.1:50112_solr    ] o.a.s.c.Overseer Overseer (id=95428655558361100-127.0.0.1:50112_solr-n_0000000001) starting
   [junit4]   2> 1998727 INFO  (TEST-BasicAuthIntegrationTest.testBasics-seed#[6C10E527400A77DD]) [    ] o.e.j.s.h.ContextHandler Stopped o.e.j.s.ServletContextHandler@5983bf9a{/solr,null,UNAVAILABLE}
   [junit4]   2> 1998727 INFO  (zkCallback-2017-thread-2-processing-n:127.0.0.1:50112_solr) [n:127.0.0.1:50112_solr    ] o.a.s.c.c.ZkStateReader A live node change: [WatchedEvent state:SyncConnected type:NodeChildrenChanged path:/live_nodes], has occurred - updating... (live nodes size: [5])
   [junit4]   2> 1998732 INFO  (TEST-BasicAuthIntegrationTest.testBasics-seed#[6C10E527400A77DD]) [    ] o.e.j.s.Server jetty-9.2.13.v20150730
   [junit4]   2> 1998739 INFO  (TEST-BasicAuthIntegrationTest.testBasics-seed#[6C10E527400A77DD]) [    ] o.e.j.s.h.ContextHandler Started o.e.j.s.ServletContextHandler@13e7fa34{/solr,null,AVAILABLE}
   [junit4]   2> 1998739 INFO  (TEST-BasicAuthIntegrationTest.testBasics-seed#[6C10E527400A77DD]) [    ] o.e.j.s.ServerConnector Started ServerConnector@25f49244{HTTP/1.1}{127.0.0.1:52458}
   [junit4]   2> 1998739 INFO  (TEST-BasicAuthIntegrationTest.testBasics-seed#[6C10E527400A77DD]) [    ] o.e.j.s.Server Started @2001427ms
   [junit4]   2> 1998739 INFO  (TEST-BasicAuthIntegrationTest.testBasics-seed#[6C10E527400A77DD]) [    ] o.a.s.c.s.e.JettySolrRunner Jetty properties: {hostPort=52458, hostContext=/solr}
   [junit4]   2> 1998740 INFO  (TEST-BasicAuthIntegrationTest.testBasics-seed#[6C10E527400A77DD]) [    ] o.a.s.s.SolrDispatchFilter SolrDispatchFilter.init(): sun.misc.Launcher$AppClassLoader@3827de24
   [junit4]   2> 1998740 INFO  (TEST-BasicAuthIntegrationTest.testBasics-seed#[6C10E527400A77DD]) [    ] o.a.s.c.SolrResourceLoader new SolrResourceLoader for directory: '/x1/jenkins/jenkins-slave/workspace/Lucene-Solr-Tests-5.5-Java7/solr/build/solr-core/test/J1/temp/solr.security.BasicAuthIntegrationTest_6C10E527400A77DD-001/tempDir-001/node6'
   [junit4]   2> 1998740 INFO  (TEST-BasicAuthIntegrationTest.testBasics-seed#[6C10E527400A77DD]) [    ] o.a.s.c.SolrResourceLoader JNDI not configured for solr (NoInitialContextEx)
   [junit4]   2> 1998740 INFO  (TEST-BasicAuthIntegrationTest.testBasics-seed#[6C10E527400A77DD]) [    ] o.a.s.c.SolrResourceLoader solr home defaulted to 'solr/' (could not find system property or JNDI)
   [junit4]   2> 1998740 INFO  (TEST-BasicAuthIntegrationTest.testBasics-seed#[6C10E527400A77DD]) [    ] o.a.s.c.c.SolrZkClient Using default ZkCredentialsProvider
   [junit4]   2> 1998741 INFO  (TEST-BasicAuthIntegrationTest.testBasics-seed#[6C10E527400A77DD]) [    ] o.a.s.c.c.ConnectionManager Waiting for client to connect to ZooKeeper
   [junit4]   2> 1998747 INFO  (zkCallback-2017-thread-1-processing-n:127.0.0.1:50112_solr) [n:127.0.0.1:50112_solr    ] o.a.s.c.OverseerAutoReplicaFailoverThread Starting OverseerAutoReplicaFailoverThread autoReplicaFailoverWorkLoopDelay=10000 autoReplicaFailoverWaitAfterExpiration=30000 autoReplicaFailoverBadNodeExpiration=60000
   [junit4]   2> 1998748 INFO  (OverseerCollectionConfigSetProcessor-95428655558361100-127.0.0.1:50112_solr-n_0000000001) [n:127.0.0.1:50112_solr    ] o.a.s.c.OverseerTaskProcessor Process current queue of overseer operations
   [junit4]   2> 1998749 INFO  (OverseerStateUpdate-95428655558361100-127.0.0.1:50112_solr-n_0000000001) [n:127.0.0.1:50112_solr    ] o.a.s.c.Overseer Starting to work on the main queue
   [junit4]   2> 1998752 INFO  (zkCallback-2023-thread-1) [    ] o.a.s.c.c.ConnectionManager Watcher org.apache.solr.common.cloud.ConnectionManager@199bc74f name:ZooKeeperConnection Watcher:127.0.0.1:51933/solr got event WatchedEvent state:SyncConnected type:None path:null path:null type:None
   [junit4]   2> 1998752 INFO  (TEST-BasicAuthIntegrationTest.testBasics-seed#[6C10E527400A77DD]) [    ] o.a.s.c.c.ConnectionManager Client is connected to ZooKeeper
   [junit4]   2> 1998753 INFO  (TEST-BasicAuthIntegrationTest.testBasics-seed#[6C10E527400A77DD]) [    ] o.a.s.c.c.SolrZkClient Using default ZkACLProvider
   [junit4]   2> 1998753 INFO  (TEST-BasicAuthIntegrationTest.testBasics-seed#[6C10E527400A77DD]) [    ] o.a.s.s.SolrDispatchFilter solr.xml found in ZooKeeper. Loading...
   [junit4]   2> 1998768 INFO  (TEST-BasicAuthIntegrationTest.testBasics-seed#[6C10E527400A77DD]) [    ] o.a.s.c.CorePropertiesLocator Config-defined core root directory: /x1/jenkins/jenkins-slave/workspace/Lucene-Solr-Tests-5.5-Java7/solr/build/solr-core/test/J1/temp/solr.security.BasicAuthIntegrationTest_6C10E527400A77DD-001/tempDir-001/node6/.
   [junit4]   2> 1998768 INFO  (TEST-BasicAuthIntegrationTest.testBasics-seed#[6C10E527400A77DD]) [    ] o.a.s.c.CoreContainer New CoreContainer 674180390
   [junit4]   2> 1998768 INFO  (TEST-BasicAuthIntegrationTest.testBasics-seed#[6C10E527400A77DD]) [    ] o.a.s.c.CoreContainer Loading cores into CoreContainer [instanceDir=/x1/jenkins/jenkins-slave/workspace/Lucene-Solr-Tests-5.5-Java7/solr/build/solr-core/test/J1/temp/solr.security.BasicAuthIntegrationTest_6C10E527400A77DD-001/tempDir-001/node6]
   [junit4]   2> 1998768 WARN  (TEST-BasicAuthIntegrationTest.testBasics-seed#[6C10E527400A77DD]) [    ] o.a.s.c.CoreContainer Couldn't add files from /x1/jenkins/jenkins-slave/workspace/Lucene-Solr-Tests-5.5-Java7/solr/build/solr-core/test/J1/temp/solr.security.BasicAuthIntegrationTest_6C10E527400A77DD-001/tempDir-001/node6/lib to classpath: /x1/jenkins/jenkins-slave/workspace/Lucene-Solr-Tests-5.5-Java7/solr/build/solr-core/test/J1/temp/solr.security.BasicAuthIntegrationTest_6C10E527400A77DD-001/tempDir-001/node6/lib
   [junit4]   2> 1998771 INFO  (TEST-BasicAuthIntegrationTest.testBasics-seed#[6C10E527400A77DD]) [    ] o.a.s.h.c.HttpShardHandlerFactory created with socketTimeout : 90000,urlScheme : ,connTimeout : 15000,maxConnectionsPerHost : 20,maxConnections : 10000,corePoolSize : 0,maximumPoolSize : 2147483647,maxThreadIdleTime : 5,sizeOfQueue : -1,fairnessPolicy : false,useRetries : false,
   [junit4]   2> 1998783 INFO  (TEST-BasicAuthIntegrationTest.testBasics-seed#[6C10E527400A77DD]) [    ] o.a.s.u.UpdateShardHandler Creating UpdateShardHandler HTTP client with params: socketTimeout=340000&connTimeout=45000&retry=true
   [junit4]   2> 1998784 INFO  (TEST-BasicAuthIntegrationTest.testBasics-seed#[6C10E527400A77DD]) [    ] o.a.s.l.LogWatcher SLF4J impl is org.slf4j.impl.Log4jLoggerFactory
   [junit4]   2> 1998784 INFO  (TEST-BasicAuthIntegrationTest.testBasics-seed#[6C10E527400A77DD]) [    ] o.a.s.l.LogWatcher Registering Log Listener [Log4j (org.slf4j.impl.Log4jLoggerFactory)]
   [junit4]   2> 1998784 INFO  (TEST-BasicAuthIntegrationTest.testBasics-seed#[6C10E527400A77DD]) [    ] o.a.s.c.ZkContainer Zookeeper client=127.0.0.1:51933/solr
   [junit4]   2> 1998784 INFO  (TEST-BasicAuthIntegrationTest.testBasics-seed#[6C10E527400A77DD]) [    ] o.a.s.c.ZkController zkHost includes chroot
   [junit4]   2> 1998784 INFO  (TEST-BasicAuthIntegrationTest.testBasics-seed#[6C10E527400A77DD]) [    ] o.a.s.c.c.SolrZkClient Using default ZkCredentialsProvider
   [junit4]   2> 1998819 INFO  (TEST-BasicAuthIntegrationTest.testBasics-seed#[6C10E527400A77DD]) [    ] o.a.s.c.c.ConnectionManager Waiting for client to connect to ZooKeeper
   [junit4]   2> 1998827 INFO  (zkCallback-2026-thread-1) [    ] o.a.s.c.c.ConnectionManager Watcher org.apache.solr.common.cloud.ConnectionManager@767fce14 name:ZooKeeperConnection Watcher:127.0.0.1:51933 got event WatchedEvent state:SyncConnected type:None path:null path:null type:None
   [junit4]   2> 1998828 INFO  (TEST-BasicAuthIntegrationTest.testBasics-seed#[6C10E527400A77DD]) [    ] o.a.s.c.c.ConnectionManager Client is connected to ZooKeeper
   [junit4]   2> 1998828 INFO  (TEST-BasicAuthIntegrationTest.testBasics-seed#[6C10E527400A77DD]) [    ] o.a.s.c.c.SolrZkClient Using default ZkACLProvider
   [junit4]   2> 1998835 WARN  (NIOServerCxn.Factory:0.0.0.0/0.0.0.0:0) [    ] o.a.z.s.NIOServerCnxn caught end of stream exception
   [junit4]   2> EndOfStreamException: Unable to read additional data from client sessionid 0x15307db4bf30012, likely client has closed socket
   [junit4]   2> 	at org.apache.zookeeper.server.NIOServerCnxn.doIO(NIOServerCnxn.java:228)
   [junit4]   2> 	at org.apache.zookeeper.server.NIOServerCnxnFactory.run(NIOServerCnxnFactory.java:208)
   [junit4]   2> 	at java.lang.Thread.run(Thread.java:745)
   [junit4]   2> 1998839 INFO  (TEST-BasicAuthIntegrationTest.testBasics-seed#[6C10E527400A77DD]) [n:127.0.0.1:52458_solr    ] o.a.s.c.c.ConnectionManager Waiting for client to connect to ZooKeeper
   [junit4]   2> 1998839 INFO  (zkCallback-2027-thread-1-processing-n:127.0.0.1:52458_solr) [n:127.0.0.1:52458_solr    ] o.a.s.c.c.ConnectionManager Watcher org.apache.solr.common.cloud.ConnectionManager@36a7cf7e name:ZooKeeperConnection Watcher:127.0.0.1:51933/solr got event WatchedEvent state:SyncConnected type:None path:null path:null type:None
   [junit4]   2> 1998840 INFO  (TEST-BasicAuthIntegrationTest.testBasics-seed#[6C10E527400A77DD]) [n:127.0.0.1:52458_solr    ] o.a.s.c.c.ConnectionManager Client is connected to ZooKeeper
   [junit4]   2> 1998872 INFO  (TEST-BasicAuthIntegrationTest.testBasics-seed#[6C10E527400A77DD]) [n:127.0.0.1:52458_solr    ] o.a.s.c.c.ZkStateReader Updating cluster state from ZooKeeper... 
   [junit4]   2> 1999892 INFO  (TEST-BasicAuthIntegrationTest.testBasics-seed#[6C10E527400A77DD]) [n:127.0.0.1:52458_solr    ] o.a.s.c.ZkController Register node as live in ZooKeeper:/live_nodes/127.0.0.1:52458_solr
   [junit4]   2> 1999893 INFO  (TEST-BasicAuthIntegrationTest.testBasics-seed#[6C10E527400A77DD]) [n:127.0.0.1:52458_solr    ] o.a.s.c.c.SolrZkClient makePath: /live_nodes/127.0.0.1:52458_solr
   [junit4]   2> 1999895 INFO  (zkCallback-2018-thread-1-processing-n:127.0.0.1:59719_solr) [n:127.0.0.1:59719_solr    ] o.a.s.c.c.ZkStateReader A live node change: [WatchedEvent state:SyncConnected type:NodeChildrenChanged path:/live_nodes], has occurred - updating... (live nodes size: [4])
   [junit4]   2> 1999895 INFO  (zkCallback-2027-thread-1-processing-n:127.0.0.1:52458_solr) [n:127.0.0.1:52458_solr    ] o.a.s.c.c.ZkStateReader A live node change: [WatchedEvent state:SyncConnected type:NodeChildrenChanged path:/live_nodes], has occurred - updating... (live nodes size: [4])
   [junit4]   2> 1999895 INFO  (zkCallback-2017-thread-1-processing-n:127.0.0.1:50112_solr) [n:127.0.0.1:50112_solr    ] o.a.s.c.c.ZkStateReader A live node change: [WatchedEvent state:SyncConnected type:NodeChildrenChanged path:/live_nodes], has occurred - updating... (live nodes size: [4])
   [junit4]   2> 1999895 INFO  (zkCallback-2020-thread-1-processing-n:127.0.0.1:39967_solr) [n:127.0.0.1:39967_solr    ] o.a.s.c.c.ZkStateReader A live node change: [WatchedEvent state:SyncConnected type:NodeChildrenChanged path:/live_nodes], has occurred - updating... (live nodes size: [4])
   [junit4]   2> 1999896 INFO  (zkCallback-2019-thread-1-processing-n:127.0.0.1:48695_solr) [n:127.0.0.1:48695_solr    ] o.a.s.c.c.ZkStateReader A live node change: [WatchedEvent state:SyncConnected type:NodeChildrenChanged path:/live_nodes], has occurred - updating... (live nodes size: [4])
   [junit4]   2> 1999898 INFO  (TEST-BasicAuthIntegrationTest.testBasics-seed#[6C10E527400A77DD]) [n:127.0.0.1:52458_solr    ] o.a.s.c.Overseer Overseer (id=null) closing
   [junit4]   2> 1999899 INFO  (TEST-BasicAuthIntegrationTest.testBasics-seed#[6C10E527400A77DD]) [n:127.0.0.1:52458_solr    ] o.a.s.c.LeaderElector Joined leadership election with path: /overseer_elect/election/95428655558361107-127.0.0.1:52458_solr-n_0000000005
   [junit4]   2> 1999900 INFO  (TEST-BasicAuthIntegrationTest.testBasics-seed#[6C10E527400A77DD]) [n:127.0.0.1:52458_solr    ] o.a.s.c.LeaderElector Watching path /overseer_elect/election/95428655558361103-127.0.0.1:39967_solr-n_0000000004 to know if I could be the leader
   [junit4]   2> 1999909 INFO  (TEST-BasicAuthIntegrationTest.testBasics-seed#[6C10E527400A77DD]) [n:127.0.0.1:52458_solr    ] o.a.s.c.CoreContainer Security conf doesn't exist. Skipping setup for authorization module.
   [junit4]   2> 1999909 INFO  (TEST-BasicAuthIntegrationTest.testBasics-seed#[6C10E527400A77DD]) [n:127.0.0.1:52458_solr    ] o.a.s.c.CoreContainer No authentication plugin used.
   [junit4]   2> 1999910 INFO  (TEST-BasicAuthIntegrationTest.testBasics-seed#[6C10E527400A77DD]) [n:127.0.0.1:52458_solr    ] o.a.s.c.CorePropertiesLocator Looking for core definitions underneath /x1/jenkins/jenkins-slave/workspace/Lucene-Solr-Tests-5.5-Java7/solr/build/solr-core/test/J1/temp/solr.security.BasicAuthIntegrationTest_6C10E527400A77DD-001/tempDir-001/node6/.
   [junit4]   2> 1999910 INFO  (TEST-BasicAuthIntegrationTest.testBasics-seed#[6C10E527400A77DD]) [n:127.0.0.1:52458_solr    ] o.a.s.c.CorePropertiesLocator Found 0 core definitions
   [junit4]   2> 1999924 INFO  (TEST-BasicAuthIntegrationTest.testBasics-seed#[6C10E527400A77DD]) [n:127.0.0.1:52458_solr    ] o.a.s.s.SolrDispatchFilter user.dir=/x1/jenkins/jenkins-slave/workspace/Lucene-Solr-Tests-5.5-Java7/solr/build/solr-core/test/J1
   [junit4]   2> 1999925 INFO  (TEST-BasicAuthIntegrationTest.testBasics-seed#[6C10E527400A77DD]) [n:127.0.0.1:52458_solr    ] o.a.s.s.SolrDispatchFilter SolrDispatchFilter.init() done
   [junit4]   2> 1999925 INFO  (TEST-BasicAuthIntegrationTest.testBasics-seed#[6C10E527400A77DD]) [    ] o.a.s.c.c.SolrZkClient Using default ZkCredentialsProvider
   [junit4]   2> 1999942 INFO  (TEST-BasicAuthIntegrationTest.testBasics-seed#[6C10E527400A77DD]) [    ] o.a.s.c.c.ConnectionManager Waiting for client to connect to ZooKeeper
   [junit4]   2> 1999950 INFO  (zkCallback-2028-thread-1) [    ] o.a.s.c.c.ConnectionManager Watcher org.apache.solr.common.cloud.ConnectionManager@2d5f3bf1 name:ZooKeeperConnection Watcher:127.0.0.1:51933/solr got event WatchedEvent state:SyncConnected type:None path:null path:null type:None
   [junit4]   2> 1999950 INFO  (TEST-BasicAuthIntegrationTest.testBasics-seed#[6C10E527400A77DD]) [    ] o.a.s.c.c.ConnectionManager Client is connected to ZooKeeper
   [junit4]   2> 1999950 INFO  (TEST-BasicAuthIntegrationTest.testBasics-seed#[6C10E527400A77DD]) [    ] o.a.s.c.c.SolrZkClient Using default ZkACLProvider
   [junit4]   2> 1999951 INFO  (TEST-BasicAuthIntegrationTest.testBasics-seed#[6C10E527400A77DD]) [    ] o.a.s.c.c.SolrZkClient makePath: /configs/solrCloudCollectionConfig/solrconfig-spellcheckcomponent.xml
   [junit4]   2> 1999967 INFO  (TEST-BasicAuthIntegrationTest.testBasics-seed#[6C10E527400A77DD]) [    ] o.a.s.c.c.SolrZkClient makePath: /configs/solrCloudCollectionConfig/schema-null-charfilters-analyzer.xml
   [junit4]   2> 1999969 INFO  (TEST-BasicAuthIntegrationTest.testBasics-seed#[6C10E527400A77DD]) [    ] o.a.s.c.c.SolrZkClient makePath: /configs/solrCloudCollectionConfig/regex-boost-processor-test.txt
   [junit4]   2> 1999971 INFO  (TEST-BasicAuthIntegrationTest.testBasics-seed#[6C10E527400A77DD]) [    ] o.a.s.c.c.SolrZkClient makePath: /configs/solrCloudCollectionConfig/solrconfig-spellchecker.xml
   [junit4]   2> 1999976 INFO  (TEST-BasicAuthIntegrationTest.testBasics-seed#[6C10E527400A77DD]) [    ] o.a.s.c.c.SolrZkClient makePath: /configs/solrCloudCollectionConfig/bad-schema-multiple-asterisk-copyfield-dest-should-fail-test.xml
   [junit4]   2> 1999978 INFO  (TEST-BasicAuthIntegrationTest.testBasics-seed#[6C10E527400A77DD]) [    ] o.a.s.c.c.SolrZkClient makePath: /configs/solrCloudCollectionConfig/schema-docValuesFaceting.xml
   [junit4]   2> 1999981 INFO  (TEST-BasicAuthIntegrationTest.testBasics-seed#[6C10E527400A77DD]) [    ] o.a.s.c.c.SolrZkClient makePath: /configs/solrCloudCollectionConfig/solrconfig-tlog-with-delayingcomponent.xml
   [junit4]   2> 1999984 INFO  (TEST-BasicAuthIntegrationTest.testBasics-seed#[6C10E527400A77DD]) [    ] o.a.s.c.c.SolrZkClient makePath: /configs/solrCloudCollectionConfig/bad-schema-currency-ft-bogus-default-code.xml
   [junit4]   2> 1999986 INFO  (TEST-BasicAuthIntegrationTest.testBasics-seed#[6C10E527400A77DD]) [    ] o.a.s.c.c.SolrZkClient makePath: /configs/solrCloudCollectionConfig/schema-numeric.xml
   [junit4]   2> 1999989 INFO  (TEST-BasicAuthIntegrationTest.testBasics-seed#[6C10E527400A77DD]) [    ] o.a.s.c.c.SolrZkClient makePath: /configs/solrCloudCollectionConfig/solrconfig_codec.xml
   [junit4]   2> 1999992 INFO  (TEST-BasicAuthIntegrationTest.testBasics-seed#[6C10E527400A77DD]) [    ] o.a.s.c.c.SolrZkClient makePath: /configs/solrCloudCollectionConfig/bad-schema-multiple-asterisk-copyfield-source-should-fail-test.xml
   [junit4]   2> 1999994 INFO  (TEST-BasicAuthIntegrationTest.testBasics-seed#[6C10E527400A77DD]) [    ] o.a.s.c.c.SolrZkClient makePath: /configs/solrCloudCollectionConfig/schema_latest.xml
   [junit4]   2> 1999997 INFO  (TEST-BasicAuthIntegrationTest.testBasics-seed#[6C10E527400A77DD]) [    ] o.a.s.c.c.SolrZkClient makePath: /configs/solrCloudCollectionConfig/schema-sorts.xml
   [junit4]   2> 2000000 INFO  (TEST-BasicAuthIntegrationTest.testBasics-seed#[6C10E527400A77DD]) [    ] o.a.s.c.c.SolrZkClient makePath: /configs/solrCloudCollectionConfig/solrconfig-headers.xml
   [junit4]   2> 2000007 INFO  (TEST-BasicAuthIntegrationTest.testBasics-seed#[6C10E527400A77DD]) [    ] o.a.s.c.c.SolrZkClient makePath: /configs/solrCloudCollectionConfig/solrconfig-implicitproperties.xml
   [junit4]   2> 2000011 INFO  (TEST-BasicAuthIntegrationTest.testBasics-seed#[6C10E527400A77DD]) [    ] o.a.s.c.c.SolrZkClient makePath: /configs/solrCloudCollectionConfig/bad-solrconfig-bogus-scriptengine-name.xml
   [junit4]   2> 2000013 INFO  (TEST-BasicAuthIntegrationTest.testBasics-seed#[6C10E527400A77DD]) [    ] o.a.s.c.c.SolrZkClient makePath: /configs/solrCloudCollectionConfig/schema-snippet-types.incl
   [junit4]   2> 2000015 INFO  (TEST-BasicAuthIntegrationTest.testBasics-seed#[6C10E527400A77DD]) [    ] o.a.s.c.c.SolrZkClient makePath: /configs/solrCloudCollectionConfig/solrconfig-parsing-update-processor-chains.xml
   [junit4]   2> 2000018 INFO  (TEST-BasicAuthIntegrationTest.testBasics-seed#[6C10E527400A77DD]) [    ] o.a.s.c.c.SolrZkClient makePath: /configs/solrCloudCollectionConfig/schema-docValuesMissing.xml
   [junit4]   2> 2000033 INFO  (TEST-BasicAuthIntegrationTest.testBasics-seed#[6C10E527400A77DD]) [    ] o.a.s.c.c.SolrZkClient makePath: /configs/solrCloudCollectionConfig/solrconfig-noopregen.xml
   [junit4]   2> 2000046 INFO  (TEST-BasicAuthIntegrationTest.testBasics-seed#[6C10E527400A77DD]) [    ] o.a.s.c.c.SolrZkClient makePath: /configs/solrCloudCollectionConfig/schema-one-field-no-dynamic-field-unique-key.xml
   [junit4]   2> 2000049 INFO  (TEST-BasicAuthIntegrationTest.testBasics-seed#[6C10E527400A77DD]) [    ] o.a.s.c.c.SolrZkClient makePath: /configs/solrCloudCollectionConfig/solrconfig-script-updateprocessor.xml
   [junit4]   2> 2000052 INFO  (TEST-BasicAuthIntegrationTest.testBasics-seed#[6C10E527400A77DD]) [    ] o.a.s.c.c.SolrZkClient makePath: /configs/solrCloudCollectionConfig/bad-error-solrconfig.xml
   [junit4]   2> 2000064 INFO  (TEST-BasicAuthIntegrationTest.testBasics-seed#[6C10E527400A77DD]) [    ] o.a.s.c.c.SolrZkClient makePath: /configs/solrCloudCollectionConfig/solrconfig-suggestercomponent.xml
   [junit4]   2> 2000090 INFO  (TEST-BasicAuthIntegrationTest.testBasics-seed#[6C10E527400A77DD]) [    ] o.a.s.c.c.SolrZkClient makePath: /configs/solrCloudCollectionConfig/bad-currency.xml
   [junit4]   2> 2000096 INFO  (TEST-BasicAuthIntegrationTest.testBasics-seed#[6C10E527400A77DD]) [    ] o.a.s.c.c.SolrZkClient makePath: /configs/solrCloudCollectionConfig/solrconfig-query-parser-init.xml
   [junit4]   2> 2000099 INFO  (TEST-BasicAuthIntegrationTest.testBasics-seed#[6C10E527400A77DD]) [    ] o.a.s.c.c.SolrZkClient makePath: /configs/solrCloudCollectionConfig/solrconfig-caching.xml
   [junit4]   2> 2000109 INFO  (TEST-BasicAuthIntegrationTest.testBasics-seed#[6C10E527400A77DD]) [    ] o.a.s.c.c.SolrZkClient makePath: /configs/solrCloudCollectionConfig/conditional.updateprocessor.js
   [junit4]   2> 2000111 INFO  (TEST-BasicAuthIntegrationTest.testBasics-seed#[6C10E527400A77DD]) [    ] o.a.s.c.c.SolrZkClient makePath: /configs/solrCloudCollectionConfig/solrconfig-indexconfig-mergepolicyfactory.xml
   [junit4]   2> 2000114 INFO  (TEST-BasicAuthIntegrationTest.testBasics-seed#[6C10E527400A77DD]) [    ] o.a.s.c.c.SolrZkClient makePath: /configs/solrCloudCollectionConfig/compoundDictionary.txt
   [junit4]   2> 2000116 INFO  (TEST-BasicAuthIntegrationTest.testBasics-seed#[6C10E527400A77DD]) [    ] o.a.s.c.c.SolrZkClient makePath: /configs/solrCloudCollectionConfig/solrconfig-tieredmergepolicyfactory.xml
   [junit4]   2> 2000118 INFO  (TEST-BasicAuthIntegrationTest.testBasics-seed#[6C10E527400A77DD]) [    ] o.a.s.c.c.SolrZkClient makePath: /configs/solrCloudCollectionConfig/phrasesuggest.txt
   [junit4]   2> 2000120 INFO  (TEST-BasicAuthIntegrationTest.testBasics-seed#[6C10E527400A77DD]) [    ] o.a.s.c.c.SolrZkClient makePath: /configs/solrCloudCollectionConfig/solrconfig-transformers.xml
   [junit4]   2> 2000126 INFO  (TEST-BasicAuthIntegrationTest.testBasics-seed#[6C10E527400A77DD]) [    ] o.a.s.c.c.SolrZkClient makePath: /configs/solrCloudCollectionConfig/bad-schema-not-indexed-but-norms.xml
   [junit4]   2> 2000138 INFO  (TEST-BasicAuthIntegrationTest.testBasics-seed#[6C10E527400A77DD]) [    ] o.a.s.c.c.SolrZkClient makePath: /configs/solrCloudCollectionConfig/blendedInfixSuggest.txt
   [junit4]   2> 2000166 INFO  (TEST-BasicAuthIntegrationTest.testBasics-seed#[6C10E527400A77DD]) [    ] o.a.s.c.c.SolrZkClient makePath: /configs/solrCloudCollectionConfig/schema-phrasesuggest.xml
   [junit4]   2> 2000171 INFO  (TEST-BasicAuthIntegrationTest.testBasics-seed#[6C10E527400A77DD]) [    ] o.a.s.c.c.SolrZkClient makePath: /configs/solrCloudCollectionConfig/hunspell-test.dic
   [junit4]   2> 2000180 INFO  (TEST-BasicAuthIntegrationTest.testBasics-seed#[6C10E527400A77DD]) [    ] o.a.s.c.c.SolrZkClient makePath: /configs/solrCloudCollectionConfig/schema-HighlighterMaxOffsetTest.xml
   [junit4]   2> 2000200 INFO  (TEST-BasicAuthIntegrationTest.testBasics-seed#[6C10E527400A77DD]) [    ] o.a.s.c.c.SolrZkClient makePath: /configs/solrCloudCollectionConfig/schema-rest-lucene-match-version.xml
   [junit4]   2> 2000208 INFO  (TEST-BasicAuthIntegrationTest.testBasics-seed#[6C10E527400A77DD]) [    ] o.a.s.c.c.SolrZkClient makePath: /configs/solrCloudCollectionConfig/solrconfig-functionquery.xml
   [junit4]   2> 2000210 INFO  (TEST-BasicAuthIntegrationTest.testBasics-seed#[6C10E527400A77DD]) [    ] o.a.s.c.c.SolrZkClient makePath: /configs/solrCloudCollectionConfig/solrconfig-externalversionconstraint.xml
   [junit4]   2> 2000213 INFO  (TEST-BasicAuthIntegrationTest.testBasics-seed#[6C10E527400A77DD]) [    ] o.a.s.c.c.SolrZkClient makePath: /configs/solrCloudCollectionConfig/bad-schema-codec-global-vs-ft-mismatch.xml
   [junit4]   2> 2000215 INFO  (TEST-BasicAuthIntegrationTest.testBasics-seed#[6C10E527400A77DD]) [    ] o.a.s.c.c.SolrZkClient makePath: /configs/solrCloudCollectionConfig/schema-sim.xml
   [junit4]   2> 2000218 INFO  (TEST-BasicAuthIntegrationTest.testBasics-seed#[6C10E527400A77DD]) [    ] o.a.s.c.c.SolrZkClient makePath: /configs/solrCloudCollectionConfig/schema-docValuesMulti.xml
   [junit4]   2> 2000219 INFO  (TEST-BasicAuthIntegrationTest.testBasics-seed#[6C10E527400A77DD]) [    ] o.a.s.c.c.SolrZkClient makePath: /configs/solrCloudCollectionConfig/solrconfig-logmergepolicyfactory.xml
   [junit4]   2> 2000222 INFO  (TEST-BasicAuthIntegrationTest.testBasics-seed#[6C10E527400A77DD]) [    ] o.a.s.c.c.SolrZkClient makePath: /configs/solrCloudCollectionConfig/solrconfig-collapseqparser.xml
   [junit4]   2> 2000225 INFO  (TEST-BasicAuthIntegrationTest.testBasics-seed#[6C10E527400A77DD]) [    ] o.a.s.c.c.SolrZkClient makePath: /configs/solrCloudCollectionConfig/solrconfig-analytics-query.xml
   [junit4]   2> 2000228 INFO  (TEST-BasicAuthIntegrationTest.testBasics-seed#[6C10E527400A77DD]) [    ] o.a.s.c.c.SolrZkClient makePath: /configs/solrCloudCollectionConfig/schema-sweetspot.xml
   [junit4]   2> 2000231 INFO  (TEST-BasicAuthIntegrationTest.testBasics-seed#[6C10E527400A77DD]) [    ] o.a.s.c.c.SolrZkClient makePath: /configs/solrCloudCollectionConfig/solrconfig-searcher-listeners1.xml
   [junit4]   2> 2000234 INFO  (TEST-BasicAuthIntegrationTest.testBasics-seed#[6C10E527400A77DD]) [    ] o.a.s.c.c.SolrZkClient makePath: /configs/solrCloudCollectionConfig/schema-id-and-version-fields-only.xml
   [junit4]   2> 2000236 INFO  (TEST-BasicAuthIntegrationTest.testBasics-seed#[6C10E527400A77DD]) [    ] o.a.s.c.c.SolrZkClient makePath: /configs/solrCloudCollectionConfig/bad-solrconfig-schema-mutable-but-not-managed.xml
   [junit4]   2> 2000238 INFO  (TEST-BasicAuthIntegrationTest.testBasics-seed#[6C10E527400A77DD]) [    ] o.a.s.c.c.SolrZkClient makePath: /configs/solrCloudCollectionConfig/hunspell-test.aff
   [junit4]   2> 2000240 INFO  (TEST-BasicAuthIntegrationTest.testBasics-seed#[6C10E527400A77DD]) [    ] o.a.s.c.c.SolrZkClient makePath: /configs/solrCloudCollectionConfig/solrconfig-response-log-component.xml
   [junit4]   2> 2000246 INFO  (TEST-BasicAuthIntegrationTest.testBasics-seed#[6C10E527400A77DD]) [    ] o.a.s.c.c.SolrZkClient makePath: /configs/solrCloudCollectionConfig/bad-schema-sim-default-does-not-exist.xml
   [junit4]   2> 2000248 INFO  (TEST-BasicAuthIntegrationTest.testBasics-seed#[6C10E527400A77DD]) [    ] o.a.s.c.c.SolrZkClient makePath: /configs/solrCloudCollectionConfig/bad-schema-dynamicfield-required.xml
   [junit4]   2> 2000251 INFO  (TEST-BasicAuthIntegrationTest.testBasics-seed#[6C10E527400A77DD]) [    ] o.a.s.c.c.SolrZkClient makePath: /configs/solrCloudCollectionConfig/bad-schema-not-indexed-but-pos.xml
   [junit4]   2> 2000253 INFO  (TEST-BasicAuthIntegrationTest.testBasics-seed#[6C10E527400A77DD]) [    ] o.a.s.c.c.SolrZkClient makePath: /configs/solrCloudCollectionConfig/solrconfig-hash.xml
   [junit4]   2> 2000259 INFO  (TEST-BasicAuthIntegrationTest.testBasics-seed#[6C10E527400A77DD]) [    ] o.a.s.c.c.SolrZkClient makePath: /configs/solrCloudCollectionConfig/solrconfig-components-name.xml
   [junit4]   2> 2000261 INFO  (TEST-BasicAuthIntegrationTest.testBasics-seed#[6C10E527400A77DD]) [    ] o.a.s.c.c.SolrZkClient makePath: /configs/solrCloudCollectionConfig/bad-mp-solrconfig.xml
   [junit4]   2> 2000297 INFO  (TEST-BasicAuthIntegrationTest.testBasics-seed#[6C10E527400A77DD]) [    ] o.a.s.c.c.SolrZkClient makePath: /configs/solrCloudCollectionConfig/solrconfig.snippet.randomindexconfig.xml
   [junit4]   2> 2000304 INFO  (TEST-BasicAuthIntegrationTest.testBasics-seed#[6C10E527400A77DD]) [    ] o.a.s.c.c.SolrZkClient makePath: /configs/solrCloudCollectionConfig/solrconfig-xinclude.xml
   [junit4]   2> 2000307 INFO  (TEST-BasicAuthIntegrationTest.testBasics-seed#[6C10E527400A77DD]) [    ] o.a.s.c.c.SolrZkClient makePath: /configs/solrCloudCollectionConfig/cross-compatible.js
   [junit4]   2> 2000316 INFO  (TEST-BasicAuthIntegrationTest.testBasics-seed#[6C10E527400A77DD]) [    ] o.a.s.c.c.SolrZkClient makePath: /configs/solrCloudCollectionConfig/solrconfig_perf.xml
   [junit4]   2> 2000327 INFO  (TEST-BasicAuthIntegrationTest.testBasics-seed#[6C10E527400A77DD]) [    ] o.a.s.c.c.SolrZkClient makePath: /configs/solrCloudCollectionConfig/bad-solrconfig-invalid-scriptfile.xml
   [junit4]   2> 2000336 INFO  (TEST-BasicAuthIntegrationTest.testBasics-seed#[6C10E527400A77DD]) [    ] o.a.s.c.c.SolrZkClient makePath: /configs/solrCloudCollectionConfig/solrconfig-basic.xml
   [junit4]   2> 2000338 INFO  (TEST-BasicAuthIntegrationTest.testBasics-seed#[6C10E527400A77DD]) [    ] o.a.s.c.c.SolrZkClient makePath: /configs/solrCloudCollectionConfig/schema-replication1.xml
   [junit4]   2> 2000341 INFO  (TEST-BasicAuthIntegrationTest.testBasics-seed#[6C10E527400A77DD]) [    ] o.a.s.c.c.SolrZkClient makePath: /configs/solrCloudCollectionConfig/bad-solrconfig-missing-scriptfile.xml
   [junit4]   2> 2000343 INFO  (TEST-BasicAuthIntegrationTest.testBasics-seed#[6C10E527400A77DD]) [    ] o.a.s.c.c.SolrZkClient makePath: /configs/solrCloudCollectionConfig/solrconfig-altdirectory.xml
   [junit4]   2> 2000350 INFO  (TEST-BasicAuthIntegrationTest.testBasics-seed#[6C10E527400A77DD]) [    ] o.a.s.c.c.SolrZkClient makePath: /configs/solrCloudCollectionConfig/schema-distributed-missing-sort.xml
   [junit4]   2> 2000353 INFO  (TEST-BasicAuthIntegrationTest.testBasics-seed#[6C10E527400A77DD]) [    ] o.a.s.c.c.SolrZkClient makePath: /configs/solrCloudCollectionConfig/enumsConfig.xml
   [junit4]   2> 2000355 INFO  (TEST-BasicAuthIntegrationTest.testBasics-seed#[6C10E527400A77DD]) [    ] o.a.s.c.c.SolrZkClient makePath: /configs/solrCloudCollectionConfig/schema-tfidf.xml
   [junit4]   2> 2000359 INFO  (TEST-BasicAuthIntegrationTest.testBasics-seed#[6C10E527400A77DD]) [    ] o.a.s.c.c.SolrZkClient makePath: /configs/solrCloudCollectionConfig/jasuggest.txt
   [junit4]   2> 2000362 INFO  (TEST-BasicAuthIntegrationTest.testBasics-seed#[6C10E527400A77DD]) [    ] o.a.s.c.c.SolrZkClient makePath: /configs/solrCloudCollectionConfig/bad-schema-dup-field.xml
   [junit4]   2> 2000364 INFO  (TEST-BasicAuthIntegrationTest.testBasics-seed#[6C10E527400A77DD]) [    ] o.a.s.c.c.SolrZkClient makePath: /configs/solrCloudCollectionConfig/fuzzysuggest.txt
   [junit4]   2> 2000366 INFO  (TEST-BasicAuthIntegrationTest.testBasics-seed#[6C10E527400A77DD]) [    ] o.a.s.c.c.SolrZkClient makePath: /configs/solrCloudCollectionConfig/schema-minimal.xml
   [junit4]   2> 2000369 INFO  (TEST-BasicAuthIntegrationTest.testBasics-seed#[6C10E527400A77DD]) [    ] o.a.s.c.c.SolrZkClient makePath: /configs/solrCloudCollectionConfig/solrconfig-highlight.xml
   [junit4]   2> 2000371 INFO  (TEST-BasicAuthIntegrationTest.testBasics-seed#[6C10E527400A77DD]) [    ] o.a.s.c.c.SolrZkClient makePath: /configs/solrCloudCollectionConfig/solrconfig-tieredmergepolicy.xml
   [junit4]   2> 2000374 INFO  (TEST-BasicAuthIntegrationTest.testBasics-seed#[6C10E527400A77DD]) [    ] o.a.s.c.c.SolrZkClient makePath: /configs/solrCloudColl

[...truncated too long message...]

719_solr c:testSolrCloudCollection s:shard1 r:core_node3 x:testSolrCloudCollection_shard1_replica2] o.a.s.c.CachingDirectoryFactory Closing directory: data/index
   [junit4]   2> 9218125 INFO  (jetty-launcher-1994-thread-9) [    ] o.e.j.s.h.ContextHandler Stopped o.e.j.s.ServletContextHandler@4916fee0{/solr,null,UNAVAILABLE}
   [junit4]   2> 9218128 INFO  (jetty-launcher-1994-thread-7) [    ] o.e.j.s.h.ContextHandler Stopped o.e.j.s.ServletContextHandler@7ad7e30d{/solr,null,UNAVAILABLE}
   [junit4]   2> 9218130 INFO  (TEST-BasicAuthIntegrationTest.testBasics-seed#[6C10E527400A77DD]) [    ] o.a.s.c.ZkTestServer connecting to 127.0.0.1:51933 51933
   [junit4]   2> NOTE: leaving temporary files on disk at: /x1/jenkins/jenkins-slave/workspace/Lucene-Solr-Tests-5.5-Java7/solr/build/solr-core/test/J1/temp/solr.security.BasicAuthIntegrationTest_6C10E527400A77DD-001
   [junit4]   2> 9218503 WARN  (TEST-BasicAuthIntegrationTest.testBasics-seed#[6C10E527400A77DD]-SendThread(127.0.0.1:51933)) [n:127.0.0.1:52458_solr    ] o.a.z.c.StaticHostProvider Unexpected exception
   [junit4]   2> java.lang.InterruptedException: sleep interrupted
   [junit4]   2> 	at java.lang.Thread.sleep(Native Method)
   [junit4]   2> 	at org.apache.zookeeper.client.StaticHostProvider.next(StaticHostProvider.java:101)
   [junit4]   2> 	at org.apache.zookeeper.ClientCnxn$SendThread.startConnect(ClientCnxn.java:940)
   [junit4]   2> 	at org.apache.zookeeper.ClientCnxn$SendThread.run(ClientCnxn.java:1003)
   [junit4]   2> 9218503 WARN  (TEST-BasicAuthIntegrationTest.testBasics-seed#[6C10E527400A77DD]-SendThread(127.0.0.1:51933)) [n:127.0.0.1:32863_solr    ] o.a.z.c.StaticHostProvider Unexpected exception
   [junit4]   2> java.lang.InterruptedException: sleep interrupted
   [junit4]   2> 	at java.lang.Thread.sleep(Native Method)
   [junit4]   2> 	at org.apache.zookeeper.client.StaticHostProvider.next(StaticHostProvider.java:101)
   [junit4]   2> 	at org.apache.zookeeper.ClientCnxn$SendThread.startConnect(ClientCnxn.java:940)
   [junit4]   2> 	at org.apache.zookeeper.ClientCnxn$SendThread.run(ClientCnxn.java:1003)
   [junit4]   2> 9218503 WARN  (jetty-launcher-1994-thread-1-SendThread(127.0.0.1:51933)) [n:127.0.0.1:59719_solr    ] o.a.z.c.StaticHostProvider Unexpected exception
   [junit4]   2> java.lang.InterruptedException: sleep interrupted
   [junit4]   2> 	at java.lang.Thread.sleep(Native Method)
   [junit4]   2> 	at org.apache.zookeeper.client.StaticHostProvider.next(StaticHostProvider.java:101)
   [junit4]   2> 	at org.apache.zookeeper.ClientCnxn$SendThread.startConnect(ClientCnxn.java:940)
   [junit4]   2> 	at org.apache.zookeeper.ClientCnxn$SendThread.run(ClientCnxn.java:1003)
   [junit4]   2> 9218504 WARN  (jetty-launcher-1994-thread-5-SendThread(127.0.0.1:51933)) [n:127.0.0.1:39967_solr    ] o.a.z.ClientCnxn Unexpected exception
   [junit4]   2> java.lang.InterruptedException: sleep interrupted
   [junit4]   2> 	at java.lang.Thread.sleep(Native Method)
   [junit4]   2> 	at org.apache.zookeeper.ClientCnxn$SendThread.run(ClientCnxn.java:994)
   [junit4]   2> Feb 22, 2016 9:22:27 AM com.carrotsearch.randomizedtesting.ThreadLeakControl tryToInterruptAll
   [junit4]   2> INFO: All leaked threads terminated.
   [junit4]   2> NOTE: test params are: codec=Asserting(Lucene54): {range_facet_l_dv=PostingsFormat(name=Asserting), range_facet_i_dv=FSTOrd50, multiDefault=FSTOrd50, id=PostingsFormat(name=Asserting), intDefault=PostingsFormat(name=Direct), _version_=PostingsFormat(name=Direct), timestamp=FSTOrd50, range_facet_l=FSTOrd50}, docValues:{range_facet_l_dv=DocValuesFormat(name=Memory), range_facet_i_dv=DocValuesFormat(name=Lucene54), timestamp=DocValuesFormat(name=Lucene54)}, sim=RandomSimilarity(queryNorm=false,coord=crazy): {}, locale=sr-BA, timezone=America/Yellowknife
   [junit4]   2> NOTE: Linux 3.13.0-52-generic amd64/Oracle Corporation 1.7.0_80 (64-bit)/cpus=4,threads=1,free=41330832,total=522190848
   [junit4]   2> NOTE: All tests run in this JVM: [TestEmbeddedSolrServerConstructors, HdfsDirectoryFactoryTest, SolrIndexConfigTest, MoreLikeThisHandlerTest, DOMUtilTest, SimpleMLTQParserTest, TestLMJelinekMercerSimilarityFactory, TestSolrQueryResponse, TestSolrXml, TestStressVersions, TestConfigReload, HdfsCollectionsAPIDistributedZkTest, TermVectorComponentTest, OverriddenZkACLAndCredentialsProvidersTest, ZkCLITest, TestSurroundQueryParser, TestDynamicLoading, ConvertedLegacyTest, DistributedFacetPivotWhiteBoxTest, TestIntervalFaceting, AddSchemaFieldsUpdateProcessorFactoryTest, TestCoreContainer, ConfigSetsAPITest, AsyncMigrateRouteKeyTest, IndexBasedSpellCheckerTest, TestPartialUpdateDeduplication, ChaosMonkeyNothingIsSafeTest, DirectSolrSpellCheckerTest, TestDFRSimilarityFactory, BigEndianAscendingWordSerializerTest, TestExpandComponent, TestCloudManagedSchema, ChangedSchemaMergeTest, SimpleCollectionCreateDeleteTest, OpenCloseCoreStressTest, TestReloadDeadlock, ClusterStateUpdateTest, DistributedDebugComponentTest, FileUtilsTest, SparseHLLTest, OverseerStatusTest, TestQuerySenderListener, UpdateRequestProcessorFactoryTest, TestUseDocValuesAsStored, TestCollationFieldDocValues, DistributedSuggestComponentTest, TestRestoreCore, TestFieldResource, RankQueryTest, DocExpirationUpdateProcessorFactoryTest, CollectionsAPIDistributedZkTest, OpenExchangeRatesOrgProviderTest, SoftAutoCommitTest, TriLevelCompositeIdRoutingTest, DistributedIntervalFacetingTest, ZkControllerTest, EnumFieldTest, ConjunctionSolrSpellCheckerTest, TestFastLRUCache, TestSchemaSimilarityResource, ShardRoutingTest, ChaosMonkeySafeLeaderTest, SpellingQueryConverterTest, TestNoOpRegenerator, TestWordDelimiterFilterFactory, DistributedFacetPivotLongTailTest, SchemaVersionSpecificBehaviorTest, TestScoreJoinQPScore, RollingRestartTest, CheckHdfsIndexTest, WordBreakSolrSpellCheckerTest, TestJsonFacets, TestCustomDocTransformer, TestUpdate, BlockCacheTest, TestRuleBasedAuthorizationPlugin, TestConfigSetImmutable, TestLeaderInitiatedRecoveryThread, StressHdfsTest, SpellPossibilityIteratorTest, AliasIntegrationTest, TestSortByMinMaxFunction, TestManagedStopFilterFactory, JavabinLoaderTest, TestCursorMarkWithoutUniqueKey, NotRequiredUniqueKeyTest, TestSolrCoreProperties, ShardRoutingCustomTest, DocumentBuilderTest, TestDocumentBuilder, CachingDirectoryFactoryTest, LeaderElectionTest, TestDistributedSearch, BasicFunctionalityTest, TestIndexSearcher, HighlighterTest, SimplePostToolTest, TestCoreDiscovery, SpellCheckCollatorTest, TestStressLucene, TestCSVLoader, FieldMutatingUpdateProcessorTest, DirectUpdateHandlerOptimizeTest, DistanceFunctionTest, DebugComponentTest, TestQueryUtils, TestQueryTypes, TermsComponentTest, FieldAnalysisRequestHandlerTest, FastVectorHighlighterTest, TestJmxIntegration, TestCSVResponseWriter, UniqFieldsUpdateProcessorFactoryTest, CSVRequestHandlerTest, TestLFUCache, CollectionStateFormat2Test, DeleteInactiveReplicaTest, DeleteReplicaTest, DistribDocExpirationUpdateProcessorTest, LeaderFailoverAfterPartitionTest, MultiThreadedOCPTest, RemoteQueryErrorTest, TestCloudInspectUtil, TestCloudPivotFacet, TestCollectionAPI, TestConfigSetsAPIExclusivity, TestConfigSetsAPIZkFailure, TestDistribDocBasedVersion, TestLeaderElectionZkExpiry, TestMiniSolrCloudClusterSSL, TestRebalanceLeaders, HdfsBasicDistributedZkTest, HdfsNNFailoverTest, TestReloadAndDeleteDocs, TestReqParamsAPI, CoreAdminCreateDiscoverTest, CoreAdminRequestStatusTest, InfoHandlerTest, SecurityConfHandlerTest, SegmentsInfoRequestHandlerTest, DistributedExpandComponentTest, DistributedFacetPivotLargeTest, DistributedFacetPivotSmallTest, SpatialHeatmapFacetsTest, SuggestComponentContextFilterQueryTest, TestDistributedStatsComponentCardinality, TestReRankQParserPlugin, TestSimpleQParserPlugin, TestSmileRequest, TestStressUserVersions, TestTrieFacet, TestXmlQParser, BJQParserTest, BlockJoinFacetRandomTest, TestClassicSimilarityFactory, TestDFISimilarityFactory, TestNonDefinedSimilarityFactory, TestPerFieldSimilarityWithDefaultOverride, TestDefaultStatsCache, TestDistribIDF, TestExactSharedStatsCache, BasicAuthIntegrationTest]
   [junit4]   2> NOTE: reproduce with: ant test  -Dtestcase=BasicAuthIntegrationTest -Dtests.seed=6C10E527400A77DD -Dtests.multiplier=2 -Dtests.slow=true -Dtests.locale=sr-BA -Dtests.timezone=America/Yellowknife -Dtests.asserts=true -Dtests.file.encoding=ISO-8859-1
   [junit4] ERROR   0.00s J1 | BasicAuthIntegrationTest (suite) <<<
   [junit4]    > Throwable #1: java.lang.Exception: Suite timeout exceeded (>= 7200000 msec).
   [junit4]    > 	at __randomizedtesting.SeedInfo.seed([6C10E527400A77DD]:0)
   [junit4] Completed [566/566 (1!)] on J1 in 7221.76s, 1 test, 2 errors <<< FAILURES!

[...truncated 12 lines...]
BUILD FAILED
/x1/jenkins/jenkins-slave/workspace/Lucene-Solr-Tests-5.5-Java7/build.xml:750: The following error occurred while executing this line:
/x1/jenkins/jenkins-slave/workspace/Lucene-Solr-Tests-5.5-Java7/build.xml:694: The following error occurred while executing this line:
/x1/jenkins/jenkins-slave/workspace/Lucene-Solr-Tests-5.5-Java7/build.xml:59: The following error occurred while executing this line:
/x1/jenkins/jenkins-slave/workspace/Lucene-Solr-Tests-5.5-Java7/solr/build.xml:233: The following error occurred while executing this line:
/x1/jenkins/jenkins-slave/workspace/Lucene-Solr-Tests-5.5-Java7/solr/common-build.xml:534: The following error occurred while executing this line:
/x1/jenkins/jenkins-slave/workspace/Lucene-Solr-Tests-5.5-Java7/lucene/common-build.xml:1477: The following error occurred while executing this line:
/x1/jenkins/jenkins-slave/workspace/Lucene-Solr-Tests-5.5-Java7/lucene/common-build.xml:1033: There were test failures: 566 suites (7 ignored), 2275 tests, 1 suite-level error, 1 error, 55 ignored (39 assumptions) [seed: 6C10E527400A77DD]

Total time: 180 minutes 27 seconds
Build step 'Invoke Ant' marked build as failure
Archiving artifacts
Recording test results
Email was triggered for: Failure - Any
Sending email for trigger: Failure - Any



Mime
View raw message