lucene-dev mailing list archives

Site index · List index
Message view « Date » · « Thread »
Top « Date » · « Thread »
From Policeman Jenkins Server <jenk...@thetaphi.de>
Subject [JENKINS] Lucene-Solr-trunk-Solaris (64bit/jdk1.8.0) - Build # 415 - Still Failing!
Date Sat, 20 Feb 2016 20:22:19 GMT
Build: http://jenkins.thetaphi.de/job/Lucene-Solr-trunk-Solaris/415/
Java: 64bit/jdk1.8.0 -XX:-UseCompressedOops -XX:+UseSerialGC

3 tests failed.
FAILED:  org.apache.solr.client.solrj.io.stream.StreamExpressionTest.testAll

Error Message:
Test abandoned because suite timeout was reached.

Stack Trace:
java.lang.Exception: Test abandoned because suite timeout was reached.
	at __randomizedtesting.SeedInfo.seed([BD09EB3C8F6DCE18]:0)


FAILED:  junit.framework.TestSuite.org.apache.solr.client.solrj.io.stream.StreamExpressionTest

Error Message:
Suite timeout exceeded (>= 7200000 msec).

Stack Trace:
java.lang.Exception: Suite timeout exceeded (>= 7200000 msec).
	at __randomizedtesting.SeedInfo.seed([BD09EB3C8F6DCE18]:0)


FAILED:  junit.framework.TestSuite.org.apache.solr.client.solrj.io.stream.StreamExpressionTest

Error Message:
Captured an uncaught exception in thread: Thread[id=2910, name=Thread-1008, state=RUNNABLE, group=TGRP-StreamExpressionTest]

Stack Trace:
com.carrotsearch.randomizedtesting.UncaughtExceptionError: Captured an uncaught exception in thread: Thread[id=2910, name=Thread-1008, state=RUNNABLE, group=TGRP-StreamExpressionTest]
Caused by: org.apache.solr.common.SolrException: Could not load collection from ZK: parallelDestinationCollection1
	at __randomizedtesting.SeedInfo.seed([BD09EB3C8F6DCE18]:0)
	at org.apache.solr.common.cloud.ZkStateReader.getCollectionLive(ZkStateReader.java:969)
	at org.apache.solr.common.cloud.ZkStateReader$LazyCollectionRef.get(ZkStateReader.java:526)
	at org.apache.solr.common.cloud.ClusterState.getCollectionOrNull(ClusterState.java:189)
	at org.apache.solr.common.cloud.ClusterState.hasCollection(ClusterState.java:119)
	at org.apache.solr.client.solrj.impl.CloudSolrClient.getCollectionNames(CloudSolrClient.java:1111)
	at org.apache.solr.client.solrj.impl.CloudSolrClient.requestWithRetryOnStaleState(CloudSolrClient.java:833)
	at org.apache.solr.client.solrj.impl.CloudSolrClient.request(CloudSolrClient.java:806)
	at org.apache.solr.client.solrj.SolrRequest.process(SolrRequest.java:149)
	at org.apache.solr.client.solrj.SolrClient.add(SolrClient.java:106)
	at org.apache.solr.client.solrj.SolrClient.add(SolrClient.java:71)
	at org.apache.solr.client.solrj.io.stream.UpdateStream.uploadBatchToCollection(UpdateStream.java:256)
	at org.apache.solr.client.solrj.io.stream.UpdateStream.read(UpdateStream.java:118)
	at org.apache.solr.client.solrj.io.stream.DaemonStream$StreamRunner.run(DaemonStream.java:245)
Caused by: java.lang.InterruptedException
	at java.lang.Object.wait(Native Method)
	at java.lang.Object.wait(Object.java:502)
	at org.apache.zookeeper.ClientCnxn.submitRequest(ClientCnxn.java:1342)
	at org.apache.zookeeper.ZooKeeper.getData(ZooKeeper.java:1153)
	at org.apache.solr.common.cloud.SolrZkClient$7.execute(SolrZkClient.java:353)
	at org.apache.solr.common.cloud.SolrZkClient$7.execute(SolrZkClient.java:350)
	at org.apache.solr.common.cloud.ZkCmdExecutor.retryOperation(ZkCmdExecutor.java:60)
	at org.apache.solr.common.cloud.SolrZkClient.getData(SolrZkClient.java:350)
	at org.apache.solr.common.cloud.ZkStateReader.fetchCollectionState(ZkStateReader.java:977)
	at org.apache.solr.common.cloud.ZkStateReader.getCollectionLive(ZkStateReader.java:964)
	... 12 more




Build Log:
[...truncated 12933 lines...]
   [junit4] Suite: org.apache.solr.client.solrj.io.stream.StreamExpressionTest
   [junit4]   2> Creating dataDir: /export/home/jenkins/workspace/Lucene-Solr-trunk-Solaris/solr/build/solr-solrj/test/J0/temp/solr.client.solrj.io.stream.StreamExpressionTest_BD09EB3C8F6DCE18-001/init-core-data-001
   [junit4]   2> 192459 INFO  (SUITE-StreamExpressionTest-seed#[BD09EB3C8F6DCE18]-worker) [    ] o.a.s.SolrTestCaseJ4 Randomized ssl (false) and clientAuth (false)
   [junit4]   2> 192459 INFO  (SUITE-StreamExpressionTest-seed#[BD09EB3C8F6DCE18]-worker) [    ] o.a.s.BaseDistributedSearchTestCase Setting hostContext system property: /_/
   [junit4]   2> 192468 INFO  (TEST-StreamExpressionTest.testAll-seed#[BD09EB3C8F6DCE18]) [    ] o.a.s.c.ZkTestServer STARTING ZK TEST SERVER
   [junit4]   2> 192468 INFO  (Thread-899) [    ] o.a.s.c.ZkTestServer client port:0.0.0.0/0.0.0.0:0
   [junit4]   2> 192468 INFO  (Thread-899) [    ] o.a.s.c.ZkTestServer Starting server
   [junit4]   2> 192568 INFO  (TEST-StreamExpressionTest.testAll-seed#[BD09EB3C8F6DCE18]) [    ] o.a.s.c.ZkTestServer start zk server on port:43072
   [junit4]   2> 192568 INFO  (TEST-StreamExpressionTest.testAll-seed#[BD09EB3C8F6DCE18]) [    ] o.a.s.c.c.SolrZkClient Using default ZkCredentialsProvider
   [junit4]   2> 192569 INFO  (TEST-StreamExpressionTest.testAll-seed#[BD09EB3C8F6DCE18]) [    ] o.a.s.c.c.ConnectionManager Waiting for client to connect to ZooKeeper
   [junit4]   2> 192572 INFO  (zkCallback-374-thread-1) [    ] o.a.s.c.c.ConnectionManager Watcher org.apache.solr.common.cloud.ConnectionManager@317c9253 name:ZooKeeperConnection Watcher:127.0.0.1:43072 got event WatchedEvent state:SyncConnected type:None path:null path:null type:None
   [junit4]   2> 192572 INFO  (TEST-StreamExpressionTest.testAll-seed#[BD09EB3C8F6DCE18]) [    ] o.a.s.c.c.ConnectionManager Client is connected to ZooKeeper
   [junit4]   2> 192572 INFO  (TEST-StreamExpressionTest.testAll-seed#[BD09EB3C8F6DCE18]) [    ] o.a.s.c.c.SolrZkClient Using default ZkACLProvider
   [junit4]   2> 192572 INFO  (TEST-StreamExpressionTest.testAll-seed#[BD09EB3C8F6DCE18]) [    ] o.a.s.c.c.SolrZkClient makePath: /solr
   [junit4]   2> 192576 INFO  (TEST-StreamExpressionTest.testAll-seed#[BD09EB3C8F6DCE18]) [    ] o.a.s.c.c.SolrZkClient Using default ZkCredentialsProvider
   [junit4]   2> 192577 INFO  (TEST-StreamExpressionTest.testAll-seed#[BD09EB3C8F6DCE18]) [    ] o.a.s.c.c.ConnectionManager Waiting for client to connect to ZooKeeper
   [junit4]   2> 192579 INFO  (zkCallback-375-thread-1) [    ] o.a.s.c.c.ConnectionManager Watcher org.apache.solr.common.cloud.ConnectionManager@2be2d3b2 name:ZooKeeperConnection Watcher:127.0.0.1:43072/solr got event WatchedEvent state:SyncConnected type:None path:null path:null type:None
   [junit4]   2> 192579 INFO  (TEST-StreamExpressionTest.testAll-seed#[BD09EB3C8F6DCE18]) [    ] o.a.s.c.c.ConnectionManager Client is connected to ZooKeeper
   [junit4]   2> 192579 INFO  (TEST-StreamExpressionTest.testAll-seed#[BD09EB3C8F6DCE18]) [    ] o.a.s.c.c.SolrZkClient Using default ZkACLProvider
   [junit4]   2> 192579 INFO  (TEST-StreamExpressionTest.testAll-seed#[BD09EB3C8F6DCE18]) [    ] o.a.s.c.c.SolrZkClient makePath: /collections/collection1
   [junit4]   2> 192582 INFO  (TEST-StreamExpressionTest.testAll-seed#[BD09EB3C8F6DCE18]) [    ] o.a.s.c.c.SolrZkClient makePath: /collections/collection1/shards
   [junit4]   2> 192584 INFO  (TEST-StreamExpressionTest.testAll-seed#[BD09EB3C8F6DCE18]) [    ] o.a.s.c.c.SolrZkClient makePath: /collections/control_collection
   [junit4]   2> 192587 INFO  (TEST-StreamExpressionTest.testAll-seed#[BD09EB3C8F6DCE18]) [    ] o.a.s.c.c.SolrZkClient makePath: /collections/control_collection/shards
   [junit4]   2> 192591 INFO  (TEST-StreamExpressionTest.testAll-seed#[BD09EB3C8F6DCE18]) [    ] o.a.s.c.AbstractZkTestCase put /export/home/jenkins/workspace/Lucene-Solr-trunk-Solaris/solr/solrj/src/test-files/solrj/solr/collection1/conf/solrconfig-streaming.xml to /configs/conf1/solrconfig.xml
   [junit4]   2> 192592 INFO  (TEST-StreamExpressionTest.testAll-seed#[BD09EB3C8F6DCE18]) [    ] o.a.s.c.c.SolrZkClient makePath: /configs/conf1/solrconfig.xml
   [junit4]   2> 192597 INFO  (TEST-StreamExpressionTest.testAll-seed#[BD09EB3C8F6DCE18]) [    ] o.a.s.c.AbstractZkTestCase put /export/home/jenkins/workspace/Lucene-Solr-trunk-Solaris/solr/solrj/src/test-files/solrj/solr/collection1/conf/schema-streaming.xml to /configs/conf1/schema.xml
   [junit4]   2> 192597 INFO  (TEST-StreamExpressionTest.testAll-seed#[BD09EB3C8F6DCE18]) [    ] o.a.s.c.c.SolrZkClient makePath: /configs/conf1/schema.xml
   [junit4]   2> 192601 INFO  (TEST-StreamExpressionTest.testAll-seed#[BD09EB3C8F6DCE18]) [    ] o.a.s.c.AbstractZkTestCase skipping /export/home/jenkins/workspace/Lucene-Solr-trunk-Solaris/solr/solrj/src/test-files/solrj/solr/collection1/conf/solrconfig.snippet.randomindexconfig.xml because it doesn't exist
   [junit4]   2> 192601 INFO  (TEST-StreamExpressionTest.testAll-seed#[BD09EB3C8F6DCE18]) [    ] o.a.s.c.AbstractZkTestCase skipping /export/home/jenkins/workspace/Lucene-Solr-trunk-Solaris/solr/solrj/src/test-files/solrj/solr/collection1/conf/stopwords.txt because it doesn't exist
   [junit4]   2> 192601 INFO  (TEST-StreamExpressionTest.testAll-seed#[BD09EB3C8F6DCE18]) [    ] o.a.s.c.AbstractZkTestCase skipping /export/home/jenkins/workspace/Lucene-Solr-trunk-Solaris/solr/solrj/src/test-files/solrj/solr/collection1/conf/protwords.txt because it doesn't exist
   [junit4]   2> 192601 INFO  (TEST-StreamExpressionTest.testAll-seed#[BD09EB3C8F6DCE18]) [    ] o.a.s.c.AbstractZkTestCase skipping /export/home/jenkins/workspace/Lucene-Solr-trunk-Solaris/solr/solrj/src/test-files/solrj/solr/collection1/conf/currency.xml because it doesn't exist
   [junit4]   2> 192601 INFO  (TEST-StreamExpressionTest.testAll-seed#[BD09EB3C8F6DCE18]) [    ] o.a.s.c.AbstractZkTestCase skipping /export/home/jenkins/workspace/Lucene-Solr-trunk-Solaris/solr/solrj/src/test-files/solrj/solr/collection1/conf/enumsConfig.xml because it doesn't exist
   [junit4]   2> 192601 INFO  (TEST-StreamExpressionTest.testAll-seed#[BD09EB3C8F6DCE18]) [    ] o.a.s.c.AbstractZkTestCase skipping /export/home/jenkins/workspace/Lucene-Solr-trunk-Solaris/solr/solrj/src/test-files/solrj/solr/collection1/conf/open-exchange-rates.json because it doesn't exist
   [junit4]   2> 192601 INFO  (TEST-StreamExpressionTest.testAll-seed#[BD09EB3C8F6DCE18]) [    ] o.a.s.c.AbstractZkTestCase skipping /export/home/jenkins/workspace/Lucene-Solr-trunk-Solaris/solr/solrj/src/test-files/solrj/solr/collection1/conf/mapping-ISOLatin1Accent.txt because it doesn't exist
   [junit4]   2> 192602 INFO  (TEST-StreamExpressionTest.testAll-seed#[BD09EB3C8F6DCE18]) [    ] o.a.s.c.AbstractZkTestCase skipping /export/home/jenkins/workspace/Lucene-Solr-trunk-Solaris/solr/solrj/src/test-files/solrj/solr/collection1/conf/old_synonyms.txt because it doesn't exist
   [junit4]   2> 192602 INFO  (TEST-StreamExpressionTest.testAll-seed#[BD09EB3C8F6DCE18]) [    ] o.a.s.c.AbstractZkTestCase skipping /export/home/jenkins/workspace/Lucene-Solr-trunk-Solaris/solr/solrj/src/test-files/solrj/solr/collection1/conf/synonyms.txt because it doesn't exist
   [junit4]   2> 192629 INFO  (TEST-StreamExpressionTest.testAll-seed#[BD09EB3C8F6DCE18]) [    ] o.a.s.SolrTestCaseJ4 Writing core.properties file to /export/home/jenkins/workspace/Lucene-Solr-trunk-Solaris/solr/build/solr-solrj/test/J0/temp/solr.client.solrj.io.stream.StreamExpressionTest_BD09EB3C8F6DCE18-001/control-001/cores/collection1
   [junit4]   2> 192631 INFO  (TEST-StreamExpressionTest.testAll-seed#[BD09EB3C8F6DCE18]) [    ] o.e.j.s.Server jetty-9.3.6.v20151106
   [junit4]   2> 192632 INFO  (TEST-StreamExpressionTest.testAll-seed#[BD09EB3C8F6DCE18]) [    ] o.e.j.s.h.ContextHandler Started o.e.j.s.ServletContextHandler@5a75c914{/_,null,AVAILABLE}
   [junit4]   2> 192634 INFO  (TEST-StreamExpressionTest.testAll-seed#[BD09EB3C8F6DCE18]) [    ] o.e.j.s.ServerConnector Started ServerConnector@375657c9{HTTP/1.1,[http/1.1]}{127.0.0.1:40601}
   [junit4]   2> 192635 INFO  (TEST-StreamExpressionTest.testAll-seed#[BD09EB3C8F6DCE18]) [    ] o.e.j.s.Server Started @196247ms
   [junit4]   2> 192635 INFO  (TEST-StreamExpressionTest.testAll-seed#[BD09EB3C8F6DCE18]) [    ] o.a.s.c.s.e.JettySolrRunner Jetty properties: {solr.data.dir=/export/home/jenkins/workspace/Lucene-Solr-trunk-Solaris/solr/build/solr-solrj/test/J0/temp/solr.client.solrj.io.stream.StreamExpressionTest_BD09EB3C8F6DCE18-001/tempDir-001/control/data, hostContext=/_, hostPort=40601, coreRootDirectory=/export/home/jenkins/workspace/Lucene-Solr-trunk-Solaris/solr/build/solr-solrj/test/J0/../../../../../../../../../../export/home/jenkins/workspace/Lucene-Solr-trunk-Solaris/solr/build/solr-solrj/test/J0/temp/solr.client.solrj.io.stream.StreamExpressionTest_BD09EB3C8F6DCE18-001/control-001/cores}
   [junit4]   2> 192636 INFO  (TEST-StreamExpressionTest.testAll-seed#[BD09EB3C8F6DCE18]) [    ] o.a.s.s.SolrDispatchFilter SolrDispatchFilter.init(): sun.misc.Launcher$AppClassLoader@6d06d69c
   [junit4]   2> 192636 INFO  (TEST-StreamExpressionTest.testAll-seed#[BD09EB3C8F6DCE18]) [    ] o.a.s.c.SolrResourceLoader new SolrResourceLoader for directory: '/export/home/jenkins/workspace/Lucene-Solr-trunk-Solaris/solr/build/solr-solrj/test/J0/temp/solr.client.solrj.io.stream.StreamExpressionTest_BD09EB3C8F6DCE18-001/control-001'
   [junit4]   2> 192636 INFO  (TEST-StreamExpressionTest.testAll-seed#[BD09EB3C8F6DCE18]) [    ] o.a.s.c.SolrResourceLoader JNDI not configured for solr (NoInitialContextEx)
   [junit4]   2> 192636 INFO  (TEST-StreamExpressionTest.testAll-seed#[BD09EB3C8F6DCE18]) [    ] o.a.s.c.SolrResourceLoader solr home defaulted to 'solr/' (could not find system property or JNDI)
   [junit4]   2> 192636 INFO  (TEST-StreamExpressionTest.testAll-seed#[BD09EB3C8F6DCE18]) [    ] o.a.s.c.c.SolrZkClient Using default ZkCredentialsProvider
   [junit4]   2> 192637 INFO  (TEST-StreamExpressionTest.testAll-seed#[BD09EB3C8F6DCE18]) [    ] o.a.s.c.c.ConnectionManager Waiting for client to connect to ZooKeeper
   [junit4]   2> 192640 INFO  (zkCallback-376-thread-1) [    ] o.a.s.c.c.ConnectionManager Watcher org.apache.solr.common.cloud.ConnectionManager@1e4aca03 name:ZooKeeperConnection Watcher:127.0.0.1:43072/solr got event WatchedEvent state:SyncConnected type:None path:null path:null type:None
   [junit4]   2> 192640 INFO  (TEST-StreamExpressionTest.testAll-seed#[BD09EB3C8F6DCE18]) [    ] o.a.s.c.c.ConnectionManager Client is connected to ZooKeeper
   [junit4]   2> 192640 INFO  (TEST-StreamExpressionTest.testAll-seed#[BD09EB3C8F6DCE18]) [    ] o.a.s.c.c.SolrZkClient Using default ZkACLProvider
   [junit4]   2> 192642 INFO  (TEST-StreamExpressionTest.testAll-seed#[BD09EB3C8F6DCE18]) [    ] o.a.s.s.SolrDispatchFilter Loading solr.xml from SolrHome (not found in ZooKeeper)
   [junit4]   2> 192642 INFO  (TEST-StreamExpressionTest.testAll-seed#[BD09EB3C8F6DCE18]) [    ] o.a.s.c.SolrXmlConfig Loading container configuration from /export/home/jenkins/workspace/Lucene-Solr-trunk-Solaris/solr/build/solr-solrj/test/J0/temp/solr.client.solrj.io.stream.StreamExpressionTest_BD09EB3C8F6DCE18-001/control-001/solr.xml
   [junit4]   2> 192648 INFO  (TEST-StreamExpressionTest.testAll-seed#[BD09EB3C8F6DCE18]) [    ] o.a.s.c.CorePropertiesLocator Config-defined core root directory: /export/home/jenkins/workspace/Lucene-Solr-trunk-Solaris/solr/build/solr-solrj/test/J0/../../../../../../../../../../export/home/jenkins/workspace/Lucene-Solr-trunk-Solaris/solr/build/solr-solrj/test/J0/temp/solr.client.solrj.io.stream.StreamExpressionTest_BD09EB3C8F6DCE18-001/control-001/cores
   [junit4]   2> 192648 INFO  (TEST-StreamExpressionTest.testAll-seed#[BD09EB3C8F6DCE18]) [    ] o.a.s.c.CoreContainer New CoreContainer 1328087567
   [junit4]   2> 192648 INFO  (TEST-StreamExpressionTest.testAll-seed#[BD09EB3C8F6DCE18]) [    ] o.a.s.c.CoreContainer Loading cores into CoreContainer [instanceDir=/export/home/jenkins/workspace/Lucene-Solr-trunk-Solaris/solr/build/solr-solrj/test/J0/temp/solr.client.solrj.io.stream.StreamExpressionTest_BD09EB3C8F6DCE18-001/control-001]
   [junit4]   2> 192648 WARN  (TEST-StreamExpressionTest.testAll-seed#[BD09EB3C8F6DCE18]) [    ] o.a.s.c.CoreContainer Couldn't add files from /export/home/jenkins/workspace/Lucene-Solr-trunk-Solaris/solr/build/solr-solrj/test/J0/temp/solr.client.solrj.io.stream.StreamExpressionTest_BD09EB3C8F6DCE18-001/control-001/lib to classpath: /export/home/jenkins/workspace/Lucene-Solr-trunk-Solaris/solr/build/solr-solrj/test/J0/temp/solr.client.solrj.io.stream.StreamExpressionTest_BD09EB3C8F6DCE18-001/control-001/lib
   [junit4]   2> 192648 INFO  (TEST-StreamExpressionTest.testAll-seed#[BD09EB3C8F6DCE18]) [    ] o.a.s.h.c.HttpShardHandlerFactory created with socketTimeout : 90000,urlScheme : ,connTimeout : 15000,maxConnectionsPerHost : 20,maxConnections : 10000,corePoolSize : 0,maximumPoolSize : 2147483647,maxThreadIdleTime : 5,sizeOfQueue : -1,fairnessPolicy : false,useRetries : false,
   [junit4]   2> 192649 INFO  (TEST-StreamExpressionTest.testAll-seed#[BD09EB3C8F6DCE18]) [    ] o.a.s.u.UpdateShardHandler Creating UpdateShardHandler HTTP client with params: socketTimeout=340000&connTimeout=45000&retry=true
   [junit4]   2> 192649 INFO  (TEST-StreamExpressionTest.testAll-seed#[BD09EB3C8F6DCE18]) [    ] o.a.s.l.LogWatcher SLF4J impl is org.slf4j.impl.Log4jLoggerFactory
   [junit4]   2> 192649 INFO  (TEST-StreamExpressionTest.testAll-seed#[BD09EB3C8F6DCE18]) [    ] o.a.s.l.LogWatcher Registering Log Listener [Log4j (org.slf4j.impl.Log4jLoggerFactory)]
   [junit4]   2> 192649 INFO  (TEST-StreamExpressionTest.testAll-seed#[BD09EB3C8F6DCE18]) [    ] o.a.s.c.ZkContainer Zookeeper client=127.0.0.1:43072/solr
   [junit4]   2> 192649 INFO  (TEST-StreamExpressionTest.testAll-seed#[BD09EB3C8F6DCE18]) [    ] o.a.s.c.ZkController zkHost includes chroot
   [junit4]   2> 192649 INFO  (TEST-StreamExpressionTest.testAll-seed#[BD09EB3C8F6DCE18]) [    ] o.a.s.c.c.SolrZkClient Using default ZkCredentialsProvider
   [junit4]   2> 192650 INFO  (TEST-StreamExpressionTest.testAll-seed#[BD09EB3C8F6DCE18]) [    ] o.a.s.c.c.ConnectionManager Waiting for client to connect to ZooKeeper
   [junit4]   2> 192652 INFO  (zkCallback-379-thread-1) [    ] o.a.s.c.c.ConnectionManager Watcher org.apache.solr.common.cloud.ConnectionManager@176aafab name:ZooKeeperConnection Watcher:127.0.0.1:43072 got event WatchedEvent state:SyncConnected type:None path:null path:null type:None
   [junit4]   2> 192652 INFO  (TEST-StreamExpressionTest.testAll-seed#[BD09EB3C8F6DCE18]) [    ] o.a.s.c.c.ConnectionManager Client is connected to ZooKeeper
   [junit4]   2> 192652 INFO  (TEST-StreamExpressionTest.testAll-seed#[BD09EB3C8F6DCE18]) [    ] o.a.s.c.c.SolrZkClient Using default ZkACLProvider
   [junit4]   2> 192654 INFO  (TEST-StreamExpressionTest.testAll-seed#[BD09EB3C8F6DCE18]) [n:127.0.0.1:40601__    ] o.a.s.c.c.ConnectionManager Waiting for client to connect to ZooKeeper
   [junit4]   2> 192656 INFO  (zkCallback-380-thread-1-processing-n:127.0.0.1:40601__) [n:127.0.0.1:40601__    ] o.a.s.c.c.ConnectionManager Watcher org.apache.solr.common.cloud.ConnectionManager@116babd6 name:ZooKeeperConnection Watcher:127.0.0.1:43072/solr got event WatchedEvent state:SyncConnected type:None path:null path:null type:None
   [junit4]   2> 192656 INFO  (TEST-StreamExpressionTest.testAll-seed#[BD09EB3C8F6DCE18]) [n:127.0.0.1:40601__    ] o.a.s.c.c.ConnectionManager Client is connected to ZooKeeper
   [junit4]   2> 192659 INFO  (TEST-StreamExpressionTest.testAll-seed#[BD09EB3C8F6DCE18]) [n:127.0.0.1:40601__    ] o.a.s.c.c.SolrZkClient makePath: /overseer/queue
   [junit4]   2> 192662 INFO  (TEST-StreamExpressionTest.testAll-seed#[BD09EB3C8F6DCE18]) [n:127.0.0.1:40601__    ] o.a.s.c.c.SolrZkClient makePath: /overseer/collection-queue-work
   [junit4]   2> 192668 INFO  (TEST-StreamExpressionTest.testAll-seed#[BD09EB3C8F6DCE18]) [n:127.0.0.1:40601__    ] o.a.s.c.c.SolrZkClient makePath: /overseer/collection-map-running
   [junit4]   2> 192672 INFO  (TEST-StreamExpressionTest.testAll-seed#[BD09EB3C8F6DCE18]) [n:127.0.0.1:40601__    ] o.a.s.c.c.SolrZkClient makePath: /overseer/collection-map-completed
   [junit4]   2> 192677 INFO  (TEST-StreamExpressionTest.testAll-seed#[BD09EB3C8F6DCE18]) [n:127.0.0.1:40601__    ] o.a.s.c.c.SolrZkClient makePath: /overseer/collection-map-failure
   [junit4]   2> 192681 INFO  (TEST-StreamExpressionTest.testAll-seed#[BD09EB3C8F6DCE18]) [n:127.0.0.1:40601__    ] o.a.s.c.c.SolrZkClient makePath: /live_nodes
   [junit4]   2> 192686 INFO  (TEST-StreamExpressionTest.testAll-seed#[BD09EB3C8F6DCE18]) [n:127.0.0.1:40601__    ] o.a.s.c.c.SolrZkClient makePath: /aliases.json
   [junit4]   2> 192689 INFO  (TEST-StreamExpressionTest.testAll-seed#[BD09EB3C8F6DCE18]) [n:127.0.0.1:40601__    ] o.a.s.c.c.SolrZkClient makePath: /clusterstate.json
   [junit4]   2> 192691 INFO  (TEST-StreamExpressionTest.testAll-seed#[BD09EB3C8F6DCE18]) [n:127.0.0.1:40601__    ] o.a.s.c.c.SolrZkClient makePath: /security.json
   [junit4]   2> 192694 INFO  (TEST-StreamExpressionTest.testAll-seed#[BD09EB3C8F6DCE18]) [n:127.0.0.1:40601__    ] o.a.s.c.ZkController Register node as live in ZooKeeper:/live_nodes/127.0.0.1:40601__
   [junit4]   2> 192695 INFO  (TEST-StreamExpressionTest.testAll-seed#[BD09EB3C8F6DCE18]) [n:127.0.0.1:40601__    ] o.a.s.c.c.SolrZkClient makePath: /live_nodes/127.0.0.1:40601__
   [junit4]   2> 192699 INFO  (TEST-StreamExpressionTest.testAll-seed#[BD09EB3C8F6DCE18]) [n:127.0.0.1:40601__    ] o.a.s.c.c.SolrZkClient makePath: /overseer_elect
   [junit4]   2> 192701 INFO  (TEST-StreamExpressionTest.testAll-seed#[BD09EB3C8F6DCE18]) [n:127.0.0.1:40601__    ] o.a.s.c.c.SolrZkClient makePath: /overseer_elect/election
   [junit4]   2> 192703 INFO  (TEST-StreamExpressionTest.testAll-seed#[BD09EB3C8F6DCE18]) [n:127.0.0.1:40601__    ] o.a.s.c.Overseer Overseer (id=null) closing
   [junit4]   2> 192704 INFO  (TEST-StreamExpressionTest.testAll-seed#[BD09EB3C8F6DCE18]) [n:127.0.0.1:40601__    ] o.a.s.c.LeaderElector Joined leadership election with path: /overseer_elect/election/95419923656540164-127.0.0.1:40601__-n_0000000000
   [junit4]   2> 192705 INFO  (TEST-StreamExpressionTest.testAll-seed#[BD09EB3C8F6DCE18]) [n:127.0.0.1:40601__    ] o.a.s.c.OverseerElectionContext I am going to be the leader 127.0.0.1:40601__
   [junit4]   2> 192705 INFO  (TEST-StreamExpressionTest.testAll-seed#[BD09EB3C8F6DCE18]) [n:127.0.0.1:40601__    ] o.a.s.c.c.SolrZkClient makePath: /overseer_elect/leader
   [junit4]   2> 192708 INFO  (TEST-StreamExpressionTest.testAll-seed#[BD09EB3C8F6DCE18]) [n:127.0.0.1:40601__    ] o.a.s.c.Overseer Overseer (id=95419923656540164-127.0.0.1:40601__-n_0000000000) starting
   [junit4]   2> 192712 INFO  (TEST-StreamExpressionTest.testAll-seed#[BD09EB3C8F6DCE18]) [n:127.0.0.1:40601__    ] o.a.s.c.c.SolrZkClient makePath: /overseer/queue-work
   [junit4]   2> 192726 INFO  (TEST-StreamExpressionTest.testAll-seed#[BD09EB3C8F6DCE18]) [n:127.0.0.1:40601__    ] o.a.s.c.OverseerAutoReplicaFailoverThread Starting OverseerAutoReplicaFailoverThread autoReplicaFailoverWorkLoopDelay=10000 autoReplicaFailoverWaitAfterExpiration=30000 autoReplicaFailoverBadNodeExpiration=60000
   [junit4]   2> 192726 INFO  (OverseerCollectionConfigSetProcessor-95419923656540164-127.0.0.1:40601__-n_0000000000) [n:127.0.0.1:40601__    ] o.a.s.c.OverseerTaskProcessor Process current queue of overseer operations
   [junit4]   2> 192726 INFO  (TEST-StreamExpressionTest.testAll-seed#[BD09EB3C8F6DCE18]) [n:127.0.0.1:40601__    ] o.a.s.c.c.ZkStateReader Updating cluster state from ZooKeeper... 
   [junit4]   2> 192727 INFO  (OverseerStateUpdate-95419923656540164-127.0.0.1:40601__-n_0000000000) [n:127.0.0.1:40601__    ] o.a.s.c.Overseer Starting to work on the main queue
   [junit4]   2> 192730 INFO  (TEST-StreamExpressionTest.testAll-seed#[BD09EB3C8F6DCE18]) [n:127.0.0.1:40601__    ] o.a.s.c.c.ZkStateReader Updated live nodes from ZooKeeper... (0) -> (1)
   [junit4]   2> 192736 INFO  (OverseerStateUpdate-95419923656540164-127.0.0.1:40601__-n_0000000000) [n:127.0.0.1:40601__    ] o.a.s.c.c.ZkStateReader Updated live nodes from ZooKeeper... (1) -> (1)
   [junit4]   2> 192771 INFO  (TEST-StreamExpressionTest.testAll-seed#[BD09EB3C8F6DCE18]) [n:127.0.0.1:40601__    ] o.a.s.c.CoreContainer Security conf doesn't exist. Skipping setup for authorization module.
   [junit4]   2> 192771 INFO  (TEST-StreamExpressionTest.testAll-seed#[BD09EB3C8F6DCE18]) [n:127.0.0.1:40601__    ] o.a.s.c.CoreContainer No authentication plugin used.
   [junit4]   2> 192772 INFO  (TEST-StreamExpressionTest.testAll-seed#[BD09EB3C8F6DCE18]) [n:127.0.0.1:40601__    ] o.a.s.c.CorePropertiesLocator Looking for core definitions underneath /export/home/jenkins/workspace/Lucene-Solr-trunk-Solaris/solr/build/solr-solrj/test/J0/../../../../../../../../../../export/home/jenkins/workspace/Lucene-Solr-trunk-Solaris/solr/build/solr-solrj/test/J0/temp/solr.client.solrj.io.stream.StreamExpressionTest_BD09EB3C8F6DCE18-001/control-001/cores
   [junit4]   2> 192774 INFO  (TEST-StreamExpressionTest.testAll-seed#[BD09EB3C8F6DCE18]) [n:127.0.0.1:40601__    ] o.a.s.c.CoreDescriptor Created CoreDescriptor: {name=collection1, config=solrconfig.xml, transient=false, schema=schema.xml, loadOnStartup=true, configSetProperties=configsetprops.json, collection=control_collection, coreNodeName=, dataDir=data/, shard=}
   [junit4]   2> 192774 INFO  (TEST-StreamExpressionTest.testAll-seed#[BD09EB3C8F6DCE18]) [n:127.0.0.1:40601__    ] o.a.s.c.CorePropertiesLocator Found core collection1 in /export/home/jenkins/workspace/Lucene-Solr-trunk-Solaris/solr/build/solr-solrj/test/J0/../../../../../../../../../../export/home/jenkins/workspace/Lucene-Solr-trunk-Solaris/solr/build/solr-solrj/test/J0/temp/solr.client.solrj.io.stream.StreamExpressionTest_BD09EB3C8F6DCE18-001/control-001/cores/collection1
   [junit4]   2> 192774 INFO  (TEST-StreamExpressionTest.testAll-seed#[BD09EB3C8F6DCE18]) [n:127.0.0.1:40601__    ] o.a.s.c.CorePropertiesLocator Found 1 core definitions
   [junit4]   2> 192775 INFO  (TEST-StreamExpressionTest.testAll-seed#[BD09EB3C8F6DCE18]) [n:127.0.0.1:40601__    ] o.a.s.s.SolrDispatchFilter user.dir=/export/home/jenkins/workspace/Lucene-Solr-trunk-Solaris/solr/build/solr-solrj/test/J0
   [junit4]   2> 192775 INFO  (TEST-StreamExpressionTest.testAll-seed#[BD09EB3C8F6DCE18]) [n:127.0.0.1:40601__    ] o.a.s.s.SolrDispatchFilter SolrDispatchFilter.init() done
   [junit4]   2> 192776 INFO  (coreLoadExecutor-905-thread-1-processing-n:127.0.0.1:40601__) [n:127.0.0.1:40601__ c:control_collection   x:collection1] o.a.s.c.ZkController publishing state=down
   [junit4]   2> 192776 INFO  (coreLoadExecutor-905-thread-1-processing-n:127.0.0.1:40601__) [n:127.0.0.1:40601__ c:control_collection   x:collection1] o.a.s.c.ZkController numShards not found on descriptor - reading it from system property
   [junit4]   2> 192779 INFO  (OverseerStateUpdate-95419923656540164-127.0.0.1:40601__-n_0000000000) [n:127.0.0.1:40601__    ] o.a.s.c.Overseer processMessage: queueSize: 1, message = {
   [junit4]   2>   "core":"collection1",
   [junit4]   2>   "roles":null,
   [junit4]   2>   "base_url":"http://127.0.0.1:40601/_",
   [junit4]   2>   "node_name":"127.0.0.1:40601__",
   [junit4]   2>   "numShards":"1",
   [junit4]   2>   "state":"down",
   [junit4]   2>   "shard":null,
   [junit4]   2>   "collection":"control_collection",
   [junit4]   2>   "operation":"state"} current state version: 0
   [junit4]   2> 192779 INFO  (coreLoadExecutor-905-thread-1-processing-n:127.0.0.1:40601__) [n:127.0.0.1:40601__ c:control_collection   x:collection1] o.a.s.c.ZkController look for our core node name
   [junit4]   2> 192779 INFO  (OverseerStateUpdate-95419923656540164-127.0.0.1:40601__-n_0000000000) [n:127.0.0.1:40601__    ] o.a.s.c.o.ReplicaMutator Update state numShards=1 message={
   [junit4]   2>   "core":"collection1",
   [junit4]   2>   "roles":null,
   [junit4]   2>   "base_url":"http://127.0.0.1:40601/_",
   [junit4]   2>   "node_name":"127.0.0.1:40601__",
   [junit4]   2>   "numShards":"1",
   [junit4]   2>   "state":"down",
   [junit4]   2>   "shard":null,
   [junit4]   2>   "collection":"control_collection",
   [junit4]   2>   "operation":"state"}
   [junit4]   2> 192780 INFO  (OverseerStateUpdate-95419923656540164-127.0.0.1:40601__-n_0000000000) [n:127.0.0.1:40601__    ] o.a.s.c.o.ClusterStateMutator building a new cName: control_collection
   [junit4]   2> 192781 INFO  (OverseerStateUpdate-95419923656540164-127.0.0.1:40601__-n_0000000000) [n:127.0.0.1:40601__    ] o.a.s.c.o.ReplicaMutator Assigning new node to shard shard=shard1
   [junit4]   2> 192784 INFO  (zkCallback-380-thread-1-processing-n:127.0.0.1:40601__) [n:127.0.0.1:40601__    ] o.a.s.c.c.ZkStateReader A cluster state change: [WatchedEvent state:SyncConnected type:NodeDataChanged path:/clusterstate.json], has occurred - updating... (live nodes size: [1])
   [junit4]   2> 193783 INFO  (coreLoadExecutor-905-thread-1-processing-n:127.0.0.1:40601__) [n:127.0.0.1:40601__ c:control_collection   x:collection1] o.a.s.c.ZkController waiting to find shard id in clusterstate for collection1
   [junit4]   2> 193783 INFO  (coreLoadExecutor-905-thread-1-processing-n:127.0.0.1:40601__) [n:127.0.0.1:40601__ c:control_collection   x:collection1] o.a.s.c.ZkController Check for collection zkNode:control_collection
   [junit4]   2> 193784 INFO  (coreLoadExecutor-905-thread-1-processing-n:127.0.0.1:40601__) [n:127.0.0.1:40601__ c:control_collection   x:collection1] o.a.s.c.ZkController Collection zkNode exists
   [junit4]   2> 193784 INFO  (coreLoadExecutor-905-thread-1-processing-n:127.0.0.1:40601__) [n:127.0.0.1:40601__ c:control_collection   x:collection1] o.a.s.c.c.ZkStateReader Load collection config from: [/collections/control_collection]
   [junit4]   2> 193785 INFO  (coreLoadExecutor-905-thread-1-processing-n:127.0.0.1:40601__) [n:127.0.0.1:40601__ c:control_collection   x:collection1] o.a.s.c.c.ZkStateReader path=[/collections/control_collection] [configName]=[conf1] specified config exists in ZooKeeper
   [junit4]   2> 193785 INFO  (coreLoadExecutor-905-thread-1-processing-n:127.0.0.1:40601__) [n:127.0.0.1:40601__ c:control_collection   x:collection1] o.a.s.c.SolrResourceLoader new SolrResourceLoader for directory: '/export/home/jenkins/workspace/Lucene-Solr-trunk-Solaris/solr/build/solr-solrj/test/J0/temp/solr.client.solrj.io.stream.StreamExpressionTest_BD09EB3C8F6DCE18-001/control-001/cores/collection1'
   [junit4]   2> 193785 INFO  (coreLoadExecutor-905-thread-1-processing-n:127.0.0.1:40601__) [n:127.0.0.1:40601__ c:control_collection   x:collection1] o.a.s.c.SolrResourceLoader JNDI not configured for solr (NoInitialContextEx)
   [junit4]   2> 193785 INFO  (coreLoadExecutor-905-thread-1-processing-n:127.0.0.1:40601__) [n:127.0.0.1:40601__ c:control_collection   x:collection1] o.a.s.c.SolrResourceLoader solr home defaulted to 'solr/' (could not find system property or JNDI)
   [junit4]   2> 193788 INFO  (coreLoadExecutor-905-thread-1-processing-n:127.0.0.1:40601__) [n:127.0.0.1:40601__ c:control_collection   x:collection1] o.a.s.c.Config loaded config solrconfig.xml with version 0 
   [junit4]   2> 193792 INFO  (coreLoadExecutor-905-thread-1-processing-n:127.0.0.1:40601__) [n:127.0.0.1:40601__ c:control_collection   x:collection1] o.a.s.c.SolrConfig current version of requestparams : -1
   [junit4]   2> 193794 WARN  (coreLoadExecutor-905-thread-1-processing-n:127.0.0.1:40601__) [n:127.0.0.1:40601__ c:control_collection   x:collection1] o.a.s.c.Config Beginning with Solr 5.5, <maxMergeDocs> is deprecated, configure it on the relevant <mergePolicyFactory> instead.
   [junit4]   2> 193794 WARN  (coreLoadExecutor-905-thread-1-processing-n:127.0.0.1:40601__) [n:127.0.0.1:40601__ c:control_collection   x:collection1] o.a.s.c.Config Beginning with Solr 5.5, <mergeFactor> is deprecated, configure it on the relevant <mergePolicyFactory> instead.
   [junit4]   2> 193794 INFO  (coreLoadExecutor-905-thread-1-processing-n:127.0.0.1:40601__) [n:127.0.0.1:40601__ c:control_collection   x:collection1] o.a.s.c.SolrConfig Using Lucene MatchVersion: 6.0.0
   [junit4]   2> 193809 INFO  (coreLoadExecutor-905-thread-1-processing-n:127.0.0.1:40601__) [n:127.0.0.1:40601__ c:control_collection   x:collection1] o.a.s.c.SolrConfig Loaded SolrConfig: solrconfig.xml
   [junit4]   2> 193816 INFO  (coreLoadExecutor-905-thread-1-processing-n:127.0.0.1:40601__) [n:127.0.0.1:40601__ c:control_collection   x:collection1] o.a.s.s.IndexSchema [collection1] Schema name=test
   [junit4]   2> 193897 INFO  (coreLoadExecutor-905-thread-1-processing-n:127.0.0.1:40601__) [n:127.0.0.1:40601__ c:control_collection   x:collection1] o.a.s.s.IndexSchema default search field in schema is text
   [junit4]   2> 193898 INFO  (coreLoadExecutor-905-thread-1-processing-n:127.0.0.1:40601__) [n:127.0.0.1:40601__ c:control_collection   x:collection1] o.a.s.s.IndexSchema unique key field: id
   [junit4]   2> 193899 WARN  (coreLoadExecutor-905-thread-1-processing-n:127.0.0.1:40601__) [n:127.0.0.1:40601__ c:control_collection   x:collection1] o.a.s.s.IndexSchema Field lowerfilt1and2 is not multivalued and destination for multiple copyFields (2)
   [junit4]   2> 193899 WARN  (coreLoadExecutor-905-thread-1-processing-n:127.0.0.1:40601__) [n:127.0.0.1:40601__ c:control_collection   x:collection1] o.a.s.s.IndexSchema Field text is not multivalued and destination for multiple copyFields (3)
   [junit4]   2> 193900 INFO  (coreLoadExecutor-905-thread-1-processing-n:127.0.0.1:40601__) [n:127.0.0.1:40601__ c:control_collection   x:collection1] o.a.s.c.ConfigSetProperties Did not find ConfigSet properties, assuming default properties: Can't find resource 'configsetprops.json' in classpath or '/configs/conf1', cwd=/export/home/jenkins/workspace/Lucene-Solr-trunk-Solaris/solr/build/solr-solrj/test/J0
   [junit4]   2> 193901 INFO  (coreLoadExecutor-905-thread-1-processing-n:127.0.0.1:40601__) [n:127.0.0.1:40601__ c:control_collection   x:collection1] o.a.s.c.CoreContainer Creating SolrCore 'collection1' using configuration from collection control_collection
   [junit4]   2> 193901 INFO  (coreLoadExecutor-905-thread-1-processing-n:127.0.0.1:40601__) [n:127.0.0.1:40601__ c:control_collection s:shard1 r:core_node1 x:collection1] o.a.s.c.SolrCore org.apache.solr.core.MockDirectoryFactory
   [junit4]   2> 193901 INFO  (coreLoadExecutor-905-thread-1-processing-n:127.0.0.1:40601__) [n:127.0.0.1:40601__ c:control_collection s:shard1 r:core_node1 x:collection1] o.a.s.c.SolrCore [[collection1] ] Opening new SolrCore at [/export/home/jenkins/workspace/Lucene-Solr-trunk-Solaris/solr/build/solr-solrj/test/J0/temp/solr.client.solrj.io.stream.StreamExpressionTest_BD09EB3C8F6DCE18-001/control-001/cores/collection1], dataDir=[/export/home/jenkins/workspace/Lucene-Solr-trunk-Solaris/solr/build/solr-solrj/test/J0/../../../../../../../../../../export/home/jenkins/workspace/Lucene-Solr-trunk-Solaris/solr/build/solr-solrj/test/J0/temp/solr.client.solrj.io.stream.StreamExpressionTest_BD09EB3C8F6DCE18-001/control-001/cores/collection1/data/]
   [junit4]   2> 193901 INFO  (coreLoadExecutor-905-thread-1-processing-n:127.0.0.1:40601__) [n:127.0.0.1:40601__ c:control_collection s:shard1 r:core_node1 x:collection1] o.a.s.c.SolrCore JMX monitoring not detected for core: collection1
   [junit4]   2> 193901 INFO  (coreLoadExecutor-905-thread-1-processing-n:127.0.0.1:40601__) [n:127.0.0.1:40601__ c:control_collection s:shard1 r:core_node1 x:collection1] o.a.s.c.CachingDirectoryFactory return new directory for /export/home/jenkins/workspace/Lucene-Solr-trunk-Solaris/solr/build/solr-solrj/test/J0/../../../../../../../../../../export/home/jenkins/workspace/Lucene-Solr-trunk-Solaris/solr/build/solr-solrj/test/J0/temp/solr.client.solrj.io.stream.StreamExpressionTest_BD09EB3C8F6DCE18-001/control-001/cores/collection1/data
   [junit4]   2> 193901 INFO  (coreLoadExecutor-905-thread-1-processing-n:127.0.0.1:40601__) [n:127.0.0.1:40601__ c:control_collection s:shard1 r:core_node1 x:collection1] o.a.s.c.SolrCore New index directory detected: old=null new=/export/home/jenkins/workspace/Lucene-Solr-trunk-Solaris/solr/build/solr-solrj/test/J0/../../../../../../../../../../export/home/jenkins/workspace/Lucene-Solr-trunk-Solaris/solr/build/solr-solrj/test/J0/temp/solr.client.solrj.io.stream.StreamExpressionTest_BD09EB3C8F6DCE18-001/control-001/cores/collection1/data/index/
   [junit4]   2> 193902 WARN  (coreLoadExecutor-905-thread-1-processing-n:127.0.0.1:40601__) [n:127.0.0.1:40601__ c:control_collection s:shard1 r:core_node1 x:collection1] o.a.s.c.SolrCore [collection1] Solr index directory '/export/home/jenkins/workspace/Lucene-Solr-trunk-Solaris/solr/build/solr-solrj/test/J0/../../../../../../../../../../export/home/jenkins/workspace/Lucene-Solr-trunk-Solaris/solr/build/solr-solrj/test/J0/temp/solr.client.solrj.io.stream.StreamExpressionTest_BD09EB3C8F6DCE18-001/control-001/cores/collection1/data/index' doesn't exist. Creating new index...
   [junit4]   2> 193902 INFO  (coreLoadExecutor-905-thread-1-processing-n:127.0.0.1:40601__) [n:127.0.0.1:40601__ c:control_collection s:shard1 r:core_node1 x:collection1] o.a.s.c.CachingDirectoryFactory return new directory for /export/home/jenkins/workspace/Lucene-Solr-trunk-Solaris/solr/build/solr-solrj/test/J0/../../../../../../../../../../export/home/jenkins/workspace/Lucene-Solr-trunk-Solaris/solr/build/solr-solrj/test/J0/temp/solr.client.solrj.io.stream.StreamExpressionTest_BD09EB3C8F6DCE18-001/control-001/cores/collection1/data/index
   [junit4]   2> 193902 INFO  (coreLoadExecutor-905-thread-1-processing-n:127.0.0.1:40601__) [n:127.0.0.1:40601__ c:control_collection s:shard1 r:core_node1 x:collection1] o.a.s.c.SolrDeletionPolicy SolrDeletionPolicy.onCommit: commits: num=1
   [junit4]   2> 	commit{dir=MockDirectoryWrapper(RAMDirectory@126ff5e2 lockFactory=org.apache.lucene.store.SingleInstanceLockFactory@a9836e7),segFN=segments_1,generation=1}
   [junit4]   2> 193902 INFO  (coreLoadExecutor-905-thread-1-processing-n:127.0.0.1:40601__) [n:127.0.0.1:40601__ c:control_collection s:shard1 r:core_node1 x:collection1] o.a.s.c.SolrDeletionPolicy newest commit generation = 1
   [junit4]   2> 193904 INFO  (OldIndexDirectoryCleanupThreadForCore-collection1) [n:127.0.0.1:40601__ c:control_collection s:shard1 r:core_node1 x:collection1] o.a.s.c.SolrCore Looking for old index directories to cleanup for core collection1 in /export/home/jenkins/workspace/Lucene-Solr-trunk-Solaris/solr/build/solr-solrj/test/J0/../../../../../../../../../../export/home/jenkins/workspace/Lucene-Solr-trunk-Solaris/solr/build/solr-solrj/test/J0/temp/solr.client.solrj.io.stream.StreamExpressionTest_BD09EB3C8F6DCE18-001/control-001/cores/collection1/data/
   [junit4]   2> 193904 WARN  (OldIndexDirectoryCleanupThreadForCore-collection1) [n:127.0.0.1:40601__ c:control_collection s:shard1 r:core_node1 x:collection1] o.a.s.c.DirectoryFactory /export/home/jenkins/workspace/Lucene-Solr-trunk-Solaris/solr/build/solr-solrj/test/J0/../../../../../../../../../../export/home/jenkins/workspace/Lucene-Solr-trunk-Solaris/solr/build/solr-solrj/test/J0/temp/solr.client.solrj.io.stream.StreamExpressionTest_BD09EB3C8F6DCE18-001/control-001/cores/collection1/data/ does not point to a valid data directory; skipping clean-up of old index directories.
   [junit4]   2> 193904 INFO  (coreLoadExecutor-905-thread-1-processing-n:127.0.0.1:40601__) [n:127.0.0.1:40601__ c:control_collection s:shard1 r:core_node1 x:collection1] o.a.s.c.SolrCore no updateRequestProcessorChain defined as default, creating implicit default
   [junit4]   2> 193906 INFO  (coreLoadExecutor-905-thread-1-processing-n:127.0.0.1:40601__) [n:127.0.0.1:40601__ c:control_collection s:shard1 r:core_node1 x:collection1] o.a.s.h.l.XMLLoader xsltCacheLifetimeSeconds=60
   [junit4]   2> 193907 INFO  (coreLoadExecutor-905-thread-1-processing-n:127.0.0.1:40601__) [n:127.0.0.1:40601__ c:control_collection s:shard1 r:core_node1 x:collection1] o.a.s.h.l.XMLLoader xsltCacheLifetimeSeconds=60
   [junit4]   2> 193909 INFO  (coreLoadExecutor-905-thread-1-processing-n:127.0.0.1:40601__) [n:127.0.0.1:40601__ c:control_collection s:shard1 r:core_node1 x:collection1] o.a.s.h.l.XMLLoader xsltCacheLifetimeSeconds=60
   [junit4]   2> 193910 INFO  (coreLoadExecutor-905-thread-1-processing-n:127.0.0.1:40601__) [n:127.0.0.1:40601__ c:control_collection s:shard1 r:core_node1 x:collection1] o.a.s.h.l.XMLLoader xsltCacheLifetimeSeconds=60
   [junit4]   2> 193912 INFO  (coreLoadExecutor-905-thread-1-processing-n:127.0.0.1:40601__) [n:127.0.0.1:40601__ c:control_collection s:shard1 r:core_node1 x:collection1] o.a.s.c.RequestHandlers Registered paths: /admin/mbeans,standard,,/update/csv,/sql,/update/json/docs,/admin/luke,/export,/admin/segments,/get,/admin/system,/replication,/admin/properties,/config,/stream,/schema,/admin/plugins,/admin/logging,/update/json,/admin/threads,/admin/ping,/update,/admin/file
   [junit4]   2> 193912 INFO  (coreLoadExecutor-905-thread-1-processing-n:127.0.0.1:40601__) [n:127.0.0.1:40601__ c:control_collection s:shard1 r:core_node1 x:collection1] o.a.s.c.SolrCore Using default statsCache cache: org.apache.solr.search.stats.LocalStatsCache
   [junit4]   2> 193913 INFO  (coreLoadExecutor-905-thread-1-processing-n:127.0.0.1:40601__) [n:127.0.0.1:40601__ c:control_collection s:shard1 r:core_node1 x:collection1] o.a.s.u.UpdateHandler Using UpdateLog implementation: org.apache.solr.update.UpdateLog
   [junit4]   2> 193913 INFO  (coreLoadExecutor-905-thread-1-processing-n:127.0.0.1:40601__) [n:127.0.0.1:40601__ c:control_collection s:shard1 r:core_node1 x:collection1] o.a.s.u.UpdateLog Initializing UpdateLog: dataDir= defaultSyncLevel=FLUSH numRecordsToKeep=100 maxNumLogsToKeep=10 numVersionBuckets=65536
   [junit4]   2> 193914 INFO  (coreLoadExecutor-905-thread-1-processing-n:127.0.0.1:40601__) [n:127.0.0.1:40601__ c:control_collection s:shard1 r:core_node1 x:collection1] o.a.s.u.CommitTracker Hard AutoCommit: disabled
   [junit4]   2> 193914 INFO  (coreLoadExecutor-905-thread-1-processing-n:127.0.0.1:40601__) [n:127.0.0.1:40601__ c:control_collection s:shard1 r:core_node1 x:collection1] o.a.s.u.CommitTracker Soft AutoCommit: disabled
   [junit4]   2> 193914 INFO  (coreLoadExecutor-905-thread-1-processing-n:127.0.0.1:40601__) [n:127.0.0.1:40601__ c:control_collection s:shard1 r:core_node1 x:collection1] o.a.s.c.SolrDeletionPolicy SolrDeletionPolicy.onInit: commits: num=1
   [junit4]   2> 	commit{dir=MockDirectoryWrapper(RAMDirectory@126ff5e2 lockFactory=org.apache.lucene.store.SingleInstanceLockFactory@a9836e7),segFN=segments_1,generation=1}
   [junit4]   2> 193914 INFO  (coreLoadExecutor-905-thread-1-processing-n:127.0.0.1:40601__) [n:127.0.0.1:40601__ c:control_collection s:shard1 r:core_node1 x:collection1] o.a.s.c.SolrDeletionPolicy newest commit generation = 1
   [junit4]   2> 193915 INFO  (coreLoadExecutor-905-thread-1-processing-n:127.0.0.1:40601__) [n:127.0.0.1:40601__ c:control_collection s:shard1 r:core_node1 x:collection1] o.a.s.s.SolrIndexSearcher Opening [Searcher@4a25e2bb[collection1] main]
   [junit4]   2> 193915 INFO  (coreLoadExecutor-905-thread-1-processing-n:127.0.0.1:40601__) [n:127.0.0.1:40601__ c:control_collection s:shard1 r:core_node1 x:collection1] o.a.s.c.c.ZkStateReader Load collection config from: [/collections/control_collection]
   [junit4]   2> 193916 INFO  (coreLoadExecutor-905-thread-1-processing-n:127.0.0.1:40601__) [n:127.0.0.1:40601__ c:control_collection s:shard1 r:core_node1 x:collection1] o.a.s.c.c.ZkStateReader path=[/collections/control_collection] [configName]=[conf1] specified config exists in ZooKeeper
   [junit4]   2> 193916 INFO  (coreLoadExecutor-905-thread-1-processing-n:127.0.0.1:40601__) [n:127.0.0.1:40601__ c:control_collection s:shard1 r:core_node1 x:collection1] o.a.s.r.ManagedResourceStorage Setting up ZooKeeper-based storage for the RestManager with znodeBase: /configs/conf1
   [junit4]   2> 193917 INFO  (coreLoadExecutor-905-thread-1-processing-n:127.0.0.1:40601__) [n:127.0.0.1:40601__ c:control_collection s:shard1 r:core_node1 x:collection1] o.a.s.r.ManagedResourceStorage Configured ZooKeeperStorageIO with znodeBase: /configs/conf1
   [junit4]   2> 193917 INFO  (coreLoadExecutor-905-thread-1-processing-n:127.0.0.1:40601__) [n:127.0.0.1:40601__ c:control_collection s:shard1 r:core_node1 x:collection1] o.a.s.r.RestManager Initializing RestManager with initArgs: {}
   [junit4]   2> 193917 INFO  (coreLoadExecutor-905-thread-1-processing-n:127.0.0.1:40601__) [n:127.0.0.1:40601__ c:control_collection s:shard1 r:core_node1 x:collection1] o.a.s.r.ManagedResourceStorage Reading _rest_managed.json using ZooKeeperStorageIO:path=/configs/conf1
   [junit4]   2> 193918 INFO  (coreLoadExecutor-905-thread-1-processing-n:127.0.0.1:40601__) [n:127.0.0.1:40601__ c:control_collection s:shard1 r:core_node1 x:collection1] o.a.s.r.ManagedResourceStorage No data found for znode /configs/conf1/_rest_managed.json
   [junit4]   2> 193918 INFO  (coreLoadExecutor-905-thread-1-processing-n:127.0.0.1:40601__) [n:127.0.0.1:40601__ c:control_collection s:shard1 r:core_node1 x:collection1] o.a.s.r.ManagedResourceStorage Loaded null at path _rest_managed.json using ZooKeeperStorageIO:path=/configs/conf1
   [junit4]   2> 193918 INFO  (coreLoadExecutor-905-thread-1-processing-n:127.0.0.1:40601__) [n:127.0.0.1:40601__ c:control_collection s:shard1 r:core_node1 x:collection1] o.a.s.r.RestManager Initializing 0 registered ManagedResources
   [junit4]   2> 193918 INFO  (coreLoadExecutor-905-thread-1-processing-n:127.0.0.1:40601__) [n:127.0.0.1:40601__ c:control_collection s:shard1 r:core_node1 x:collection1] o.a.s.h.ReplicationHandler Commits will be reserved for  10000
   [junit4]   2> 193918 INFO  (coreLoadExecutor-905-thread-1-processing-n:127.0.0.1:40601__) [n:127.0.0.1:40601__ c:control_collection s:shard1 r:core_node1 x:collection1] o.a.s.u.UpdateLog Looking up max value of version field to seed version buckets
   [junit4]   2> 193918 INFO  (coreLoadExecutor-905-thread-1-processing-n:127.0.0.1:40601__) [n:127.0.0.1:40601__ c:control_collection s:shard1 r:core_node1 x:collection1] o.a.s.u.VersionInfo Refreshing highest value of _version_ for 65536 version buckets from index
   [junit4]   2> 193919 INFO  (coreLoadExecutor-905-thread-1-processing-n:127.0.0.1:40601__) [n:127.0.0.1:40601__ c:control_collection s:shard1 r:core_node1 x:collection1] o.a.s.u.VersionInfo No terms found for _version_, cannot seed version bucket highest value from index
   [junit4]   2> 193919 INFO  (coreLoadExecutor-905-thread-1-processing-n:127.0.0.1:40601__) [n:127.0.0.1:40601__ c:control_collection s:shard1 r:core_node1 x:collection1] o.a.s.u.UpdateLog Could not find max version in index or recent updates, using new clock 1526718780024029184
   [junit4]   2> 193920 INFO  (coreLoadExecutor-905-thread-1-processing-n:127.0.0.1:40601__) [n:127.0.0.1:40601__ c:control_collection s:shard1 r:core_node1 x:collection1] o.a.s.u.UpdateLog Took 2.0ms to seed version buckets with highest version 1526718780024029184
   [junit4]   2> 193920 INFO  (coreLoadExecutor-905-thread-1-processing-n:127.0.0.1:40601__) [n:127.0.0.1:40601__ c:control_collection s:shard1 r:core_node1 x:collection1] o.a.s.c.ZkController watch zkdir /configs/conf1
   [junit4]   2> 193921 INFO  (searcherExecutor-906-thread-1-processing-n:127.0.0.1:40601__ x:collection1 s:shard1 c:control_collection r:core_node1) [n:127.0.0.1:40601__ c:control_collection s:shard1 r:core_node1 x:collection1] o.a.s.c.SolrCore [collection1] Registered new searcher Searcher@4a25e2bb[collection1] main{ExitableDirectoryReader(UninvertingDirectoryReader())}
   [junit4]   2> 193922 INFO  (coreLoadExecutor-905-thread-1-processing-n:127.0.0.1:40601__) [n:127.0.0.1:40601__ c:control_collection s:shard1 r:core_node1 x:collection1] o.a.s.c.CoreContainer registering core: collection1
   [junit4]   2> 193923 INFO  (coreZkRegister-899-thread-1-processing-n:127.0.0.1:40601__ x:collection1 s:shard1 c:control_collection r:core_node1) [n:127.0.0.1:40601__ c:control_collection s:shard1 r:core_node1 x:collection1] o.a.s.c.ZkController Register replica - core:collection1 address:http://127.0.0.1:40601/_ collection:control_collection shard:shard1
   [junit4]   2> 193925 INFO  (coreZkRegister-899-thread-1-processing-n:127.0.0.1:40601__ x:collection1 s:shard1 c:control_collection r:core_node1) [n:127.0.0.1:40601__ c:control_collection s:shard1 r:core_node1 x:collection1] o.a.s.c.c.SolrZkClient makePath: /collections/control_collection/leader_elect/shard1/election
   [junit4]   2> 193933 INFO  (coreZkRegister-899-thread-1-processing-n:127.0.0.1:40601__ x:collection1 s:shard1 c:control_collection r:core_node1) [n:127.0.0.1:40601__ c:control_collection s:shard1 r:core_node1 x:collection1] o.a.s.c.LeaderElector Joined leadership election with path: /collections/control_collection/leader_elect/shard1/election/95419923656540164-core_node1-n_0000000000
   [junit4]   2> 193934 INFO  (coreZkRegister-899-thread-1-processing-n:127.0.0.1:40601__ x:collection1 s:shard1 c:control_collection r:core_node1) [n:127.0.0.1:40601__ c:control_collection s:shard1 r:core_node1 x:collection1] o.a.s.c.ShardLeaderElectionContext Running the leader process for shard=shard1 and weAreReplacement=false and leaderVoteWait=0
   [junit4]   2> 193937 INFO  (coreZkRegister-899-thread-1-processing-n:127.0.0.1:40601__ x:collection1 s:shard1 c:control_collection r:core_node1) [n:127.0.0.1:40601__ c:control_collection s:shard1 r:core_node1 x:collection1] o.a.s.c.ShardLeaderElectionContext Enough replicas found to continue.
   [junit4]   2> 193938 INFO  (coreZkRegister-899-thread-1-processing-n:127.0.0.1:40601__ x:collection1 s:shard1 c:control_collection r:core_node1) [n:127.0.0.1:40601__ c:control_collection s:shard1 r:core_node1 x:collection1] o.a.s.c.ShardLeaderElectionContext I may be the new leader - try and sync
   [junit4]   2> 193938 INFO  (coreZkRegister-899-thread-1-processing-n:127.0.0.1:40601__ x:collection1 s:shard1 c:control_collection r:core_node1) [n:127.0.0.1:40601__ c:control_collection s:shard1 r:core_node1 x:collection1] o.a.s.c.SyncStrategy Sync replicas to http://127.0.0.1:40601/_/collection1/
   [junit4]   2> 193938 INFO  (OverseerStateUpdate-95419923656540164-127.0.0.1:40601__-n_0000000000) [n:127.0.0.1:40601__    ] o.a.s.c.Overseer processMessage: queueSize: 1, message = {
   [junit4]   2>   "operation":"leader",
   [junit4]   2>   "shard":"shard1",
   [junit4]   2>   "collection":"control_collection"} current state version: 1
   [junit4]   2> 193938 INFO  (coreZkRegister-899-thread-1-processing-n:127.0.0.1:40601__ x:collection1 s:shard1 c:control_collection r:core_node1) [n:127.0.0.1:40601__ c:control_collection s:shard1 r:core_node1 x:collection1] o.a.s.c.SyncStrategy Sync Success - now sync replicas to me
   [junit4]   2> 193938 INFO  (coreZkRegister-899-thread-1-processing-n:127.0.0.1:40601__ x:collection1 s:shard1 c:control_collection r:core_node1) [n:127.0.0.1:40601__ c:control_collection s:shard1 r:core_node1 x:collection1] o.a.s.c.SyncStrategy http://127.0.0.1:40601/_/collection1/ has no replicas
   [junit4]   2> 193940 INFO  (coreZkRegister-899-thread-1-processing-n:127.0.0.1:40601__ x:collection1 s:shard1 c:control_collection r:core_node1) [n:127.0.0.1:40601__ c:control_collection s:shard1 r:core_node1 x:collection1] o.a.s.c.c.SolrZkClient makePath: /collections/control_collection/leaders/shard1
   [junit4]   2> 193947 INFO  (coreZkRegister-899-thread-1-processing-n:127.0.0.1:40601__ x:collection1 s:shard1 c:control_collection r:core_node1) [n:127.0.0.1:40601__ c:control_collection s:shard1 r:core_node1 x:collection1] o.a.s.c.ShardLeaderElectionContextBase Creating leader registration node /collections/control_collection/leaders/shard1/leader after winning as /collections/control_collection/leader_elect/shard1/election/95419923656540164-core_node1-n_0000000000
   [junit4]   2> 193950 INFO  (coreZkRegister-899-thread-1-processing-n:127.0.0.1:40601__ x:collection1 s:shard1 c:control_collection r:core_node1) [n:127.0.0.1:40601__ c:control_collection s:shard1 r:core_node1 x:collection1] o.a.s.c.ShardLeaderElectionContext I am the new leader: http://127.0.0.1:40601/_/collection1/ shard1
   [junit4]   2> 193951 INFO  (OverseerStateUpdate-95419923656540164-127.0.0.1:40601__-n_0000000000) [n:127.0.0.1:40601__    ] o.a.s.c.Overseer processMessage: queueSize: 1, message = {
   [junit4]   2>   "operation":"leader",
   [junit4]   2>   "shard":"shard1",
   [junit4]   2>   "collection":"control_collection",
   [junit4]   2>   "base_url":"http://127.0.0.1:40601/_",
   [junit4]   2>   "core":"collection1",
   [junit4]   2>   "state":"active"} current state version: 1
   [junit4]   2> 194057 INFO  (zkCallback-380-thread-1-processing-n:127.0.0.1:40601__) [n:127.0.0.1:40601__    ] o.a.s.c.c.ZkStateReader A cluster state change: [WatchedEvent state:SyncConnected type:NodeDataChanged path:/clusterstate.json], has occurred - updating... (live nodes size: [1])
   [junit4]   2> 194103 INFO  (coreZkRegister-899-thread-1-processing-n:127.0.0.1:40601__ x:collection1 s:shard1 c:control_collection r:core_node1) [n:127.0.0.1:40601__ c:control_collection s:shard1 r:core_node1 x:collection1] o.a.s.c.ZkController We are http://127.0.0.1:40601/_/collection1/ and leader is http://127.0.0.1:40601/_/collection1/
   [junit4]   2> 194103 INFO  (coreZkRegister-899-thread-1-processing-n:127.0.0.1:40601__ x:collection1 s:shard1 c:control_collection r:core_node1) [n:127.0.0.1:40601__ c:control_collection s:shard1 r:core_node1 x:collection1] o.a.s.c.ZkController No LogReplay needed for core=collection1 baseURL=http://127.0.0.1:40601/_
   [junit4]   2> 194104 INFO  (coreZkRegister-899-thread-1-processing-n:127.0.0.1:40601__ x:collection1 s:shard1 c:control_collection r:core_node1) [n:127.0.0.1:40601__ c:control_collection s:shard1 r:core_node1 x:collection1] o.a.s.c.ZkController I am the leader, no recovery necessary
   [junit4]   2> 194104 INFO  (coreZkRegister-899-thread-1-processing-n:127.0.0.1:40601__ x:collection1 s:shard1 c:control_collection r:core_node1) [n:127.0.0.1:40601__ c:control_collection s:shard1 r:core_node1 x:collection1] o.a.s.c.ZkController publishing state=active
   [junit4]   2> 194104 INFO  (coreZkRegister-899-thread-1-processing-n:127.0.0.1:40601__ x:collection1 s:shard1 c:control_collection r:core_node1) [n:127.0.0.1:40601__ c:control_collection s:shard1 r:core_node1 x:collection1] o.a.s.c.ZkController numShards not found on descriptor - reading it from system property
   [junit4]   2> 194107 INFO  (OverseerStateUpdate-95419923656540164-127.0.0.1:40601__-n_0000000000) [n:127.0.0.1:40601__    ] o.a.s.c.Overseer processMessage: queueSize: 1, message = {
   [junit4]   2>   "core":"collection1",
   [junit4]   2>   "core_node_name":"core_node1",
   [junit4]   2>   "roles":null,
   [junit4]   2>   "base_url":"http://127.0.0.1:40601/_",
   [junit4]   2>   "node_name":"127.0.0.1:40601__",
   [junit4]   2>   "numShards":"1",
   [junit4]   2>   "state":"active",
   [junit4]   2>   "shard":"shard1",
   [junit4]   2>   "collection":"control_collection",
   [junit4]   2>   "operation":"state"} current state version: 2
   [junit4]   2> 194108 INFO  (OverseerStateUpdate-95419923656540164-127.0.0.1:40601__-n_0000000000) [n:127.0.0.1:40601__    ] o.a.s.c.o.ReplicaMutator Update state numShards=1 message={
   [junit4]   2>   "core":"collection1",
   [junit4]   2>   "core_node_name":"core_node1",
   [junit4]   2>   "roles":null,
   [junit4]   2>   "base_url":"http://127.0.0.1:40601/_",
   [junit4]   2>   "node_name":"127.0.0.1:40601__",
   [junit4]   2>   "numShards":"1",
   [junit4]   2>   "state":"active",
   [junit4]   2>   "shard":"shard1",
   [junit4]   2>   "collection":"control_collection",
   [junit4]   2>   "operation":"state"}
   [junit4]   2> 194108 INFO  (coreZkRegister-899-thread-1-processing-n:127.0.0.1:40601__ x:collection1 s:shard1 c:control_collection r:core_node1) [n:127.0.0.1:40601__ c:control_collection s:shard1 r:core_node1 x:collection1] o.a.s.c.c.ZkStateReader Updated live nodes from ZooKeeper... (1) -> (1)
   [junit4]   2> 194213 INFO  (zkCallback-380-thread-1-processing-n:127.0.0.1:40601__) [n:127.0.0.1:40601__    ] o.a.s.c.c.ZkStateReader A cluster state change: [WatchedEvent state:SyncConnected type:NodeDataChanged path:/clusterstate.json], has occurred - updating... (live nodes size: [1])
   [junit4]   2> 194280 INFO  (TEST-StreamExpressionTest.testAll-seed#[BD09EB3C8F6DCE18]) [    ] o.a.s.c.c.SolrZkClient Using default ZkCredentialsProvider
   [junit4]   2> 194281 INFO  (TEST-StreamExpressionTest.testAll-seed#[BD09EB3C8F6DCE18]) [    ] o.a.s.c.c.ConnectionManager Waiting for client to connect to ZooKeeper
   [junit4]   2> 194283 INFO  (zkCallback-382-thread-1) [    ] o.a.s.c.c.ConnectionManager Watcher org.apache.solr.common.cloud.ConnectionManager@3d120c0b name:ZooKeeperConnection Watcher:127.0.0.1:43072/solr got event WatchedEvent state:SyncConnected type:None path:null path:null type:None
   [junit4]   2> 194283 INFO  (TEST-StreamExpressionTest.testAll-seed#[BD09EB3C8F6DCE18]) [    ] o.a.s.c.c.ConnectionManager Client is connected to ZooKeeper
   [junit4]   2> 194283 INFO  (TEST-StreamExpressionTest.testAll-seed#[BD09EB3C8F6DCE18]) [    ] o.a.s.c.c.SolrZkClient Using default ZkACLProvider
   [junit4]   2> 194283 INFO  (TEST-StreamExpressionTest.testAll-seed#[BD09EB3C8F6DCE18]) [    ] o.a.s.c.c.ZkStateReader Updating cluster state from ZooKeeper... 
   [junit4]   2> 194286 INFO  (TEST-StreamExpressionTest.testAll-seed#[BD09EB3C8F6DCE18]) [    ] o.a.s.c.c.ZkStateReader Updated live nodes from ZooKeeper... (0) -> (1)
   [junit4]   2> 194287 INFO  (TEST-StreamExpressionTest.testAll-seed#[BD09EB3C8F6DCE18]) [    ] o.a.s.c.ChaosMonkey monkey: init - expire sessions:false cause connection loss:false
   [junit4]   2> 194287 INFO  (TEST-StreamExpressionTest.testAll-seed#[BD09EB3C8F6DCE18]) [    ] o.a.s.c.AbstractFullDistribZkTestBase Creating collection1 with stateFormat=2
   [junit4]   2> 194287 INFO  (TEST-StreamExpressionTest.testAll-seed#[BD09EB3C8F6DCE18]) [    ] o.a.s.c.c.SolrZkClient Using default ZkCredentialsProvider
   [junit4]   2> 194288 INFO  (TEST-StreamExpressionTest.testAll-seed#[BD09EB3C8F6DCE18]) [    ] o.a.s.c.c.ConnectionManager Waiting for client to connect to ZooKeeper
   [junit4]   2> 194290 INFO  (zkCallback-383-thread-1) [    ] o.a.s.c.c.ConnectionManager Watcher org.apache.solr.common.cloud.ConnectionManager@118395ec name:ZooKeeperConnection Watcher:127.0.0.1:43072/solr got event WatchedEvent state:SyncConnected type:None path:null path:null type:None
   [junit4]   2> 194291 INFO  (TEST-StreamExpressionTest.testAll-seed#[BD09EB3C8F6DCE18]) [    ] o.a.s.c.c.ConnectionManager Client is connected to ZooKeeper
   [junit4]   2> 194291 INFO  (TEST-StreamExpressionTest.testAll-seed#[BD09EB3C8F6DCE18]) [    ] o.a.s.c.c.SolrZkClient Using default ZkACLProvider
   [junit4]   2> 194295 INFO  (OverseerStateUpdate-95419923656540164-127.0.0.1:40601__-n_0000000000) [n:127.0.0.1:40601__    ] o.a.s.c.Overseer processMessage: queueSize: 1, message = {
   [junit4]   2>   "operation":"create",
   [junit4]   2>   "name":"collection1",
   [junit4]   2>   "numShards":"2",
   [junit4]   2>   "stateFormat":"2"} current state version: 3
   [junit4]   2> 194295 INFO  (OverseerStateUpdate-95419923656540164-127.0.0.1:40601__-n_0000000000) [n:127.0.0.1:40601__    ] o.a.s.c.o.ClusterStateMutator building a new cName: collection1
   [junit4]   2> 194320 INFO  (TEST-StreamExpressionTest.testAll-seed#[BD09EB3C8F6DCE18]) [    ] o.a.s.SolrTestCaseJ4 Writing core.properties file to /export/home/jenkins/workspace/Lucene-Solr-trunk-Solaris/solr/build/solr-solrj/test/J0/temp/solr.client.solrj.io.stream.StreamExpressionTest_BD09EB3C8F6DCE18-001/shard-1-001/cores/collection1
   [junit4]   2> 194321 INFO  (TEST-StreamExpressionTest.testAll-seed#[BD09EB3C8F6DCE18]) [    ] o.a.s.c.AbstractFullDistribZkTestBase create jetty 1 in directory /export/home/jenkins/workspace/Lucene-Solr-trunk-Solaris/solr/build/solr-solrj/test/J0/temp/solr.client.solrj.io.stream.StreamExpressionTest_BD09EB3C8F6DCE18-001/shard-1-001
   [junit4]   2> 194322 INFO  (TEST-StreamExpressionTest.testAll-seed#[BD09EB3C8F6DCE18]) [    ] o.e.j.s.Server jetty-9.3.6.v20151106
   [junit4]   2> 194325 INFO  (TEST-StreamExpressionTest.testAll-seed#[BD09EB3C8F6DCE18]) [    ] o.e.j.s.h.ContextHandler Started o.e.j.s.ServletContextHandler@2bd6396b{/_,null,AVAILABLE}
   [junit4]   2> 194325 INFO  (TEST-StreamExpressionTest.testAll-seed#[BD09EB3C8F6DCE18]) [    ] o.e.j.s.ServerConnector Started ServerConnector@1bb4b883{HTTP/1.1,[http/1.1]}{127.0.0.1:37209}
   [junit4]   2> 194325 INFO  (TEST-StreamExpressionTest.testAll-seed#[BD09EB3C8F6DCE18]) [    ] o.e.j.s.Server Started @197937ms
   [junit4]   2> 194325 INFO  (TEST-StreamExpressionTest.testAll-seed#[BD09EB3C8F6DCE18]) [    ] o.a.s.c.s.e.JettySolrRunner Jetty properties: {solr.data.dir=/export/home/jenkins/workspace/Lucene-Solr-trunk-Solaris/solr/build/solr-solrj/test/J0/temp/solr.client.solrj.io.stream.StreamExpressionTest_BD09EB3C8F6DCE18-001/tempDir-001/jetty1, solrconfig=solrconfig.xml, hostContext=/_, hostPort=37209, coreRootDirectory=/export/home/jenkins/workspace/Lucene-Solr-trunk-Solaris/solr/build/solr-solrj/test/J0/../../../../../../../../../../export/home/jenkins/workspace/Lucene-Solr-trunk-Solaris/solr/build/solr-solrj/test/J0/temp/solr.client.solrj.io.stream.StreamExpressionTest_BD09EB3C8F6DCE18-001/shard-1-001/cores}
   [junit4]   2> 194325 INFO  (TEST-StreamExpressionTest.testAll-seed#[BD09EB3C8F6DCE18]) [    ] o.a.s.s.SolrDispatchFilter SolrDispatchFilter.init(): sun.misc.Launcher$AppClassLoader@6d06d69c
   [junit4]   2> 194325 INFO  (TEST-StreamExpressionTest.testAll-seed#[BD09EB3C8F6DCE18]) [    ] o.a.s.c.SolrResourceLoader new SolrResourceLoader for directory: '/export/home/jenkins/workspace/Lucene-Solr-trunk-Solaris/solr/build/solr-solrj/test/J0/temp/solr.client.solrj.io.stream.StreamExpressionTest_BD09EB3C8F6DCE18-001/shard-1-001'
   [junit4]   2> 194325 INFO  (TEST-StreamExpressionTest.testAll-seed#[BD09EB3C8F6DCE18]) [    ] o.a.s.c.SolrResourceLoader JNDI not configured for solr (NoInitialContextEx)
   [junit4]   2> 194325 INFO  (TEST-StreamExpressionTest.testAll-seed#[BD09EB3C8F6DCE18]) [    ] o.a.s.c.SolrResourceLoader solr home defaulted to 'solr/' (could not find system property or JNDI)
   [junit4]   2> 194326 INFO  (TEST-StreamExpressionTest.testAll-seed#[BD09EB3C8F6DCE18]) [    ] o.a.s.c.c.SolrZkClient Using default ZkCredentialsProvider
   [junit4]   2> 194326 INFO  (TEST-StreamExpressionTest.testAll-seed#[BD09EB3C8F6DCE18]) [    ] o.a.s.c.c.ConnectionManager Waiting for client to connect to ZooKeeper
   [junit4]   2> 194329 INFO  (zkCallback-384-thread-1) [    ] o.a.s.c.c.ConnectionManager Watcher org.apache.solr.common.cloud.ConnectionManager@1a27a8e3 name:ZooKeeperConnection Watcher:127.0.0.1:43072/solr got event WatchedEvent state:SyncConnected type:None path:null path:null type:None
   [junit4]   2> 194329 INFO  (TEST-StreamExpressionTest.testAll-seed#[BD09EB3C8F6DCE18]) [    ] o.a.s.c.c.ConnectionManager Client is connected to ZooKeeper
   [junit4]   2> 194329 INFO  (TEST-StreamExpressionTest.testAll-seed#[BD09EB3C8F6DCE18]) [    ] o.a.s.c.c.SolrZkClient Using default ZkACLProvider
   [junit4]   2> 194331 INFO  (TEST-StreamExpressionTest.testAll-seed#[BD09EB3C8F6DCE18]) [    ] o.a.s.s.SolrDispatchFilter Loading solr.xml from SolrHome (not found in ZooKeeper)
   [junit4]   2> 194331 INFO  (TEST-StreamExpressionTest.testAll-seed#[BD09EB3C8F6DCE18]) [    ] o.a.s.c.SolrXmlConfig Loading container configuration from /export/home/jenkins/workspace/Lucene-Solr-trunk-Solaris/solr/build/solr-solrj/test/J0/temp/solr.client.solrj.io.stream.StreamExpressionTest_BD09EB3C8F6DCE18-001/shard-1-001/solr.xml
   [junit4]   2> 194348 INFO  (TEST-StreamExpressionTest.testAll-seed#[BD09EB3C8F6DCE18]) [    ] o.a.s.c.CorePropertiesLocator Config-defined core root directory: /export/home/jenkins/workspace/Lucene-Solr-trunk-Solaris/solr/build/solr-solrj/test/J0/../../../../../../../../../../export/home/jenkins/workspace/Lucene-Solr-trunk-Solaris/solr/build/solr-solrj/test/J0/temp/solr.client.solrj.io.stream.StreamExpressionTest_BD09EB3C8F6DCE18-001/shard-1-001/cores
   [junit4]   2> 194348 INFO  (TEST-StreamExpressionTest.testAll-seed#[BD09EB3C8F6DCE18]) [    ] o.a.s.c.CoreContainer New CoreContainer 1368068733
   [junit4]   2> 194348 INFO  (TEST-StreamExpressionTest.testAll-seed#[BD09EB3C8F6DCE18]) [    ] o.a.s.c.CoreContainer Loading cores into CoreContainer [instanceDir=/export/home/jenkins/workspace/Lucene-Solr-trunk-Solaris/solr/build/solr-solrj/test/J0/temp/solr.client.solrj.io.stream.StreamExpressionTest_BD09EB3C8F6DCE18-001/shard-1-001]
   [junit4]   2> 194348 WARN  (TEST-StreamExpressionTest.testAll-seed#[BD09EB3C8F6DCE18]) [    ] o.a.s.c.CoreContainer Couldn't add files from /export/home/jenkins/workspace/Lucene-Solr-trunk-Solaris/solr/build/solr-solrj/test/J0/temp/solr.client.solrj.io.stream.StreamExpressionTest_BD09EB3C8F6DCE18-001/shard-1-001/lib to classpath: /export/home/jenkins/workspace/Lucene-Solr-trunk-Solaris/solr/build/solr-solrj/test/J0/temp/solr.client.solrj.io.stream.StreamExpressionTest_BD09EB3C8F6DCE18-001/shard-1-001/lib
   [junit4]   2> 194348 INFO  (TEST-StreamExpressionTest.testAll-seed#[BD09EB3C8F6DCE18]) [    ] o.a.s.h.c.HttpShardHandlerFactory created with socketTimeout : 90000,urlScheme : ,connTimeout : 15000,maxConnectionsPerHost : 20,maxConnections : 10000,corePoolSize : 0,maximumPoolSize : 2147483647,maxThreadIdleTime : 5,sizeOfQueue : -1,fairnessPolicy : false,useRetries : false,
   [junit4]   2> 194349 INFO  (TEST-StreamExpressionTest.testAll-seed#[BD09EB3C8F6DCE18]) [    ] o.a.s.u.UpdateShardHandler Creating UpdateShardHandler HTTP client with params: socketTimeout=340000&connTimeout=45000&retry=true
   [junit4]   2> 194349 INFO  (TEST-StreamExpressionTest.testAll-seed#[BD09EB3C8F6DCE18]) [    ] o.a.s.l.LogWatcher SLF4J impl is org.slf4j.impl.Log4jLoggerFactory
   [junit4]   2> 194349 INFO  (TEST-StreamExpressionTest.testAll-seed#[BD09EB3C8F6DCE18]) [    ] o.a.s.l.LogWatcher Registering Log Listener [Log4j (org.slf4j.impl.Log4jLoggerFactory)]
   [junit4]   2> 194349 INFO  (TEST-StreamExpressionTest.testAll-seed#[BD09EB3C8F6DCE18]) [    ] o.a.s.c.ZkContainer Zookeeper client=127.0.0.1:43072/solr
   [junit4]   2> 194349 INFO  (TEST-StreamExpressionTest.testAll-seed#[BD09EB3C8F6DCE18]) [    ] o.a.s.c.ZkController zkHost includes chroot
   [junit4]   2> 194350 INFO  (TEST-StreamExpressionTest.testAll-seed#[BD09EB3C8F6DCE18]) [    ] o.a.s.c.c.SolrZkClient Using default ZkCredentialsProvider
   [junit4]   2> 194350 INFO  (TEST-StreamExpressionTest.testAll-seed#[BD09EB3C8F6DCE18]) [    ] o.a.s.c.c.ConnectionManager Waiting for client to connect to ZooKeeper
   [junit4]   2> 194353 INFO  (zkCallback-387-thread-1) [    ] o.a.s.c.c.ConnectionManager Watcher org.apache.solr.common.cloud.ConnectionManager@7b93d7c7 name:ZooKeeperConnection Watcher:127.0.0.1:43072 got event WatchedEvent state:SyncConnected type:None path:null path:null type:None
   [junit4]   2> 194353 INFO  (TEST-StreamExpressionTest.testAll-seed#[BD09EB3C8F6DCE18]) [    ] o.a.s.c.c.ConnectionManager Client is connected to ZooKeeper
   [junit4]   2> 194353 INFO  (TEST-StreamExpressionTest.testAll-seed#[BD09EB3C8F6DCE18]) [    ] o.a.s.c.c.SolrZkClient Using default ZkACLProvider
   [junit4]   2> 194356 INFO  (TEST-StreamExpressionTest.testAll-seed#[BD09EB3C8F6DCE18]) [n:127.0.0.1:37209__    ] o.a.s.c.c.ConnectionManager Waiting for client to connect to ZooKeeper
   [junit4]   2> 194357 INFO  (zkCallback-388-thread-1-processing-n:127.0.0.1:37209__) [n:127.0.0.1:37209__    ] o.a.s.c.c.ConnectionManager Watcher org.apache.solr.common.cloud.ConnectionManager@58a5b9e2 name:ZooKeeperConnection Watcher:127.0.0.1:43072/solr got event WatchedEvent state:SyncConnected type:None path:null path:null type:None
   [junit4]   2> 194358 INFO  (TEST-StreamExpressionTest.testAll-seed#[BD09EB3C8F6DCE18]) [n:127.0.0.1:37209__    ] o.a.s.c.c.ConnectionManager Client is connected to ZooKeeper
   [junit4]   2> 194368 INFO  (TEST-StreamExpressionTest.testAll-seed#[BD09EB3C8F6DCE18]) [n:127.0.0.1:37209__    ] o.a.s.c.c.ZkStateReader Updating cluster state from ZooKeeper... 
   [junit4]   2> 194371 INFO  (TEST-StreamExpressionTest.testAll-seed#[BD09EB3C8F6DCE18]) [n:127.0.0.1:37209__    ] o.a.s.c.c.ZkStateReader Updated live nodes from ZooKeeper... (0) -> (1)
   [junit4]   2> 194400 INFO  (OverseerStateUpdate-95419923656540164-127.0.0.1:40601__-n_0000000000) [n:127.0.0.1:40601__    ] o.a.s.c.o.ZkStateWriter going to create_collection /collections/collection1/state.json
   [junit4]   2> 195379 INFO  (TEST-StreamExpressionTest.testAll-seed#[BD09EB3C8F6DCE18]) [n:127.0.0.1:37209__    ] o.a.s.c.ZkController Register node as live in ZooKeeper:/live_nodes/127.0.0.1:37209__
   [junit4]   2> 195380 INFO  (TEST-StreamExpressionTest.testAll-seed#[BD09EB3C8F6DCE18]) [n:127.0.0.1:37209__    ] o.a.s.c.c.SolrZkClient makePath: /live_nodes/127.0.0.1:37209__
   [junit4]   2> 195383 INFO  (zkCallback-382-thread-1) [    ] o.a.s.c.c.ZkStateReader A live node change: [WatchedEvent state:SyncConnected type:NodeChildrenChanged path:/live_nodes], has occurred - updating... (live nodes size: [1])
   [junit4]   2> 195383 INFO  (zkCallback-380-thread-1-processing-n:127.0.0.1:40601__) [n:127.0.0.1:40601__    ] o.a.s.c.c.ZkStateReader A live node change: [WatchedEvent state:SyncConnected type:NodeChildrenChanged path:/live_nodes], has occurred - updating... (live nodes size: [1])
   [junit4]   2> 195383 INFO  (zkCallback-388-thread-1-processing-n:127.0.0.1:37209__) [n:127.0.0.1:37209__    ] o.a.s.c.c.ZkStateReader A live node change: [WatchedEvent state:SyncConnected type:NodeChildrenChanged path:/live_nodes], has occurred - updating... (live nodes size: [1])
   [junit4]   2> 195385 INFO  (zkCallback-388-thread-1-processing-n:127.0.0.1:37209__) [n:127.0.0.1:37209__    ] o.a.s.c.c.ZkStateReader Updated live nodes from ZooKeeper... (1) -> (2)
   [junit4]   2> 195385 INFO  (zkCallback-382-thread-1) [    ] o.a.s.c.c.ZkStateReader Updated live nodes from ZooKeeper... (1) -> (2)
   [junit4]   2> 195385 INFO  (zkCallback-380-thread-1-processing-n:127.0.0.1:40601__) [n:127.0.0.1:40601__    ] o.a.s.c.c.ZkStateReader Updated live nodes from ZooKeeper... (1) -> (2)
   [junit4]   2> 195386 INFO  (TEST-StreamExpressionTest.testAll-seed#[BD09EB3C8F6DCE18]) [n:127.0.0.1:37209__    ] o.a.s.c.Overseer Overseer (id=null) closing
   [junit4]   2> 195387 INFO  (TEST-StreamExpressionTest.testAll-seed#[BD09EB3C8F6DCE18]) [n:127.0.0.1:37209__    ] o.a.s.c.LeaderElector Joined leadership election with path: /overseer_elect/election/95419923656540169-127.0.0.1:37209__-n_0000000001
   [junit4]   2> 195388 INFO  (TEST-StreamExpressionTest.testAll-seed#[BD09EB3C8F6DCE18]) [n:127.0.0.1:37209__    ] o.a.s.c.LeaderElector Watching path /overseer_elect/election/95419923656540164-127.0.0.1:40601__-n_0000000000 to know if I could be the leader
   [junit4]   2> 195421 INFO  (TEST-StreamExpressionTest.testAll-seed#[BD09EB3C8F6DCE18]) [n:127.0.0.1:37209__    ] o.a.s.c.CoreContainer Security conf doesn't exist. Skipping setup for authorization module.
   [junit4]   2> 195421 INFO  (TEST-StreamExpressionTest.testAll-seed#[BD09EB3C8F6DCE18]) [n:127.0.0.1:37209__    ] o.a.s.c.CoreContainer No authentication plugin used.
   [junit4]   2> 195423 INFO  (TEST-StreamExpressionTest.testAll-seed#[BD09EB3C8F6DCE18]) [n:127.0.0.1:37209__    ] o.a.s.c.CorePropertiesLocator Looking for core definitions underneath /export/home/jenkins/workspace/Lucene-Solr-trunk-Solaris/solr/build/solr-solrj/test/J0/../../../../../../../../../../export/home/jenkins/workspace/Lucene-Solr-trunk-Solaris/solr/build/solr-solrj/test/J0/temp/solr.client.solrj.io.stream.StreamExpressionTest_BD09EB3C8F6DCE18-001/shard-1-001/cores
   [junit4]   2> 195424 INFO  (TEST-StreamExpressionTest.testAll-seed#[BD09EB3C8F6DCE18]) [n:127.0.0.1:37209__    ] o.a.s.c.CoreDescriptor Created CoreDescriptor: {name=collection1, config=solrconfig.xml, transient=false, schema=schema.xml, loadOnStartup=true, configSetProperties=configsetprops.json, collection=collection1, coreNodeName=, dataDir=data/, shard=}
   [junit4]   2> 195424 INFO  (TEST-StreamExpressionTest.testAll-seed#[BD09EB3C8F6DCE18]) [n:127.0.0.1:37209__    ] o.a.s.c.CorePropertiesLocator Found core collection1 in /export/home/jenkins/workspace/Lucene-Solr-trunk-Solaris/solr/build/solr-solrj/test/J0/../../../../../../../../../../export/home/jenkins/workspace/Lucene-Solr-trunk-Solaris/solr/build/solr-solrj/test/J0/temp/solr.client.solrj.io.stream.StreamExpressionTest_BD09EB3C8F6DCE18-001/shard-1-001/cores/collection1
   [junit4]   2> 195424 INFO  (TEST-StreamExpressionTest.testAll-seed#[BD09EB3C8F6DCE18]) [n:127.0.0.1:37209__    ] o.a.s.c.CorePropertiesLocator Found 1 core definitions
   [junit4]   2> 195425 INFO  (TEST-StreamExpressionTest.testAll-seed#[BD09EB3C8F6DCE18]) [n:127.0.0.1:37209__    ] o.a.s.s.SolrDispatchFilter user.dir=/export/home/jenkins/workspace/Lucene-Solr-trunk-Solaris/solr/build/solr-solrj/test/J0
   [junit4]   2> 195426 INFO  (TEST-StreamExpressionTest.testAll-seed#[BD09EB3C8F6DCE18]) [n:127.0.0.1:37209__    ] o.a.s.s.SolrDispatchFilter SolrDispatchFilter.init() done
   [junit4]   2> 195426 INFO  (coreLoadExecutor-916-thread-1-processing-n:127.0.0.1:37209__) [n:127.0.0.1:37209__ c:collection1   x:collection1] o.a.s.c.ZkController publishing state=down
   [junit4]   2> 195426 INFO  (coreLoadExecutor-916-thread-1-processing-n:127.0.0.1:37209__) [n:127.0.0.1:37209__ c:collection1   x:collection1] o.a.s.c.ZkController numShards not found on descriptor - reading it from system property
   [junit4]   2> 195428 INFO  (coreLoadExecutor-916-thread-1-processing-n:127.0.0.1:37209__) [n:127.0.0.1:37209__ c:collection1   x:collection1] o.a.s.c.ZkController Registering watch for collection collection1
   [junit4]   2> 195428 INFO  (coreLoadExecutor-916-thread-1-processing-n:127.0.0.1:37209__) [n:127.0.0.1:37209__ c:collection1   x:collection1] o.a.s.c.c.ZkStateReader addZkWatch [collection1]
   [junit4]   2> 195429 INFO  (OverseerStateUpdate-95419923656540164-127.0.0.1:40601__-n_0000000000) [n:127.0.0.1:40601__    ] o.a.s.c.Overseer processMessage: queueSize: 1, message = {
   [junit4]   2>   "core":"collection1",
   [junit4]   2>   "roles":null,
   [junit4]   2>   "base_url":"http://127.0.0.1:37209/_",
   [junit4]   2>   "node_name":"127.0.0.1:37209__",
   [junit4]   2>   "numShards":"2",
   [junit4]   2>   "state":"down",
   [junit4]   2>   "shard":null,
   [junit4]   2>   "collection":"collection1",
   [junit4]   2>   "operation":"state"} current state version: 3
   [junit4]   2> 195429 INFO  (coreLoadExecutor-916-thread-1-processing-n:127.0.0.1:37209__) [n:127.0.0.1:37209__ c:collection1   x:collection1] o.a.s.c.c.ZkStateReader Add data for [collection1] ver [0]
   [junit4]   2> 195429 INFO  (coreLoadExecutor-916-thread-1-processing-n:127.0.0.1:37209__) [n:127.0.0.1:37209__ c:collection1   x:collection1] o.a.s.c.ZkController look for our core node name
   [junit4]   2> 195430 INFO  (OverseerStateUpdate-95419923656540164-127.0.0.1:40601__-n_0000000000) [n:127.0.0.1:40601__    ] o.a.s.c.o.ReplicaMutator Update state numShards=2 message={
   [junit4]   2>   "core":"collection1",
   [junit4]   2>   "roles":null,
   [junit4]   2>   "base_url":"http://127.0.0.1:37209/_",
   [junit4]   2>   "node_name":"127.0.0.1:37209__",
   [junit4]   2>   "numShards":"2",
   [junit4]   2>   "state":"down",
   [junit4]   2>   "shard":null,
   [junit4]   2>   "collection":"collection1",
   [junit4]   2>   "operation":"state"}
   [junit4]   2> 195430 INFO  (OverseerStateUpdate-95419923656540164-127.0.0.1:40601__-n_0000000000) [n:127.0.0.1:40601__    ] o.a.s.c.o.ReplicaMutator Collection already exists with numShards=2
   [junit4]   2> 195430 INFO  (OverseerStateUpdate-95419923656540164-127.0.0.1:40601__-n_0000000000) [n:127.0.0.1:40601__    ] o.a.s.c.o.ReplicaMutator Assigning new node to shard shard=shard2
   [junit4]   2> 195536 INFO  (OverseerStateUpdate-95419923656540164-127.0.0.1:40601__-n_0000000000) [n:127.0.0.1:40601__    ] o.a.s.c.o.ZkStateWriter going to update_collection /collections/collection1/state.json version: 0
   [junit4]   2> 195537 INFO  (zkCallback-388-thread-1-processing-n:127.0.0.1:37209__) [n:127.0.0.1:37209__    ] o.a.s.c.c.ZkStateReader A cluster state change: [WatchedEvent state:SyncConnected type:NodeDataChanged path:/collections/collection1/state.json] for collection [collection1] has occurred - updating... (live nodes size: [2])
   [junit4]   2> 195538 INFO  (zkCallback-388-thread-1-processing-n:127.0.0.1:37209__) [n:127.0.0.1:37209__    ] o.a.s.c.c.ZkStateReader Updating data for [collection1] from [0] to [1]
   [junit4]   2> 196430 INFO  (coreLoadExecutor-916-thread-1-processing-n:127.0.0.1:37209__) [n:127.0.0.1:37209__ c:collection1   x:collection1] o.a.s.c.ZkController waiting to find shard id in clusterstate for collection1
   [junit4]   2> 196431 INFO  (coreLoadExecutor-916-thread-1-processing-n:127.0.0.1:37209__) [n:127.0.0.1:37209__ c:collection1   x:collection1] o.a.s.c.ZkController Check for collection zkNode:collection1
   [junit4]   2> 196432 INFO  (coreLoadExecutor-916-thread-1-processing-n:127.0.0.1:37209__) [n:127.0.0.1:37209__ c:collection1   x:collection1] o.a.s.c.ZkController Collection zkNode exists
   [junit4]   2> 196432 INFO  (coreLoadExecutor-916-thread-1-processing-n:127.0.0.1:37209__) [n:127.0.0.1:37209__ c:collection1   x:collection1] o.a.s.c.c.ZkStateReader Load collection config from: [/collections/collection1]
   [junit4]   2> 196433 INFO  (coreLoadExecutor-916-thread-1-processing-n:127.0.0.1:37209__) [n:127.0.0.1:37209__ c:collection1   x:collection1] o.a.s.c.c.ZkStateReader path=[/collections/collection1] [configName]=[conf1] specified config exists in ZooKeeper
   [junit4]   2> 196433 INFO  (coreLoadExecutor-916-thread-1-processing-n:127.0.0.1:37209__) [n:127.0.0.1:37209__ c:collection1   x:collection1] o.a.s.c.SolrResourceLoader new SolrResourceLoader for directory: '/export/home/jenkins/workspace/Lucene-Solr-trunk-Solaris/solr/build/solr-solrj/test/J0/temp/solr.client.solrj.io.stream.StreamExpressionTest_BD09EB3C8F6DCE18-001/shard-1-001/cores/collection1'
   [junit4]   2> 196433 INFO  (coreLoadExecutor-916-thread-1-processing-n:127.0.0.1:37209__) [n:127.0.0.1:37209__ c:collection1   x:collection1] o.a.s.c.SolrResourceLoader JNDI not configured for solr (NoInitialContextEx)
   [junit4]   2> 196433 INFO  (coreLoadExecutor-916-thread-1-processing-n:127.0.0.1:37209__) [n:127.0.0.1:37209__ c:collection1   x:collection1] o.a.s.c.SolrResourceLoader solr home defaulted to 'solr/' (could not find system property or JNDI)
   [junit4]   2> 196435 INFO  (coreLoadExecutor-916-thread-1-processing-n:127.0.0.1:37209__) [n:127.0.0.1:37209__ c:collection1   x:collection1] o.a.s.c.Config loaded config solrconfig.xml with version 0 
   [junit4]   2> 196439 INFO  (coreLoadExecutor-916-thread-1-processing-n:127.0.0.1:37209__) [n:127.0.0.1:37209__ c:collection1   x:collection1] o.a.s.c.SolrConfig current version of requestparams : -1
   [junit4]   2> 196441 WARN  (coreLoadExecutor-916-thread-1-processing-n:127.0.0.1:37209__) [n:127.0.0.1:37209__ c:collection1   x:collection1] o.a.s.c.Config Beginning with Solr 5.5, <maxMergeDocs> is deprecated, configure it on the relevant <mergePolicyFactory> instead.
   [junit4]   2> 196441 WARN  (coreLoadExecutor-916-thread-1-processing-n:127.0.0.1:37209__) [n:127.0.0.1:37209__ c:collection1   x:collection1] o.a.s.c.Config Beginning with Solr 5.5, <mergeFactor> is deprecated, configure it on the relevant <mergePolicyFactory> instead.
   [junit4]   2> 196442 INFO  (coreLoadExecutor-916-thread-1-processing-n:127.0.0.1:37209__) [n:127.0.0.1:37209__ c:collection1   x:collection1] o.a.s.c.SolrConfig Using Lucene MatchVersion: 6.0.0
   [junit4]   2> 196448 INFO  (coreLoadExecutor-916-thread-1-processing-n:127.0.0.1:37209__) [n:127.0.0.1:37209__ c:collection1   x:collection1] o.a.s.c.SolrConfig Loaded SolrConfig: solrconfig.xml
   [junit4]   2> 196454 INFO  (coreLoadExecutor-916-thread-1-processing-n:127.0.0.1:37209__) [n:127.0.0.1:37209__ c:collection1   x:collection1] o.a.s.s.IndexSchema [collection1] Schema name=test
   [junit4]   2> 196533 INFO  (coreLoadExecutor-916-thread-1-processing-n:127.0.0.1:37209__) [n:127.0.0.1:37209__ c:collection1   x:collection1] o.a.s.s.IndexSchema default search field in schema is text
   [junit4]   2> 196533 INFO  (coreLoadExecutor-916-thread-1-processing-n:127.0.0.1:37209__) [n:127.0.0.1:37209__ c:collection1   x:collection1] o.a.s.s.IndexSchema unique key field: id
   [junit4]   2> 196534 WARN  (coreLoadExecutor-916-thread-1-processing-n:127.0.0.1:37209__) [n:127.0.0.1:37209__ c:collection1   x:collection1] o.a.s.s.IndexSchema Field lowerfilt1and2 is not multivalued and destination for multiple copyFields (2)
   [junit4]   2> 196534 WARN  (coreLoadExecutor-916-thread-1-processing-n:127.0.0.1:37209__) [n:127.0.0.1:37209__ c:collection1   x:collection1] o.a.s.s.IndexSchema Field text is not multivalued and destination for multiple copyFields (3)
   [junit4]   2> 196535 INFO  (coreLoadExecutor-916-thread-1-processing-n:127.0.0.1:37209__) [n:127.0.0.1:37209__ c:collection1   x:collection1] o.a.s.c.ConfigSetProperties Did not find ConfigSet properties, assuming default properties: Can't find resource 'configsetprops.json' in classpath or '/configs/conf1', cwd=/export/home/jenkins/workspace/Lucene-Solr-trunk-Solaris/solr/build/solr-solrj/test/J0
   [junit4]   2> 196536 INFO  (coreLoadExecutor-916-thread-1-processing-n:127.0.0.1:37209__) [n:127.0.0.1:37209__ c:collection1   x:collection1] o.a.s.c.CoreContainer Creating SolrCore 'collection1' using configuration from collection collection1
   [junit4]   2> 196536 INFO  (coreLoadExecutor-916-thread-1-processing-n:127.0.0.1:37209__) [n:127.0.0.1:37209__ c:collection1 s:shard2 r:core_node1 x:collection1] o.a.s.c.SolrCore org.apache.solr.core.MockDirectoryFactory
   [junit4]   2> 196536 INFO  (coreLoadExecutor-916-thread-1-processing-n:127.0.0.1:37209__) [n:127.0.0.1:37209__ c:collection1 s:shard2 r:core_node1 x:collection1] o.a.s.c.SolrCore [[collection1] ] Opening new SolrCore at [/export/home/jenkins/workspace/Lucene-Solr-trunk-Solaris/solr/build/solr-solrj/test/J0/temp/solr.client.solrj.io.stream.StreamExpressionTest_BD09EB3C8F6DCE18-001/shard-1-001/cores/collection1], dataDir=[/export/home/jenkins/workspace/Lucene-Solr-trunk-Solaris/solr/build/solr-solrj/test/J0/../../../../../../../../../../export/home/jenkins/workspace/Lucene-Solr-trunk-Solaris/solr/build/solr-solrj/test/J0/temp/solr.client.solrj.io.stream.StreamExpressionTest_BD09EB3C8F6DCE18-001/shard-1-001/cores/collection1/data/]
   [junit4]   2> 196536 INFO  (coreLoadExecutor-916-thread-1-processing-n:127.0.0.1:37209__) [n:127.0.0.1:37209__ c:collection1 s:shard2 r:core_node1 x:collection1] o.a.s.c.SolrCore JMX monitoring not detected for core: collection1
   [junit4]   2> 196536 INFO  (coreLoadExecutor-916-thread-1-processing-n:127.0.0.1:37209__) [n:127.0.0.1:37209__ c:collection1 s:shard2 r:core_node1 x:collection1] o.a.s.c.CachingDirectoryFactory return new directory for /export/home/jenkins/workspace/Lucene-Solr-trunk-Solaris/solr/build/solr-solrj/test/J0/../../../../../../../../../../export/home/jenkins/workspace/Lucene-Solr-trunk-Solaris/solr/build/solr-solrj/test/J0/temp/solr.client.solrj.io.stream.StreamExpressionTest_BD09EB3C8F6DCE18-001/shard-1-001/cores/collection1/data
   [junit4]   2> 196536 INFO  (coreLoadExecutor-916-thread-1-processing-n:127.0.0.1:37209__) [n:127.0.0.1:37209__ c:collection1 s:shard2 r:core_node1 x:collection1] o.a.s.c.SolrCore New index directory detected: old=null new=/export/home/jenkins/workspace/Lucene-Solr-trunk-Solaris/solr/build/solr-solrj/test/J0/../../../../../../../../../../export/home/jenkins/workspace/Lucene-Solr-trunk-Solaris/solr/build/solr-solrj/test/J0/temp/solr.client.solrj.io.stream.StreamExpressionTest_BD09EB3C8F6DCE18-001/shard-1-001/cores/collection1/data/index/
   [junit4]   2> 196536 WARN  (coreLoadExecutor-916-thread-1-processing-n:127.0.0.1:37209__) [n:127.0.0.1:37209__ c:collection1 s:shard2 r:core_node1 x:collection1] o.a.s.c.SolrCore [collection1] Solr index directory '/export/home/jenkins/workspace/Lucene-Solr-trunk-Solaris/solr/build/solr-solrj/test/J0/../../../../../../../../../../export/home/jenkins/workspace/Lucene-Solr-trunk-Solaris/solr/build/solr-solrj/test/J0/temp/solr.client.solrj.io.stream.StreamExpressionTest_BD09EB3C8F6DCE18-001/shard-1-001/cores/collection1/data/index' doesn't exist. Creating new index...
   [junit4]   2> 196537 INFO  (coreLoadExecutor-916-thread-1-processing-n:127.0.0.1:37209__) [n:127.0.0.1:37209__ c:collection1 s:shard2 r:core_node1 x:collection1] o.a.s.c.CachingDirectoryFactory return new directory for /export/home/jenkins/workspace/Lucene-Solr-trunk-Solaris/solr/build/solr-solrj/test/J0/../../../../../../../../../../export/home/jenkins/workspace/Lucene-Solr-trunk-Solaris/solr/build/solr-solrj/test/J0/temp/solr.client.solrj.io.stream.StreamExpressionTest_BD09EB3C8F6DCE18-001/shard-1-001/cores/collection1/data/index
   [junit4]   2> 196537 INFO  (coreLoadExecutor-916-thread-1-processing-n:127.0.0.1:37209__) [n:127.0.0.1:37209__ c:collection1 s:shard2 r:core_node1 x:collection1] o.a.s.c.SolrDeletionPolicy SolrDeletionPolicy.onCommit: commits: num=1
   [junit4]   2> 	commit{dir=MockDirectoryWrapper(RAMDirectory@f0a50da lockFactory=org.apache.lucene.store.SingleInstanceLockFactory@12721606),segFN=segments_1,generation=1}
   [junit4]   2> 196537 INFO  (coreLoadExecutor-916-thread-1-processing-n:127.0.0.1:37209__) [n:127.0.0.1:37209__ c:collection1 s:shard2 r:core_node1 x:collection1] o.a.s.c.SolrDeletionPolicy newest commit generation = 1
   [junit4]   2> 196539 INFO  (coreLoadExecutor-916-thread-1-processing-n:127.0.0.1:37209__) [n:127.0.0.1:37209__ c:collection1 s:shard2 r:core_node1 x:collection1] o.a.s.c.SolrCore no updateRequestProcessorChain defined as default, creating implicit default
   [junit4]   2> 196538 INFO  (OldIndexDirectoryCleanupThreadForCore-collection1) [n:127.0.0.1:37209__ c:collection1 s:shard2 r:core_node1 x:collection1] o.a.s.c.SolrCore Looking for old index directories to cleanup for core collection1 in /export/home/jenkins/workspace/Lucene-Solr-trunk-Solaris/solr/build/solr-solrj/test/J0/../../../../../../../../../../export/home/jenkins/workspace/Lucene-Solr-trunk-Solaris/solr/build/solr-solrj/test/J0/temp/solr.client.solrj.io.stream.StreamExpressionTest_BD09EB3C8F6DCE18-001/shard-1-001/cores/collection1/data/
   [junit4]   2> 196539 WARN  (OldIndexDirectoryCleanupThreadForCore-collection1) [n:127.0.0.1:37209__ c:collection1 s:shard2 r:core_node1 x:collection1] o.a.s.c.DirectoryFactory /export/home/jenkins/workspace/Lucene-Solr-trunk-Solaris/solr/build/solr-solrj/test/J0/../../../../../../../../../../export/home/jenkins/workspace/Lucene-Solr-trunk-Solaris/solr/build/solr-solrj/test/J0/temp/solr.client.solrj.io.stream.StreamExpressionTest_BD09EB3C8F6DCE18-001/shard-1-001/cores/collection1/data/ does not point to a valid data directory; skipping clean-up of old index directories.
   [junit4]   2> 196540 INFO  (coreLoadExecutor-916-thread-1-processing-n:127.0.0.1:37209__) [n:127.0.0.1:37209__ c:collection1 s:shard2 r:core_node1 x:collection1] o.a.s.h.l.XMLLoader xsltCacheLifetimeSeconds=60
   [junit4]   2> 196542 INFO  (coreLoadExecutor-916-thread-1-processing-n:127.0.0.1:37209__) [n:127.0.0.1:37209__ c:collection1 s:shard2 r:core_node1 x:collection1] o.a.s.h.l.XMLLoader xsltCacheLifetimeSeconds=60
   [junit4]   2> 196544 INFO  (coreLoadExecutor-916-thread-1-processing-n:127.0.0.1:37209__) [n:127.0.0.1:37209__ c:collection1 s:shard2 r:core_node1 x:collection1] o.a.s.h.l.XMLLoader xsltCacheLifetimeSeconds=60
   [junit4]   2> 196545 INFO  (coreLoadExecutor-916-thread-1-processing-n:127.0.0.1:37209__) [n:127.0.0.1:37209__ c:collection1 s:shard2 r:core_node1 x:collection1] o.a.s.h.l.XMLLoader xsltCacheLifetimeSeconds=60
   [junit4]   2> 196548 INFO  (coreLoadExecutor-916-thread-1-processing-n:127.0.0.1:37209__) [n:127.0.0.1:37209__ c:collection1 s:shard2 r:core_node1 x:collection1] o.a.s.c.RequestHandlers Registered paths: /admin/mbeans,standard,,/update/csv,/sql,/update/json/docs,/admin/luke,/export,/admin/segments,/get,/admin/system,/replication,/admin/properties,/config,/stream,/schema,/admin/plugins,/admin/logging,/update/json,/admin/threads,/admin/ping,/update,/admin/file
   [junit4]   2> 196549 INFO  (coreLoadExecutor-916-thread-1-processing-n:127.0.0.1:37209__) [n:127.0.0.1:37209__ c:collection1 s:shard2 r:core_node1 x:collection1] o.a.s.c.SolrCore Using default statsCache cache: org.apache.solr.search.stats.LocalStatsCache
   [junit4]   2> 196549 INFO  (coreLoadExecutor-916-thread-1-processing-n:127.0.0.1:37209__) [n:127.0.0.1:37209__ c:collection1 s:shard2 r:core_node1 x:collection1] o.a.s.u.UpdateHandler Using UpdateLog implementation: org.apache.solr.update.UpdateLog
   [junit4]   2> 196549 INFO  (coreLoadExecutor-916-thread-1-processing-n:127.0.0.1:37209__) [n:127.0.0.1:37209__ c:collection1 s:shard2 r:core_node1 x:collection1] o.a.s.u.UpdateLog Initializing UpdateLog: dataDir= defaultSyncLevel=FLUSH numRecordsToKeep=100 maxNumLogsToKeep=10 numVersionBuckets=65536
   [junit4]   2> 196551 INFO  (coreLoadExecutor-916-thread-1-processing-n:127.0.0.1:37209__) [n:127.0.0.1:37209__ c:collection1 s:shard2 r:core_node1 x:collection1] o.a.s.u.CommitTracker Hard AutoCommit: disabled
   [junit4]   2> 196551 INFO  (coreLoadExecutor-916-thread-1-processing-n:127.0.0.1:37209__) [n:127.0.0.1:37209__ c:collection1 s:shard2 r:core_node1 x:collection1] o.a.s.u.CommitTracker Soft AutoCommit: disabled
   [junit4]   2> 196551 INFO  (coreLoadExecutor-916-thread-1-processing-n:127.0.0.1:37209__) [n:127.0.0.1:37209__ c:collection1 s:shard2 r:core_node1 x:collection1] o.a.s.c.SolrDeletionPolicy SolrDeletionPolicy.onInit: commits: num=1
   [junit4]   2> 	commit{dir=MockDirectoryWrapper(RAMDirectory@f0a50da lockFactory=org.apache.lucene.store.SingleInstanceLockFactory@12721606),segFN=segments_1,generation=1}
   [junit4]   2> 196551 INFO  (coreLoadExecutor-916-thre

[...truncated too long message...]

sionTest_BD09EB3C8F6DCE18-001/shard-4-001/cores/parallelDestinationCollection_shard2_replica2/data/index;done=false>>]
   [junit4]   2> 7417477 INFO  (coreCloseExecutor-1031-thread-1) [n:127.0.0.1:58790__ c:parallelDestinationCollection s:shard2 r:core_node2 x:parallelDestinationCollection_shard2_replica2] o.a.s.c.CachingDirectoryFactory Closing directory: /export/home/jenkins/workspace/Lucene-Solr-trunk-Solaris/solr/build/solr-solrj/test/J0/temp/solr.client.solrj.io.stream.StreamExpressionTest_BD09EB3C8F6DCE18-001/shard-4-001/cores/parallelDestinationCollection_shard2_replica2/data/index
   [junit4]   2> 7417478 INFO  (TEST-StreamExpressionTest.testAll-seed#[BD09EB3C8F6DCE18]) [    ] o.e.j.s.ServerConnector Stopped ServerConnector@64b7a57{HTTP/1.1,[http/1.1]}{127.0.0.1:0}
   [junit4]   2> 7417478 INFO  (TEST-StreamExpressionTest.testAll-seed#[BD09EB3C8F6DCE18]) [    ] o.e.j.s.h.ContextHandler Stopped o.e.j.s.ServletContextHandler@5e372ebd{/_,null,UNAVAILABLE}
   [junit4]   2> 7417479 INFO  (TEST-StreamExpressionTest.testAll-seed#[BD09EB3C8F6DCE18]) [    ] o.a.s.c.ZkTestServer connecting to 127.0.0.1:43072 43072
   [junit4]   2> 7417538 INFO  (SUITE-StreamExpressionTest-seed#[BD09EB3C8F6DCE18]-worker) [    ] o.a.s.SolrTestCaseJ4 ###deleteCore
   [junit4]   2> NOTE: leaving temporary files on disk at: /export/home/jenkins/workspace/Lucene-Solr-trunk-Solaris/solr/build/solr-solrj/test/J0/temp/solr.client.solrj.io.stream.StreamExpressionTest_BD09EB3C8F6DCE18-001
   [junit4]   2> Feb 20, 2016 8:21:52 PM com.carrotsearch.randomizedtesting.ThreadLeakControl tryToInterruptAll
   [junit4]   2> SEVERE: There are still zombie threads that couldn't be terminated:
   [junit4]   2>    1) Thread[id=2232, name=TEST-StreamExpressionTest.testAll-seed#[BD09EB3C8F6DCE18]-SendThread(127.0.0.1:43072), state=TIMED_WAITING, group=TGRP-StreamExpressionTest]
   [junit4]   2>         at java.lang.Thread.sleep(Native Method)
   [junit4]   2>         at org.apache.zookeeper.client.StaticHostProvider.next(StaticHostProvider.java:101)
   [junit4]   2>         at org.apache.zookeeper.ClientCnxn$SendThread.startConnect(ClientCnxn.java:940)
   [junit4]   2>         at org.apache.zookeeper.ClientCnxn$SendThread.run(ClientCnxn.java:1003)
   [junit4]   2>    2) Thread[id=2875, name=TEST-StreamExpressionTest.testAll-seed#[BD09EB3C8F6DCE18]-SendThread(127.0.0.1:43072), state=TIMED_WAITING, group=TGRP-StreamExpressionTest]
   [junit4]   2>         at java.lang.Thread.sleep(Native Method)
   [junit4]   2>         at org.apache.zookeeper.ClientCnxn$SendThread.run(ClientCnxn.java:994)
   [junit4]   2> NOTE: test params are: codec=Asserting(Lucene60): {i_multi=PostingsFormat(name=Direct), join2_s=PostingsFormat(name=Asserting), multiDefault=PostingsFormat(name=Asserting), a_f=PostingsFormat(name=Asserting), intDefault=PostingsFormat(name=SimpleText), join1_i=PostingsFormat(name=Direct), a_i=PostingsFormat(name=Direct), join3_i=PostingsFormat(name=LuceneVarGapDocFreqInterval), checkpoint_ss=PostingsFormat(name=LuceneVarGapDocFreqInterval), level1_s=PostingsFormat(name=Direct), ident_s=PostingsFormat(name=Asserting), s_multi=PostingsFormat(name=LuceneVarGapDocFreqInterval), level2_s=PostingsFormat(name=SimpleText), a_s=PostingsFormat(name=LuceneVarGapDocFreqInterval), _version_=PostingsFormat(name=SimpleText), side_s=PostingsFormat(name=LuceneVarGapDocFreqInterval), id=PostingsFormat(name=Direct), timestamp=PostingsFormat(name=SimpleText)}, docValues:{i_multi=DocValuesFormat(name=Asserting), join2_s=DocValuesFormat(name=Memory), multiDefault=DocValuesFormat(name=Memory), a_f=DocValuesFormat(name=Memory), intDefault=DocValuesFormat(name=Lucene54), join1_i=DocValuesFormat(name=Asserting), a_i=DocValuesFormat(name=Asserting), join3_i=DocValuesFormat(name=Lucene54), checkpoint_ss=DocValuesFormat(name=Lucene54), level1_s=DocValuesFormat(name=Asserting), ident_s=DocValuesFormat(name=Memory), s_multi=DocValuesFormat(name=Lucene54), level2_s=DocValuesFormat(name=Lucene54), a_s=DocValuesFormat(name=Lucene54), side_s=DocValuesFormat(name=Lucene54), id=DocValuesFormat(name=Asserting)}, sim=RandomSimilarity(queryNorm=false,coord=no): {}, locale=lt, timezone=Atlantic/Jan_Mayen
   [junit4]   2> NOTE: SunOS 5.11 amd64/Oracle Corporation 1.8.0_72 (64-bit)/cpus=3,threads=3,free=110279992,total=213028864
   [junit4]   2> NOTE: All tests run in this JVM: [TestCloudSolrClientConnections, DocumentAnalysisResponseTest, ModifiableSolrParamsTest, TestUpdateRequestCodec, TestClusteringResponse, TermsResponseTest, TestDocumentObjectBinder, SchemaTest, StreamingTest, SolrZkClientTest, JettyWebappTest, FacetFieldTest, TestCollectionAdminRequest, TestJsonRecordReader, TestSolrProperties, TestSolrJErrorHandling, CloudSolrClientMultiConstructorTest, ShardParamsTest, ConcurrentUpdateSolrClientTest, TestJavaBinCodec, FieldAnalysisResponseTest, SolrExampleStreamingTest, SolrExampleStreamingBinaryTest, SolrExampleBinaryTest, SolrExampleXMLTest, SolrExampleEmbeddedTest, TestBatchUpdate, LargeVolumeEmbeddedTest, TestSpellCheckResponse, LargeVolumeJettyTest, TestEmbeddedSolrServer, TestCoreAdmin, TestNamedListCodec, SolrQueryTest, TestHash, TestXMLEscaping, SolrDocumentTest, IteratorChainTest, ClientUtilsTest, NamedListTest, AnlysisResponseBaseTest, CollectionAdminRequestRequiredParamsTest, SolrSchemalessExampleTest, BasicHttpSolrClientTest, JdbcTest, StreamExpressionTest]
   [junit4]   2> NOTE: reproduce with: ant test  -Dtestcase=StreamExpressionTest -Dtests.seed=BD09EB3C8F6DCE18 -Dtests.slow=true -Dtests.locale=lt -Dtests.timezone=Atlantic/Jan_Mayen -Dtests.asserts=true -Dtests.file.encoding=ISO-8859-1
   [junit4] ERROR   0.00s J0 | StreamExpressionTest (suite) <<<
   [junit4]    > Throwable #1: java.lang.Exception: Suite timeout exceeded (>= 7200000 msec).
   [junit4]    > 	at __randomizedtesting.SeedInfo.seed([BD09EB3C8F6DCE18]:0)Throwable #2: com.carrotsearch.randomizedtesting.UncaughtExceptionError: Captured an uncaught exception in thread: Thread[id=2910, name=Thread-1008, state=RUNNABLE, group=TGRP-StreamExpressionTest]
   [junit4]    > Caused by: org.apache.solr.common.SolrException: Could not load collection from ZK: parallelDestinationCollection1
   [junit4]    > 	at __randomizedtesting.SeedInfo.seed([BD09EB3C8F6DCE18]:0)
   [junit4]    > 	at org.apache.solr.common.cloud.ZkStateReader.getCollectionLive(ZkStateReader.java:969)
   [junit4]    > 	at org.apache.solr.common.cloud.ZkStateReader$LazyCollectionRef.get(ZkStateReader.java:526)
   [junit4]    > 	at org.apache.solr.common.cloud.ClusterState.getCollectionOrNull(ClusterState.java:189)
   [junit4]    > 	at org.apache.solr.common.cloud.ClusterState.hasCollection(ClusterState.java:119)
   [junit4]    > 	at org.apache.solr.client.solrj.impl.CloudSolrClient.getCollectionNames(CloudSolrClient.java:1111)
   [junit4]    > 	at org.apache.solr.client.solrj.impl.CloudSolrClient.requestWithRetryOnStaleState(CloudSolrClient.java:833)
   [junit4]    > 	at org.apache.solr.client.solrj.impl.CloudSolrClient.request(CloudSolrClient.java:806)
   [junit4]    > 	at org.apache.solr.client.solrj.SolrRequest.process(SolrRequest.java:149)
   [junit4]    > 	at org.apache.solr.client.solrj.SolrClient.add(SolrClient.java:106)
   [junit4]    > 	at org.apache.solr.client.solrj.SolrClient.add(SolrClient.java:71)
   [junit4]    > 	at org.apache.solr.client.solrj.io.stream.UpdateStream.uploadBatchToCollection(UpdateStream.java:256)
   [junit4]    > 	at org.apache.solr.client.solrj.io.stream.UpdateStream.read(UpdateStream.java:118)
   [junit4]    > 	at org.apache.solr.client.solrj.io.stream.DaemonStream$StreamRunner.run(DaemonStream.java:245)
   [junit4]    > Caused by: java.lang.InterruptedException
   [junit4]    > 	at java.lang.Object.wait(Native Method)
   [junit4]    > 	at java.lang.Object.wait(Object.java:502)
   [junit4]    > 	at org.apache.zookeeper.ClientCnxn.submitRequest(ClientCnxn.java:1342)
   [junit4]    > 	at org.apache.zookeeper.ZooKeeper.getData(ZooKeeper.java:1153)
   [junit4]    > 	at org.apache.solr.common.cloud.SolrZkClient$7.execute(SolrZkClient.java:353)
   [junit4]    > 	at org.apache.solr.common.cloud.SolrZkClient$7.execute(SolrZkClient.java:350)
   [junit4]    > 	at org.apache.solr.common.cloud.ZkCmdExecutor.retryOperation(ZkCmdExecutor.java:60)
   [junit4]    > 	at org.apache.solr.common.cloud.SolrZkClient.getData(SolrZkClient.java:350)
   [junit4]    > 	at org.apache.solr.common.cloud.ZkStateReader.fetchCollectionState(ZkStateReader.java:977)
   [junit4]    > 	at org.apache.solr.common.cloud.ZkStateReader.getCollectionLive(ZkStateReader.java:964)
   [junit4]    > 	... 12 more
   [junit4] Completed [78/78 (1!)] on J0 in 7225.55s, 1 test, 3 errors <<< FAILURES!

[...truncated 11 lines...]
BUILD FAILED
/export/home/jenkins/workspace/Lucene-Solr-trunk-Solaris/build.xml:740: The following error occurred while executing this line:
/export/home/jenkins/workspace/Lucene-Solr-trunk-Solaris/build.xml:684: The following error occurred while executing this line:
/export/home/jenkins/workspace/Lucene-Solr-trunk-Solaris/build.xml:59: The following error occurred while executing this line:
/export/home/jenkins/workspace/Lucene-Solr-trunk-Solaris/solr/build.xml:246: The following error occurred while executing this line:
/export/home/jenkins/workspace/Lucene-Solr-trunk-Solaris/solr/common-build.xml:524: The following error occurred while executing this line:
/export/home/jenkins/workspace/Lucene-Solr-trunk-Solaris/lucene/common-build.xml:1457: The following error occurred while executing this line:
/export/home/jenkins/workspace/Lucene-Solr-trunk-Solaris/lucene/common-build.xml:1014: There were test failures: 78 suites, 530 tests, 2 suite-level errors, 1 error [seed: BD09EB3C8F6DCE18]

Total time: 202 minutes 0 seconds
Build step 'Invoke Ant' marked build as failure
Archiving artifacts
[WARNINGS] Skipping publisher since build result is FAILURE
Recording test results
Email was triggered for: Failure - Any
Sending email for trigger: Failure - Any



Mime
View raw message